##TITLE=1H_Ac20(dark-bottle)
 CDCl3
 8 sc, 
 8.04.2022
##JCAMPDX= 6.0         $$ Bruker NMR JCAMP-DX V2.0
##DATA TYPE= NMR FID
##DATA CLASS= NTUPLES
##ORIGIN= UXNMR, Bruker Analytische Messtechnik GmbH
##OWNER= root
$$ XWIN-NMR		Version 3.5
$$ Fri Apr  8 10:39:59 2022 Russian Standard Time (UT+4h)  she@DPX200
##.OBSERVE FREQUENCY= 200.13135
##.OBSERVE NUCLEUS= ^1H
##.DELAY= (6, 6)
##.ACQUISITION MODE= SIMULTANEOUS
##.ACQUISITION SCHEME= undefined
##.AVERAGES= 8
##.DIGITISER RES= 18
##SPECTROMETER/DATA SYSTEM= spect
##.PULSE SEQUENCE= zg30
##.SOLVENT NAME= CDCl3
##.SHIFT REFERENCE= (INTERNAL, CDCl3, 0, 15.7039)
##AUDIT TRAIL= $$ (NUMBER, WHEN, WHO, WHERE, WHAT)
$$ ##TITLE= Audit trail, XWIN-NMR		Version 3.5
$$ ##JCAMPDX= 5.01
$$ ##ORIGIN= Bruker BioSpin GmbH
$$ ##OWNER= she
$$ F:/spectra/data/she/nmr/H-F/1/audita.txt
$$ ##AUDIT TRAIL=  $$ (NUMBER, WHEN, WHO, WHERE, WHAT)
(   1,<2022-04-08 10:38:44.87 +0400>,<she>,<DPX200>,
      <created by zg, POWCHK disabled, PULCHK disabled
       configuration hash MD5:
       00 E9 B6 7A A2 85 ED C7 34 08 36 98 17 FE 4E 26
       data hash MD5: 16K
       8C 70 63 85 88 1B 5B B4 3E E6 80 E2 E5 CF 77 42>)
$$ ##END=
$$ 
$$ hash MD5
$$ E6 8D B4 28 1E 91 F3 3A A4 45 F9 9C 0D 9D FD 6C
##$RELAX= 
##$RELAX= 
##$RELAX= 
##$RELAX= 
##$RELAX= 
##$RELAX= 
$$ Bruker specific parameters
$$ --------------------------
##$DU= <F:/spectra>
##$EXPNO= 1
##$NAME= <H-F>
##$PROCNO= 1
##$TYPE= <nmr>
##$USER= <she>
##$AMP= (0..31)
100 100 100 100 100 100 100 100 100 100 100 100 100 100 100 100 100 100 
100 100 100 100 100 100 100 100 100 100 100 100 100 100 
##$AQSEQ= 0
##$AQ_mod= 1
##$AUNM= <au_zg>
##$AUTOPOS= <>
##$BF1= 200.13
##$BF2= 200.13
##$BF3= 200.13
##$BF4= 200.13
##$BF5= 200.13
##$BF6= 200.13
##$BF7= 200.13
##$BF8= 200.13
##$BYTORDA= 1
##$CFDGTYP= 0
##$CFRGTYP= 5
##$CHEMSTR= <none>
##$CNST= (0..31)
1 1 145 1 1 1 1 1 1 1 1 1 1 1 1 1 1 1 1 1 1 1 1 1 1 1 1 1 1 1 1 1 
##$CPDPRG= <>
##$CPDPRG1= <>
##$CPDPRG2= <>
##$CPDPRG3= <>
##$CPDPRG4= <mlev>
##$CPDPRG5= <mlev>
##$CPDPRG6= <mlev>
##$CPDPRG7= <mlev>
##$CPDPRG8= <mlev>
##$CPDPRGB= <>
##$CPDPRGT= <>
##$D= (0..31)
0 1.2 0 0 0 0 0 0 0 0.06 0 0.03 0 0 0 0 0.0002 0 0 0 0 0 0 0 0 0 0 0 0 
0 0 0 
##$DATE= 1649399924
##$DBL= (0..7)
120 120 120 120 120 120 120 120 
##$DBP= (0..7)
150 150 150 150 150 150 150 150 
##$DBP07= 0
##$DBPNAM0= <>
##$DBPNAM1= <>
##$DBPNAM2= <>
##$DBPNAM3= <>
##$DBPNAM4= <>
##$DBPNAM5= <>
##$DBPNAM6= <>
##$DBPNAM7= <>
##$DBPOAL= (0..7)
0.5 0.5 0.5 0.5 0.5 0.5 0.5 0.5 
##$DBPOFFS= (0..7)
0 0 0 0 0 0 0 0 
##$DE= 6
##$DECBNUC= <off>
##$DECIM= 32
##$DECNUC= <off>
##$DECSTAT= 4
##$DIGMOD= 1
##$DIGTYP= 9
##$DL= (0..7)
0 120 120 120 120 120 120 120 
##$DP= (0..7)
150 150 150 150 150 150 150 150 
##$DP07= 0
##$DPNAME0= <>
##$DPNAME1= <>
##$DPNAME2= <>
##$DPNAME3= <>
##$DPNAME4= <>
##$DPNAME5= <>
##$DPNAME6= <>
##$DPNAME7= <>
##$DPOAL= (0..7)
0.5 0.5 0.5 0.5 0.5 0.5 0.5 0.5 
##$DPOFFS= (0..7)
0 0 0 0 0 0 0 0 
##$DQDMODE= 0
##$DR= 18
##$DS= 0
##$DSLIST= <SSSSSSSSSSSSSSS>
$$ [...]
##$SUBNAM2= <"">
##$SUBNAM3= <"">
##$SUBNAM4= <"">
##$SUBNAM5= <"">
##$SUBNAM6= <"">
##$SUBNAM7= <"">
##$SUBNAM8= <"">
##$SUBNAM9= <"">
##$SW= 18.05172834244
##$SWIBOX= (0..15)
0 0 2 0 0 0 0 0 0 0 0 0 0 0 0 0 
##$SW_h= 3612.71676300578
##$TD= 16384
##$TD0= 1
##$TE= 0
##$TE2= 300
##$TE3= 300
##$TEG= 300
##$TL= (0..7)
0 120 120 120 120 120 120 120 
##$TP= (0..7)
150 150 150 150 150 150 150 150 
##$TP07= 0
##$TPNAME0= <>
##$TPNAME1= <>
##$TPNAME2= <>
##$TPNAME3= <>
##$TPNAME4= <>
##$TPNAME5= <>
##$TPNAME6= <>
##$TPNAME7= <>
##$TPOAL= (0..7)
0.5 0.5 0.5 0.5 0.5 0.5 0.5 0.5 
##$TPOFFS= (0..7)
0 0 0 0 0 0 0 0 
##$TUNHIN= 0
##$TUNHOUT= 0
##$TUNXOUT= 0
##$USERA1= <user>
##$USERA2= <user>
##$USERA3= <user>
##$USERA4= <user>
##$USERA5= <user>
##$V9= 5
##$VALIST= <valist>
##$VCLIST= <CCCCCCCCCCCCCCC>
##$VD= 0
##$VDLIST= <DDDDDDDDDDDDDDD>
##$VPLIST= <PPPPPPPPPPPPPPP>
##$VTLIST= <TTTTTTTTTTTTTTT>
##$WBST= 1024
##$WBSW= 4
##$XGAIN= (0..3)
0 0 0 0 
##$XL= 0
##$YL= 0
##$YMAX_a= 292077
##$YMIN_a= -311550
##$ZGOPTNS= <>
##$ZL1= 120
##$ZL2= 120
##$ZL3= 120
##$ZL4= 120
##$ABSF1= 10
##$ABSF2= 0
##$ABSG= 5
##$ABSL= 3
##$ALPHA= 0
##$AQORDER= 0
##$ASSFAC= 0
##$ASSFACI= 0
##$ASSFACX= 0
##$ASSWID= 0
##$AUNMP= <proc_1d>
##$AZFE= 0.1
##$AZFW= 0.1
##$BCFW= 1
##$BC_mod= 2
##$BYTORDP= 1
##$COROFFS= 0
##$CY= 11.3945322036743
##$DATMOD= 1
##$DC= 2
##$DFILT= <>
##$DTYPP= 0
##$F1P= 2.36226072786647
##$F2P= -0.459571619588291
##$FCOR= 0.5
##$FTSIZE= 0
##$FT_mod= 4
##$GAMMA= 1
##$GB= 0.15
##$INTBC= 1
##$INTSCL= 1
##$ISEN= 128
##$LB= 0.24
##$LEV0= 0
##$LPBIN= 0
##$MAXI= 10000
##$MC2= 0
##$MEAN= 0
##$ME_mod= 0
##$MI= 1.114404
##$NCOEF= 0
##$NC_proc= 0
##$NLEV= 6
##$NOISF1= 3.799351
##$NOISF2= 2.8
##$NSP= 1
##$NTH_PI= 0
##$NZP= 0
##$OFFSET= 15.70392
##$PC= 1
##$PHC0= -18393.87
##$PHC1= 15.20078
##$PH_mod= 1
##$PKNL= yes
##$PPARMOD= 0
##$PSCAL= 0
##$PSIGN= 0
##$REVERSE= no
##$SF= 200.130013532006
##$SI= 16384
##$SIGF1= 3
##$SIGF2= 2
##$SINO= 400
##$SIOLD= 16384
##$SREGLST= <1H.CDCl3>
##$SSB= 0
##$STSI= 0
##$STSR= 0
##$SW_p= 3612.71676300578
##$SYMM= 0
##$S_DEV= 0
##$TDeff= 0
##$TDoff= 0
##$TI= <>
##$TILT= no
##$TM1= 0
##$TM2= 0
##$TOPLEV= 0
##$USERP1= <user>
##$USERP2= <user>
##$USERP3= <user>
##$USERP4= <user>
##$USERP5= <user>
##$WDW= 1
##$XDIM= 8192
##$YMAX_p= 0
##$YMIN_p= 0
$$ End of Bruker specific parameters
$$ ---------------------------------
##NTUPLES= NMR FID
##VAR_NAME=  TIME,          FID/REAL,        FID/IMAG
##SYMBOL=    X,             R,               I
##VAR_TYPE=  INDEPENDENT,   DEPENDENT,       DEPENDENT
##VAR_FORM=  AFFN,          ASDF,            ASDF
##VAR_DIM=   8192,          8192,            8192
##UNITS=     SECONDS,       ARBITRARY UNITS, ARBITRARY UNITS
##FACTOR=    0.0002768,     1,               1
##FIRST=     0,             0,               0
##LAST=      2.2672688,     0,               0
##MIN=       0,             -311550,         0
##MAX=       2.2672688,     292077,          0
$$ Real data points
##PAGE= N=1
##DATA TABLE= (X++(R..R)), XYDATA
0 0 0 0 0 0 0 0 0 0 0 0 0 8 -8 8 -8 16 -16 16 -24 32 -33 40 -48 57 -66 79 -90 106 -122 139 -160 184 -208
33 -208 234 -267 299 -337 375 -422 471 -525 583 -646 715 -792 875 -965 1064 -1174 1290 -1424
51 -1424 1568 -1729 1906 -2106 2333 -2586 2880 -3221 3622 -4101 4687 -5423 6377 -7672 9535
66 9535 -12463 17741 -30209 124331 -52449 -311550 106692 285993 -75667 -294334 91679
77 91679 285153 -75703 -290833 79849 280699 -73552 -288266 69881 275255 -68983
87 -68983 -283178 62264 270206 -62784 -275992 56879 267552 -54628 -268089 52706
97 52706 265276 -45999 -260921 48127 263038 -37974 -255392 42202 259532 -32447
107 -32447 -252248 34574 253874 -28583 -250995 25951 247840 -24553 -249462 17146
117 17146 242854 -19671 -246856 9986 238962 -12600 -242331 4549 236153 -4448
127 -4448 -235758 658 233858 4631 -228625 -4093 230378 12264 -222669 -9986
137 -9986 225903 18624 -218118 -17156 219442 23027 -215638 -25059 212710 26284
147 26284 -213466 -32336 207190 30084 -210538 -38282 203612 35700 -206948 -42479
157 -42479 202075 42214 -202857 -45315 201854 48934 -198429 -48021 201382 54732
167 54732 -195382 -51671 199835 58636 -193910 -56664 196233 61101 -193232 -62248
177 -62248 192000 62830 -192686 -66992 187654 64684 -190844 -70715 184352 67369
187 67369 -187001 -72711 181545 71116 -181702 -73353 179772 75168 -176209 -73798
197 -73798 177340 78467 -171394 -74824 174274 80359 -167886 -77249 169814 80921 -166115
208 -166115 -80749 164674 81158 -164514 -84383 160002 81927 -162873 -87251 156891 83977
219 83977 -159536 -88555 154895 87223 -155459 -89258 153804 90574 -150871 -89215 151982
230 151982 93528 -146288 -90307 148869 95266 -143001 -92361 144328 95841 -140015 -95169
241 -95169 138429 95021 -137184 -97859 132207 95200 -133606 -99760 127206 95956 -128833
252 -128833 -100434 123390 98300 -123220 -100225 120502 101102 -117484 -100251 117988 104069
263 104069 -112442 -101033 114323 105992 -108633 -103683 109922 107589 -106069 -107256 104941
274 104941 108381 -104220 -111250 100206 109483 -101700 -114335 96233 111436 -98504 -116414
285 -116414 93568 114769 -94147 -117230 91539 118399 -89287 -117788 89718 121002 -84617
296 -84617 -118526 86455 122472 -81273 -119673 82276 123020 -78795 -121758 77599 122585
307 122585 -76608 -124570 73106 122087 -74381 -125991 69484 122889 -71711 -126777 67050
318 67050 124527 -68164 -126764 65534 126837 -64076 -126159 64724 129213 -60755 -126761
329 -126761 63041 130982 -58576 -128094 60466 131513 -57325 -129993 57190 130603 -56479
340 -56479 -131846 54002 129937 -55213 -133139 50501 129590 -52732 -132858 48427 129846
351 129846 -49517 -131302 46740 130326 -45137 -129058 44984 130405 -41148 -126768 42842
362 42842 129633 -38285 -125716 39727 127855 -36071 -125710 35785 125597 -34722 -125896
373 -125896 31472 123511 -32615 -126274 28150 122280 -30130 -125243 25840 122281 -26548
384 -26548 -123879 24140 123033 -22607 -122196 22547 123719 -18863 -120852 20187 123807
395 123807 -16021 -120326 17298 122416 -13382 -120199 13010 120468 -11592 -120543
405 -120543 8808 118430 -9483 -120079 4781 116627 -6309 -119150 1672 115610
415 115610 -2354 -116949 -482 115407 1866 -114626 -2421 115504 5919 -112685
425 -112685 -4753 114974 9297 -111608 -8019 113908 11697 -111806 -11769 112656
435 112656 13430 -112819 -15889 111425 15237 -113790 -19234 110648 17713 -113685 -21617
446 -21617 110962 20674 -112749 -23118 111763 23918 -111469 -24342 112459 27451 -110129
457 -110129 -26080 112720 29951 -109163 -28195 111342 31428 -108705 -30903 109133 32230
468 32230 -108698 -33611 106984 33036 -108334 -35898 104841 33742 -107035 -37555 103743
479 103743 35739 -105049 -38113 103456 38177 -102766 -38580 103237 40567 -100702 -39093
490 -39093 102679 42769 -99837 -40595 101605 43654 -99251 -42774 99921 44436 -99366
501 -99366 -45742 97855 44936 -98892 -47738 95986 45796 -97236 -49376 93973 47634
512 47634 -95294 -49984 92996 50270 -92164 -50309 91763 52017 -88696 -50942 90038
523 90038 54117 -85924 -51815 87311 54917 -84100 -53966 84007 55391 -82513 -56328
534 -56328 80606 55724 -81070 -58279 77877 56455 -79272 -59856 75817 58286 -77034
545 -77034 -60894 74975 60760 -74418 -61464 74272 63203 -72016 -62053 73347 65386
556 65386 -70271 -63920 71817 67111 -68996 -66125 69214 67848 -68375 -68782 66347 68515
568 68515 -67071 -71298 63937 69789 -65301 -73039 61647 71303 -62720 -73657 60137 73426
580 73426 -59478 -73876 58987 75553 -56677 -74235 57582 76961 -53960 -75357 55762
591 55762 78337 -52796 -76909 53470 78160 -51872 -78768 50960 78333 -51289 -80469
602 -80469 49136 78912 -50839 -81954 47685 79936 -49379 -82356 47468 81714 -47456
613 -47456 -82073 47299 83295 -45572 -82098 46947 84410 -43820 -82326 45565 84815
624 84815 -42606 -83008 43106 84125 -41711 -83580 40555 82924 -40573 -84405 37963
635 37963 82173 -39164 -84330 35731 82136 -36824 -83539 34286 82548 -34218 -82297
646 -82297 33484 83025 -31462 -81279 32077 83417 -29160 -81018 30034 83288 -27381
657 -27381 -81416 27841 82974 -26237 -82454 25344 81841 -25267 -83237 22375 81409
668 81409 -23742 -83722 20353 81369 -21335 -83343 18859 81934 -18576 -82596 17724
679 17724 82532 -15688 -81259 16162 83033 -12923 -80322 13889 82339 -10703 -80319 10819
691 10819 81377 -8975 -80776 7899 79953 -7438 -80943 4939 79251 -5782 -81026 2653
703 2653 78997 -3639 -80549 1125 79372 -944 -79860 -130 80399 1793 -79380 -1045
715 -1045 81125 4051 -79104 -2741 81858 5719 -80049 -4622 81288 6738 -80893 -6957
727 -6957 80652 7626 -81600 -9646 80079 8509 -81837 -11682 79638 10398 -81496 -12619
739 -12619 79980 12342 -80095 -13532 80090 14789 -78821 -14227 79874 16728 -77684 -15213
751 -15213 79471 17709 -76924 -16772 78155 18557 -77120 -18747 76615 18933 -77137 -20418
763 -20418 75319 19399 -77117 -21782 74824 20455 -76174 -22487 74774 22081 -75146 -22948
775 -22948 75055 23608 -73899 -23073 75377 25482 -72587 -23697 74301 26281 -72060 -25328
787 -25328 72753 26967 -71413 -27036 70950 27132 -70805 -28987 68838 27728 -69746 -30691
799 -30691 66995 29182 -67885 -31689 65538 31181 -65588 -31890 64546 33012 -63392 -32740
811 -32740 63717 34912 -61199 -33428 62521 35921 -59980 -34961 60948 36813 -59417 -36819
823 -36819 59158 37592 -59157 -38937 57282 38189 -58535 -40822 56369 39366 -57573 -41737
835 -41737 55714 41068 -56012 -42228 55136 42993 -54225 -42687 54873 44682 -52497 -43869
847 -43869 53726 46317 -51439 -45111 52366 47034 -50587 -46866 50058 47117 -50082 -48382 48130
860 48130 47718 -49338 -49939 46670 48730 -47867 -50688 46107 49947 -46313 -51118 45526 51368 -44607
874 -44607 -51178 45257 52767 -43470 -51768 44899 53960 -42602 -52556 43863 54443 -42509 -54151
887 -54151 42519 54474 -42357 -55538 41101 54638 -42244 -56384 40099 54970 -41452 -56829
899 -56829 39580 55705 -39998 -56476 39095 56326 -38142 -56059 38346 57315 -36347 -55527
911 -55527 37119 57281 -35007 -55905 35605 56847 -33500 -56422 33619 56365 -33185 -56903
923 -56903 31679 55887 -32451 -57399 30248 55788 -30988 -57568 28895 56205 -29364 -56741
935 -56741 28106 57080 -27529 -56748 27382 57933 -25718 -56556 26481 58309 -24051 -57182
947 -57182 25019 58090 -22993 -57244 22855 57685 -21869 -58253 20674 57460 -20537 -58882
959 -58882 18258 57083 -18994 -58758 16518 57220 -16853 -58174 15208 57620 -14220 -57431
971 -57431 13994 58241 -11803 -56899 12367 58695 -10026 -56855 10738 58499 -9075 -57574
983 -57574 8548 58050 -8281 -58415 6954 57756 -7294 -59138 5422 57873 -6253 -59486
995 -59486 4439 58485 -5150 -59509 3781 59397 -3347 -59199 3121 60223 -1569 -59119
1007 -59119 2214 60617 -343 -58912 1318 60398 467 -59458 -154 59736 1073 -59826
1019 -59826 -2204 59000 1729 -59777 -3901 58213 2814 -59650 -4751 57970 4153 -59099
1031 -59099 -5435 58231 6011 -57904 -5676 58381 7118 -57114 -6244 58237 8321 -56700
1043 -56700 -7318 57647 8647 -56573 -8116 57315 8544 -57012 -9399 56199 9046 -57154
1055 -57154 -10341 55722 9624 -57087 -11431 55288 10844 -56153 -11953 55168 11845 -54903
1067 -54903 -12226 54934 13368 -53531 -12546 54316 14651 -52313 -13799 52919 15263 -51655
1079 -51655 -15054 51438 15842 -50979 -16637 50153 16340 -50252 -18100 48833 17452 -49554
1091 -49554 -19051 47910 18719 -48564 -19856 47451 20155 -47276 -20567 47413 21697 -46018
1103 -46018 -21149 47018 22896 -45336 -21884 46434 23849 -45343 -23484 45591 24299 -45102
1115 -45102 -24921 44279 24860 -44787 -26711 43166 25914 -43972 -27794 42398 27126 -43159
1127 -43159 -28565 41948 28804 -41712 -28827 41448 29913 -40398 -29637 41110 31243 -39026
1139 -39026 -30160 40335 31919 -38806 -31673 38817 32517 -38596 -32982 37922 32629 -38511 -33904
1152 -33904 37066 33169 -37995 -34699 36482 33763 -37533 -34986 36534 34730 -36439 -35313 36958
1165 36958 35821 -35849 -35089 36451 36678 -34892 -35549 36119 37292 -34742 -36373 34975 37216 -34435
1179 -34435 -37397 34013 37023 -33744 -37834 32491 36979 -33359 -38164 31211 37371 -32016 -38229
1192 -38229 30478 37660 -30161 -38153 30239 38408 -28922 -37573 29374 38980 -27705 -37585 28580
1205 28580 38787 -26934 -37997 27332 38686 -26614 -38775 26194 38571 -26415 -39200 24877
1217 24877 38191 -25756 -39826 24227 38417 -24710 -39628 23652 39085 -23449 -39209 23032
1229 23032 39830 -21781 -39174 22203 40376 -20336 -39373 21000 40501 -19518 -39605 19216
1241 19216 40271 -18294 -39978 17724 40105 -17432 -40567 15927 39881 -16424 -40985 14574
1253 14574 40171 -15153 -41181 13702 40403 -13715 -41120 13265 41626 -12428 -41068 12613
1265 12613 42094 -11020 -41168 11990 42460 -10554 -41511 10976 42373 -10154 -42654 9761
1277 9761 42657 -9566 -43049 8554 42322 -9498 -43912 7631 42702 -8482 -43981 7186
1289 7186 42972 -7220 -43481 6621 43828 -5843 -43060 6389 43822 -4741 -42682 5391
1301 5391 44060 -3856 -42910 4388 43349 -3275 -43200 3059 43196 -3129 -43327 2170
1313 2170 42657 -2544 -43485 1081 42481 -1890 -43157 756 42540 -844 -42694 241
1325 241 42836 336 -42419 215 43069 898 -41933 -264 43322 1370 -41820 -1131
1337 -1131 42658 2003 -41888 -1891 41571 2318 -41925 -3070 40899 2696 -41568 -4413
1349 -4413 40264 3560 -41111 -4811 39763 4615 -39853 -5396 39452 6070 -38906 -5855
1361 -5855 39064 7396 -38072 -6621 38754 8069 -37633 -7698 38087 8937 -37501 -8765
1373 -8765 37404 9299 -37571 -10200 36599 9692 -37360 -11013 36600 10513 -37354 -11659
1385 -11659 35916 11507 -36716 -12241 36324 12708 -36048 -12463 36361 13814 -35257 -13535
1397 -13535 35801 14828 -34577 -14486 35333 15712 -34612 -15680 34607 15734 -34449 -16994
1409 -16994 33442 16658 -34117 -18054 32950 17085 -33658 -18777 32731 18248 -33066 -19058
1421 -19058 32493 19430 -32142 -19282 32709 20072 -31622 -19444 32649 21076 -31618 -20046
1433 -20046 32372 21144 -31524 -20732 31631 20992 -31831 -21734 31231 21319 -32019 -22177
1445 -22177 30976 21428 -31902 -22839 30575 22085 -31301 -22695 30698 22996 -30123 -22383 30443
1458 30443 23312 -29256 -22587 29774 23926 -28649 -23250 29293 24379 -28112 -23807 27953 24077
1471 24077 -27652 -24484 26865 24255 -27141 -25106 25956 24331 -26622 -25481 25468 25038 -25579
1484 -25579 -25390 25112 25525 -24607 -25415 25045 25933 -23974 -25434 24357 26444 -23062 -25579 23691
1498 23691 26635 -22763 -26302 22786 26617 -22249 -26890 21604 26666 -22051 -27523 20819 26747
1511 26747 -21330 -27815 19721 27240 -20100 -27889 19240 28024 -18999 -27697 18597 28207 -17603
1524 -17603 -27948 17826 28824 -16398 -28057 17126 29048 -16015 -29058 16001 29047 -15689
1536 -15689 -29300 14877 29147 -15273 -30218 14153 29541 -14823 -30542 13751 29838 -14162
1548 -14162 -30589 13455 30708 -13134 -31022 13195 31243 -12700 -30784 12984 31820 -12082
1560 -12082 -31037 12180 32025 -11358 -31684 11241 31838 -11126 -32201 10744 31688 -10661
1572 -10661 -32450 9427 31819 -10206 -32717 8828 32060 -9344 -32584 8567 32346 -8564
1584 -8564 -32225 8495 32661 -7700 -31709 8354 32757 -7159 -31798 7799 32850 -6526
1596 -6526 -32169 7046 32546 -6854 -32429 6384 32085 -6640 -32623 5532 31976 -6309
1608 -6309 -32871 5495 31813 -5649 -32664 4885 31863 -4743 -32116 4689 32180 -3767
1620 -3767 -31486 4202 32178 -3181 -30929 3292 31645 -2178 -30983 2509 31322 -2064
1632 -2064 -31039 1153 30752 -1451 -30929 387 30260 -823 -30747 -530 30024 127
1644 127 -30212 -1073 29848 1148 -29860 -1511 29869 2228 -29458 -1850 30257 2852
1656 2852 -29198 -2333 29903 3358 -29143 -3172 29651 3940 -29439 -4345 29125 4353
1668 4353 -29827 -5222 28787 4994 -29302 -5999 28552 5662 -29148 -6448 28786 6654
1680 6654 -28761 -7130 28598 7598 -28187 -7484 28663 8721 -27770 -8456 28243 9332
1692 9332 -27601 -9266 28172 9883 -27610 -9969 27532 9891 -27970 -10838 27291 10360
1704 10360 -27814 -11424 26857 11024 -27675 -11620 27070 11718 -27222 -11855 27229 12141
1716 12141 -27012 -11854 27523 12566 -26817 -12193 27491 12879 -26658 -12756 26918 13200
1728 13200 -26663 -13289 26297 13118 -26499 -14091 25897 13486 -26155 -14603 25391 13849
1740 13849 -25771 -14464 25123 14469 -25052 -14699 24933 15278 -24219 -14802 24699 15812
1752 15812 -23799 -15015 24258 15733 -23343 -15629 23566 15943 -23109 -16005 22812 16270 -22846
1765 -22846 -16672 22330 15994 -22810 -17252 21850 16723 -22128 -17253 21498 16954 -21485 -16898
1778 -16898 21458 17535 -20551 -17287 21084 18060 -20073 -17568 20431 18549 -19535 -18392 19486
1791 19486 18660 -18966 -18967 18716 18887 -18550 -19647 17765 19232 -18115 -20066 17192 19551 -17145
1805 -17145 -20510 16413 20279 -16645 -20637 16250 20926 -15682 -20514 15817 21579 -15266 -20918
1818 -20918 15730 21823 -14824 -21310 15209 21991 -14631 -21913 14185 22099 -14612 -22447 14157
1831 14157 22270 -14370 -23183 13764 22560 -14114 -23372 13145 22981 -13134 -23320 13172 23399
1844 23399 -12481 -23437 12974 23870 -11907 -23425 12076 24202 -11520 -23602 11774 24278
1856 24278 -10898 -23973 10953 24173 -10945 -24686 10020 24132 -10686 -24842 9493 24138
1868 24138 -10162 -24898 9471 24319 -9543 -24568 9207 24886 -9004 -24299 8851 25183
1880 25183 -8606 -24412 9052 24956 -7981 -24480 8455 25145 -8005 -24772 8035 24550
1892 24550 -7817 -24994 7386 24256 -7336 -24969 6483 24039 -7067 -24926 6031 24367
1904 24367 -6001 -24503 5651 24337 -5114 -24221 4996 24273 -4394 -23979 4590 24397
1916 24397 -3565 -23684 3891 23998 -3336 -23783 2907 23729 -2715 -24064 1982 23602
1928 23602 -2402 -24088 1509 23546 -1947 -24071 835 23549 -1345 -23867 968 24025
1940 24025 -463 -23653 420 24098 406 -23339 66 23939 657 -23339 -396 23865
1952 23865 1109 -23683 -1620 23852 1532 -23360 -2297 23404 2071 -23953 -3024 23042
1964 23042 2842 -23806 -3638 23112 3561 -23579 -4140 23105 4285 -23005 -4429 23572
1976 23572 4734 -23015 -4603 23452 5402 -22817 -4921 23342 5675 -22965 -5291 23259
1988 23259 5915 -23108 -6329 23135 5792 -23309 -6596 22915 6019 -23211 -6841 22828
2000 22828 6655 -23282 -7027 22999 7461 -22539 -7256 22930 7790 -22076 -7461 22674
2012 22674 8190 -21880 -7779 22324 8533 -21942 -8387 21551 8587 -21600 -8840 21122
2024 21122 8608 -21355 -9439 20678 9189 -21268 -10003 20469 9443 -20873 -9992 20462
2036 20462 10099 -20248 -10123 20339 10484 -19779 -9924 20305 10436 -19404 -10086 19849 10894
2049 10894 -19153 -10722 19334 10943 -19063 -11202 18614 11018 -19054 -11684 18182 11144 -18680
2062 -18680 -11930 17844 11607 -18220 -12329 17373 12428 -17362 -12411 17380 12917 -16593 -12491
2075 -12491 16956 13611 -15982 -13194 16322 13788 -15726 -13785 15773 14048 -15524 -14381 15296
2088 15296 14224 -15288 -14803 14774 14683 -15262 -15226 14389 14693 -14781 -15461 14338 14962 -14388 -15441
2103 -15441 14717 15688 -13925 -15557 14415 16021 -13870 -15635 14024 16486 -13641 -16102 13685
2116 13685 16224 -13408 -16649 12922 16525 -13480 -17074 12678 16650 -12917 -17171 12412 17023
2129 17023 -12500 -17518 11880 17422 -11753 -17374 11720 18166 -11461 -17616 11592 17991 -11046
2142 -11046 -17638 11343 17956 -10789 -17896 10993 18241 -10655 -18205 10454 18084 -10767 -18519
2155 -18519 9870 17948 -10449 -18534 9723 18140 -10127 -18429 9778 18102 -9611 -18331 9698
2168 9698 18442 -9124 -17943 9378 18623 -8608 -18099 8656 18469 -8326 -18237 8007 18502
2181 18502 -7809 -18320 7238 18202 -7632 -18632 6909 18082 -7088 -18457 6271 17986
2193 17986 -6471 -18436 5857 18034 -5689 -18441 5622 18602 -5175 -18028 5296 18719
2205 18719 -4720 -18075 4920 18711 -4285 -18161 4500 18508 -3814 -18548 3523 18472
2217 18472 -3740 -18632 3141 18180 -3447 -18748 2723 18310 -3063 -18748 2530 18528
2229 18528 -2264 -18724 2022 18756 -1492 -18376 1564 18685 -1080 -18334 1130 18819
2241 18819 -270 -18343 369 18905 4 -18548 -78 18705 123 -18990 -517 18430
2253 18430 557 -19265 -856 18514 888 -19094 -1095 18865 1265 -18944 -1321 18942
2265 18942 1515 -18458 -1316 19094 1963 -18476 -1566 18669 2011 -18363 -1862 18989
2277 18989 2076 -18703 -2557 18665 2461 -18878 -2607 18409 2626 -18828 -3207 18068
2289 18068 2966 -18528 -3442 18180 3446 -18353 -3695 18043 3996 -17771 -3847 18302
2301 18302 4299 -17602 -4150 17906 4558 -17274 -4169 17607 4700 -17402 -4920 17089
2313 17089 4697 -17095 -5174 16780 4820 -16987 -5759 16485 5208 -16745 -5712 16386
2325 16386 5461 -16269 -5943 16329 5588 -16232 -5619 16213 6149 -15604 -5907 15793
2337 15793 6728 -15258 -6416 15718 7144 -15041 -6970 15292 7152 -15251 -7563 14665 7277
2350 7277 -14819 -8096 14440 7810 -14569 -8480 13856 8474 -14251 -8660 14086 9015 -13795
2363 -13795 -8627 14048 9065 -13346 -8996 13723 9800 -13150 -9542 13387 9905 -13197 -9718
2376 -9718 12984 10107 -13188 -10145 12817 9883 -13311 -10725 12501 10168 -13058 -10656 12522
2389 12522 10542 -12913 -10922 12389 11027 -12124 -10974 12558 11466 -12121 -10872 12272 11733
2402 11733 -12006 -11319 12134 11717 -11441 -11987 11570 11971 -11440 -12399 11224 12035 -11256 -12377
2416 -12377 10775 12040 -11050 -12571 10642 12538 -11010 -12688 10682 12923 -10534 -12300 10515
2429 10515 12729 -10245 -12480 10431 12844 -10133 -12653 10348 12752 -10086 -12634 9845 12880
2442 12880 -10086 -12785 9541 12510 -9718 -12980 8860 12632 -9236 -13493 8534 12998 -8815
2455 -8815 -13289 8521 13002 -8293 -12974 8348 13372 -7702 -12857 7699 13347 -7399 -13071
2468 -13071 7690 13466 -6716 -13266 6907 13372 -6580 -13414 6349 13260 -6515 -13548 5970
2481 5970 13329 -6306 -13688 5592 13610 -5752 -13620 5547 13619 -5073 -13577 5358 13920
2494 13920 -4718 -13481 4940 13855 -4492 -13525 4797 14074 -4394 -13802 4241 13946 -3837
2507 -3837 -14237 3465 13717 -3526 -14260 3376 13963 -3287 -14466 2734 14087 -2689
2519 -2689 -14418 2362 14263 -2230 -14342 2362 14593 -2091 -14303 1939 14469 -1607
2531 -1607 -14332 1974 14677 -1368 -14674 1201 14818 -1231 -14896 1098 14545 -1316
2543 -1316 -14809 852 14424 -1124 -14925 702 14862 -705 -14627 737 14776 -450
2555 -450 -14597 544 14910 -146 -14336 356 14804 106 -14520 99 14636 334
2567 334 -14609 -230 14802 542 -14469 -609 14322 583 -14293 -1270 14046 864
2579 864 -14439 -1556 14049 1142 -14207 -1462 13961 1694 -13983 -1691 14069 2045
2591 2045 -13585 -1721 14100 2480 -13541 -1999 14047 2433 -13649 -2193 13480 2605
2603 2605 -13382 -2661 13051 2367 -13450 -2723 13199 2687 -13514 -3183 13038 3065
2615 3065 -12846 -3313 12862 3649 -12704 -3606 12541 3895 -12370 -3827 12787 4419 -12549
2628 -12549 -4406 12316 4798 -12033 -4758 12223 4789 -12086 -5345 11619 5135 -12062 -5564
2641 -5564 11655 5647 -11907 -5852 11270 5510 -11779 -6268 11570 5825 -11466 -5831 11471
2654 11471 6359 -11330 -5976 11606 6410 -10831 -6353 11585 6815 -11259 -6464 10909 6760
2667 6760 -11278 -6947 10801 6775 -10819 -7334 10642 7132 -10701 -7704 10530 7575 -10618
2680 -10618 -7861 10730 7992 -10514 -7979 10290 8172 -10154 -8081 10336 8608 -9944 -8257
2693 -8257 10321 8716 -9867 -8755 9869 8723 -9608 -8891 9768 8745 -10084 -8898 9355
2706 9355 8848 -9622 -9153 9188 8811 -9380 -9133 9237 8947 -9340 -9001 9151 9260 -8908 -8952
2721 -8952 9147 9320 -8750 -8877 8840 9382 -8361 -9104 8520 9316 -8580 -9321 8006 9311 -8032
2736 -8032 -9687 7690 9424 -7954 -9709 7401 9538 -7583 -9782 7378 9841 -7133 -9710
2749 -9710 6977 9888 -6638 -9765 6861 10137 -6252 -9702 6389 10010 -6020 -10098 6130
2762 6130 10223 -5862 -9926 5809 10406 -5997 -10480 5526 10234 -5823 -10637 5609 10054
2775 10054 -5465 -10508 5019 10500 -4955 -10460 4948 10466 -4575 -10720 4629 10808 -4351
2788 -4351 -10646 4572 10895 -4160 -11065 4298 11074 -3820 -11192 3763 11070 -3850 -11262
2801 -11262 3272 11063 -3697 -11794 2957 11350 -3226 -11523 2799 11436 -3019 -11519 2846
2814 2846 11736 -2902 -11275 3006 11913 -2424 -11411 2843 11684 -2448 -11289 2388 11488
2827 11488 -2272 -11462 1940 11509 -2458 -11614 1770 11496 -2490 -11807 1679 11375 -1810
2840 -1810 -11722 1553 11672 -1525 -11636 1392 11593 -1293 -11723 1439 11736 -1042
2852 -1042 -11397 1185 11781 -886 -11438 794 11626 -702 -11496 497 11540 -479
2864 -479 -11324 289 11464 -485 -11463 102 11175 -472 -11326 -99 11172 -162
2876 -162 -10913 -263 11296 441 -10906 -176 11209 762 -10715 -466 11043 747
2888 747 -10817 -511 10915 888 -10691 -1235 10450 1085 -10780 -1319 10214 1501 -10649
2901 -10649 -1797 10437 1837 -10685 -2384 10300 1978 -10272 -2233 10384 2706 -10024 -2695
2914 -2695 10194 2924 -10001 -2507 10502 3175 -10036 -2908 10279 3140 -9795 -3119 10085
2927 10085 3198 -10099 -3732 9928 3329 -10177 -3752 9689 3366 -10221 -3873 9935 3771
2940 3771 -9856 -4228 9708 4003 -9595 -4186 9488 4322 -9688 -4348 9726 4578 -9529
2953 -9529 -4445 9698 4785 -9450 -4833 9412 4948 -9250 -5071 9409 5064 -9403 -5434
2966 -5434 9161 5130 -9331 -5293 9061 5201 -9039 -5383 9160 5495 -9001 -5423 9054
2979 9054 5728 -8518 -5732 8950 5724 -8520 -5764 8926 5691 -8754 -5662 8576 6104
2992 6104 -8371 -6115 8305 6038 -8544 -6173 8153 6003 -8350 -6182 7865 6076 -8099
3005 -8099 -6362 7893 6192 -7828 -6481 7911 6413 -7673 -6378 7764 6858 -7188 -6471 7332
3019 7332 6626 -7222 -6543 7346 7007 -6890 -6951 6894 6919 -6915 -7036 6612 6793 -6656 -7431 6445
3035 6445 7030 -6300 -7069 6216 7282 -5946 -7193 5883 7300 -5711 -7339 5733 7619 -5492
3049 -5492 -7353 5910 7376 -5347 -7659 5440 7825 -5454 -7628 5221 7735 -5174 -7893
3062 -7893 4755 7594 -4779 -8162 4661 7961 -4900 -8478 4615 8215 -4159 -8152 4535
3075 4535 8197 -3934 -8413 4367 8740 -3854 -8537 4305 8930 -3881 -8761 3771 8704
3088 8704 -3966 -8813 3760 8591 -3582 -8721 3343 8911 -3643 -9176 3118 8680 -3496
3101 -3496 -8891 3300 8726 -3388 -8949 3197 8852 -3194 -9058 3133 9259 -2831 -8684
3114 -8684 3042 9154 -2535 -8957 2769 9069 -2524 -8925 2249 8925 -2487 -9288 2063
3127 2063 8917 -2423 -9418 2064 9033 -2208 -8968 2031 8773 -1927 -8998 2097 9007
3140 9007 -1799 -8921 2121 9139 -1624 -8580 1443 9089 -1353 -8784 1256 8725 -1413
3153 -1413 -8519 1178 8675 -1388 -8658 893 8482 -1051 -8921 673 8512 -1039 -8669 753 8577
3168 8577 -502 -8373 605 8456 -189 -8424 257 8632 44 -8452 153 8627 510 -8422 -206
3183 -206 8347 487 -8848 -713 8226 820 -8478 -924 8058 877 -8402 -1103 8421 917 -8347
3198 -8347 -1512 8209 1345 -8153 -1397 8358 1500 -8214 -1546 8185 1807 -7923 -1530 8225 1737
3213 1737 -8157 -1831 8199 1896 -8077 -2085 8083 1986 -8169 -2366 8035 2064 -8102 -2441
3227 -2441 7891 2223 -8390 -2470 7985 2383 -7918 -2687 7770 2642 -7713 -2582 8127
3240 8127 3238 -8051 -2877 7986 3066 -7960 -2917 7795 3128 -8082 -3444 7694 2924
3253 2924 -8047 -3436 7525 3295 -7747 -3530 7427 3468 -7517 -3524 7344 3579 -7374
3266 -7374 -3475 7455 3727 -7019 -3514 7309 3748 -7218 -3542 7348 3910 -7025 -3860
3279 -3860 7105 3676 -7014 -4040 6869 3906 -6871 -4129 6645 4232 -6635 -4195 6521
3292 6521 4281 -6645 -4378 6521 4578 -6646 -4151 6437 4371 -6307 -4417 6126 4762
3305 4762 -5864 -4457 6173 4770 -6032 -4875 5940 4782 -5915 -4916 5719 4689 -5560
3318 -5560 -5130 5669 4873 -5633 -5068 5473 5102 -5474 -5284 5349 5047 -5192 -5105 5090 5292
3333 5292 -4989 -5229 4950 5414 -4727 -5497 5012 5791 -4808 -5597 4712 5864 -4582 -5910
3347 -5910 4607 5887 -4465 -6030 4316 6202 -4300 -6206 4195 6138 -4304 -6420 4185
3360 4185 6311 -4016 -6467 4059 6350 -4009 -6330 3756 6445 -3686 -6242 3796 6310
3373 6310 -3568 -6428 3843 6610 -3295 -6348 3470 6258 -3623 -6663 3584 6386 -3401 -6580
3387 -6580 3272 6502 -3299 -6597 2951 6536 -3418 -6846 3184 6843 -3295 -6803 3077 6661
3401 6661 -2689 -6494 2582 6764 -2490 -6672 2724 6770 -2504 -6832 2682 6845 -2660 -6684 2180
3416 2180 6580 -2080 -6813 1884 6692 -2154 -6642 1979 6464 -1964 -6803 1836 6516 -1807 -6459
3431 -6459 1657 6825 -1740 -6446 1857 6627 -1454 -6392 1511 6503 -1303 -6617 1399 6407 -1250
3446 -1250 -6452 1230 6526 -1087 -6569 824 6451 -910 -6854 827 6473 -643 -6380 709 6448
3461 6448 -263 -6795 365 6620 -61 -6485 161 6808 125 -6706 93 6581 -21 -6704 -9
3476 -9 6560 407 -6594 -344 6487 549 -6669 -499 6461 406 -6457 -953 6237 876 -6552 -775
3492 -775 6590 945 -6468 -896 6558 1042 -6378 -1009 6423 1155 -6370 -1049 6698 1120 -6236
3507 -6236 -1411 6393 1405 -6255 -1430 6419 1472 -6469 -1841 6169 1537 -6569 -1792 6349 1866
3522 1866 -6432 -2102 6398 1989 -6503 -1869 6345 2007 -6143 -2153 6664 1974 -6136 -1821 6335
3537 6335 1951 -5768 -2074 6231 2208 -6004 -2406 5840 1946 -6123 -2505 5854 2142 -6156 -2389
3552 -2389 5755 2218 -5872 -2630 5972 2673 -5917 -2553 5750 2894 -5405 -2591 5714 2759 -5609
3567 -5609 -2743 5719 2978 -5577 -2686 5436 2910 -5490 -3067 5079 2950 -5439 -3250 5262 3186
3582 3186 -5283 -3328 4900 3260 -5078 -3357 4822 3363 -4904 -3582 4818 3733 -4628 -3299 4892
3597 4892 3636 -4376 -3773 4689 3647 -4440 -3582 4503 3640 -4481 -3768 4380 3765 -4356 -4062 4359
3613 4359 3742 -4260 -3979 4078 3927 -4173 -4110 3985 4271 -4018 -4286 3775 4411 -3856 -4316 4022 4479
3630 4479 -3556 -4359 4056 4490 -3856 -4614 3732 4737 -3789 -4832 3589 4485 -3588 -4802 3596 4386
3646 4386 -3797 -4839 3318 4860 -3275 -5052 3408 4794 -3374 -4835 3433 4799 -3108 -4900 3187
3661 3187 4905 -3068 -4693 3360 5054 -2953 -5087 3180 4930 -3230 -5010 3012 5061 -3017 -5252
3676 -5252 2771 5016 -2768 -5209 2774 4794 -2814 -4998 2597 4978 -2660 -5332 2502 5146 -2593
3691 -2593 -5013 2171 5194 -1976 -4921 2665 5107 -2294 -5066 2100 5301 -1932 -5139 1820 5104
3706 5104 -2118 -4957 1683 4819 -2016 -5295 1924 5016 -1715 -5054 1611 5098 -1606 -4989 1376
3721 1376 5024 -1373 -4959 1354 5047 -1209 -4985 1268 5313 -1281 -5220 1284 5230 -921 -5327
3736 -5327 851 5159 -863 -4941 484 5158 -626 -5044 530 5276 -885 -5011 180 4990 -509
3751 -509 -5071 482 5238 -398 -5179 422 5162 -200 -5103 131 4927 50 -5106 -64 5157
3766 5157 -137 -4992 89 4907 154 -5305 -67 5047 201 -5194 -139 5128 282 -5310 -484
3781 -484 5244 611 -5300 -470 5176 599 -5109 -603 5213 666 -4813 -611 5199 636 -5216
3796 -5216 -958 5138 699 -5290 -1090 4919 892 -5230 -845 5141 821 -5250 -1003 4864 966
3811 966 -5082 -1086 5082 1133 -4913 -1235 4921 1415 -4824 -994 4954 1279 -4913 -1165 4846
3826 4846 1230 -4839 -1249 4741 1334 -4659 -1270 4702 1462 -4828 -1408 4771 1579 -4706 -1760
3841 -1760 4529 1602 -4646 -1852 4627 1793 -4619 -1460 4281 1845 -4331 -1575 4380 1969 -4443
3856 -4443 -2026 4207 2105 -4262 -2046 4158 2044 -4185 -2121 4256 2275 -3823 -1974 4156 2371
3871 2371 -4126 -2447 3974 2297 -4115 -2189 3891 2352 -3695 -2172 3771 2498 -3426 -2540 3710
3886 3710 2826 -3487 -2588 3640 2872 -3743 -2778 3632 3001 -3373 -2934 3348 3011 -3551 -2911 3530 2950
3903 2950 -3461 -2996 3189 3109 -3400 -3429 3175 3128 -3219 -3323 3106 3345 -3301 -3165 3194 3397 -3053 -3327
3921 -3327 3189 3459 -3155 -3271 2907 3427 -2966 -3731 3118 3473 -2752 -3393 2988 3421 -2982 -3440 2789
3938 2789 3407 -2922 -3768 2758 3439 -2933 -3580 2542 3751 -2835 -3478 2861 3808 -2728 -3748 2759
3954 2759 3755 -2466 -3772 2641 3841 -2478 -3806 2390 3890 -2424 -3884 2376 3536 -2194 -3798
3969 -3798 2274 3514 -2160 -3888 1975 3783 -2027 -3823 2143 3782 -2113 -3452 2233 3868 -1901
3984 -1901 -3412 1649 3797 -1642 -3685 1728 3937 -1736 -3700 1586 3681 -1940 -3944 1465 3821
3999 3821 -1472 -3774 1274 3731 -1307 -3811 1416 3873 -1355 -3804 1196 3652 -1035 -3901 1280
4014 1280 4046 -864 -3942 1136 3871 -944 -3937 927 3877 -1042 -3831 821 3807 -810 -3806
4029 -3806 731 3990 -893 -4147 158 3966 -520 -4171 456 3782 -541 -3752 503 4067 -150
4044 -150 -3784 326 3934 -330 -3992 347 4057 59 -3651 129 4381 -162 -4004 144 3782
4059 3782 -91 -4136 77 3772 -56 -4107 -131 4074 110 -3951 -182 3989 147 -3886 -44
4074 -44 3865 293 -4073 24 4024 177 -3713 -211 4028 570 -3782 -600 4034 428 -3726
4089 -3726 -499 3897 415 -3724 -721 3949 518 -3846 -418 3665 498 -3895 -684 3834 469
4104 469 -3927 -603 3884 710 -3601 -887 3707 781 -3556 -769 3814 862 -3315 -850 3837
4119 3837 877 -3611 -744 3650 826 -3528 -1070 3301 1175 -3520 -1119 3139 1024 -3520 -1279
4134 -1279 3301 1250 -3286 -1272 3391 1323 -3375 -1103 3477 1367 -3236 -1388 3376 1313 -3099
4149 -3099 -1514 3040 1473 -3250 -1255 3165 1381 -2742 -1521 3009 1697 -2991 -1572 2954 1779
4164 1779 -3062 -1907 2605 1877 -3041 -1802 2855 1788 -2666 -2011 2817 2137 -2543 -1986 3084 2301
4180 2301 -2653 -2111 2675 2283 -2701 -2197 2602 1938 -2427 -2081 2530 2141 -2724 -2270 2525 2315 -2505
4197 -2505 -2363 2388 2279 -2582 -2525 2521 2171 -2424 -2288 2623 2659 -2281 -2436 2332 2415 -2129 -2269 2379
4215 2379 2663 -2189 -2597 2487 2444 -2395 -2337 2521 2273 -2049 -2656 2039 2469 -2428 -2529 2286 2593 -2288
4233 -2288 -2777 2100 2625 -2016 -2587 1883 2561 -2009 -2387 2033 2888 -2117 -2536 1945 2799 -1915 -2688
4250 -2688 1843 2792 -1702 -2678 1756 2679 -1784 -2945 1448 2670 -1881 -2690 1557 2908 -1658 -2604
4266 -2604 1727 2749 -1215 -2510 1555 2710 -1386 -2570 1253 2605 -1579 -2766 1389 2579 -1197
4281 -1197 -2563 1324 2758 -1125 -2761 1197 2727 -1278 -3100 940 2778 -1042 -2887 871 2942
4296 2942 -738 -2686 893 2848 -656 -2868 834 2908 -606 -2735 763 2708 -751 -3058 525
4311 525 3108 -649 -2638 657 2877 -488 -3091 757 2870 -535 -2961 532 2826 -603 -2754
4326 -2754 241 2921 -242 -2918 301 2710 -387 -3031 -154 2899 -370 -3053 313 3038 27
4341 27 -2731 373 2944 -417 -2940 194 2869 -63 -3172 132 2755 -221 -3077 -57 2848
4356 2848 -61 -2850 129 3072 -121 -3017 -92 2909 259 -2917 -250 2991 36 -2664 52
4371 52 2690 330 -2884 -56 2757 350 -3002 -215 2769 331 -2941 -575 2705 165 -2671
4386 -2671 -543 2785 361 -2710 -183 2632 335 -2803 -475 2729 509 -2622 -382 2700 763
4401 763 -2822 -355 2604 617 -2584 -518 2801 763 -2563 -570 2293 631 -2550 -766 2408
4416 2408 819 -2456 -978 2474 742 -2434 -1135 2338 569 -2310 -1067 2473 781 -2056 -1015
4431 -1015 2108 777 -2370 -801 2135 1191 -2264 -1197 2231 928 -2467 -1260 2343 1250 -2239
4446 -2239 -1110 2054 1348 -2076 -1184 2180 1155 -2068 -1222 2171 1441 -2242 -1529 2168 1296 -2294
4462 -2294 -1674 2145 1714 -1922 -1471 2039 1666 -1955 -1631 1811 1553 -1883 -1538 2122 1614 -2079 -1468
4479 -1468 1897 1417 -1967 -1693 2025 1463 -1928 -1748 1796 1619 -1836 -1621 1839 1555 -1855 -1492 1732
4496 1732 1384 -1672 -1619 1458 1659 -1706 -1819 1744 1820 -1535 -1662 1399 1750 -1729 -1554 1544 1890 -1527
4514 -1527 -1853 1759 1818 -1496 -1732 1243 1869 -1453 -1831 1579 1897 -1528 -2141 1507 1685 -1428 -1961
4531 -1961 1217 1950 -1301 -1777 1277 1808 -1288 -1791 1367 1811 -1107 -1865 1324 1837 -1181 -1833 1227
4548 1227 1965 -1026 -1854 1030 1965 -1141 -2015 996 1937 -1101 -2045 1019 1787 -879 -1855 941 1703
4565 1703 -855 -1993 683 2322 -747 -2131 782 2087 -747 -1967 893 1838 -635 -1948 562
4580 562 1925 -813 -2175 638 2000 -514 -2162 765 1847 -703 -2058 726 1878 -465 -1949
4595 -1949 574 2168 -413 -1991 441 1975 -380 -2026 309 2208 -277 -2300 387 2145 -280
4610 -280 -2144 485 2050 -173 -2242 148 2026 -97 -2192 -6 2236 -305 -2346 135 2125
4625 2125 -65 -1966 202 2287 -221 -1946 18 2012 -87 -1808 84 2221 -137 -2037 104
4640 104 1886 -226 -1906 40 2270 -256 -2109 -179 1987 -50 -2077 -171 1934 9 -2136
4655 -2136 -135 2057 134 -2167 -272 2177 242 -1767 -165 2032 388 -1987 -147 1959 247
4670 247 -1555 -351 1868 119 -1918 -284 1967 199 -1898 -267 1995 519 -2016 -524 1861
4685 1861 417 -1783 -343 1727 648 -1747 -421 1732 487 -1850 -719 1618 518 -1765 -613
4700 -613 1928 594 -1645 -577 1649 442 -1865 -666 1758 753 -1747 -714 1476 487 -1710
4715 -1710 -644 1591 730 -1594 -802 1627 749 -1655 -950 1598 962 -1530 -886 1195 797 -1453 -1102
4732 -1102 1713 751 -1384 -1116 1360 792 -1395 -1057 1473 1030 -1396 -778 1378 1034 -1436 -915 1415
4749 1415 952 -1274 -1046 1575 1044 -1249 -913 1445 1322 -1249 -1177 1176 1168 -1267 -1120 1426 945 -1150
4767 -1150 -990 1133 1259 -1361 -1207 1217 1160 -1324 -1250 1225 1002 -1247 -1252 1220 1111 -1384 -1302 1346
4785 1346 1411 -1080 -1020 1346 1382 -1295 -1237 1291 1134 -1109 -1388 1252 1490 -1241 -1376 1205 1456 -851
4803 -851 -1279 987 1258 -1256 -1338 941 1256 -999 -1224 941 1171 -1032 -1281 1047 1112 -775 -1403 849
4821 849 1281 -974 -1192 741 1219 -827 -1465 740 1357 -1110 -1308 862 1528 -617 -1372 774 1466
4838 1466 -717 -1603 756 1698 -573 -1489 407 1534 -760 -1499 550 1407 -537 -1318 740 1515 -445
4855 -445 -1115 789 1155 -306 -1576 496 1311 -413 -1326 423 1452 -327 -1430 318 1059 -569
4871 -569 -1662 300 1633 -733 -1465 422 1490 -406 -1469 517 1633 -359 -1375 242 1640
4886 1640 -11 -1372 304 1433 -328 -1401 160 1526 -158 -1544 64 1560 -86 -1460 116
4901 116 1586 -62 -1253 204 1523 -178 -1636 27 1297 -232 -1557 186 1550 68 -1283
4916 -1283 71 1618 200 -1560 252 1423 165 -1569 -1 1310 86 -1653 -73 1278 -273
4931 -273 -1513 -115 1436 162 -1373 159 1445 -118 -1459 -403 1443 -60 -1275 -119 1218
4946 1218 307 -1513 -324 1543 174 -1239 -3 1236 295 -1406 -206 1314 28 -1312 -203
4961 -203 1289 278 -1146 -420 1143 214 -1296 -136 1180 413 -1280 -499 1247 287 -1228 -301 1184
4978 1184 406 -1103 -373 1196 472 -1108 -327 1283 559 -1082 -307 1296 544 -1115 -326 1191 390
4995 390 -1143 -531 1254 674 -830 -684 1100 862 -1340 -706 1161 534 -1247 -849 1077 799 -1015
5012 -1015 -743 1137 930 -1094 -498 1075 787 -1215 -520 1055 683 -832 -733 1048 805 -1018 -730
5029 -730 929 785 -1100 -770 951 791 -1070 -811 904 971 -1088 -778 910 880 -998 -674 1024 620
5047 620 -885 -662 941 926 -793 -771 950 985 -921 -799 790 775 -1065 -838 844 742 -824 -608
5065 -608 964 760 -684 -841 550 853 -809 -1117 761 979 -795 -1083 837 1205 -605 -944 649
5082 649 1052 -773 -817 767 961 -591 -836 563 838 -614 -1047 759 768 -929 -736 724 1064 -573
5100 -573 -947 407 834 -479 -929 517 875 -723 -1065 569 1177 -418 -940 586 911 -498 -936
5117 -936 458 1147 -453 -875 672 1053 -414 -1246 76 994 -521 -925 397 963 -452 -999 378
5134 378 1085 -517 -946 483 741 -68 -1011 141 1046 -385 -844 297 1126 -303 -879 139 1097 -247
5152 -247 -1010 220 1122 -297 -973 245 1007 -309 -998 293 1184 65 -1043 122 996 -434 -1089
5169 -1089 314 992 -167 -1181 133 1045 45 -959 33 852 -85 -917 117 942 76 -1155 -68
5186 -68 1117 -167 -1159 125 1070 -77 -1064 -264 1155 -166 -902 34 1129 62 -995 -46 1167
5203 1167 -43 -720 -48 973 157 -855 108 1218 170 -1019 -176 1071 177 -863 -361 921 214
5220 214 -963 -353 803 167 -955 48 965 85 -1052 -334 967 161 -926 -107 860 187 -774 -384
5238 -384 1082 154 -818 -421 958 287 -751 -254 1007 528 -790 -262 864 417 -852 -132 977
5255 977 92 -977 -206 781 473 -831 -449 795 332 -802 -287 920 451 -723 -535 775 478 -761
5273 -761 -315 719 474 -651 -354 830 614 -801 -509 697 295 -809 -830 866 485 -873 -440 969
5291 969 545 -726 -780 954 464 -769 -579 786 735 -725 -519 663 502 -492 -320 614 487 -688
5309 -688 -488 660 705 -749 -722 688 724 -579 -508 731 673 -622 -559 567 625 -473 -595 412 581
5328 581 -483 -645 410 545 -754 -538 680 663 -354 -473 487 607 -534 -444 750 567 -335 -556
5346 -556 633 700 -704 -701 334 944 -300 -615 381 783 -377 -721 354 952 -573 -468 263 586 -369
5365 -369 -674 363 383 -473 -586 559 857 -332 -771 527 406 -392 -844 327 877 -433 -880 283
5383 283 830 -359 -829 453 732 -419 -709 625 910 -380 -576 244 668 -142 -571 257 645 -289
5401 -289 -845 218 980 -262 -645 78 425 -247 -656 333 892 -115 -523 219 639 -283 -716 203 801
5420 801 -111 -608 120 745 34 -651 116 741 -147 -818 0 700 -353 -907 5 817 -168 -1087 -171 882
5440 882 63 -806 -216 556 -16 -721 -81 1201 71 -923 99 767 259 -807 -40 693 136 -716 -217
5459 -217 891 -18 -777 -126 896 -8 -767 -30 755 139 -846 250 907 -90 -946 -254 809 -68 -851
5478 -851 -210 777 -81 -721 -313 788 235 -922 -42 704 192 -852 111 530 243 -456 23 696 62
5497 62 -769 72 642 158 -819 -208 759 132 -685 -489 604 464 -560 -224 659 107 -524 -27 474 -119
5517 -119 -533 -242 424 256 -584 -497 494 396 -589 -198 684 148 -618 -475 511 431 -582 -670 799 240 -427
5538 -427 -448 609 484 -534 -445 399 339 -771 -645 518 138 -662 -362 509 436 -692 -331 630 399 -533
5558 -533 -445 312 414 -680 -306 358 689 -549 -467 876 515 -448 -454 629 501 -473 -349 431 291 -634
5578 -634 -577 538 558 -258 -589 576 607 -394 -478 255 455 -331 -601 561 416 -442 -419 257 385 -313
5598 -313 -375 532 363 -308 -365 508 519 -133 -694 319 511 -331 -524 41 399 -379 -523 512 606 -453
5618 -453 -597 399 670 -466 -565 395 447 -419 -709 195 585 -289 -487 227 644 -475 -767 152 643 -255
5638 -255 -727 162 654 -334 -703 292 594 -159 -471 34 643 -353 -698 249 753 -117 -640 283 423 -68
5658 -68 -532 327 259 -95 -290 113 595 -159 -470 107 726 15 -401 155 456 -28 -935 87 683 -21
5678 -21 -352 138 507 -85 -722 141 441 155 -645 151 729 -108 -622 36 387 -110 -330 -47 555 27
5698 27 -566 298 372 -12 -532 -55 654 -7 -540 -25 419 -96 -472 135 630 245 -701 -230 496 18 -437
5719 -437 148 711 -38 -668 -327 600 75 -303 -301 488 91 -530 -142 600 161 -653 -44 544 -8 -397 -290
5740 -290 515 143 -477 -339 451 104 -562 -97 341 312 -580 -47 723 267 -466 -170 491 362 -677 -169
5760 -169 733 246 -471 -170 642 334 -548 -26 646 510 -674 -237 410 196 -373 -316 439 217 -703 -162
5780 -162 606 182 -620 -254 513 445 -473 -191 573 107 -459 -427 598 206 -485 -364 473 105 -473 -393 519
5801 519 194 -574 -375 435 -14 -567 -243 509 41 -420 -355 303 522 -477 -361 307 373 -327 -407 228 385
5822 385 -150 -548 319 544 -495 -330 -83 436 -273 -526 285 311 20 -342 220 549 -277 -286 247 358 -287
5843 -287 -442 265 433 -73 -385 337 184 -384 -554 406 528 -191 -387 449 369 -339 -448 479 310 -10
5863 -10 -339 105 340 -270 -479 333 558 -139 -403 224 318 -370 -294 288 591 -337 -534 -28 229 -149 -666
5884 -666 20 298 -93 -590 215 485 106 -214 85 376 -272 -583 187 390 -311 -524 323 530 -383 -208
5904 -208 221 342 -127 -230 425 687 -117 -313 76 404 -145 -532 7 541 -582 -452 290 296 -7 -478
5924 -478 -15 561 -41 -592 -22 476 -207 -582 106 305 -139 -580 -7 724 -147 -668 82 348 -147 -451
5944 -451 -77 498 -82 -524 158 552 223 -362 58 424 158 -401 147 618 -208 -297 42 627 39 -404
5964 -404 -114 219 -29 -527 -44 528 -72 -500 -213 277 88 -288 103 666 277 -457 26 410 -6 -504
5984 -504 -441 488 205 -550 53 318 -46 -212 -204 416 445 -288 -188 518 390 -413 -266 522 21 -248 1
6005 1 554 108 -521 -61 182 86 -347 57 552 64 -285 -162 378 293 -629 -23 394 230 -523 -269 192
6026 192 342 -506 -203 378 460 -369 -150 271 215 -499 -98 305 257 -290 -113 524 300 -501 -294 390 176
6047 176 -430 -55 348 75 -404 -424 379 -43 -266 -329 380 207 -170 -117 308 353 -379 -189 168 438 -443
6068 -443 -483 374 230 -304 -353 209 61 -433 -292 167 86 19 22 298 199 -380 -115 148 190 -313 -447 298 357
6091 357 -401 -383 415 439 -243 -141 107 246 -293 -122 439 430 -180 -121 192 274 -340 -337 653 138 -274 -109 60
6114 60 320 92 -307 354 338 -404 -86 180 224 -220 -325 144 269 -83 -479 283 189 -64 -223 232 171 -164
6136 -164 -373 202 345 -111 -185 236 353 -307 -267 184 357 -250 33 197 280 19 -251 185 476 -104 -396
6157 -396 102 463 -184 -220 205 455 -267 -271 203 314 -239 -175 82 349 -214 -163 -77 340 -87 -201 178 121
6179 121 200 -473 175 392 -148 -327 182 450 -261 -435 294 550 -10 -242 28 365 -238 -436 33 504
6199 504 -96 -388 19 282 -106 -711 -158 243 -22 -435 258 302 40 -218 40 329 -33 -485 66 238
6219 238 -60 -256 61 422 -30 -205 -113 478 150 -385 94 265 -104 -384 -215 398 -60 -512 271 170
6239 170 74 -589 -138 400 -35 -454 -58 668 -156 -200 -39 353 65 -217 58 363 244 -396 -117 315 -44
6260 -44 -262 -18 322 -43 -96 -148 251 -101 -330 -39 313 14 -358 -311 176 151 -309 -277 145 140 -106 -62 348
6283 348 -3 -570 -322 387 3 -198 24 365 256 -378 -246 238 -23 -141 -60 175 108 -448 -67 491 245
6304 245 -221 -149 274 107 -71 -184 194 158 -325 -226 174 141 -293 142 285 187 -346 -72 483 242 -318 -202
6326 -202 156 137 -330 -177 200 70 -157 -55 309 186 -310 -185 284 54 -341 -163 427 51 -433 -145
6346 -145 300 75 -304 -188 -52 303 -180 -178 103 430 -232 -226 378 40 -437 -94 55 265 -130 -310 111
6367 111 147 -247 -169 241 272 -199 -180 471 441 -309 -289 341 115 -122 -290 78 149 -393 -286 351 155 -545
6389 -545 -168 147 376 -204 -252 278 380 -62 -321 191 274 -70 -52 6 442 -194 -76 222 190 -111 -120 97
6411 97 402 -86 -344 385 114 65 -355 339 186 -266 -251 393 145 -64 -305 184 465 -99 1 41 139 -221
6433 -221 -335 27 302 -136 -257 72 342 -367 -339 148 648 -10 -468 156 66 -113 -194 190 396 83 -370
6454 -370 -27 243 -416 -339 39 285 -35 -26 -19 223 15 -373 -71 173 -89 -223 317 306 -73 -184 -162 178
6476 178 -90 -61 94 52 -81 -232 -154 266 -339 -227 -109 368 37 -383 145 302 57 -202 -35 339 1
6497 1 -274 162 172 -104 -221 119 308 199 -431 215 -53 230 -65 -102 414 -108 -25 68 169 -139 -392 284
6519 284 64 143 17 236 362 -52 -242 -10 128 -20 -177 188 278 50 -143 -32 208 273 -307 103 242
6540 242 66 -265 -45 285 -21 -601 -174 384 -10 -505 -20 83 -128 -428 -314 315 -49 -260 -105 282
6560 282 64 -375 -187 292 78 -71 -90 267 31 -191 49 60 0 -371 -100 269 259 46 -54 26 -58 -210
6582 -210 -67 188 -89 -272 -86 67 148 -423 -213 301 187 -282 -231 265 54 -356 -119 100 298 -221 -80
6603 -80 307 -19 -152 35 359 99 -361 -67 -14 191 -58 -180 337 -82 -163 -2 335 412 -82 -238 311
6624 311 147 -75 57 173 62 -298 -174 276 46 -598 -87 141 58 -122 93 285 325 -228 -158 -162 268 -308
6646 -308 -383 356 63 9 -26 332 476 -102 -301 140 166 -78 -52 19 259 -161 151 106 -109 -83 -86 264 349 -227
6670 -227 -276 47 137 -394 -597 303 439 -58 -88 372 149 -103 -18 238 -36 -241 -114 -97 149 -169 -184 132
6692 132 -4 135 -119 23 311 -27 -203 -40 51 -145 -253 20 79 -386 -10 -48 71 -43 -10 -57 188 -183
6714 -183 -273 63 107 -109 -366 -34 381 -45 -287 322 424 -120 -85 155 125 -379 -195 165 257 -221 -290 199
6736 199 236 -231 -365 -117 171 -2 -11 43 160 61 -253 145 393 24 -266 118 309 -215 -192 -78 192 -68
6758 -68 -214 122 240 -362 -265 -7 160 -217 -411 26 452 -4 -640 -232 274 175 -404 21 332 -275 -136
6779 -136 89 105 -110 -135 134 248 141 -5 96 0 122 -309 -179 442 87 -129 113 356 -114 -87 199
6800 199 306 -182 -361 169 83 155 -291 215 202 -2 -143 0 323 -83 -222 193 194 223 -30 -51 377 -8
6822 -8 -271 89 150 153 -193 101 353 277 -8 28 278 72 -171 147 -7 49 -438 142 247 -164 -327 -176 259
6845 259 -150 -452 98 323 25 -314 62 316 128 -103 -10 -102 282 15 -108 497 -23 -65 64 72 -71 -135
6867 -135 -133 365 50 13 -417 214 -47 -297 -23 68 173 -121 -126 61 170 -269 -361 367 -21 -199 -52 28 29
6890 29 -117 -293 236 128 -158 30 66 47 -147 -55 148 276 -137 -268 342 -120 -165 15 232 -36 -277 161
6912 161 305 191 -24 -138 172 376 -139 -99 190 28 -176 -64 231 120 -366 -246 328 86 -350 -298 -228
6933 -228 91 -79 -88 145 86 -199 10 229 346 -58 43 134 244 -194 -163 73 10 -234 -100 -67 126 -35
6955 -35 -150 263 265 -47 -112 229 252 -161 11 -23 -26 -191 -167 198 -75 -192 -143 470 -29 132 -140 -30 118
6978 118 -30 -139 156 165 -157 -172 212 330 -157 -110 186 -73 -160 -233 141 76 -54 -207 -140 80 60 -177 -2
7001 -2 35 1 -326 81 342 8 29 179 357 -167 -89 26 376 70 56 197 317 -199 -204 79 118 -60 -188
7024 -188 40 103 -238 -299 -104 50 -85 -176 323 -31 95 -404 -128 262 26 -119 286 114 -98 -314 -240
7045 -240 -207 -103 -202 64 143 -154 -199 -76 409 15 -189 139 227 -163 -23 -61 321 -47 -166 -137 138 -24
7067 -24 -230 72 -20 -53 -170 23 360 -77 -67 63 355 -119 -127 26 -71 -103 -344 58 383 -195 -163 152 165
7090 165 -134 -24 167 177 -234 -108 -117 188 -63 -381 -137 -7 120 -69 36 121 -180 -167 26 174 -66 -209
7112 -209 -133 241 123 -241 -137 -32 85 -427 130 202 -129 -218 -39 232 -81 -301 -155 349 -44 -153 -21
7133 -21 296 109 -263 -100 1 110 27 188 220 -176 94 -174 199 75 -410 -58 329 -127 -35 -17 133 31
7155 31 -316 36 -99 211 55 48 132 -61 -37 -296 59 23 24 28 -29 106 -107 -310 -94 -41 -123 7 -157 56
7179 56 71 -141 337 -75 -93 -42 -218 -87 -251 -78 103 269 -35 -62 128 118 -247 -266 248 -10 165 10
7201 10 274 179 -44 -179 69 156 96 29 -85 157 -23 -53 -8 81 -41 -185 70 65 -89 -229 4 162 112 -85
7225 -85 -9 161 -55 -83 225 98 -56 89 -42 38 -49 -117 91 -1 -177 -80 90 245 -199 -49 150 132 123 -283
7249 -283 -61 134 -113 -472 346 232 -249 -38 314 236 -28 -212 -72 65 -90 -291 139 274 -181 -156 155
7270 155 -147 -245 -240 -57 318 57 -173 20 291 -117 -13 28 16 91 -109 -13 43 56 68 164 -58 -37 -281 10
7294 10 282 -77 -98 164 154 145 -389 -95 -77 -6 26 -61 -19 -203 -96 -31 227 66 -84 45 -118 81 -195 11
7318 11 229 -80 -274 84 178 -42 -338 -37 -46 -70 30 -172 63 177 -3 -144 61 -222 -198 79 192 -28
7340 -28 -275 56 125 90 7 -113 132 191 74 -102 204 -19 -323 171 298 227 -152 -133 347 -175 -132 14 58
7363 58 1 -196 -77 140 -51 -125 -159 340 134 -180 -164 170 -12 28 33 167 6 -138 -168 -50 251 -34 -201
7386 -201 38 209 -125 -235 200 -35 -200 35 127 113 -126 -5 147 61 -108 -116 -119 -89 -289 -136 67 295 -134
7409 -134 14 34 -11 -287 -38 148 52 -132 -309 319 -67 -55 -10 78 87 -147 -496 89 131 -34 -198 153 235
7432 235 -144 28 54 122 -277 -108 108 110 94 13 -37 -7 13 -78 -42 149 114 -35 79 -48 -176 -195 -215 -161 -6
7457 -6 7 79 85 -208 -38 79 152 268 -144 -62 -58 -192 -114 -35 62 -267 31 44 59 -102 -256 -7 17 -40 -185 146
7483 146 -24 -89 31 116 59 173 -155 -166 163 178 16 -21 184 -113 -172 116 138 -146 -141 -110 344 -91 -158 229
7507 229 179 -18 -181 -97 46 -177 -265 73 318 -52 -187 -2 -76 -40 -155 195 179 -226 -35 80 245 54
7529 54 71 130 -25 -42 -157 27 308 168 -126 -81 144 87 -235 120 231 -91 -120 -10 -172 -83 -167 0 53
7552 53 190 -188 207 78 151 -66 223 215 -131 -246 -35 155 21 212 104 227 35 -476 -29 -21 30 -162
7574 -162 39 193 92 -169 55 -48 72 -139 -96 167 254 11 63 194 -82 -56 -90 -44 -29 -302 15 131
7596 131 -91 -73 49 47 117 -95 -106 110 237 -188 4 216 58 -57 74 31 -1 -117 -80 168 -142 -17 -66
7619 -66 -52 122 -72 -114 285 59 48 -297 171 278 47 13 -13 110 -316 9 67 202 -232 25 235 -27
7641 -27 -222 -44 -15 288 -4 -259 -8 100 -136 -130 118 306 40 -182 -175 116 -2 -210 78 97 -369 72
7663 72 112 258 -254 -353 45 121 14 -316 167 16 66 -46 -44 -43 -93 -97 0 -126 -73 91 18 247 -201 -238 83
7688 83 168 341 -77 -26 -20 -286 -32 36 -76 -33 -206 -114 187 -118 -168 66 -102 -1 -213 18 -7 -173 -144 -26
7712 -26 -214 140 -155 155 199 78 -205 104 326 98 -278 -83 304 -162 -33 204 -92 -335 -160 57 67
7733 67 -44 -501 109 289 25 -32 198 113 51 -477 32 -122 293 -144 -3 249 151 -177 219 56 -35 -220
7755 -220 11 160 -24 -234 36 316 41 52 178 253 -115 -66 40 50 -233 -60 -5 313 -258 -227 -104 165
7777 165 74 -44 107 125 171 -75 -189 138 23 -127 133 100 -52 -157 49 208 142 -148 -197 93 148 -33
7799 -33 -243 226 239 -313 -234 117 158 36 5 61 -136 -235 -240 360 -9 -518 -161 56 -243 -143 -67 9 -200 -275
7823 -275 -161 98 -10 -297 -166 60 115 -110 -87 76 161 -121 -133 198 -62 -209 65 146 54 -376 -219 149
7845 149 102 -140 -34 131 -34 -242 -45 -77 74 -110 -68 1 71 -132 28 230 132 -71 -182 110 -10 -270
7867 -270 -268 33 -124 -302 -103 53 182 -106 -213 193 149 -130 -378 -142 162 -20 -97 182 158 -60 -196 267
7889 267 67 204 -185 50 19 -206 -183 251 210 -31 -259 279 358 -131 -298 100 267 -340 -109 196 27
7910 27 -59 -79 220 277 -277 -182 19 223 -218 10 23 301 -99 -129 93 259 -245 -236 150 117 -97 51 -46 169
7934 169 -110 -245 162 198 -110 -130 155 61 -251 109 65 -79 12 -175 276 403 -122 -141 -1 297 -154 -144
7956 -144 284 284 -32 -180 -44 386 4 -410 2 252 35 -207 180 301 109 -273 -52 427 -107 24 -27
7977 -27 74 -134 -202 18 149 -39 -264 102 295 238 -111 -188 292 76 -422 -240 206 190 -325 -78 -190 -87
7999 -87 -87 -251 330 -45 -219 -25 260 -181 -74 201 151 135 -63 -29 402 234 -243 -61 212 93 -25 -252
8021 -252 198 27 -293 224 284 -84 -78 -56 152 14 -215 -176 404 -222 -266 162 42 -94 -127 -51 139 217 -136
8044 -136 -153 -93 46 -273 -132 247 -68 -407 -150 247 -87 -189 21 127 -18 -150 -223 198 182 -189 -47
8065 -47 171 -51 -247 -122 -6 27 -352 -31 211 65 -321 -1 183 128 -60 -130 251 177 51 -225 -164 366
8087 366 -114 -165 185 42 -66 -317 -15 -13 -292 -48 173 239 -62 -150 253 -16 -121 -91 260 254 -127 1 121
8110 121 -60 -194 -306 100 -171 -111 -179 187 340 -216 -231 160 371 -257 -94 196 231 -124 -220 422 298 -151
8132 -151 -34 411 85 -223 -50 230 86 -206 -55 99 385 -252 -35 -198 -24 17 -251 164 4 -94 -213
8153 -213 186 259 23 66 41 160 -235 -211 321 135 -309 -56 135 185 -252 -253 299 238 2 -121 132 142 -12
8176 -12 -181 217 219 10 -288 213 247 -159 -219 163 224 -82 -301 130 190
8191A90
$$ Imaginary data points
##PAGE= N=2
##DATA TABLE= (X++(I..I)), XYDATA
0 0 0 0 0 0 0 0 0 0 0 0 0 0 0 0 8 -8 8 -8 8 -11 16 -16 23 -24 25 -32 39 -42 48 -56 64 -72 82 -92 105 -116
36 -116 130 -146 162 -181 198 -221 246 -272 300 -334 367 -402 442 -488 540 -594 654 -723 800
55 800 -888 989 -1107 1245 -1409 1611 -1866 2194 -2639 3269 -4236 5881 -9215 18518 -95156
70 -95156 -301277 96480 292077 -85543 -292116 90371 291436 -77614 -285698 84048
80 84048 288590 -71162 -281765 75401 282937 -66752 -278969 66220 275265 -63416
90 -63416 -275959 57417 268017 -59396 -272134 49613 262237 -52894 -266713 44263
100 44263 259055 -44788 -260217 40251 257597 -35758 -253897 36426 256417 -28006
110 -28006 -248769 31274 253074 -21693 -245318 23926 248340 -16506 -243507 14791
120 14791 242169 -12456 -242445 6170 236324 -7736 -239611 -996 231088 -1365
130 -1365 -234410 -7113 227392 6560 -227667 -11313 224636 15229 -220294 -15784
140 -15784 221659 23037 -214397 -20742 217712 29004 -210100 -26741 212445 33114
150 33114 -207775 -33721 206608 35933 -206566 -40943 201913 39471 -205520 -47128
160 -47128 198692 44121 -202905 -51214 197673 49562 -199376 -53539 197546 55744
170 55744 -195444 -55823 197553 61523 -191771 -58634 195846 65368 -189626 -62490
180 -62490 192180 67349 -188453 -67153 187340 68516 -186869 -71423 182210 69316
190 69316 -184554 -75222 177480 71643 -180504 -76957 174726 74566 -175674 -76977
200 -76977 172803 77821 -170168 -77302 170685 81440 -165295 -78188 168075 83588 -162123
211 -162123 -80571 164148 84806 -160204 -83751 160140 85056 -159243 -87675 155580 85713
222 85713 -157683 -90508 151971 87205 -154497 -92364 149352 89655 -150355 -92638 147314
233 147314 93276 -145064 -92723 145309 96053 -139737 -92896 141898 97924 -135316 -94066
244 -94066 136823 98167 -131928 -96389 130742 97716 -128597 -99297 124732 97439 -125617
255 -125617 -101680 119525 98298 -121260 -102710 115660 100102 -116270 -103434 112996 103793
266 103793 -110954 -103834 110657 107277 -105870 -105037 108045 110126 -102188 -107796 104346 112017
278 112017 -99829 -110869 99645 112888 -98096 -114798 94724 113881 -95653 -118227 90463
289 90463 115337 -92379 -119930 87319 117776 -88550 -120650 85443 120383 -83622 -120293
300 -120293 82973 122755 -78691 -120770 80546 124568 -74925 -121388 76756 124872 -72501
311 -72501 -123160 72699 124574 -70991 -125489 68242 124277 -69525 -127510 64647 124714
322 124714 -66850 -128623 62687 126215 -63959 -129086 61423 128462 -60526 -128868 60777
333 60777 130966 -57405 -128597 59377 132366 -54880 -129298 56890 132552 -53101 -130645
344 -130645 53572 131853 -51943 -131754 49995 130165 -50735 -132485 46035 128530 -48094
355 -48094 -131753 43336 128141 -44532 -129744 41438 128060 -40436 -127290 39734 128367
366 128367 -36410 -124915 37967 127697 -32952 -123723 34703 126352 -30758 -123537 31218
377 31218 124426 -29411 -124426 27098 122748 -27463 -124559 23468 121426 -25314 -124554
388 -124554 20683 121360 -22105 -123539 19130 121809 -18285 -121415 17077 122399
398 122399 -13929 -119939 15181 122192 -10481 -118552 11926 121062 -7742 -118081
408 -118081 7949 118985 -5535 -118119 3555 116253 -3432 -117657 -744 114084
418 114084 -564 -116838 -3737 113350 2855 -115260 -6265 113388 6992 -113319
428 -113319 -7829 113672 11159 -111566 -10040 113853 14637 -110954 -12903 113651
438 113651 16939 -111457 -16504 112662 18697 -112356 -20080 111566 19793 -113446 -23609
449 -23609 110968 21829 -113626 -25933 110714 24511 -112441 -27684 110869 27797 -110664
460 -110664 -28590 111179 30835 -108871 -29680 110769 33216 -107039 -31082 109253 34553
471 34553 -106116 -33496 107085 35374 -106005 -36344 104723 35708 -105593 -38116 102731
482 102731 36358 -104988 -40234 101757 37887 -103334 -40551 100944 40483 -101279 -41267
493 -41267 101475 43220 -99355 -42005 100918 45238 -97814 -43409 100002 46586 -97166
504 -97166 -45566 97750 47268 -96524 -48154 95178 47792 -95747 -50375 92617 48099
515 48099 -94275 -51832 90150 50145 -91588 -52559 88684 52062 -88320 -52770 87058
526 87058 54192 -84895 -53204 85322 56060 -81684 -54407 83112 57539 -79500 -55790
537 -55790 79982 57938 -78447 -58479 77017 58382 -77529 -60683 74570 59102 -76105
548 -76105 -62642 72807 61064 -74402 -63797 71813 63355 -71814 -64488 71395 65941 -69512
560 -69512 -65575 70490 68511 -67076 -66891 68915 70189 -65703 -69044 66287 71363 -64325
572 -64325 -71352 63191 71507 -63193 -73360 60147 72180 -61457 -75383 57647 73474
583 73474 -58748 -76225 56329 75263 -55938 -76178 55395 77083 -53283 -76405 54321
594 54321 78922 -51142 -77076 52981 79873 -50022 -78184 50824 80603 -49243 -80065
605 -80065 48937 80136 -49423 -82323 47351 80644 -48729 -83427 45973 81328 -47550
616 -47550 -83662 44952 82688 -45564 -83693 44800 83988 -43064 -82721 44161 84722
627 84722 -41081 -82547 42529 84718 -39200 -82711 40273 83722 -37922 -83237 37445
638 37445 82672 -37077 -83820 34561 81959 -35674 -83626 32302 81286 -33880 -83285
649 -83285 30701 81510 -30876 -82307 29712 82588 -28373 -81451 28835 83028 -25818
660 -25818 -81200 27058 83544 -23948 -81580 24772 83347 -22544 -82338 21905 82415
671 82415 -21341 -83081 19366 81423 -19908 -83409 16741 81074 -17704 -83124 14956
682 14956 81166 -14804 -81852 13337 81838 -11355 -80380 11663 82041 -8581 -79586 9780
694 9780 81532 -6329 -79271 7035 80729 -4702 -79873 4308 79477 -3583 -80489 1444
706 1444 78987 -2246 -80808 -934 78866 -540 -80933 -2320 79632 1920 -80611 -3624
718 -3624 80666 4500 -79845 -4305 81583 6835 -79602 -5611 81860 8327 -80173 -7547
730 -7547 81621 9855 -80651 -9986 80851 10475 -81075 -12240 79593 11498 -81180 -14305
742 -14305 79005 12891 -80560 -15404 78371 14946 -79269 -16134 78366 17035 -77720 -16630
754 -16630 78408 18548 -76451 -17438 78366 20130 -75841 -18757 76859 20517 -76097 -20542
766 -20542 75934 20709 -76067 -22285 74919 21197 -76143 -23653 73970 22275 -75554 -24385
778 -24385 73503 23581 -74325 -24989 73408 25424 -72525 -25118 73398 27278 -71052 -25610
790 -25610 72025 28307 -70015 -27210 70780 29147 -69084 -29015 68497 29696 -67656 -30824
802 -30824 66071 30493 -66604 -32412 63873 31252 -65058 -33659 62604 32899 -63088 -34470
814 -34470 61869 34746 -60788 -35026 61079 36921 -58977 -35767 60324 38356 -57856 -37166
826 -37166 59035 39197 -57414 -39179 57703 39920 -57350 -41087 55901 40652 -56781 -42810
838 -42810 54297 41578 -56041 -44133 53601 43201 -54070 -44715 52907 45028 -52404 -45156 52504
851 52504 47025 -50463 -45735 51540 48130 -48830 -46983 49881 48940 -48105 -48474 47955 49124 -47272
865 -47272 -50030 46196 49170 -47079 -51278 44652 49922 -46239 -52297 43825 51369 -44802 -52858
878 -52858 43637 52645 -43337 -52970 43868 54236 -42082 -53379 43383 55265 -41464 -54091
890 -54091 42628 55813 -40964 -55010 41575 55789 -40749 -56100 39937 55720 -40628 -57099
902 -57099 38466 55524 -39541 -57400 37595 55752 -38000 -57092 36682 56363 -35957 -56455
914 -56455 35531 57026 -33955 -55622 34740 57346 -32465 -55682 33177 56904 -31346 -56234
926 -56234 31407 56722 -30637 -56960 29582 56274 -29709 -57445 27699 55998 -28999 -57785
938 -57785 26706 56450 -27212 -57545 25777 57224 -25387 -57140 25135 58211 -23227 -57076
950 -57076 23870 58563 -21226 -57133 21913 58581 -20027 -57537 19864 58203 -18632 -58171
962 -58171 17247 57498 -17499 -58504 14906 56926 -15640 -58760 13024 57236 -13735 -58225
974 -58225 12130 57275 -11370 -57542 10771 58062 -8987 -57256 9732 58987 -7408 -57291
986 -57291 8442 58894 -6642 -57705 6820 58744 -5691 -58871 5089 58378 -5300 -59606
998 -59606 3603 58361 -4361 -60221 2407 58951 -3180 -60296 1602 59559 -1576 -59730
1010 -59730 1025 60051 380 -59200 240 60422 1573 -59024 -766 59845 2711 -58963
1022 -58963 -2264 59400 3445 -59013 -4115 58422 3955 -59208 -5458 57514 4684 -58867
1034 -58867 -6644 57243 5698 -58468 -7268 57433 7200 -57276 -7535 57883 8283 -56573
1046 -56573 -7800 57653 9755 -56308 -8461 57449 10121 -56018 -9373 56847 10372 -56605
1058 -56605 -10737 55855 10540 -56065 -11850 54812 11144 -55748 -12732 54008 12139 -54865
1070 -54865 -13574 53659 13534 -53430 -13919 52644 14827 -51861 -14486 52263 16344 -50446
1082 -50446 -15423 51301 17230 -49588 -16846 50058 17923 -48918 -18302 48429 18441 -48695
1094 -48695 -19813 47226 18939 -48356 -21049 46434 20139 -47042 -21554 46261 21669 -46557
1106 -46557 -22476 46215 23351 -45435 -22987 46177 24827 -44355 -23952 45529 25809 -43779
1118 -43779 -25233 44525 26424 -43519 -26864 42878 27281 -43274 -28370 41935 27854 -42840
1130 -42840 -29533 40817 28819 -41635 -29981 40148 29955 -40409 -30628 39889 31486 -38928
1142 -38928 -31260 39645 32416 -37825 -31799 38843 33400 -37474 -32752 38083 33759 -37502 -33946
1155 -33946 37151 33884 -37664 -34949 36549 34250 -37375 -35703 35896 35001 -37067 -36156 35634
1168 35634 35655 -36065 -36333 35765 36639 -34911 -36097 35412 37326 -33899 -36550 34806 37768 -33000
1182 -33000 -37015 33727 37847 -32734 -37331 32230 37784 -31863 -38155 30706 37262 -31176 -38489
1195 -38489 29669 37680 -30000 -38680 28870 37749 -28633 -38310 28268 38420 -27219 -38031 27919
1208 27919 39030 -26468 -37875 27400 38933 -25576 -38409 26091 39090 -25074 -38916 24945
1220 24945 38982 -24633 -39454 23506 38528 -24146 -39912 22281 38777 -23057 -39941 21556
1232 21556 39236 -21491 -39877 20824 40082 -19555 -39883 19912 40439 -18150 -39508 18883
1244 18883 40885 -16896 -39765 16993 40775 -15546 -40214 15484 40604 -15130 -41147 14151
1256 14151 40637 -14393 -41700 12779 40537 -13337 -41955 12023 41138 -12164 -41920 11548
1268 11548 41884 -10978 -41708 11262 42866 -9859 -41958 10602 43274 -9292 -42448 9752
1280 9752 43395 -8705 -42906 8584 43158 -8249 -43506 7335 43171 -7770 -44285 6274
1292 6274 42919 -7092 -44026 5475 42993 -5633 -43681 4897 43379 -4519 -43213 4439
1304 4439 43633 -3169 -42889 3948 43762 -2483 -42560 3147 43456 -1741 -43141 2301
1316 2301 43004 -1866 -43508 1019 42292 -1352 -43248 235 42071 -784 -43409 -574
1328 -574 42501 6 -42782 -833 42725 1160 -42179 -1029 42864 1937 -41733 -1297
1340 -1297 42285 2722 -41127 -2094 41733 3409 -40986 -3279 41064 3576 -40754 -4553
1352 -4553 40120 4369 -40428 -5826 39064 5081 -39927 -6497 38569 6242 -38763 -7099
1364 -7099 38602 7372 -38135 -7691 38251 8696 -37376 -8067 37959 9548 -36902 -9099
1376 -9099 37551 10350 -36871 -10345 36876 10667 -36803 -11404 36490 11214 -37033 -12365
1388 -12365 35793 12039 -36681 -13386 35708 12916 -36006 -13893 35503 13878 -34998 -14338
1400 -14338 35271 15223 -34291 -15240 34957 16448 -33760 -15723 34591 17374 -33202 -17194
1412 -17194 33755 17569 -33250 -17859 32654 18194 -33429 -19228 32051 18347 -32803 -19724
1424 -19724 31911 19285 -32702 -20280 32205 20175 -31852 -20133 32405 21092 -31544 -20358
1436 -20358 32334 21633 -31312 -20582 31922 21836 -31401 -21441 31527 21973 -31538 -21936
1448 -21936 30900 21827 -31262 -22919 30184 22099 -31315 -23295 30200 22784 -30368 -23393 29530
1461 29530 23096 -29291 -23454 29085 24119 -28130 -23556 28565 24649 -27127 -23775 27634 24674
1474 24674 -26728 -24574 26752 24880 -26223 -24883 26014 24722 -25651 -25518 24970 24814 -25648
1487 -25648 -26045 24265 25409 -24728 -26101 24010 25790 -23869 -25876 23635 26154 -23090 -25839
1500 -25839 23363 26985 -21916 -26229 22499 27291 -21470 -26747 21431 27329 -21261 -27060 20378
1513 20378 27094 -20448 -27807 19211 27283 -19874 -28496 18499 27755 -18513 -28492 17556 28253
1526 28253 -17285 -28487 17006 28679 -16076 -28289 16426 29432 -15103 -28782 15996 29988
1538 29988 -14753 -29331 14978 30019 -14385 -30036 13961 29951 -14215 -30894 13319 29941
1550 29941 -13900 -31299 12698 30324 -13221 -31189 12459 31060 -12424 -31504 12508 31548
1562 31548 -11418 -31533 11897 32218 -10570 -31520 11240 32380 -10169 -31760 10373 32184
1574 32184 -9700 -32286 9267 31951 -9414 -32379 8497 32106 -9349 -32871 7874 31772
1586 31772 -8505 -32711 7857 32314 -7754 -32377 7461 32664 -7013 -32009 7325 32802
1598 32802 -6342 -32041 6967 32947 -6156 -32060 6443 32491 -5911 -32441 5583 31951
1610 31951 -5791 -32643 4955 31787 -5408 -32679 4400 31671 -4642 -32301 3569 31487
1622 31487 -3939 -31619 3531 31705 -2780 -30903 3147 31627 -1589 -30563 2238 31397
1634 31397 -663 -30666 1162 30654 -178 -30563 62 30165 157 -30285 -1049 29628
1646 29628 688 -30392 -1663 29481 1389 -29927 -2295 29517 2141 -29712 -2833 29947
1658 29947 3294 -29141 -2937 29758 3996 -29116 -3598 29747 4602 -28957 -4288 29565
1670 29565 5034 -29285 -5442 29341 5671 -29105 -6144 28732 6289 -29179 -7302 28132
1682 28132 7004 -28780 -8106 28199 7877 -28306 -8353 28103 9159 -27683 -9025 28298
1694 28298 9960 -27317 -9438 27961 10379 -27104 -10305 27631 10776 -27361 -10957 27347
1706 27347 10948 -27661 -11533 27001 10999 -27689 -12056 26941 11508 -27572 -12330 26978
1718 26978 12276 -27173 -12630 27268 12793 -26973 -12713 26928 13346 -26317 -12727 26994
1730 26994 13801 -25953 -13190 26590 13963 -25951 -13873 25682 14249 -25804 -14574 25167
1742 25167 13973 -25549 -15168 24485 14532 -25129 -15521 24127 14830 -24329 -15523 23651 15565
1755 15565 -23472 -15295 23851 16227 -23048 -15652 23518 16610 -22537 -15957 23106 16731 -22340
1768 -22340 -16601 22369 16678 -22345 -17148 21402 16411 -21983 -17736 20929 17056 -21544 -17969
1781 -17969 20483 17539 -20669 -17936 20178 18314 -19730 -17960 19857 18482 -18775 -18353 19158
1794 19158 19278 -17941 -18771 18391 19385 -17547 -19632 17552 19633 -17387 -20112 16397 20074 -17126
1808 -17126 -20724 16090 20032 -16619 -21053 15342 20664 -15749 -21304 15131 21470 -15064 -21309
1821 -21309 15374 21959 -14706 -21373 14958 22342 -14154 -21730 14826 22750 -13998 -22370 13880
1834 13880 22752 -13764 -23070 13357 22623 -13627 -23571 12709 23318 -13120 -23765 12316 23458
1847 23458 -12375 -23751 12188 23835 -11640 -23888 11746 24452 -10929 -23665 11383 24757
1859 24757 -10266 -24059 10678 24726 -10041 -24334 10155 24553 -9853 -24568 9667 24366
1871 24366 -9815 -24817 8885 24020 -9591 -24983 8703 24484 -9163 -24806 8526 24765
1883 24765 -8551 -24469 8840 24898 -8019 -24385 8679 24986 -7499 -24120 7932 24985
1895 24985 -7193 -24328 7134 24565 -6854 -24564 6122 24233 -6446 -24958 5512 23752
1907 23752 -5945 -24514 4745 23873 -4916 -24120 4277 23923 -4159 -23967 3725 24054
1919 24054 -3120 -23639 3277 24350 -2515 -23364 2856 24073 -2157 -23645 2053 23988
1931 23988 -1888 -23682 1321 23636 -1760 -24132 765 23155 -1238 -24025 158 23372
1943 23372 -461 -23781 -134 23476 403 -23490 -547 23658 978 -23262 -1037 23968
1955 23968 1860 -22987 -1588 23751 2470 -23362 -2303 23208 2776 -23422 -3373 23070
1967 23070 3200 -23436 -4018 23056 3732 -23383 -4457 23043 4324 -23423 -4863 23136
1979 23136 5123 -23011 -5015 23390 5531 -23221 -5362 23588 6056 -22659 -5588 23471
1991 23471 6362 -22848 -6044 23067 6241 -23093 -6496 22875 6087 -23043 -6965 22668
2003 22668 6619 -23116 -7545 22407 7138 -22912 -7790 22213 7452 -22370 -7528 22328
2015 22328 8462 -21775 -8087 22316 9082 -21337 -8411 21810 9203 -21131 -8911 21300
2027 21300 9370 -21091 -9435 20761 9306 -20801 -10002 20223 9271 -20769 -10151 19772
2039 19772 9814 -20418 -10395 19825 10156 -19955 -10318 20016 10730 -19460 -10298 19655 11028
2052 11028 -18805 -10735 19288 11359 -18549 -11187 18859 11480 -18593 -11589 18134 11657 -18196
2065 -18196 -12162 17456 12150 -17570 -12862 16739 12357 -17143 -13198 16443 13067 -16375 -13230
2078 -13230 16369 13791 -16005 -13635 15963 14192 -15365 -14079 15702 14360 -15072 -14392 15121
2091 15121 14563 -14831 -14907 14538 14943 -14771 -15115 14199 15093 -14698 -15728 14209 15137 -14236 -15700
2106 -15700 13949 15627 -14123 -15954 14090 16224 -13402 -15668 13963 16409 -13186 -15915 13633
2119 13633 16998 -13013 -16752 13074 16931 -12601 -17292 12502 17245 -12638 -17333 12052 17244
2132 17244 -12378 -17944 11426 17459 -11840 -18150 11324 17609 -11259 -18014 11251 18294 -10750
2145 -10750 -17748 11066 18388 -10140 -17899 10836 18496 -10218 -18175 10404 18287 -10390 -18400
2158 -18400 10061 18104 -10006 -18267 9513 18138 -9964 -18610 9251 18254 -9458 -18467 9080
2171 9080 18024 -9071 -18235 8718 18254 -8369 -18048 8407 18578 -7589 -18056 7999 18756
2184 18756 -7084 -18064 7406 18389 -6699 -18334 6532 18309 -6393 -18280 6017 17913
2196 17913 -6043 -18581 5438 18292 -5523 -18759 5119 18203 -5052 -18337 4920 18439
2208 18439 -4433 -18323 4544 18763 -4002 -17963 4359 18770 -3484 -18258 3884 18572
2220 18572 -3141 -18227 3090 18332 -3029 -18690 2497 18152 -2665 -18691 1962 18419
2232 18419 -2244 -18681 1326 18230 -1124 -18657 984 18673 -443 -18423 582 18966
2244 18966 17 -18470 389 18915 435 -18603 -125 18864 709 -18537 -726 18633
2256 18633 815 -18807 -1115 18532 822 -19156 -1505 18423 1229 -18961 -1644 18634
2268 18634 1335 -18645 -1891 18944 1861 -18589 -1717 18958 2360 -18440 -1923 18987
2280 18987 2514 -18531 -2343 18732 2940 -18552 -2802 18370 3143 -18353 -3373 18323
2292 18323 3220 -18469 -3780 17796 3575 -18085 -4038 17529 3804 -17708 -4367 17531
2304 17531 4299 -17589 -4502 17531 4752 -17399 -4435 17395 4905 -16983 -5049 17130
2316 17130 5113 -16842 -4994 16797 5214 -16610 -5372 16541 5380 -17032 -6074 16267
2328 16267 5455 -16567 -6118 15797 5799 -16048 -6176 15815 6330 -15648 -6696 15623 7057
2341 7057 -15242 -6823 15589 7342 -14874 -7199 15012 7672 -14832 -7628 14588 7927 -14617
2354 -14617 -8183 14029 8277 -14479 -8779 13782 8595 -14122 -9150 13574 8702 -13778 -9328
2367 -9328 13510 9165 -13443 -9550 13395 10017 -13108 -9666 13249 9999 -12871 -9867 13361
2380 13361 10330 -12753 -10248 12829 10468 -12882 -10509 12627 10410 -12569 -10983 12350 10793
2393 10793 -12589 -11334 12087 11228 -12465 -11497 12164 11312 -12222 -11477 11937 11663 -11353 -11670
2407 -11670 11859 12336 -11344 -11836 11695 12155 -11301 -12019 11085 12469 -11215 -12314 10830 12197
2421 12197 -10902 -12791 10379 12138 -10867 -12824 10477 12210 -10497 -12570 10249 12721 -10086
2434 -10086 -12775 10203 12843 -9840 -12369 10177 13003 -9524 -12589 9824 12908 -9345 -12388
2447 -12388 9307 12894 -9447 -13108 9080 12810 -8993 -13174 8306 12749 -8746 -13209 8170
2460 8170 12866 -8208 -13146 7777 13273 -7435 -13237 7394 13243 -6808 -13319 7166 13465
2473 13465 -6488 -13171 6589 13543 -6514 -13432 6212 13582 -6091 -13724 5709 13476 -6007
2486 -6007 -13673 5465 13456 -5639 -13783 4954 13381 -5232 -13905 4894 13697 -4755 -13581
2499 -13581 4682 13906 -4252 -13594 4441 14081 -3702 -13734 3885 14230 -3448 -14115
2511 -14115 3529 14109 -3196 -14179 2931 14054 -3074 -14428 2353 14226 -2797 -14651
2523 -14651 1958 14236 -1968 -14435 1772 14456 -1653 -14488 1773 14542 -1307 -14491
2535 -14491 1608 14762 -938 -14287 1524 14809 -888 -14476 1235 14711 -723 -14601
2547 -14601 805 14439 -740 -14678 256 14117 -563 -14708 251 14497 -499 -14974
2559 -14974 216 14576 -254 -14512 263 14734 140 -14498 -49 14422 768 -14172
2571 -14172 -222 14718 801 -14399 -634 14446 1072 -14363 -1183 14124 1265 -14434
2583 -14434 -1583 13874 1264 -14251 -1915 13784 1736 -14006 -1852 13567 2026 -13745
2595 -13745 -1947 13735 2164 -13279 -2136 13848 2462 -13179 -2240 13571 2753 -13189
2607 -13189 -2751 13334 3002 -13121 -2833 12832 3160 -13084 -3326 12612 3255 -13028
2619 -13028 -3952 12775 3462 -12530 -4037 12442 4369 -12596 -4291 12388 4465 -12245 -4447
2632 -4447 12294 5008 -11746 -4908 12059 5357 -12008 -5165 11991 5408 -11713 -5610 11562
2645 11562 5380 -11863 -5930 11294 6036 -11554 -6080 11143 5933 -11583 -6538 11290 6361
2658 6361 -11260 -6729 11597 6585 -11025 -6495 11217 7105 -10837 -6864 11194 7087 -10753
2671 -10753 -6959 11010 7421 -10681 -7428 10824 7338 -10561 -7715 10591 7545 -10462 -8074
2684 -8074 10120 7874 -10495 -8547 9904 8242 -10274 -8615 10162 8589 -10316 -8468 10167
2697 10167 8604 -9563 -8361 9892 8755 -9609 -8625 9879 8549 -9830 -8897 9290 8847 -9607
2711 -9607 -8967 9081 8539 -9501 -9016 8948 8653 -9081 -8891 8837 8956 -8905 -9008 9015 9169
2726 9169 -8702 -9135 8563 9497 -8172 -9373 8357 9682 -7658 -9504 7893 9844 -7683 -9535
2740 -9535 7658 9572 -7665 -9807 7172 9539 -7335 -10025 6749 9695 -7270 -10119 6691
2753 6691 9890 -6719 -10099 6333 9991 -6374 -9921 6286 10481 -5673 -9873 5998 10595
2766 10595 -5678 -10268 5788 10303 -5459 -10178 5488 10261 -5494 -10524 4998 10201 -5178
2779 -5178 -10596 4820 10528 -4881 -10798 4386 10646 -4424 -10838 4342 10792 -4222 -10936
2792 -10936 4019 11195 -3647 -10820 3882 11129 -3348 -11015 3701 11493 -3281 -11245 3520
2805 3520 11283 -3485 -11363 3051 11256 -3102 -11381 2702 11546 -3008 -11679 2670 11470
2818 11470 -2927 -11604 2693 11647 -2500 -11462 2543 11623 -2442 -11446 2501 11555 -2023
2831 -2023 -11463 2170 11710 -1836 -11454 1808 11692 -1901 -11804 1695 11796 -1901 -11608
2844 -11608 1358 11534 -1471 -11698 1070 11381 -1255 -11704 783 11576 -869 -11489
2856 -11489 1086 11386 -817 -11323 828 11671 -405 -11366 541 11440 -372 -11145
2868 -11145 387 10978 143 -11043 -91 11132 -97 -11243 -550 10717 273 -10995
2880 -10995 -550 10952 299 -10991 -645 10687 666 -10595 -827 10948 966 -10671
2892 -10671 -766 10704 1403 -10636 -1284 10613 1400 -10509 -1465 10407 1951 -10388 -2131
2905 -2131 10443 1888 -10646 -2278 10427 2245 -10657 -2735 10288 2509 -10064 -2681 10085
2918 10085 2735 -9896 -3030 9847 3138 -9749 -2919 10092 3476 -9780 -3337 10046 3362
2931 3362 -9733 -3529 10051 3613 -9810 -3572 9804 3395 -9884 -3788 9645 3721 -10026
2944 -10026 -3993 9920 3883 -10023 -4061 9646 4486 -9666 -4403 9894 4834 -9638 -4767
2957 -4767 9555 4959 -9300 -5015 9399 5357 -9475 -5152 9403 5174 -9168 -5288 9199
2970 9199 5389 -9420 -5669 8962 5432 -9320 -5883 8848 5535 -9085 -5797 8854 5490
2983 5490 -9003 -5913 8627 5803 -8482 -5749 8800 6011 -8200 -5891 8497 6087 -8322
2996 -8322 -6130 8051 6212 -8290 -6079 8114 6120 -8258 -6353 7839 6098 -8153 -6363
3009 -6363 7611 6166 -7854 -6420 7473 6612 -7406 -6629 7238 6677 -7318 -6744 7089 6824
3023 6824 -6881 -6660 7186 7057 -6506 -6838 6757 7130 -6603 -6865 6334 6955 -6379 -7387 6115
3038 6115 7109 -6649 -7363 6042 7143 -6013 -7258 5946 7367 -5680 -7472 5845 7426 -5685
3052 -5685 -7397 5718 7870 -5113 -7475 5163 7848 -4965 -7630 5123 7970 -4701 -7887
3065 -7887 4747 8054 -4523 -8258 4387 8122 -4689 -8480 4252 8129 -4394 -8580 4260
3078 4260 8445 -4037 -8758 3667 8701 -3881 -8593 3853 8813 -3489 -8531 4071 8699
3091 8699 -3539 -8826 3740 8382 -3572 -8693 3510 8710 -3444 -8645 3364 8879 -3501
3104 -3501 -8708 2956 8792 -3104 -8997 2932 8779 -3150 -8966 2972 9033 -2693 -9004
3117 -9004 2917 9183 -2526 -8925 2690 9043 -2170 -8812 2490 9284 -2337 -9108 2088
3130 2088 9090 -2075 -9336 1738 8861 -1917 -8939 1575 8852 -2133 -9093 1729 8594
3143 8594 -1694 -9134 1396 8784 -1683 -8779 1502 8985 -1303 -8895 1462 8774 -942
3156 -942 -8611 1320 8824 -965 -8543 828 8486 -787 -8741 694 8318 -888 -8780 183 8665
3171 8665 -374 -8657 283 8276 -28 -8554 187 8458 270 -8304 -65 8595 693 -8252 -265
3186 -265 8629 942 -8309 -572 8482 876 -8296 -1212 8414 775 -8204 -1349 8441 1288 -8200
3201 -8200 -1495 8041 1319 -8276 -1392 8166 1427 -8280 -1766 7915 1725 -8076 -1610 8197 1949
3216 1949 -7985 -1889 8437 2012 -7974 -2091 8218 2420 -8093 -2457 8069 2560 -8099 -2783
3230 -2783 8046 2615 -8184 -2534 7987 2615 -8388 -2903 7906 2883 -8047 -2814 8089
3243 8089 3020 -7717 -2982 8109 3362 -7676 -3146 7681 3532 -7644 -3177 7936 3493
3256 3493 -7676 -3218 7634 3378 -7595 -3514 7443 3097 -7683 -3768 7389 3494 -7431
3269 -7431 -3773 7222 3673 -7461 -3674 7174 3556 -7216 -3606 7151 3965 -6870 -3724
3282 -3724 6878 4109 -6973 -3792 6895 4013 -6543 -4322 6529 4281 -6452 -4509 6420
3295 6420 4223 -6733 -4410 6221 4441 -6439 -4720 6049 4646 -5985 -4737 6289 4981
3308 4981 -6093 -4499 6084 4719 -5666 -4903 5865 5085 -5606 -4896 5634 5007 -5480 -4804
3322 -4804 5353 4973 -5688 -5274 5424 5265 -5147 -5348 5199 5023 -5307 -5717 4793 5410 -4994
3337 -4994 -5434 4750 5746 -4752 -5579 4641 5928 -4588 -5581 4484 5740 -4246 -5902 4384
3351 4384 5943 -4188 -5689 4434 6207 -4317 -6231 3981 6101 -4103 -6130 3828 6053 -3975
3365 -3975 -6399 3703 6223 -3847 -6602 3783 6677 -3443 -6678 3738 6594 -3693 -6396
3378 -6396 3924 6685 -3335 -6287 3524 6729 -3253 -6515 3637 6502 -3287 -6886 2995 6573
3392 6573 -3329 -6577 3287 6545 -3284 -6800 2923 6653 -3119 -6849 2990 6806 -2735 -6893 2732
3407 2732 7012 -2632 -6567 2495 7056 -2090 -6489 2621 7060 -2298 -6822 2086 6729 -2293 -6726
3422 -6726 2115 6836 -2142 -6663 1777 6494 -1988 -6640 1887 6720 -1841 -6676 1497 6804 -1811
3437 -1811 -6705 1474 6676 -1520 -6465 1349 6569 -1004 -6453 1186 6728 -753 -6564 1030 6508
3452 6508 -971 -6702 939 6336 -815 -6714 500 6797 -623 -6785 313 6458 -237 -6262 229
3467 229 6665 -74 -6435 159 6750 179 -6630 21 6648 522 -6422 -11 6725 511 -6471
3482 -6471 -500 6555 498 -6536 -729 6406 595 -6695 -923 6323 695 -6563 -865 6275 1037
3497 1037 -6533 -903 6309 1188 -6522 -1038 6459 1447 -6218 -1301 6627 1569 -6356 -1257 6394
3512 6394 1550 -6240 -1541 6378 1418 -6323 -1873 6536 1784 -6399 -2028 6333 1673 -6589 -2018
3527 -2018 6286 1840 -6133 -2034 6306 2230 -6213 -2224 6528 2220 -6045 -2122 6506 2403 -5864
3542 -5864 -2006 6007 2344 -5797 -2005 5856 2485 -5874 -2285 5886 2314 -5909 -2510 5541 2375
3557 2375 -5880 -2614 5612 2519 -5761 -2766 5617 2891 -5652 -3009 5566 2856 -5532 -2609 5526
3572 5526 3247 -5213 -2932 5469 3259 -5040 -2930 5100 3005 -4970 -3269 4861 3173 -4951 -3643
3587 -3643 4886 3186 -5037 -3577 4679 3168 -4675 -3655 4792 3454 -4547 -3485 4713 3633 -4313
3602 -4313 -3381 4572 3841 -4335 -3557 4468 3990 -4468 -3649 4349 3869 -4355 -4005 4278 4082 -4206 -4161
3619 -4161 4024 4006 -4019 -4289 3993 4229 -3826 -4416 3794 4294 -3689 -4381 3580 4437 -3799 -4317 3750
3636 3750 4637 -3475 -4568 3592 4609 -3323 -4777 3369 4880 -3398 -4761 3362 4809 -3363 -4632
3651 -4632 3165 4727 -3495 -4918 3054 4614 -3395 -4935 3191 5225 -3135 -5028 3017 5116 -3238
3666 -3238 -4875 3124 5140 -2927 -5032 3072 5183 -2704 -4993 2689 4968 -2488 -5038 2817 4885
3681 4885 -2972 -5073 2481 5210 -2466 -5378 2388 5140 -2571 -5276 2256 5159 -2204 -5478 2331
3696 2331 5019 -2097 -4974 2222 5073 -2019 -4938 2146 5196 -2074 -4879 2067 5055 -2116 -5023
3711 -5023 2031 4807 -1638 -5279 2142 5104 -1787 -5135 1530 4981 -1510 -5080 1378 5021 -1078
3726 -1078 -5054 1242 5217 -1096 -5105 1265 5155 -939 -5107 1084 5262 -793 -5259 659 5265
3741 5265 -713 -5227 520 4946 -656 -5168 687 5228 -380 -5415 343 5041 -416 -5089 81
3756 81 5278 -259 -5004 159 5384 -127 -5094 124 5162 -176 -5229 -112 5265 50 -5007
3771 -5007 152 5016 339 -5169 -134 5021 290 -5239 -601 4948 76 -5203 -483 5175 565
3786 565 -5182 -448 5351 791 -5365 -502 4966 1096 -5121 -902 5337 1036 -5010 -640 5139
3801 5139 847 -4987 -1044 5182 835 -4963 -1009 5251 886 -5097 -1190 5038 952 -5098 -1422
3816 -1422 4999 937 -5172 -1320 4862 1345 -5073 -1320 4989 1231 -4861 -1359 4599 1456 -4819
3831 -4819 -1345 4866 1379 -4505 -1364 4929 1392 -4600 -1668 4530 1585 -4641 -1708 4441 1546
3846 1546 -4681 -1805 4369 1752 -4583 -1960 4243 2074 -4381 -1937 4243 2265 -4215 -1919 4392
3861 4392 1973 -4226 -1925 4003 2274 -3813 -2432 4145 2442 -3894 -2209 3786 2385 -3982 -2566
3876 -2566 3788 2352 -4032 -2542 3770 2409 -3979 -2526 3565 2495 -3555 -2480 3544 2799 -3632
3891 -3632 -2585 3758 2634 -3483 -2825 3659 2698 -3542 -2990 3547 2907 -3294 -2992 3426 3058 -3486
3907 -3486 -3267 3214 3132 -3307 -3160 3392 3103 -3203 -3309 3131 3039 -3221 -3322 2954 3335 -3142 -3243 3160
3925 3160 3453 -2988 -3577 3002 3557 -2775 -3543 2873 3469 -2845 -3499 2829 3686 -2883 -3271 2918 3564
3942 3564 -2875 -3529 2779 3353 -2693 -3776 2570 3502 -2614 -3741 2442 3623 -2614 -3512 2756 3753
3958 3753 -2274 -3653 2477 3909 -2378 -3463 2402 3713 -2602 -3641 2402 3813 -2346 -3660 1876
3973 1876 3550 -2175 -3970 2083 3545 -2215 -4087 1966 3511 -2058 -3753 1883 3473 -2152 -3793
3988 -3793 1987 3801 -1642 -3820 1596 3833 -1382 -3693 1833 3754 -1469 -3762 1373 3961 -1273
4003 -1273 -3899 1331 3776 -1218 -3891 1246 3622 -1279 -3893 918 3870 -1254 -3617 975 4009
4018 4009 -1100 -4102 881 4007 -792 -3830 794 4042 -537 -3932 739 3914 -519 -4011 448
4033 448 3806 -718 -4130 585 3726 -552 -3883 252 3635 -572 -3876 403 3763 -447 -3699
4048 -3699 177 3925 -149 -4009 261 3809 -177 -3922 17 3900 -194 -3979 157 3977 -43
4063 -43 -3947 -159 4082 84 -4002 -205 3818 -54 -3948 -343 4079 214 -4070 -360 4062
4078 4062 241 -4023 -383 4086 296 -4107 -463 4076 439 -3989 -338 3976 464 -3747 -568
4093 -568 3907 554 -3834 -437 3831 741 -3841 -674 3937 494 -3764 -901 3750 742 -3679
4108 -3679 -927 3706 495 -3582 -916 3479 915 -3673 -783 3713 723 -3283 -756 3434 1022
4123 1022 -3520 -858 3442 1101 -3485 -936 3439 1199 -3451 -1196 3350 1221 -3307 -1233 3273
4138 3273 1149 -3415 -1410 3346 1365 -3419 -1439 3328 1570 -3221 -1057 3183 1589 -3016 -1689
4153 -1689 3179 1544 -3064 -1323 3263 1547 -3022 -1636 3074 1513 -2817 -1853 2772 1691 -2979
4168 -2979 -1816 2957 1793 -2988 -2055 3006 1959 -2851 -2136 2693 2113 -2807 -1919 2612 2138 -2668
4184 -2668 -2197 2856 2107 -2628 -2131 2750 2310 -2494 -2222 2693 2293 -2668 -2342 2665 2231 -2448 -2351
4201 -2351 2397 1856 -2467 -2302 2357 2532 -2518 -2474 2289 2134 -2286 -2264 2417 2580 -2309 -2314 2437 2635
4219 2635 -2195 -2449 2275 2618 -2227 -2708 2210 2658 -2044 -2522 2393 2650 -2546 -2616 2099 2613 -2140
4236 -2140 -2603 1998 2740 -2170 -2730 1941 2614 -1759 -2822 2026 2729 -1744 -2423 2095 2861 -1994 -2613
4253 -2613 1915 2750 -1737 -2563 1998 2661 -1785 -2694 1622 2675 -1693 -2700 1496 2460 -1633 -2863
4269 -2863 1487 2411 -1256 -2903 1283 2631 -1711 -2774 1370 2905 -1239 -2705 1357 2728 -1170
4284 -1170 -2817 1199 2843 -1186 -2762 994 2922 -988 -2869 894 2781 -816 -2788 1008 2999
4299 2999 -658 -3023 847 2794 -756 -2863 507 2964 -663 -2840 682 2847 -541 -2870 514
4314 514 2679 -541 -2952 755 2920 -679 -2913 502 2815 -371 -2882 445 3113 -197 -3166
4329 -3166 194 2723 -391 -2879 417 2835 -527 -2920 232 2781 -85 -2853 140 3000 -93
4344 -93 -2731 188 3054 51 -3086 110 2824 193 -2990 -6 3167 203 -2703 -57 3004
4359 3004 37 -2956 -45 3149 174 -2695 95 2773 34 -3111 -112 2821 216 -2707 -178
4374 -178 2781 298 -2728 -72 2930 328 -2857 -157 2777 449 -2865 -412 2637 300 -2699
4389 -2699 -381 2611 232 -2347 -704 2795 431 -2800 -377 2634 925 -2753 -681 2573 354
4404 354 -2712 -598 2681 766 -2415 -562 2637 690 -2479 -755 2579 997 -2595 -637 2484
4419 2484 749 -2331 -961 2383 756 -2373 -688 2377 889 -2298 -915 2184 955 -2220 -977
4434 -977 2358 955 -2116 -1096 2225 1282 -2169 -1103 2170 1195 -2107 -1239 2171 1305 -2357 -1207
4450 -1207 2205 1214 -2080 -1250 1953 1368 -1967 -1273 2122 1536 -2027 -1652 2109 1322 -2087 -1576 1988
4467 1988 1626 -2000 -1461 2007 1574 -1929 -1542 1900 1775 -1820 -1789 1919 1565 -1940 -1761 1770 1528
4484 1528 -1728 -1807 1732 1688 -1878 -1926 1868 1467 -1643 -1730 1769 1924 -1619 -1747 1697 1852 -1599 -1716
4502 -1716 1708 1636 -1626 -1761 1700 1993 -1508 -1695 1639 2004 -1634 -1656 1687 2034 -1806 -1855 1347 1922
4520 1922 -1691 -2057 1455 1865 -1600 -1535 1669 1684 -1785 -2045 1412 1836 -1550 -1885 1287 1962 -1235
4537 -1235 -1880 1509 2001 -1253 -1986 1174 1912 -1049 -1918 1025 1943 -1188 -1613 944 2021 -1100 -1847
4554 -1847 1114 1863 -1057 -1920 1066 1977 -1044 -2030 903 1783 -764 -1925 810 1939 -865 -1978
4570 -1978 984 1919 -714 -2000 831 2105 -629 -2138 824 2208 -905 -1785 698 2227 -705
4585 -705 -1981 540 1923 -682 -2378 439 2041 -535 -2055 435 2121 -425 -2029 642 2182
4600 2182 -448 -2034 364 2087 -377 -2014 394 2119 -251 -2136 701 2037 -152 -2127 434
4615 434 2123 -170 -2124 101 2220 -267 -1937 228 2156 -60 -2133 -49 2166 -139 -2228
4630 -2228 -54 1891 -408 -2134 -77 2318 4 -2154 224 2010 -119 -1979 334 1932 113
4645 113 -2020 291 2076 298 -1989 53 2194 -61 -1933 48 1856 89 -2140 -69 2150
4660 2150 -48 -1982 -323 1872 184 -1831 58 2203 379 -1734 -212 1888 317 -1784 -167
4675 -167 1856 134 -1939 -448 1824 455 -2073 -199 1927 170 -1929 -407 1670 684 -2050
4690 -2050 -809 1703 552 -1855 -605 1776 623 -1420 -641 1860 309 -1526 -400 1594 427
4705 427 -1838 -506 1707 670 -1717 -806 1626 508 -1767 -857 1571 846 -1474 -871 1518 787
4721 787 -1431 -988 1756 921 -1647 -838 1286 893 -1551 -1146 1545 944 -1507 -1268 1601 849 -1633
4738 -1633 -913 1617 1019 -1636 -1203 1666 1079 -1451 -1090 1380 1020 -1456 -851 1307 833 -1586 -980
4755 -980 1462 1404 -1589 -1096 1634 1222 -1346 -1197 1556 1221 -910 -1173 1290 1411 -1228 -945 1363
4772 1363 1191 -1313 -1392 1215 987 -1172 -1160 1313 1325 -1280 -1323 1336 1015 -1115 -1243 1145 1019 -1252
4790 -1252 -1132 1099 1244 -1049 -1284 1220 1464 -1162 -1356 1274 1539 -860 -1035 1098 1374 -1223 -1141
4807 -1141 1041 1389 -1097 -1386 916 1217 -864 -1052 964 1466 -874 -1438 1154 1406 -756 -1565 742
4824 742 1413 -1075 -1147 982 1246 -847 -1099 732 1204 -564 -1228 748 1279 -585 -1303 958 1324 -781
4842 -781 -1525 457 1297 -567 -1594 499 1306 -762 -1676 432 1159 -474 -1240 628 1499 -580 -1482
4859 -1482 295 1409 -372 -1254 230 1406 -315 -1583 438 1385 -533 -1737 278 1424 -470
4874 -470 -1530 422 1390 -586 -1711 276 1450 -454 -1606 517 1569 -290 -1513 393 1535
4889 1535 -260 -1246 286 1340 -107 -1425 2 1323 -69 -1422 238 1436 -401 -1540 219
4904 219 1373 -281 -1478 170 1601 -131 -1529 -38 1403 -111 -1628 263 1447 -54 -1541
4919 -1541 -67 1550 67 -1587 154 1448 52 -1148 4 1441 149 -1406 13 1480 338
4934 338 -1349 -134 1420 16 -1424 3 1360 111 -1447 -47 1412 226 -1454 -181 1300
4949 1300 22 -1519 -129 1286 180 -1686 -170 1251 209 -1312 -306 1389 208 -1522 -283
4964 -283 1258 248 -1166 -436 1222 226 -1363 -381 1098 396 -1312 -506 1182 303 -1116 -275 1132
4981 1132 251 -1242 -513 1073 320 -1031 -602 1066 554 -1279 -391 1282 662 -1139 -540 1079 318
4998 318 -1243 -479 955 593 -1203 -713 888 599 -833 -620 1174 602 -1052 -668 1047 637 -1085
5015 -1085 -724 1076 663 -1060 -434 1049 689 -1029 -484 1223 604 -1062 -836 785 659 -1032 -789
5032 -789 898 861 -1202 -934 1120 875 -933 -504 817 809 -982 -627 837 855 -1006 -810 844 812 -1052
5051 -1052 -845 857 1014 -1039 -762 890 1144 -1025 -695 889 824 -693 -679 983 822 -936 -885 879
5069 879 681 -907 -821 744 635 -839 -850 555 1019 -798 -916 598 864 -582 -697 657 1006 -885
5087 -885 -923 705 960 -588 -996 790 919 -795 -1010 748 1077 -661 -965 644 677 -363 -882 606
5105 606 857 -418 -1115 627 810 -772 -1058 484 864 -526 -1211 789 1043 -483 -770 284 1143
5122 1143 -364 -1097 536 985 -627 -845 467 977 -290 -1175 455 1232 -233 -1031 382 1205 -355
5139 -355 -851 504 1025 -289 -1108 268 1113 -195 -961 125 924 -194 -988 318 1084 -189 -1027
5156 -1027 207 998 118 -1053 86 1034 -428 -1054 102 1089 42 -979 65 848 -42 -1258 -9
5173 -9 1194 -5 -964 -155 924 -114 -973 82 1108 -237 -1301 66 979 -51 -967 48 1150
5190 1150 157 -1170 144 1137 5 -901 -237 966 152 -1198 -273 1036 51 -885 -114 697 13 -1292
5208 -1292 -222 1151 -85 -927 111 969 19 -942 -29 874 381 -1028 -306 842 219 -1088 -158
5225 -158 1240 375 -943 -280 1099 280 -1048 -65 1143 318 -976 -241 956 102 -654 -206 1021
5242 1021 131 -966 32 609 333 -955 -160 819 487 -734 -293 835 476 -815 -341 888 467 -775
5260 -775 -465 812 273 -734 -431 1268 256 -737 -578 917 316 -716 -532 712 211 -822 -442
5277 -442 747 476 -816 -384 596 572 -850 -824 881 717 -481 -396 858 482 -665 -483 851 633
5295 633 -616 -478 772 686 -748 -629 817 615 -717 -722 691 469 -705 -520 592 683 -699 -613 873
5314 873 750 -616 -449 559 679 -666 -740 599 507 -1030 -607 553 430 -529 -601 527 601 -800 -769
5333 -769 595 815 -893 -702 707 805 -647 -851 500 594 -654 -694 701 718 -418 -730 407 709
5351 709 -722 -807 380 617 -717 -446 335 724 -437 -837 449 889 -406 -965 468 502 -759 -935
5369 -935 440 589 -375 -528 277 798 -533 -592 478 736 -408 -903 411 858 -501 -663 260 898
5387 898 -318 -818 202 848 -503 -1226 296 712 -307 -747 225 495 -206 -705 166 578 -270 -470
5405 -470 199 713 -11 -793 205 1008 -157 -678 263 688 -133 -895 41 939 -61 -835 -77 517 143
5424 143 -719 -155 698 3 -916 -8 725 334 -749 120 858 56 -923 114 801 -26 -734 48 837
5443 837 29 -581 47 755 -175 -921 -13 674 -106 -544 -207 897 95 -928 -172 689 47 -1005 -12
5462 -12 694 -43 -1037 -34 751 244 -613 -83 699 302 -782 -446 813 157 -863 -99 777 -108 -774
5481 -774 -282 712 312 -632 -282 856 253 -412 -228 580 87 -798 -147 320 160 -768 -205 862 404
5500 404 -679 -101 701 15 -573 -210 778 189 -723 -206 817 134 -746 -319 674 265 -596 -486 768
5519 768 339 -630 -351 503 184 -623 -262 554 156 -792 -310 476 233 -620 -510 701 173 -306 -363 419
5539 419 433 -694 -127 534 396 -656 -262 431 299 -329 -459 375 471 -526 -359 527 484 -668 -528 512
5559 512 549 -670 -496 316 490 -194 -513 569 338 -679 -424 627 449 -651 -470 521 294 -368 -657
5578 -657 553 512 -352 -287 499 375 -315 -538 501 574 -346 -592 495 646 -549 -536 279 323 -83 -468
5598 -468 340 609 -426 -401 621 746 -341 -419 314 615 -563 -504 381 455 -387 -520 198 654 -329 -700
5618 -700 375 725 -475 -577 443 322 -344 -511 298 685 -371 -550 130 718 -411 -725 466 583
5636 583 -207 -521 100 598 -425 -616 287 557 -216 -788 428 436 -290 -402 97 603 -340 -438 307 662
5656 662 -338 -691 204 579 -13 -540 -41 555 -146 -611 77 233 -119 -512 145 473 -236 -358 27 577
5676 577 -282 -414 249 584 -122 -447 -199 576 25 -450 -48 341 30 -561 77 633 -148 -537 146 452
5696 452 10 -428 10 763 -22 -532 18 662 117 -639 132 719 -19 -610 -373 577 -62 -571 115 580
5716 580 142 -531 -6 544 34 -557 -136 697 221 -387 -67 503 -172 -715 -292 677 -20 -562 -60 842
5736 842 29 -398 135 490 248 -591 -5 463 285 -649 -160 562 325 -408 -112 561 248 -608 -321 620
5756 620 410 -532 -125 556 63 -342 -211 422 203 -803 -376 523 332 -462 -243 328 362 -443 -387 391
5776 391 439 -316 -475 504 139 -458 -169 344 183 -556 -262 621 205 -567 -164 158 337 -265 -303 275 132
5797 132 -568 -332 376 504 -324 -347 580 332 -468 -253 489 546 -452 -346 555 289 -602 -224 372 428 -245
5818 -245 -291 196 163 -521 -441 411 315 -486 -311 338 313 -195 -431 400 572 -481 -373 275 258 -601 -264 522
5840 522 255 -357 -473 432 297 -213 -459 89 530 -366 -410 331 501 -383 -219 427 631 -353 -316 663 630
5861 630 -371 -466 282 507 -123 -687 231 535 -87 -481 191 469 -178 -427 423 446 -518 -433 191 287 -256
5882 -256 -383 150 588 -342 -380 262 475 -197 -477 211 647 17 -425 188 536 123 -535 226 438 -323
5902 -323 -419 182 259 -164 -394 158 474 -47 -427 221 509 -103 -381 349 485 -324 -385 89 401 -58 -519
5923 -519 157 681 -347 -376 377 369 -57 -600 161 628 -137 -521 22 196 -325 -397 232 309 26 -584 164
5944 164 400 -206 -340 24 459 118 -573 84 636 -70 -478 124 302 -95 -634 -157 514 71 -306 191
5964 191 476 107 -657 112 520 9 -501 -184 537 177 -468 -109 362 45 -480 33 544 120 -551 -70
5984 -70 491 70 -304 -124 326 137 -408 -11 548 142 -616 112 372 58 -334 -210 508 77 -450 -126
6004 -126 549 122 -424 -249 311 226 -652 87 356 95 -433 -355 545 67 -344 -225 563 317 -528 -245 453
6025 453 417 -425 -96 446 208 -372 -20 488 69 -457 -195 417 146 -463 -572 346 122 -286 -220 559 2
6046 2 -640 -314 220 64 -349 -81 253 160 -450 -325 159 256 -415 -256 577 121 -466 -230 124 188 -369 -348
6068 -348 222 189 -275 -298 483 250 -109 -140 169 255 -306 -270 360 349 -324 -31 126 293 -330 -202 454 410
6090 410 -193 -195 412 437 -99 -202 314 355 -336 -345 411 169 -662 -109 526 386 -166 -198 395 353 -216 -240 266
6113 266 56 -330 -348 297 290 -107 -268 243 159 -239 -211 143 321 -187 -367 -44 327 69 -589 140 386 6
6135 6 -552 47 193 -208 -254 253 281 -118 -412 144 280 -299 -394 181 412 -152 -92 135 608 -434 -292 220
6157 220 257 -181 -220 60 125 -70 -593 -78 402 -172 -553 78 313 -37 -457 34 376 146 -576 -36 354
6178 354 -4 -331 292 295 -148 -405 34 287 -33 -547 132 534 -36 -369 241 430 -202 -404 -50 206 83
6199 83 -500 7 258 193 -280 -111 125 -157 -402 -286 190 -10 -338 19 412 -49 -435 -154 432 2 -274
6220 -274 85 240 37 -325 -283 393 84 -417 160 19 -341 -363 16 343 -132 -200 99 331 -220 -146 -8
6241 -8 358 110 -92 81 277 -75 -339 190 480 -70 -375 -21 97 -116 -190 97 237 115 -290 55 545
6262 545 251 -121 102 434 40 -634 -346 288 154 -412 -239 259 67 -229 -188 565 240 -395 55 241
6282 241 55 -420 -389 150 369 -278 -278 255 -51 -156 -114 432 96 -480 -275 175 58 -409 -350 386 157 -571
6304 -571 -40 399 215 -356 -159 231 250 -307 -128 501 258 -365 -178 353 226 -331 -157 452 345 -167
6324 -167 -176 486 219 -367 -180 128 124 -336 -101 -55 -13 -146 -64 160 392 -582 -168 173 69 -266 -144 498
6346 498 340 -389 -444 465 156 -272 51 421 218 -483 -130 404 184 -226 -111 141 267 -127 -136 200 436
6367 436 -75 -271 402 305 -236 -319 264 333 -28 -176 198 173 -173 -201 181 192 -204 -244 -30 303 -421 -346 228
6390 228 225 -271 -376 264 402 -81 -223 184 -4 -103 -224 169 150 -136 -155 149 187 -212 -238 212 375 75
6412 75 -296 -47 289 -170 -262 197 399 -172 -211 -24 217 -233 -271 80 320 -141 -299 165 -12 -260 -189 211
6434 211 256 -299 -205 317 353 -83 -353 134 282 -130 -131 156 348 0 -361 73 200 -39 -64 201 397 -111
6456 -111 -230 95 153 -108 -142 -55 391 -38 -392 217 298 -48 -277 108 289 130 -182 101 302 68 -361
6477 -361 57 90 -92 -194 -5 211 -148 -406 282 320 -38 -326 127 53 -4 -182 279 285 -12 -227 -112 238
6499 238 -163 -57 -241 187 60 -163 -44 156 -20 -87 178 135 110 -162 -70 272 81 -153 -7 328 -147
6520 -147 -236 30 381 280 -83 58 295 241 -379 -22 107 102 -224 -5 273 53 -397 -117 257 63 -116
6541 -116 73 127 134 -328 -27 220 0 -146 24 240 233 -399 -62 155 73 -402 -159 241 107 -214 -228 178
6563 178 190 -322 8 348 -116 -378 -130 352 84 -250 -189 306 110 -253 -229 290 52 -461 -115 478 66
6584 66 -29 -166 246 18 -34 20 100 66 -402 91 31 93 -263 95 142 127 18 12 186 161 -374 -229 168 -132
6608 -132 -271 -178 377 -96 -395 -251 149 85 -186 54 169 -78 -369 -116 152 -53 65 -129 252 276 -282
6629 -282 -250 209 106 -158 -20 83 -16 -143 7 185 137 -366 -215 394 116 -359 29 469 62 -362 -7
6650 -7 10 125 -69 -251 66 182 -373 -168 143 165 -249 -449 30 348 -354 -463 242 84 -342 -46 153
6671 153 17 66 -239 199 136 3 -76 89 237 10 -244 367 183 -315 -400 211 121 -337 -198 343 150 -171
6693 -171 -245 139 109 -162 -107 229 189 -152 4 183 418 -232 -162 60 344 -203 -69 72 295 -195 -158 159
6715 159 278 -131 -284 234 349 -186 -110 87 -122 26 -247 -14 253 -192 -295 62 163 -260 -294 207 191
6736 191 -174 -471 278 97 -29 -130 20 257 -91 50 38 131 -96 -60 -97 457 -76 -281 107 -70 -220
6757 -220 -222 -14 161 -50 -220 302 351 -240 -311 173 243 -58 -197 105 108 -17 -386 81 253 82 -359 129
6779 129 292 105 -168 -66 497 -88 -278 42 292 114 -242 99 273 -47 -308 -26 236 -11 -58 153
6799 153 195 -102 -187 98 223 -14 -162 75 291 125 -61 -89 286 180 -208 -106 28 -17 -287 138 203 -122
6821 -122 -2 86 274 -45 -234 -211 444 70 -376 -118 242 -41 -81 73 179 -72 -327 -115 363 -104 -266
6842 -266 -213 75 -184 -550 -161 277 54 -297 -86 79 98 -366 -176 299 -57 -262 -13 213 243 -149 0
6863 0 -77 237 -452 -7 189 104 56 -247 196 4 -286 -278 310 119 -2 -17 305 -96 -142 -19 402 -8 -130
6886 -130 -15 9 3 -255 -111 271 184 -30 -77 165 11 -321 -152 187 157 -31 85 367 279 -329 -83 264
6908 264 243 -211 -156 210 210 -216 -172 182 45 -156 -215 236 345 -195 -17 115 264 15 -345 105 206 -47
6930 -47 -182 261 209 -62 -36 53 73 -146 -106 159 119 37 -279 -67 -15 48 -244 75 155 -37 -116 50 -29 -178
6954 -178 -286 -42 384 -163 -49 221 129 129 63 166 14 -416 -400 273 445 -6 -195 118 347 111 48 197
6976 197 223 -67 -27 29 306 -133 -257 321 38 -164 -76 -13 -94 -60 -133 195 209 -178 -184 74 308 2 1 -75 262
7001 262 -143 66 153 135 -97 -60 233 59 -454 -243 98 155 27 -198 248 172 -147 -114 136 225 -72 -143 -104
7024 -104 250 -81 -183 -89 192 24 -274 222 335 -68 -124 66 285 -69 -84 116 43 -137 -114 146 290 151
7046 151 -115 24 62 -183 -20 -191 -49 -186 -274 176 154 11 44 -45 245 63 -423 -172 197 -256 -392 105
7068 105 44 143 -193 142 300 -81 -122 -65 133 -36 -288 -53 163 327 -44 256 244 9 -279 220 182 -5
7090 -5 -87 34 146 -42 -290 170 339 -103 -173 61 298 8 -161 49 -109 -224 -181 17 48 -103 -287 -99
7112 -99 309 -92 -103 -188 292 204 -88 117 122 20 -289 79 134 164 -128 -101 96 117 -107 -226 394 90 -295
7135 -295 141 100 -101 -48 -110 317 -187 -173 1 8 -6 -216 -103 97 113 -239 56 255 285 -199 -16 175 -115
7158 -115 -310 90 282 155 -202 -159 191 111 200 11 154 79 -37 -31 326 140 -241 -5 78 39 -163 -239 165
7181 165 62 91 140 -18 -64 -119 -57 168 90 -100 -231 172 229 -68 78 106 -32 -141 -98 97 357 -49 -257
7204 -257 98 32 -112 -111 168 99 116 -53 -36 -132 56 -107 220 146 -132 4 106 91 21 -203 -31 221 -107
7227 -107 177 58 173 -230 -68 93 159 95 -87 97 219 33 44 170 451 -194 -85 -45 117 46 -109 101
7249 101 52 -37 -339 171 -39 91 -126 163 195 -33 -148 222 416 -21 -336 105 147 -59 19 -48 186 -90
7271 -90 -172 215 330 55 -131 43 348 -81 64 73 169 -312 -121 37 130 127 -230 28 10 9 -175 -42 150 -4
7295 -4 -3 2 116 36 -125 7 66 20 -215 -156 263 73 -212 140 20 197 -350 -72 121 -240 -272 127 125 262
7319 262 -12 -104 75 -41 -153 -136 -9 -121 -121 -149 100 -98 -69 -135 167 276 -76 17 -4 68 -63 11 264 -57
7343 -57 -274 9 177 202 49 165 -119 22 -263 -165 423 208 -247 -120 54 48 -195 17 -32 123 -33 -314
7365 -314 205 56 -272 -292 4 -17 -81 -79 213 -40 -101 -220 180 175 -3 -119 118 115 90 -37 10 242 -82 -86 101
7390 101 -53 -173 -67 161 113 -41 -381 19 -76 -34 -80 7 203 -91 -273 -8 7 -172 -86 129 363 117
7412 117 -44 210 -36 -187 -51 80 71 11 33 68 -53 -125 -241 17 155 131 -331 273 163 -125 -88 165 259
7435 259 -59 -17 -43 73 -316 -286 116 19 -131 -149 135 191 -67 -124 -24 27 -202 11 270 81 -147 -11 106
7458 106 -179 -156 -67 155 56 135 -229 -248 14 -123 -144 -84 12 -97 -41 75 193 -21 -130 103 111 -160 -227 110
7482 110 -22 -19 -47 128 259 -163 -67 176 30 2 -154 -92 153 -235 -94 -27 -21 -98 -191 9 109 -19 43 74
7506 74 102 90 -79 62 218 24 80 -10 251 -271 -119 195 108 -91 -133 136 30 29 -327 36 149 -110 -143
7529 -143 -93 54 143 -53 -166 168 49 213 -11 -267 142 -186 93 140 -38 -296 -93 101 73 -132 -57 139
7551 139 30 -317 -49 -6 -138 -84 -125 241 -114 29 25 69 -29 -178 26 253 -39 -174 47 246 189 -263 146
7574 146 75 161 -64 -104 -36 139 51 65 -116 305 -44 -7 6 -231 -63 -148 168 217 -107 -211 107 58 174 -143
7598 -143 90 107 -143 -199 3 322 33 -116 39 125 -155 -115 -6 -60 -195 -23 166 87 -69 77 365 -100
$$ [...]
8191a2
##END NTUPLES=NMR FID
##END=
