##TITLE=1H_Ac20(Clear-bottle)
 CDCl3
 8 sc, 
 8.04.2022
##JCAMPDX= 6.0         $$ Bruker NMR JCAMP-DX V2.0
##DATA TYPE= NMR FID
##DATA CLASS= NTUPLES
##ORIGIN= UXNMR, Bruker Analytische Messtechnik GmbH
##OWNER= root
$$ XWIN-NMR		Version 3.5
$$ Fri Apr  8 10:34:17 2022 Russian Standard Time (UT+4h)  she@DPX200
##.OBSERVE FREQUENCY= 200.13135
##.OBSERVE NUCLEUS= ^1H
##.DELAY= (6, 6)
##.ACQUISITION MODE= SIMULTANEOUS
##.ACQUISITION SCHEME= undefined
##.AVERAGES= 8
##.DIGITISER RES= 18
##SPECTROMETER/DATA SYSTEM= spect
##.PULSE SEQUENCE= zg30
##.SOLVENT NAME= CDCl3
##.SHIFT REFERENCE= (INTERNAL, CDCl3, 0, 15.7039)
##AUDIT TRAIL= $$ (NUMBER, WHEN, WHO, WHERE, WHAT)
$$ ##TITLE= Audit trail, XWIN-NMR		Version 3.5
$$ ##JCAMPDX= 5.01
$$ ##ORIGIN= Bruker BioSpin GmbH
$$ ##OWNER= she
$$ F:/spectra/data/she/nmr/H-F/1/audita.txt
$$ ##AUDIT TRAIL=  $$ (NUMBER, WHEN, WHO, WHERE, WHAT)
(   1,<2022-04-08 10:32:40.65 +0400>,<she>,<DPX200>,
      <created by zg, POWCHK disabled, PULCHK disabled
       configuration hash MD5:
       00 E9 B6 7A A2 85 ED C7 34 08 36 98 17 FE 4E 26
       data hash MD5: 16K
       9A 28 E3 8B 1F 3D F2 34 26 E8 E6 D0 A3 73 9B BA>)
$$ ##END=
$$ 
$$ hash MD5
$$ E8 33 63 F5 23 96 0A E5 77 98 DC 53 42 D0 DA 41
##$RELAX= 
##$RELAX= 
##$RELAX= 
##$RELAX= 
##$RELAX= 
##$RELAX= 
$$ Bruker specific parameters
$$ --------------------------
##$DU= <F:/spectra>
##$EXPNO= 1
##$NAME= <H-F>
##$PROCNO= 1
##$TYPE= <nmr>
##$USER= <she>
##$AMP= (0..31)
100 100 100 100 100 100 100 100 100 100 100 100 100 100 100 100 100 100 
100 100 100 100 100 100 100 100 100 100 100 100 100 100 
##$AQSEQ= 0
##$AQ_mod= 1
##$AUNM= <au_zg>
##$AUTOPOS= <>
##$BF1= 200.13
##$BF2= 200.13
##$BF3= 200.13
##$BF4= 200.13
##$BF5= 200.13
##$BF6= 200.13
##$BF7= 200.13
##$BF8= 200.13
##$BYTORDA= 1
##$CFDGTYP= 0
##$CFRGTYP= 5
##$CHEMSTR= <none>
##$CNST= (0..31)
1 1 145 1 1 1 1 1 1 1 1 1 1 1 1 1 1 1 1 1 1 1 1 1 1 1 1 1 1 1 1 1 
##$CPDPRG= <>
##$CPDPRG1= <>
##$CPDPRG2= <>
##$CPDPRG3= <>
##$CPDPRG4= <mlev>
##$CPDPRG5= <mlev>
##$CPDPRG6= <mlev>
##$CPDPRG7= <mlev>
##$CPDPRG8= <mlev>
##$CPDPRGB= <>
##$CPDPRGT= <>
##$D= (0..31)
0 1.2 0 0 0 0 0 0 0 0.06 0 0.03 0 0 0 0 0.0002 0 0 0 0 0 0 0 0 0 0 0 0 
0 0 0 
##$DATE= 1649399560
##$DBL= (0..7)
120 120 120 120 120 120 120 120 
##$DBP= (0..7)
150 150 150 150 150 150 150 150 
##$DBP07= 0
##$DBPNAM0= <>
##$DBPNAM1= <>
##$DBPNAM2= <>
##$DBPNAM3= <>
##$DBPNAM4= <>
##$DBPNAM5= <>
##$DBPNAM6= <>
##$DBPNAM7= <>
##$DBPOAL= (0..7)
0.5 0.5 0.5 0.5 0.5 0.5 0.5 0.5 
##$DBPOFFS= (0..7)
0 0 0 0 0 0 0 0 
##$DE= 6
##$DECBNUC= <off>
##$DECIM= 32
##$DECNUC= <off>
##$DECSTAT= 4
##$DIGMOD= 1
##$DIGTYP= 9
##$DL= (0..7)
0 120 120 120 120 120 120 120 
##$DP= (0..7)
150 150 150 150 150 150 150 150 
##$DP07= 0
##$DPNAME0= <>
##$DPNAME1= <>
##$DPNAME2= <>
##$DPNAME3= <>
##$DPNAME4= <>
##$DPNAME5= <>
##$DPNAME6= <>
##$DPNAME7= <>
##$DPOAL= (0..7)
0.5 0.5 0.5 0.5 0.5 0.5 0.5 0.5 
##$DPOFFS= (0..7)
0 0 0 0 0 0 0 0 
##$DQDMODE= 0
##$DR= 18
##$DS= 0
$$ [...]
##$SUBNAM2= <"">
##$SUBNAM3= <"">
##$SUBNAM4= <"">
##$SUBNAM5= <"">
##$SUBNAM6= <"">
##$SUBNAM7= <"">
##$SUBNAM8= <"">
##$SUBNAM9= <"">
##$SW= 18.05172834244
##$SWIBOX= (0..15)
0 0 2 0 0 0 0 0 0 0 0 0 0 0 0 0 
##$SW_h= 3612.71676300578
##$TD= 16384
##$TD0= 1
##$TE= 0
##$TE2= 300
##$TE3= 300
##$TEG= 300
##$TL= (0..7)
0 120 120 120 120 120 120 120 
##$TP= (0..7)
150 150 150 150 150 150 150 150 
##$TP07= 0
##$TPNAME0= <>
##$TPNAME1= <>
##$TPNAME2= <>
##$TPNAME3= <>
##$TPNAME4= <>
##$TPNAME5= <>
##$TPNAME6= <>
##$TPNAME7= <>
##$TPOAL= (0..7)
0.5 0.5 0.5 0.5 0.5 0.5 0.5 0.5 
##$TPOFFS= (0..7)
0 0 0 0 0 0 0 0 
##$TUNHIN= 0
##$TUNHOUT= 0
##$TUNXOUT= 0
##$USERA1= <user>
##$USERA2= <user>
##$USERA3= <user>
##$USERA4= <user>
##$USERA5= <user>
##$V9= 5
##$VALIST= <valist>
##$VCLIST= <CCCCCCCCCCCCCCC>
##$VD= 0
##$VDLIST= <DDDDDDDDDDDDDDD>
##$VPLIST= <PPPPPPPPPPPPPPP>
##$VTLIST= <TTTTTTTTTTTTTTT>
##$WBST= 1024
##$WBSW= 4
##$XGAIN= (0..3)
0 0 0 0 
##$XL= 0
##$YL= 0
##$YMAX_a= 239322
##$YMIN_a= -288177
##$ZGOPTNS= <>
##$ZL1= 120
##$ZL2= 120
##$ZL3= 120
##$ZL4= 120
##$ABSF1= 10
##$ABSF2= 0
##$ABSG= 5
##$ABSL= 3
##$ALPHA= 0
##$AQORDER= 0
##$ASSFAC= 0
##$ASSFACI= 0
##$ASSFACX= 0
##$ASSWID= 0
##$AUNMP= <proc_1d>
##$AZFE= 0.1
##$AZFW= 0.1
##$BCFW= 1
##$BC_mod= 2
##$BYTORDP= 1
##$COROFFS= 0
##$CY= 11.3945322036743
##$DATMOD= 1
##$DC= 2
##$DFILT= <>
##$DTYPP= 0
##$F1P= 2.36226072786647
##$F2P= -0.459571619588291
##$FCOR= 0.5
##$FTSIZE= 0
##$FT_mod= 4
##$GAMMA= 1
##$GB= 0.15
##$INTBC= 1
##$INTSCL= 1
##$ISEN= 128
##$LB= 0.24
##$LEV0= 0
##$LPBIN= 0
##$MAXI= 10000
##$MC2= 0
##$MEAN= 0
##$ME_mod= 0
##$MI= 1.114404
##$NCOEF= 0
##$NC_proc= 0
##$NLEV= 6
##$NOISF1= 3.799351
##$NOISF2= 2.8
##$NSP= 1
##$NTH_PI= 0
##$NZP= 0
##$OFFSET= 15.70392
##$PC= 1
##$PHC0= -18390.6
##$PHC1= 11.40078
##$PH_mod= 1
##$PKNL= yes
##$PPARMOD= 0
##$PSCAL= 0
##$PSIGN= 0
##$REVERSE= no
##$SF= 200.130013532006
##$SI= 16384
##$SIGF1= 3
##$SIGF2= 2
##$SINO= 400
##$SIOLD= 16384
##$SREGLST= <1H.CDCl3>
##$SSB= 0
##$STSI= 0
##$STSR= 0
##$SW_p= 3612.71676300578
##$SYMM= 0
##$S_DEV= 0
##$TDeff= 0
##$TDoff= 0
##$TI= <>
##$TILT= no
##$TM1= 0
##$TM2= 0
##$TOPLEV= 0
##$USERP1= <user>
##$USERP2= <user>
##$USERP3= <user>
##$USERP4= <user>
##$USERP5= <user>
##$WDW= 1
##$XDIM= 8192
##$YMAX_p= 0
##$YMIN_p= 0
$$ End of Bruker specific parameters
$$ ---------------------------------
##NTUPLES= NMR FID
##VAR_NAME=  TIME,          FID/REAL,        FID/IMAG
##SYMBOL=    X,             R,               I
##VAR_TYPE=  INDEPENDENT,   DEPENDENT,       DEPENDENT
##VAR_FORM=  AFFN,          ASDF,            ASDF
##VAR_DIM=   8192,          8192,            8192
##UNITS=     SECONDS,       ARBITRARY UNITS, ARBITRARY UNITS
##FACTOR=    0.0002768,     1,               1
##FIRST=     0,             0,               0
##LAST=      2.2672688,     0,               0
##MIN=       0,             -288177,         0
##MAX=       2.2672688,     239322,          0
$$ Real data points
##PAGE= N=1
##DATA TABLE= (X++(R..R)), XYDATA
0@%%%%%%%%%%%Qj6J6j6K4l2L3m1N6o5P3q9J06j26J50j72J97k29K67l07L49l97
$$ 0 0 0 0 0 0 0 0 0 0 0 0 8 -8 8 -8 16 -16 17 -24 32 -33 40 -49 57 -69 81 -91 106 -123 144 -163 186 -211
33b11M50n07N73o46P22q09R04j009J123j245J381j530J690j864K056k269K500
$$ -211 239 -268 305 -341 381 -428 476 -533 590 -655 726 -804 886 -978 1078 -1191 1309
50A309k751L031l341L686m069M499m988N546o190O945p842Q929j0280J2010j4319
$$ 1309 -1442 1589 -1752 1934 -2135 2364 -2624 2922 -3268 3677 -4165 4764 -5516 6494 -7825
65g825J7575k2542L1124m9976J66182j31189k91526L47673J79826k81381j81402
$$ -7825 9750 -12792 18332 -31644 134538 3349 -288177 59496 239322 -42059 -223461
76b23461K99611J16317k73087r8197K84787M6152k73106k4685K83312j6937k76577
$$ -223461 76150 192467 -80620 -178817 105970 152122 -120984 -145669 137643 120706 -155871
87a55871L7004K84255o8443k78252Q6783K81971j09113k73911J24222K73621j41665
$$ -155871 -118867 165388 96945 -181307 -94524 187447 78334 -195577 -71355 202266 60601
98F0601k62442J54421K56749j68008k44147J79037K33913j91715k19628K00432
$$ 60601 -201841 -47420 209329 41321 -202826 -23789 210124 18409 -201219 -787
108g87K05227k12477j89807K20201J72440k30869j55919K37526J36809k45302
$$ -787 204440 -8037 -197844 22357 194797 -36072 -191991 45535 182344 -62958
118f2958j19225K50438J01231k55741q2360K60004O4783k61692m5223K63977K8333
$$ -62958 -182183 68255 169486 -86255 -168615 91389 156172 -105520 -150743 113234 141567
129A41567k62715r175K62303p292k58605K4558K55265m0578k50278N6224K43645
$$ 141567 -121148 -130323 131980 124688 -133917 -109359 145906 105328 -144950 -88726 154919
140A54919p1936k37640Q5966K28083j01032k20374J13125K09969j27017j99996
$$ 154919 82983 -154657 -68691 159392 58360 -162014 -48889 161080 34063 -165933
150a65933J37729J89068j49310j77824J60500J65883j69308j53046J79155J41089
$$ -165933 -28204 160864 11554 -166270 -5770 160113 -9195 -162241 16914 158003
160A58003j86146j27191J94825J14530k00233j00016K06620Q6507k11141p1968
$$ 158003 -28143 -155334 39491 154021 -46212 -146228 60392 146899 -64242 -136210
170a36210K14390N7651k18004m3548K18741K8273k20713j4700K19329q13k18749
$$ -136210 78180 135831 -82173 -125721 93020 121293 -99420 -114120 105209 104396 -114353
181a14353J4457K15531k9125k12209M3074K07792n6140k01847O9196J96787q0937
$$ -114353 -99896 115635 86510 -125699 -82625 125167 69027 -132820 -63624 133163 52226
192E2226j88649R3582J81988j03870j72502J14927J64314j24602j54377J33972
$$ 52226 -136423 -42841 139147 35277 -137225 -22298 142016 17414 -136963 -2991
202b991J44098j42677j33929J49645J22475j57753j12254J63476R9667j69705
$$ -2991 141107 -1570 -135499 14146 136621 -21132 -133386 30090 129757 -39948
212c9948q9088J74183P6398j79119o4385J82634N1925j85202l8981J87796K6945
$$ -39948 -129036 45147 121545 -57574 -121959 60675 112600 -72602 -111583 76213 103158
223A03158j88223j3421J89445J751j88240J1648J87811k3432j85042L5852J82088
$$ 103158 -85065 -98486 90959 92710 -95530 -83882 103929 80497 -104545 -68693 113395
234A13395m7875j78359N8944J73159p0654j68283Q0644J61193r2049j54677J00781
$$ 113395 65520 -112839 -53895 119264 48610 -119673 -39029 122164 30115 -124562 -23781
245b3781J46457j10367j38598J18157J29749j26124j20355J33650J11081j39176
$$ -23781 122676 12309 -126289 -8132 121617 -4507 -124862 8788 119869 -19307
255a9307j00564J45530R1481j50173q0072J55415P0266j58974n8583J62080M7983
$$ -19307 -119871 25659 117140 -33033 -113105 42310 112576 -46398 -104981 57099 105082
266A05082j64567l6827J66051K5140j67887j4753J67743K639j68602Q016J66920
$$ 105082 -59485 -96312 69739 94879 -73008 -87761 79982 82621 -85981 -77965 88955
277H8955j9688j65859L0377J63153m1628j60263N2544J56600o2461j51569P2960
$$ 88955 69267 -96592 -66215 96938 55310 -104953 -52409 104191 41730 -109839 -36879
288c6879J47023q1732j40206R1507J34614r9577j26613J08116J19060j15222j11084
$$ -36879 110144 28412 -111794 -20287 114327 14750 -111863 -3747 115313 91 -110993
299a10993J22265J02190j28887r3357J33802Q2901j38724p4067J41741O3746j45926
$$ -110993 11272 113462 -15425 -108782 25020 107921 -30803 -104870 36871 100617 -45309
310d5309n4479J48077M4005j50295l3936J51599K4165j52226j3524J53035M229
$$ -45309 -99788 48289 92294 -58001 -91937 59662 83827 -68399 -81923 71112 75341
321G5341j52121O530J51939j5938j49745K6598J47893l5758j45081M5488J41727
$$ 75341 -76780 -70250 81689 65751 -83994 -57396 90497 54739 -90342 -44854 96873
332I6873n4829j38342O3625J33563p3334j28563Q0615J22512q9573j17024R6521
$$ 96873 42044 -96298 -32673 100890 27556 -101007 -20392 102120 12547 -104477 -7956
343g956J09748j04094j02542J10091R5296j16162q6785J21722P8792j25793o9487
$$ -7956 101792 -2302 -104844 5247 100543 -15619 -102404 19318 98110 -27683 -97170
354i7170J30547O1414j33417n1170J35783M2959j37771l3056J39179K3848j40314
$$ -97170 33377 94791 -38626 -89796 45987 88946 -48825 -81881 57298 81146 -59168
365e9168j4282J40127M547j40209M077J38346j4078j37127K2546J34370l1886
$$ -59168 -73450 66677 71224 -68985 -64908 73438 59360 -77767 -55221 79149 47263
376D7263j32034L9870J28874m8117j25369N6513J21648o4166j16527P2193J12592
$$ 47263 -84771 -44901 83973 35856 -89513 -33000 88648 24482 -92045 -19852 92740
387I2740p8929j06343Q6476J00871r2667r4086R8906Q7635j04560q0534J09667
$$ 92740 13811 -92532 -6056 94815 2148 -91938 6968 94603 -9957 -90491 19176
398A9176P2821j14503o5858J18130N7335j22588m9154J24086M0726j27313l2231
$$ 19176 91997 -22506 -88364 29766 87101 -35487 -84641 39445 80171 -47142 -79373
409g9373J28418K3345j29318j4552J29802O022j29053L054J28540j0846j26379
$$ -79373 49045 72390 -56928 -71480 58322 64344 -64709 -61655 66885 56039 -70340
420g0340J9375J25311k6998j22347L5487J19490m2607j16346N0176J12157n7368
$$ -70340 -50965 74346 47348 -74999 -39512 79978 37371 -78975 -28799 83358 25990
431B5990j08578O4500J02894p1481r8525P7151R2796q3908q7415Q8813Q1326r4602
$$ 25990 -82588 -18088 84806 13325 -85200 -8049 84747 839 -86576 2237 83563 -11039
443a1039p4792R9626O8112j03861o0674J08266N3757j11176m5870J14739L8641
$$ -11039 -85831 13795 81907 -21954 -82628 25638 79395 -31781 -77651 37088 75729
454G5729j16371l0244J18660K2581j19779j4695J20712O348j20699R69J20088
$$ 75729 -40642 -70886 47774 70355 -49424 -64119 56593 62941 -57758 -56789 63299
465F3299r447j19319J6469J17195k4566j15342L1345J12328l8991j09459M5772
$$ 63299 53852 -65467 -48998 68197 43631 -71711 -40366 71962 32971 -76488 -30716
476c0716J05725n1997j01803N8745R7977o4447r2943P0907Q8078p5690q2144Q1221
$$ -30716 75009 23012 -78791 -20046 77931 13484 -79459 -8552 79526 3836 -78308 2913
488B913P7343q6195p0847R0657O5052r4934n8955R8333N1724j01868m5354J04470
$$ 2913 80256 -5939 -76786 13871 78923 -16011 -74966 23367 75091 -26777 -72131 32339
500C2339L7752j07410l1255J08995K3289j10645j6498J12021Q546j12222p52J12153
$$ 32339 70091 -37319 -68574 40421 63710 -46935 -63433 48588 57134 -55088 -55840 56313
512E6313o559j10759J4070J10466k0984j08422K9033J06232l5019j03588M2239
$$ 56313 49754 -61005 -46935 63531 42547 -65875 -36842 69390 34371 -69217 -26978
523b6978J00321m8447r6991N4691R2419o0690q8112O5476Q3090p1279p8450P5604
$$ -26978 73343 24896 -72095 -17404 75015 14325 -73787 -8311 74779 3500 -74950 654
535F54P2607q0205o7816Q4091O1643q8116n5174R1411M9472r3792m3013R6984
$$ 654 73261 -6944 -74760 9331 70974 -17142 -72316 19095 68567 -25225 -68238 28746
547B8746L6820r8648k9678J00829K3603j02251j6315J03493R776j03725k783J03487
$$ 28746 65566 -33082 -62760 38069 61672 -40579 -56894 46599 56375 -47350 -50133 53354
559E3354m496j03519J0814J02601j8008j01996K4738R9045l1202r7627L7576R4338
$$ 53354 48858 -54661 -43847 58754 40746 -61250 -36512 62533 31331 -66296 -28720 65618
571F5618m3954r1109M9735Q7949n5230q3796O0524Q0032o5558p4335P0489P0073
$$ 65618 21664 -69445 -19710 68239 13009 -70787 -10263 69769 4211 -70124 365 70438
583G0438p4177o4519P8688N9305q2135n3303Q5054M7318q7829m1724Q9920L5273
$$ 70438 -3739 -68258 10430 69735 -12400 -65703 19351 66669 -21160 -62884 27036 62309
595F2309r2472k9332R3420K2528r4988j6632R5458J0100r6243l934R6640k842
$$ 62309 -30163 -59495 33925 56453 -38535 -55167 40291 50391 -45852 -49786 46854 44012
607D4012r6014R471R5326j5274r3977K1899R3260k7914r0610L4343Q8699l9850
$$ 44012 -52002 -42531 52795 37521 -56456 -34557 58703 30789 -59821 -25478 63221 23371
619B3371q5777M5965Q2500n1528p9131N6460P5023o1773p0659O5439O6016p0525
$$ 23371 -62406 -16441 66059 14531 -64600 -8140 66883 5110 -65549 -110 65906 -4619
631d619o1516P3920N5761p7506n0827Q0739M4930q3126l9082Q5381L3968q7243
$$ -4619 -66135 7785 63546 -13960 -64787 15952 60882 -22244 -61326 24055 58023 -29220
643b9220k7606Q8967K2018q9431j5342R0327R927r0283l719R0273k196q9942P922
$$ -29220 -56826 32141 54159 -35272 -50614 39713 49640 -40643 -44362 45911 43715 -46227 -38305
656c8305Q9306j4366q8291J9665Q6587k6146q4915L1128Q2481l6962q0450M2217
$$ -38305 51001 36635 -51656 -31991 54596 28450 -56465 -25337 57144 20182 -60268 -18051
668a8051P7321m7471p4244N2828P0759n7430o6237O1607O2871o5383n8092O9515
$$ -18051 59270 11799 -62445 -9617 61142 3712 -62525 -918 61953 -3430 -61522 7993
680G993N3883p2700m8362P6157M3134p8697l8009Q0911L2591q2923k7036Q3707
$$ 7993 61876 -10824 -59186 16971 60105 -18592 -56601 24310 56901 -26022 -53058 30649
692C0649K1058q5425j5692Q5449R975q6202m784Q6141j397q5445O934Q4548j2157
$$ 30649 51707 -33718 -49410 36039 46014 -40188 -44972 41169 39772 -45673 -38739 45809 33652
705C3652q3327J7885Q2093k2914q0020K8660P8261l2877p5829L8463P2948m2787
$$ 33652 -49675 -31790 50303 27389 -52631 -23971 54290 21413 -54416 -15953 56995 14208
717A4208o9835M7642O6824n2583o3208N6276N9105o0774n5405O4252N0528o8279
$$ 14208 -55627 -7985 58839 6256 -56952 -676 58429 -2345 -57750 6502 57030 -11249
729a1249m6045P0701M1251p4042l5974P6191L1077p7879k5867P9606K0442q0098
$$ -11249 -57294 13407 54658 -19384 -55358 20833 51910 -25969 -51836 27770 48212 -31886
741c1886j4844Q1679R648q1715l751Q1823j061q1504O977Q0267j1860p9518J7124
$$ -31886 -46730 34949 44597 -37118 -40869 40954 39893 -41611 -34634 45633 33773 -45745 -28621
754b8621P7645k2259p6411K6824P3748l1958p1684L6600O8603m1221o5821M4948
$$ -28621 49024 26765 -49646 -22822 50926 18968 -52716 -16116 52487 11266 -54555 -9607
766i607O2676m9034n9213N2929N6021n6702n1293N9762M8066o2840m3148O5912
$$ -9607 53069 4035 -55178 -2249 53772 -2930 -54223 5539 53605 -9235 -52383 13529
778A3529L8896o8141l4034P0702K9599p2769k4577P4260J9201p5809j4237P6019
$$ 13529 52425 -15716 -49750 20952 50551 -22218 -46795 27465 46666 -29143 -43380 32639
790C2639Q937p6959m436P7180j490p6813O145P6184j1461p5144J6698P3604k1029
$$ 32639 41576 -35383 -39819 37361 35871 -40942 -34797 41387 29926 -45218 -28520 45084 24055
803B4055p1863K5638P0534l0133o7454L4773O5070l8537o1909M2360N9399m6238
$$ 24055 -47808 -22170 48364 18231 -49223 -14450 50620 12083 -49826 -7466 51933 5695
815E695n5816M9736N2062n2783m8930N5476M4871n8640m1031O0664L6777o3418
$$ 5695 -50121 -385 51677 -1106 -50036 5440 50311 -8329 -49360 11304 48081 -15337
827a5337l2969O5308K8199o7205k3856O8896J9233o9716j4414P0984R846p1167
$$ -15337 -48306 17002 45201 -22004 -45860 23036 42269 -27447 -41861 29123 38969 -32198
839c2198m648P1772N31p1844M733P1869r506p0946J4235O9663j8996o8167K3095
$$ -32198 -36846 34926 35457 -36387 -31654 40215 30709 -40237 -26002 43661 24665 -43502 -20407
852b0407O6437k8051o4403L1509O2149l6275n9531L9436N6612m3200n3679M6560
$$ -20407 46030 17979 -46424 -14915 47234 10959 -48572 -9136 47476 4276 -49403 -2843
864b843N0287m9510m6660N2445M3368n4921l9044N7584L5448n9089l1325O1261
$$ -2843 47444 -2066 -48726 3719 47087 -7834 -46878 10706 46154 -12935 -44260 17001
876A7001K7539o2989k2862O4310J8541o5375j4537O6359R436o6955m996O6766
$$ 17001 44540 -18449 -41311 22999 41540 -23835 -38372 27987 37423 -29532 -34528 32238
888C2238M51o7481M028O6631q661o6467J3263O5278j7888o3890K1951O3038k6182
$$ 32238 32689 -34792 -30764 35867 27206 -39261 -25998 39280 21392 -42498 -20547 42491 16309
901A6309o0702L0419N8996l3974n6252L8094N3547m1151n0596M4762M7408m7613
$$ 16309 -44393 -13974 45022 11048 -45204 -7110 46437 5286 -45310 -548 46860 -753
913g53m4172N0112M1016n3417l7246N5307L2946n7383k9704N9057K5275o0608
$$ -753 -44925 5187 46203 -7214 -44460 10847 43793 -13590 -43294 15763 41038 -19570
925a9570k1201O1418J6924o2381j3007O3432Q741o3341m327O3581N01o3472M349
$$ -19570 -40771 20647 37571 -24810 -37817 25615 34356 -28985 -33312 30269 30770 -32702 -28353
938b8353O3245q058o2556J2814O1822j6898o0555K0683N9260k5062n7505K8907
$$ -28353 34892 26834 -35722 -22908 38914 22016 -38539 -17856 41404 16342 -41163 -12256
950a2256N5206l2822n3502L6060N0740l9956m7959M2869M4932m5783m1997M8490
$$ -12256 42950 10128 -43374 -7314 43426 3470 -44489 -1620 43312 -2471 -44468 4022
962D022L8712n1107l4861N3489L1553n5060k7616N6828K4003n7858j9984N9417
$$ 4022 42734 -8373 -43234 10255 41808 -13252 -40868 15960 39963 -17895 -37879 21538
974B1538J5953n9768j2139O0080Q528o0871m646O0993K83o0964L562O0043p581
$$ 21538 37491 -22277 -34416 25664 34192 -26679 -31325 29668 29951 -31013 -27451 32592 25011
987B5011n9717J1078N8551j5111n7421J8642N6233k2301n4862K6178N3127k9371
$$ 25011 -34706 -23628 34923 19812 -37609 -18967 37266 14965 -39897 -13719 39408 10037
999A0037n0665L3053M8682l5845m6124L9202M3966m2340m0602M4924L7511m7405
$$ 10037 -40628 -7575 41107 5262 -40862 -1660 42306 -34 -40636 4288 41799 -5606
1011e606l4531M9865L0806n1813k7705N3482K3743n5547k0203N6036J6525n7457
$$ -5606 -40137 9728 40534 -11279 -38984 14498 38241 -17306 -37509 18527 35052 -22405
1023b2405j2504N7925Q477n8007m860N8559J208n7978K645N8124o631n7109J0494
$$ -22405 -34909 23016 31493 -26514 -31374 27185 28393 -29585 -26940 31184 24553 -32556 -22062
1036b2062N6184j3292n5325J7463N3943k1146n2142K4268N0402k7843m8345L0527
$$ -22062 34122 20830 -34495 -17032 36911 15765 -36377 -12109 38293 10450 -37895 -7368
1048g368M6258l4100m4122L6781M1344l9820l8728M1946L5975m4474l2750M6898
$$ -7368 38890 4790 -39332 -2551 38793 -1027 -39755 2191 38166 -6308 -39058 7840
1060G840K9688m8936k6183N0992K2771n2233j8939N3521J5675n4221j1737N5247
$$ 7840 37528 -11408 -37591 13401 36172 -16061 -35000 18521 34196 -20025 -31762 23485
1072B3485Q069n5443m824N5804O32n5370K517N5124o818n4467R668N3928j3641
$$ 23485 31554 -23889 -28713 27091 27723 -27647 -25130 29994 23176 -31291 -21623 32305 18664
1085A8664n2773J6896N1397k0280m9906K3416M8193k6574m5973K9304M4106l1795
$$ 18664 -34109 -17213 34184 13904 -36002 -12586 35607 9033 -36940 -7636 36470 4675
1097D675m1636L4839L9557l7425l6395L9578L3981m1710l1256M4175K8097m6257
$$ 4675 -36961 -2122 37435 10 -36385 3193 37174 -4536 -35792 8383 36480 -9777
1109i777k4649M7256K1904m9390j8507N0227J4613n1468j1421N2169P435n2393
$$ -9777 -34426 12830 34734 -14656 -33163 17064 31677 -19791 -31212 20957 28392 -24001
1121b4001m074N2392Q77n2774K840N2765o211n2051J0228N1068j3033n0015J6848
$$ -24001 -28075 24317 25194 -27580 -24740 28025 21814 -30237 -20009 31059 18026 -31989 -15141
1134a5141M8812j9629m7301K2798M5943k6110m3921K8481M1762l1031m0197L3560
$$ -15141 33671 14042 -33259 -10461 35482 9372 -34549 -6068 35694 4663 -35534 -1974
1146a974L7202l5879l4905L7798L2284m0054k9551M1629K6798m3451k3846M4969
$$ -1974 35228 -651 -35556 2242 34526 -5528 -35079 6550 33348 -10103 -33949 11020
1158A1020K1011m5928j7875M7435J4693m8182j0954M9076P939m9538m288M9639
$$ 11020 32031 -13897 -31772 15663 30356 -17826 -28780 20296 28235 -21303 -25591 24048
1170B4048J175m9849K219M9671n571m9535Q967M8601j2740m7636J5274M6682j8662
$$ 24048 25223 -24626 -22407 27264 21693 -27842 -18875 29726 16986 -30650 -15376 31306 12644
1183A2644m5789K2040M3426k4501m2046K7445M0339l0040l7476L1906L5988l4503
$$ 12644 -33145 -11105 32321 7820 -34226 -6781 33558 3518 -33958 -2052 33936 -567
1195e67l3031L6393L1225l8173k8381M0209K5713m1748k2606M2499K0017m4165
$$ -567 -33598 2795 34020 -4153 -32534 7675 33388 -8360 -30966 11533 31550 -12615
1207a2615j7359M5298J3750m5897j1196M6299P632m6589m992M7006J615m7181
$$ -12615 -29974 15324 29074 -16823 -28019 18280 25912 -20677 -25669 21337 22952 -24229
1219b4229J973M6700m828m6416Q046M5966j0998m4824J4191M4283j7113m2937
$$ -24229 -22256 24444 19616 -26800 -18754 27212 16214 -28610 -14419 29864 12751 -30186
1231c0186K0282M1597k3104l9588K5584L8115k8201l6300L0448L3986l2888l1768
$$ -30186 -9904 31693 8589 -30999 -5415 32700 4499 -31801 -1353 32633 -255 -32023
1243c2023L4751K9228l7116k6960L8418K4054l9864k1566M1389J8653m2077j5943
$$ -32023 2728 31956 -5160 -32120 6298 30352 -9512 -31078 10311 28964 -13113 -29056
1255b9056M3352J2891m3828r847M4658P225m5032l524M4677J034m4423J849M4552
$$ -29056 14296 27187 -16641 -26488 18170 25395 -19637 -23161 21516 22550 -21873 -20024 24528
1268B4528m935m4076P952M3262j0913m2764J3436M1730j6631m0658J9435L8779
$$ 24528 19593 -24483 -16531 26731 15818 -26946 -13510 28220 11589 -29069 -9634 29145
1280B9145k2027l7421K4339L5986k7474l3471K9188L1918l1200k9727L3552K7620
$$ 29145 7118 -30303 -5964 30022 2548 -30923 -1735 30183 -1017 -30744 2808 30428
1292C0428l5103k4948L6673K2830l8189k0104L9754J7202m0513j4761M1554J1776
$$ 30428 -4675 -29623 7050 29880 -8309 -28413 11341 28543 -11970 -26731 14823 26599
1304B6599m2380r015M2634N768m2772l456M2694M28m2643K122M2550n035m2071
$$ 26599 -15781 -24796 17838 23606 -19166 -22622 20072 20500 -22143 -20021 22529 17494 -24577
1317b4577P829M1321j0358m0568J3038L9701j5466l8448J8584L7382k0759l5653
$$ -24577 -16748 24573 14215 -26353 -13315 26386 10920 -27528 -8944 28438 7679 -27974
1329b7974K3085L4386k5567l2622K7833L0355k9610k8729L1658K6200l3577k3901
$$ -27974 -4889 29497 3930 -28692 -859 29496 -114 -28843 2815 29015 -4562 -28463
1341b8463L5156K0956l6622j8854L7773J6242l8847j3834L9721J1271m0214q520
$$ -28463 6693 27649 -8973 -27827 9946 26188 -12659 -26493 13228 24499 -15715 -24235
1353b4235M1090N665m0993l051M1402P15m1400K807M0519m998l9952P464L9587
$$ -24235 16855 22520 -18473 -21524 19878 20593 -20807 -18000 22519 17521 -22431 -14967 24620
1366B4620j0064l8949J2349L7703j4847l7011J7290L5505j9568l4385K1493L2790
$$ 24620 14556 -24393 -12044 25659 10812 -26199 -8909 26596 7028 -27357 -5864 26926
1378B6926k3835l1264K5715K9524k7386k7511K9267K5499l0914k3055L2668K1360
$$ 26926 3091 -28173 -2458 27066 -320 -27831 1436 26935 -3979 -27034 5634 26994
1390B6994l4272j8397L5410J6234l6506j3643L7352J1349l8165q851L8752N879
$$ 26994 -7278 -25675 9735 25969 -10537 -24180 13172 24521 -13644 -22495 16257 22136
1402B2136l9250l398L9242J86l9222K086L9253n042l8654P192L8295r797l7500
$$ 22136 -17114 -20512 18730 18916 -20306 -18220 21033 15991 -22663 -15471 22824 13027 -24473
1415b4473J2051L6679j4523l4912J6869L3697j8523l2764K1148L1335k2808k9706
$$ -24473 -12422 24257 9734 -25178 -8309 25388 6865 -25899 -4751 26584 3776 -25930
1427b5930K4716K8142k6420k6450K8259K4199k9719k2312L0832K0276l2276j8393
$$ -25930 -1214 26928 508 -25942 2317 26516 -3203 -25515 5317 25593 -6683 -25076
1439b5076L3222J6082l4707j3433L5135J1142l6116q528L6762N901l7005l326
$$ -25076 8146 24228 -10479 -23912 11223 22365 -13751 -22279 14483 20384 -16621 -19947
1451a9947L7243J062l7033J535L7179m004l6795O497L6791r266l5751J1669L4900
$$ -19947 17296 18358 -18675 -17140 20039 16035 -20760 -14263 22528 13262 -22489 -10820 24080
1464B4080j4009l3793J5867L2643j8315l1349J9879L0160k2186k8717K4121K6497
$$ 24080 10071 -23722 -7855 24788 6473 -24876 -4997 25163 2977 -25740 -1619 24878
1476B4878k5442k5098K7043K3008k8240k1161K9781J9351l1033j6853L1985J5152
$$ 24878 -564 -25662 1381 24389 -3851 -25012 4769 24120 -6913 -23766 8219 23371
1488B3371l2876j2712L3761J0607l4302q308L4902N974l5227l470L5021J094l5501
$$ 23371 -9505 -22217 11544 22151 -12151 -20459 14443 20417 -14810 -18280 16741 17835 -17666
1501a7666J003L5369l956l4629O075L4052q328l3792J0498L3108j2727l2462J5241
$$ -17666 -16663 18706 14750 -19879 -13804 20248 11920 -21872 -11374 21734 9007 -23455 -8214
1514h214L1166j7123k9650J9308K8746k1215k7234K3005K5941k4568k3998K6135
$$ -8214 22952 5829 -23821 -4513 24233 3018 -24216 -1211 24730 162 -23836 2299
1526B299K2211k7521k0424K8477J8551k9670j6591L0608J4482l1836j2377L2108
$$ 2299 24510 -3011 -23435 5042 23593 -6077 -22668 7940 22422 -9414 -21791 10317
1538A0317J0126l2656q328L3117N979l3085m017L3589K072l4057P41L3641k663
$$ 10317 20443 -12213 -20541 12576 18555 -14530 -18547 15042 17114 -16943 -16202 17439 14776
1551A4776l3136N112L2869p079l2567R750L1713j2080l0386J3612K9830j5990
$$ 14776 -18360 -13248 19621 12542 -20025 -10275 21438 9358 -21028 -7416 22414 6424
1563F424k8840J7943K7450j9814k6195K1509K4361k3565k2984K4745K1519k6137
$$ 6424 -22416 -4473 22977 3163 -23032 -1523 22838 -727 -23711 1034 22553 -3584
1575c584j9588K7601J7714k8679j5608K9334J4049l0332j1569L0915J0050l1536
$$ -3584 -23172 4429 22143 -6536 -22144 7190 21239 -9093 -20662 10253 20303 -11233
1587a1233p820L2188N768l2563l466L2441J610l2764M62L2328k610l2106M617
$$ -11233 -19053 13135 18903 -13660 -17126 15315 16925 -15839 -15377 16951 14341 -17765 -13148
1600a3148L1566o712l1190Q866L0056j0703k9627J2688K8859j4435k8086J6900
$$ -13148 18418 11706 -19484 -10618 19438 8735 -20892 -8204 20655 6220 -21866 -4966
1612d966K6563j8214k5501K0096K4004k1219k2831K3381K1199k4805j9119K6091
$$ -4966 21597 3383 -22118 -2022 21982 763 -22068 1313 22512 -2293 -21412 4679
1624D679J7483k7528j5532K8211J3519k9312j1515K9658R635l0523p680L0861
$$ 4679 22162 -5366 -20898 7313 20832 -8480 -19995 9663 19298 -11225 -18905 11956
1636A1956N472l1040l716L1431J383l1246O10L1051k231l0825M311L0840o621
$$ 11956 17428 -13612 -17328 14103 15486 -15760 -15150 15901 13670 -17155 -12844 17996 11375
1649A1375k9730Q384K9111r967k8393J2331K7410j4059k6584J5554K5580j7063
$$ 11375 -18355 -9971 19140 9173 -19220 -6889 20521 6462 -20122 -4568 21012 3949
1661C949k4639J8839K2970k0632k1635K1829K0092k3401j8537K4214J7181k5616
$$ 3949 -20690 -1851 21119 487 -21148 681 20773 -2628 -21165 3049 20230 -5386
1673e386j5010K6524J3267k7286j1545K8360R331k8604p295K9573N558k9743l638
$$ -5386 -20396 6128 19395 -7891 -19436 8924 18255 -10349 -17644 11929 17487 -12256 -15894
1686a5894L0131J217k9784O14K9554k412k9607M457K8824o419k8394P911K8017
$$ -15894 14237 15454 -14330 -13716 15838 13426 -16181 -11724 17100 10681 -17713 -9802 18215
1699A8215r760k7886J1924K6504j3363k5741J5115K4650j6554k3223J7772K2448
$$ 18215 8455 -19431 -7507 18997 5634 -20107 -4992 19658 3104 -20119 -2347 20101
1711B0101j9244k0726K0394J9706k2051j7729K3083J6771k4836j4628K5485J2877
$$ 20101 857 -19869 525 20231 -1820 -19549 3534 20305 -4531 -19159 6326 19203
1723A9203k5983j1296K6697R186k7095p857K7974N240k8188l566K8147J952k8473
$$ 19203 -6780 -18076 8621 17807 -9288 -17145 10829 16069 -12119 -15685 12462 14414 -14059
1736a4059j18K8721k205k8420M256K8153n972k7549P747K7166r374k6238J1006
$$ -14059 -14177 14544 12339 -16081 -11825 16328 10356 -17193 -9446 17720 8346 -17892 -6886
1749f886K5556j2574k4416J4147K3511j5752k2731J7445K1229j8607k0227J9708
$$ -6886 18670 6096 -18320 -4173 19338 3586 -19145 -1700 19529 922 -19305 403
1761D03J8848k1119j7250K1802J5901k3196j4370K4071J2799k4681j1260K5484
$$ 403 19251 -1868 -19118 2684 18585 -4611 -18981 5090 17889 -6792 -18052 7432
1773G432R444k5635p843K6323O158k6792l781K7276J769k7150j7K6960j507k7329
$$ 7432 16876 -8759 -16602 9721 15879 -10913 -14694 12582 14351 -12799 -12816 14144 12637 -14692
1787a4692L762K6932n762k6469P471K5577q871k5507J0676K4553j2313k3885J4028
$$ -14692 -10930 16002 10240 -16229 -8758 16819 7948 -17559 -6883 17670 5357 -18528 -4500
1800d500K2308j5185k1496J6887K0313j7971j9047J9261J7985k0672j6207K1372
$$ -4500 17808 2623 -18873 -1986 18327 356 -18691 570 18555 -2117 -18324 3048
1812C048J5209k2485j3226K2934J2289k3963j0324K4540Q805k5394o994K5498
$$ 3048 18257 -4228 -17454 5480 17769 -6194 -16518 8022 16827 -8567 -15561 9937
1824I937N124k5854l764K5924K202k6260n35K6350j909k5586L347K5677n379k4765
$$ 9937 15061 -10793 -14557 11367 13569 -12691 -13226 13124 11215 -14371 -11024 14653 9274 -15491
1838a5491O750K4718q699k3839J0157K3309j1696k2135J3244K1591j4980k0363
$$ -15491 -8741 15977 7278 -16561 -6404 16905 5209 -16926 -3682 17909 2929 -17434
1850a7434J6350J9113j7498j8292J8683J7061j9857j5643K0551J4189k1654j2739
$$ -17434 -1084 18029 531 -17761 922 17983 -1874 -17517 3034 17223 -4431 -17170
1862a7170K2176J1566k3563r328K3486Q128k4153o679K4723N043k4642l529K5014
$$ -17170 5006 16572 -6991 -16319 7167 15295 -8858 -15537 9186 14229 -10413 -13942 11072
1875A1072J568k4459j82K4918j274k4647L269K3968m423k4418O509K3609p955
$$ 11072 12640 -11819 -12001 12917 11643 -13004 -9735 14233 9810 -14608 -8099 15510 7555
1888G555k3178R353K2419j1017k2096J2679K0898j4065j9730J5092J8887j6445
$$ 7555 -15623 -6270 16149 5132 -16964 -4285 16613 2548 -17182 -2090 16797 352
1900C52j7783J7560J6780j8762j5250J9914J4111k0979j2188K1786J0524k2059
$$ 352 -17431 129 16909 -1853 -17103 2811 16922 -4057 -16245 5541 16065 -5994
1912e994r454K2888P813k3016o711K3960M508k3668l321K4064J462k4168l7K3737
$$ -5994 -15448 7440 15253 -7763 -14474 9486 13994 -9674 -12995 11069 12531 -11637 -11674 12063
1926A2063j638k3684K709K3907m394k3414O023K2848p756k2146R216K1519j0289
$$ 12063 10425 -13259 -10550 13357 8963 -14451 -8428 14420 6664 -15482 -6266 15253 4964
1939D964k0607J1685K0068j2935j9165J4421J8124j5497j7052J6573J5889j7782
$$ 4964 -15643 -3958 16110 3175 -15990 -1569 16555 1058 -15994 579 16468 -1314
1951a314j4624J8730J3387j9791j2043K0356J0447k1251r296K1977P454k2217
$$ -1314 -15938 2792 16179 -3612 -15655 4701 15148 -6103 -15399 6578 14032 -8185
1963h185n980K2580M521k2917l280K3425J693k3250J11K3181j565k2680L378K2413
$$ -8185 -14165 8415 12936 -9981 -13261 10164 11857 -11393 -11282 11899 10334 -12346 -8968 13445
1977A3445m174k2398N473K2020p187k1355Q694K0445r816k0103J0655J9680j2476
$$ 13445 9271 -13127 -7654 14366 7179 -14176 -5482 14963 5147 -14956 -4301 15379 2903
1990B903j8736J3602J7813j4915j6643J6040J5349j6982j4036J7495J3202j8349
$$ 2903 -15833 -2231 15582 667 -15976 64 15413 -1569 -15605 1890 15092 -3257
2002c257j1768J9664R982j9926q997K1100P276k1261n925K1792M438k2189k678
$$ -3257 -15025 4639 14621 -5305 -14302 6798 14074 -7187 -13112 8680 13118 -9071 -11749
2015a1749K1721J672k2278j39K2361j634k2229K924K1808m199k1780N769K1189
$$ -11749 9972 11644 -10634 -10773 11588 9954 -12275 -9351 12457 8258 -13522 -7753 13436
2028A3436p186k0659Q461K0354r606j9640J1147J8571j2141j7574J3316J6750
$$ 13436 6250 -14409 -5948 14406 4800 -14840 -3693 14878 2737 -14837 -1521 15229
2040A5229j4355j5544J5176J4649j6017j3578J6756J2706j8043j1602J8903R920
$$ 15229 874 -14670 506 15155 -862 -14440 2316 15022 -3021 -14623 4280 14200
2052A4200j9304q698J9627P489k0347o152K0415M804k0716l591K1397J719k1245
$$ 14200 -5104 -13802 5825 13314 -7033 -13185 7230 12034 -8682 -12273 9124 10843 -10402
2065a0402l29K1396j236k1010L155K0517m022k0438N535K0289p091j9638Q166
$$ -10402 -10731 10665 9429 -11581 -8426 12091 8069 -12369 -6834 13455 6364 -13274 -5108
2078e108J9230r657j8148J0166J7894j1770j6983J2636J6050j3728j5392J4973
$$ -5108 14122 4465 -13683 -3517 14377 2607 -14376 -1740 14310 582 -14810 163
2090A63J3864j5456j3231J6516J1988j7284j0431J7706R862j8456q492J9002P042
$$ 163 14027 -1429 -14660 1856 13844 -3440 -13871 3835 13697 -4759 -13251 5751 12793
2103A2793j9238n560J9520M566j9763l458K0342J857k0548l17K0279j155k0143
$$ 12793 -6445 -12005 7515 12081 -7682 -11140 9202 11059 -9489 -9806 10473 9318 -10825
2116a0825K370J9739l660j9642M638J9466o237j8910P550J8335q700j7563R729
$$ -10825 -8455 11284 7624 -12018 -7380 12086 5849 -13061 -5511 12824 4124 -13439 -3710
2129c710J7003j0978j6181J2433J5239j3163j4480J4194J3490j4907j2414J5875
$$ -3710 13293 2315 -13866 -1433 13806 643 -13837 357 13847 -1060 -13474 2401
2141B401J1557j6877j0215J7182R120j7900p867J8262O624j8894n564J9157M164
$$ 2401 13958 -2919 -13134 4048 13168 -4732 -12599 5663 12287 -6607 -12171 6986 11150
2154A1150j9230k790J9185J638j9416m14J9430q39j9233K186J9448l399j8957
$$ 11150 -8080 -10870 8315 9953 -9463 -9877 9553 8714 -10519 -8333 11115 7716 -11241
2167a1241M751J8489n792j8320P441J7423q239j7175R703J6110j0830j5163J1360
$$ -11241 -6490 11999 6207 -12113 -4672 12751 4512 -12663 -2960 13150 2320 -12843 -1483
2180a483J4965j2762j4177J3723J2656j4644j1704J5232J0733j5734r823J6606
$$ -1483 13482 720 -13457 266 12922 -1722 -13426 1806 12539 -3195 -13018 3588
2192C588Q719j7090p476J7461O439j7666n365J8079M424j8417k708J8650J384
$$ 3588 12307 -4783 -12259 5202 11641 -6025 -11390 6689 11113 -7304 -10012 8638 10022
2205A0022j8517k75J8532r64j8778K152J8549l295j8532M605J7720n427j7671
$$ 10022 -8495 -8770 9762 8798 -9980 -7828 10721 7426 -11106 -6501 11219 5792 -11879
2218a1879O674J6752p638j6318Q890J5719r804j5167J1023J4398j2099j3311J2817
$$ -11879 -5205 11547 3909 -12409 -3519 12200 2396 -12771 -1748 12650 551 -12760 57
2231E7J2779j3740j1295J4259J0838j5420r421J5802Q320j6443p246J6840O134
$$ 57 12836 -904 -12199 2060 12898 -2522 -11943 3859 12179 -4264 -11510 5330 11464
2244A1464j7421m840J7620L692j7920k714J7846J438j7883k81J7940q80j7536
$$ 11464 -5957 -10797 6823 10515 -7405 -10119 7727 9165 -8718 -8999 8941 8061 -9475
2257i475J916J7360k845j7511M530J6824n239j6802O750J6096p434j5544Q398
$$ -9475 -7559 9801 6956 -10555 -6025 10799 5560 -11242 -4492 11604 4170 -11374 -2976
2270b976J4806r312j4137J0374J3628j1356j3122J1971J2355j2859j1732J3668
$$ -2976 11830 2518 -11619 -1245 12383 1027 -12095 -124 12231 -628 -12360 1308
2282A308J0476j4427r397J5213Q296j6053o986J6153O028j6347m806J6753L854
$$ 1308 11784 -2643 -12040 3173 11469 -4584 -11570 4583 10611 -5736 -10542 6211 10065
2295A0065j7023k418J7400R53j6926l58J7215j132j6707J926J6936l376j6444
$$ 10065 -6958 -9376 8024 8977 -7949 -8307 8908 7776 -8931 -7005 9931 6555 -9889
2308i889L986J6263n302j5905O234J5503p289j4995Q112J4687r442j3832J0411
$$ -9889 -5903 10360 5058 -10847 -4613 10890 3601 -11394 -3282 11405 1963 -11869 -1458
2321a458J2722j0636j2442J1480J2052j2674j0496J3326R796j3992q656J4189
$$ -1458 11264 628 -11814 -334 11718 -956 -11452 1874 11670 -2322 -10978 3211
2333C211P978j4773p158J5637N556j5944m134J5708L420j6052k562J6254J276
$$ 3211 11189 -3584 -10742 4895 10451 -5493 -9627 6081 9501 -6551 -9113 7141 8417
2346H417j6314m2J5987p99j6209J831J6159l036j5868M488J5085n109j4942O361
$$ 8417 -7897 -7939 8048 7249 -8960 -7129 9030 5994 -9874 -5386 9699 4590 -10352 -3991
2360c991J4657p088j4152Q020J3695q873j3161R536J2816j0593j1809J1193J1012
$$ -3991 10666 3578 -10574 -2554 11141 2268 -10893 -1357 11459 866 -10943 250 11262
2373A1262j1991j0391J2865Q917j2751q945J3949P530j4234o816J4608N642j4816
$$ 11262 -729 -11120 1745 10662 -2089 -11034 2915 10445 -3789 -10605 4003 9645 -5171
2386e171m613J5381L486j5508k525J5946J367j5735r9J5465q30j5280K068J5225
$$ -5171 -9784 5597 9083 -6425 -8950 6996 8363 -7372 -7471 7994 7164 -8116 -6048 9177
2400I177l058j4984M010J4435m671j4840O120J4084p271j3430P714J2977q743
$$ 9177 6119 -8865 -4855 9580 4909 -9931 -3811 10273 3002 -10428 -2714 10263 1520
2413A520j2194R378J1825j0184j1210J0735J0497j1512r776J2189R158j2769p807
$$ 1520 -10674 -1296 10529 345 -10865 -130 10367 -1145 -10921 1268 10426 -2343 -10150
2426a0150J3052P281j3609o333J4063N586j4280m548J4478L265j4611k543J4934
$$ -10150 2902 10183 -3426 -9759 4304 9890 -4390 -8938 5540 8805 -5806 -8349 6585
2439F585J316j4933n09J4994o84j4940J773J4853k961j4378L566J4317m559j4129
$$ 6585 7901 -7032 -7541 7453 6769 -8171 -6398 8455 5494 -8884 -5318 8999 4440 -9689
2453i689N659J3569o291j3149P408J2710q230j1907R024J1109r489j0820J0736
$$ -9689 -4030 9539 3248 -9901 -2493 10217 1987 -9920 -896 10213 724 -10096 640
2466F40R823j1510q877J1684Q398j2373p758J2806O545j3250n558J3487N114j3943
$$ 640 10463 -1047 -9924 1760 10158 -2215 -9973 2833 9378 -3872 -9430 4057 9171 -4772
2480d772m319J4225L098j4107k364J4356J454j4500j8J4194q95j3913J630J4270
$$ -4772 -9091 5134 8232 -5875 -8239 6117 7571 -6929 -6947 7247 6352 -7561 -5931 8339
2494H339k772j3684L471J3472m328j3507N333J2890n908j2751P159J1700p664
$$ 8339 5567 -8117 -4646 8826 4498 -9009 -3676 9214 3306 -9445 -2286 9414 1750
2507A750j1428Q424J0984r488j0140R886R717j0775q691J1245P815j1795o896
$$ 1750 -9678 -1254 9730 242 -9898 -12 9705 -1070 -9761 1484 9299 -2496 -9392
2520i392J2240O482j2664n340J2862M627j3439l440J3607K639j3792j740J3866
$$ -9392 2848 9330 -3334 -8674 4188 8815 -4624 -8064 5543 8182 -5610 -7350 6516
2533F516Q11j3940r9J3953j186j3425J819J3484k953j3496L705J3174m511j2869
$$ 6516 7327 -6613 -6712 7241 6055 -7370 -5551 7933 4980 -8516 -4811 8363 3852 -9017
2547i017N402J2263n686j2254O908J1661p519j1080Q344J0369q825r873R667R092
$$ -9017 -3615 8648 2962 -9292 -2384 9277 1758 -9322 -978 9391 566 -9307 360 9452
2561I452r942q642J0795P698j1384o701J1422O385j2269n279J2379M084j2629
$$ 9452 -490 -9132 1663 9361 -2023 -8724 2698 9083 -3186 -8465 3914 7998 -4631
2574d631l356J2602K792j3131j559J3204Q65j3545K38J3379p68j3227J742J3097
$$ -4631 -7987 4615 7407 -5724 -7283 5921 6786 -6759 -6521 6858 6090 -7137 -5395 7702
2588G702k663j2801L581J2419m129j2486N369J1796o088j1327O522J0916p098
$$ 7702 5039 -7762 -4181 8238 4109 -8377 -3008 8788 2700 -8627 -2105 8811 1713
2601A713j0638Q009R704q591r286R244Q635r809q364J0618P403j0825o763J1434
$$ 1713 -8925 -916 8788 197 -9089 155 8790 -1019 -9383 1235 8638 -2187 -8950 2484
2615B484N805j1467n038J1941M586j2496l137J2138K687j2636j286J2472M54j2341
$$ 2484 8289 -3178 -8216 3725 8311 -4185 -7322 4816 7503 -5133 -6419 6053 6507 -5834
2629e834L6J2449p13j2710J849J2197k637j2361L401J1894m240j1442M960J1177
$$ -5834 -5798 6651 5938 -6772 -4923 7274 4637 -7724 -4323 7571 3331 -8111 -3151 8026
2643H026n473j1074O468J0416p112r873P785R475q140r093R001Q210r148p775
$$ 8026 2553 -8521 -2053 8363 1251 -8622 -837 8638 498 -8595 406 8616 -532 -8307
2657h307R709P174j0434o152J0209N911j0873n004J1305M199j1787l168J1742
$$ -8307 1402 8576 -1858 -8010 2199 8110 -2763 -7767 3538 7737 -4050 -7218 4524
2670D524K389j2038j392J1479J388j2258j93J2095m95j2309J958J1533k276j1555
$$ 4524 6913 -5125 -6517 4962 6350 -5908 -6101 5994 5499 -6810 -4852 6681 4405 -7150
2684g150L168J1664m112j1042M598J0880n488j0321O156R830p119q938P268Q847
$$ -7150 -3982 7682 3570 -7472 -2874 8006 2518 -7803 -1647 8183 1064 -7874 -606 8241
2698H241q034q434Q664P776r173p247R227P041j0031o043J0317N257j0496m760
$$ 8241 207 -8227 437 8213 -960 -8207 1020 8061 -1970 -8013 2304 7561 -2935 -7695
2712g695J0762M264j1171l158J1058K786j1603j666J1655J119j1757oJ1300l79
$$ -7695 3067 7331 -3840 -6998 4060 6846 -4757 -6423 5232 6351 -5406 -5412 5888 5509
2726E509j1786J414J1723k491j1213K891J1044l797j0652M280J0395n116r861
$$ 5509 -6277 -4863 6860 4369 -6844 -3953 7091 3294 -7358 -3078 7317 2201 -7660
2739g660N777R515o553r168P292Q719p752q050Q084P599q656o697Q968O607r664
$$ -7660 -1883 7632 1079 -8089 -797 7922 170 -7880 204 7803 -853 -7550 1418 8025 -1639
2754a639n702R757N182j0328m369J0473L827j1031k994J0963K144j0667j920J1023
$$ -1639 -7341 2416 7598 -2730 -7099 3374 7201 -3830 -6824 4139 6283 -4384 -6304 4719
2768D719J275j1375m39J1232l38j0974J375J0711j992j0747K603J0586l169j0408
$$ 4719 5994 -5381 -5820 5412 5074 -5900 -4525 6186 4194 -6553 -3950 6636 3467 -6941
2782f941M077J0265m696r835N246R363n628r093O577Q363p330q008P713P332q268
$$ -6941 -2864 7401 2705 -7130 -1884 7479 1851 -7242 -665 7698 368 -7640 73 7405 -863
2797h63o546Q629O041r265n312R245M877r738m265J0110L662j0148k814J0152
$$ -863 -7409 1220 7261 -2004 -7316 1929 6806 -2932 -7197 2913 6575 -3573 -6387 3765
2811C765K401j0545j511J0803P60j0745Q3J0772p81j0696J335J0796k374j0565
$$ 3765 6166 -4379 -5890 4913 5673 -5072 -4989 5783 5002 -5694 -4359 6437 4063 -6502
2825f502K838J0479l519r898L904R397m633r409N418R005o089q570O493Q195p034
$$ -6502 -3664 6815 3296 -6602 -2698 6699 2066 -7343 -1925 7080 991 -7579 -1086 7109 75
2840G5p274P283P256q150o390Q755N386q652n166R227M637r496l713R570K968
$$ 75 -7199 84 7340 -810 -7200 1555 6941 -1711 -6877 2350 6987 -2509 -6222 3348 6316
2855F316r983k310J0143J852j0432j369J0550M33j0242j7J0290r77j0082J468
$$ 6316 -3667 -5977 4166 6018 -4414 -5783 4767 5200 -5042 -5059 5231 4254 -5828 -4360
2869d360J0294k462r806K749R944l388r674L844R772m792r080N384Q783n951q256
$$ -4360 5934 3472 -6334 -3585 6359 2971 -6703 -2859 6913 2121 -6959 -1575 7208 1257 -6999
2884f999O304Q327p083p735P369O935p567o596Q149N729q377n157Q578M728r137
$$ -6999 -695 7632 549 -7186 183 7118 -449 -7045 1104 6833 -1544 -6701 1877 6605 -2532
2899b532m236R467L371r174l091R656K060r798j214R962P04r958o4R994l92r951
$$ -2532 -6768 2699 6070 -3104 -6195 3461 5521 -4277 -5491 4471 5175 -4783 -4847 5147 4755 -5196
2915e196J230R724j800r637K311R445l090r141L520R017m125r011N177Q169n408
$$ -5196 -3966 5758 3958 -5679 -3368 6077 2987 -6154 -2634 6383 2258 -6753 -1576 6593 1185
2930A185q150N880P735o232p509O879O593o829o287P829N645q427m848Q361M701
$$ 1185 -6965 -1085 6650 418 -7091 -212 6381 -448 -6735 1094 6739 -1688 -6536 1825 6526
2945F526q967l610Q936L194r218k532R251K161r636j294R785L85r718k2R693o73
$$ 6526 -2441 -6051 2885 6079 -3139 -5671 3580 5741 -3895 -5189 4596 4981 -4737 -4759 4934 4261
2961D261r847J453R465j757r307K383R238k987r325L910Q776m413q142M834Q043
$$ 4261 -5586 -4133 5332 3575 -5732 -3349 5889 2902 -6423 -2513 6263 1850 -6292 -1458 6585
2976F585n503p751O230P167o422o788O909O171p028n796P354N296p939m901Q317
$$ 6585 1082 -6669 -439 6728 306 -6482 427 6598 -430 -6226 1128 6424 -1515 -6416 1901
2991A901M212q495l739Q782L268r286k290Q713K194r142j728R876M38r343K2R248
$$ 1901 6113 -2382 -6121 2661 5929 -3357 -5647 3066 5260 -3882 -5610 4266 4704 -4639 -4617 4631
3007D631l44r176J078R243j872q935K632Q765l317q394L598Q157m372p677M793
$$ 4631 4287 -4889 -3811 5432 3560 -5375 -2743 6022 2705 -5689 -2091 6066 1694 -5983 -1190
3022a190P299n021p398N870O541n954o559O419O223p060n571P380N170p644m877
$$ -1190 6109 1088 -6310 -440 6101 147 -6412 7 6230 -830 -6401 979 6149 -1495 -6372
3037f372Q142M120q143l512Q714K916q737k646Q948K086q928j625R207P93r469
$$ -6372 1770 5890 -2253 -5765 2949 5865 -2872 -5518 3430 5516 -3412 -5037 4170 4963 -4506
3052d506K9R116m99r040R70R144k004q763K212Q515k731q254L479P996m021p612
$$ -4506 -4477 4639 4140 -4900 -3930 5214 3210 -5553 -3341 5174 2443 -5811 -2332 5664 1643 -5969
3068e969M574P284n124o631N204O930n883o612O445N883o522n402O961N113p594
$$ -5969 -1395 5889 765 -5866 -662 6268 385 -6227 218 6101 -421 -5823 1138 6251 -1343
3083a343m397P457L955p633l632Q247K662q247k360Q412J897q675j245Q661P27
$$ -1343 -5740 1717 5672 -1961 -5593 2654 5316 -2931 -5291 3121 5018 -3657 -4902 3759 4486
3098D486q849m8Q675l10q531Q58Q636j650q471K297Q240k571q244L128Q173m007
$$ 4486 -4363 -4411 4264 3954 -4577 -3719 4917 3267 -5204 -2907 5333 2762 -5482 -2354 5819 1812
3114A812p658M453P192m574p088N007O759n804o255O209N595o502n251O892M808
$$ 1812 -5846 -1393 5799 1225 -5863 -856 5903 99 -6156 53 5648 -854 -6105 787 5595
3129E595o932m255P371L615p507l081P877K526q038k045Q176J749q090j375Q288
$$ 5595 -1337 -5592 1779 5394 -2113 -5194 2683 5209 -2829 -4874 3302 5051 -3039 -4414 3874
3144C874M12q222J61Q197q08q309J582P930j585q319K093P976k534p771L208P583
$$ 3874 4286 -3936 -3775 4422 3614 -4695 -3113 4817 3232 -5087 -2994 4982 2448 -5323 -2115 5468
3160E468m032p126M066P115m578o736M933O604n459o047N941N517n974n358O640
$$ 5468 1436 -5690 -1624 5491 913 -5823 -890 5714 255 -5792 149 5666 -308 -5666 974
3175I74M504o724l992O973L757p442l299P540K683p722j917P622J544q054q75
$$ 974 5478 -1246 -5238 1735 5492 -1950 -5249 2291 4974 -2748 -4665 2957 4501 -3553 -4428
3190d428P960K67p810L22P797m17q149J019Q128j671p827K151P493k554p170K913
$$ -4428 3532 3799 -4011 -3689 4108 3691 -4458 -3439 4689 3018 -4809 -2658 4835 2281 -4889 -1976
3206a976P289l397p254M226O447m343o290N115N501n027n795N604N419o010m972
$$ -1976 5313 1916 -5338 -1112 5335 992 -5298 -183 5318 291 -5504 100 5519 -491 -5463
3221e463O162M535o602m035O729L736p129l018P164K728p554j953P629J328p371
$$ -5463 699 5234 -1368 -5403 1326 5062 -2067 -5085 2079 4807 -2747 -4700 2929 4257 -3114
3236c114j032P607O78p819J60P591o93p554R77P650j472p549K052P331k795o911
$$ -3114 -4146 3461 4139 -3680 -3520 4071 3378 -4176 -3199 4451 2979 -4570 -2518 4813 2018 -4893
3252d893K870O865l246o779L899O436m249o269M756N978n320n226N313N149n826
$$ -4893 -2023 4842 1596 -5183 -1284 5152 903 -5366 -610 5368 48 -5178 135 5284 -542
3267e42m498N765M640o454m135O703L562o775l136P168K578p135k091P100J605
$$ -542 -5040 725 5365 -1089 -5224 1479 5041 -1734 -4870 2298 4876 -2259 -4350 2750 4355
3282D355p446r90P285M81p403l44P821n89p267R29P221j228p224J963O966k477
$$ 4355 -3091 -4081 3204 3685 -3718 -4062 3759 3170 -4097 -3168 4053 2825 -4399 -2436 4530 2053
3298B053o842L056O624l235o326L447O317m079n921M381N598n059n089N354M834
$$ 2053 -4789 -1733 4891 1656 -4670 -1223 5094 1015 -4906 -525 5073 14 -5075 279 5113
3313E113n674m604N780M299o161l704O330L391o574k963O717K635p120j995P358
$$ 5113 -561 -5165 615 4914 -1247 -4951 1379 4770 -1804 -4767 1950 4585 -2535 -4530 2828
3328B828J292p149q78P330M11p263j02P217l43p145R78O808j153o787J718O757
$$ 2828 4120 -3029 -3907 3423 3834 -3429 -3531 3686 3343 -3802 -2824 3984 2831 -3956 -2238 4519
3344D519k236o742K667O473l280o120L542O180m496n506M496N238m725m808N000
$$ 4519 2283 -4459 -1792 4681 1401 -4719 -1177 5003 507 -4999 -503 4735 10 -4798 202
3359B02M691n644m088N807L841n898l442O215L003o339k665O698J930o713j665
$$ 202 4893 -751 -4839 968 4809 -1089 -4531 1684 4687 -1652 -4317 2381 4311 -2402 -4067
3374d067O814J134o660j044O987N49p142K61O845o12o788O08P228j359o837J689
$$ -4067 2747 3881 -2779 -3823 3164 3713 -3429 -3168 3677 3065 -3723 -3115 4113 2754 -4083 -2394
3390b394O700k231o196K496O229l002o183L548N739l843n415M194N316m684m827
$$ -2394 4306 2075 -4121 -1625 4604 1602 -4581 -1033 4706 863 -4552 -358 4958 274 -4553
3405d553M741M634n288m220N563L704n664l322N877K673n886k636O224K292o315
$$ -4553 188 4822 -466 -4686 877 4581 -1083 -4405 1472 4145 -1741 -4377 1847 4139 -2176
3420b176k037O636J207o699o49O868P8o437l3O827m64o510P23O606j440o390J917
$$ -2176 -4213 2423 3630 -3069 -3718 3150 3228 -3209 -3242 3585 3121 -3389 -2666 3940 2500 -3890 -1973
3437a973O295k260o234K372O186l232n464L304N299l665n022M071M778m361m707
$$ -1973 4322 2062 -4172 -1800 4386 1154 -4310 -1006 4293 628 -4394 -323 4455 94 -4613
3452d613M576M395n002l850N139L512n252l050N507K781n940j988N854K037o108
$$ -4613 -37 4358 -644 -4494 645 4157 -1095 -4145 1362 4143 -1797 -3785 2069 4106 -2002
3467b002j716O131J304o384p42O424J35o376J42O731p43o481J102O069j632n828
$$ -2002 -3718 2413 3717 -2667 -3409 3015 3150 -3226 -3084 3647 2904 -3577 -2475 3594 1962 -3866
3483c866J613O089k105o075K656O009k718n993L496N173l664m772L852M581m140
$$ -3866 -2253 3836 1731 -4344 -1688 4321 1603 -4390 -894 4279 615 -4157 -305 4276 136
3498A36m432M584M131m614l924M927L382n096l299N506K828n546k444N723J880
$$ 136 -4296 288 4419 -195 -4119 808 4190 -906 -4205 1301 4129 -1417 -3861 1862 3742
3513C742n955j413O135O51n713q14N978K63n898P0O243n68o106R48N997j454n682
$$ 3742 -2213 -3626 2509 3160 -2553 -3367 2611 2874 -3024 -2954 3289 2721 -3385 -2437 3560 2106 -3576
3530c576J692N559j828n608K074N752k776n060K921M934l237m862L444M734m230
$$ -3576 -1884 3675 1847 -3761 -1687 4065 1289 -3771 -850 4084 847 -4015 -571 4163 -67
3545f7l884M120L889m601l799N089L209n012k854N280K426n400k298N679K110
$$ -67 -3951 169 4058 -543 -4342 747 3956 -1056 -3910 1370 3796 -1604 -3902 1777 3887
3560C887n672j454N749J135o026q86N939M47n910Q5N968o39n874R63N570j367
$$ 3887 -1785 -3239 2510 3645 -2381 -3267 2672 3119 -2791 -2706 3262 2623 -3251 -2288 3282 1915
3576A915n496J915N300k244n136K396N054k742m953K947N024l368m777M043M101
$$ 1915 -3581 -1666 3634 1390 -3746 -1350 3704 962 -3991 -1044 3980 612 -4165 -122 3979
3591C979l806m057M323L630m430l342M569L082n031k458M713K440n129k041N345
$$ 3979 173 -3884 439 4069 -361 -3703 866 3948 -1083 -3541 1172 3612 -1517 -3558 1787
3606A787J542n318j602N596J299n917o34N619L89n716P6N765n18n436R06N364
$$ 1787 3329 -1989 -3591 2005 3304 -2613 -3247 2372 2761 -2955 -2879 2886 2368 -3068 -2162 3202
3622C202j388n096J375N515j908n214K375N066k763m656K983M147l174m126L365
$$ 3202 1814 -3282 -1907 3608 1700 -3514 -1139 3927 1164 -3492 -509 3638 464 -3662 -297
3637b97M212l925l669L930L442m163k988M089K923m456k890M995K264m849k146
$$ -297 3915 -10 -3679 251 3693 -470 -3458 631 3554 -902 -3792 1203 3467 -1382 -3528
3652c528N048J685n148j112N259P98n156n34N485J29n571J53N364p01n022P39
$$ -3528 1520 3205 -1943 -3055 2204 3002 -2154 -2688 2797 2926 -2645 -2492 2872 2171 -2851 -2112
3668b112N356j166n526J834M918j930n011K458M693k372m657K704M259l008l986
$$ -2112 3244 2078 -3448 -1614 3304 1374 -3637 -1179 3514 1142 -3515 -811 3448 440 -3546
3683c546L181L980l520l706L955L288m292k848M213K942m516k423M737J826m654
$$ -3546 -365 3615 95 -3611 344 3632 -660 -3508 705 3647 -869 -3292 1445 3271 -1383
3698a383j943M869J736n167j201N250R24n367o57N433J5n373M96N199p37m968
$$ -1383 -3326 1543 3279 -1888 -3089 2161 3085 -2282 -2939 2494 2509 -2864 -2368 2831 2094 -2874
3714b874P50N151j162m924J261N183j750n067K244M818k803m339K954M208l026
$$ -2874 -2124 3027 1865 -3059 -1798 3385 1635 -3432 -1188 3630 827 -3512 -558 3650 624
3729F24m190L352L685l589l259L778L248m083k868M021K548m343k335M233K203
$$ 624 -3566 -214 3471 -118 -3377 401 3649 -434 -3302 719 3267 -1076 -3411 822 3025
3744C025m858j360N093J293m907j311N139O02m726m68M745L01n138K37N188p52
$$ 3025 -1833 -3193 1900 3193 -1714 -3025 2114 2716 -2010 -2478 2267 2568 -2570 -2333 2855 2103
3760B103n177J166M679r21m930J657M797k237m438K270M496k743m351K871M091
$$ 2103 -3074 -1908 2771 1850 -3080 -1423 3374 1137 -3301 -1031 3465 722 -3629 -758 3333
3775C333k990l811L307L166k961l506L587L200m013k527L918K724m453j923M137
$$ 3333 343 -3468 -161 3005 44 -3462 125 3325 -688 -3215 703 3427 -1026 -2949 1188
3790A188K017m362j969M966J281m774r93M406Q44m777k37M568L7m597J48M840
$$ 1188 3205 -1157 -3126 1840 3121 -1653 -2646 1760 2604 -2173 -2410 2158 2195 -2402 -2254 2586
3806B586o26n060J129M603j335m436J641M594j953m291K220M431k557m049K525
$$ 2586 1960 -3100 -1971 2632 1297 -3139 -1498 3096 1143 -3148 -928 3503 946 -3103 -578
3821e78L985k932l608L140L349l541l131L566K979l998k316L665K636m298k050
$$ -578 3407 475 -3133 7 3356 -185 -3316 250 3229 -769 -3085 580 3216 -1082 -3132
3836c132M170J963m560j341M534J119m669j006M868O02m497m78M423Q5m378K08
$$ -3132 1038 3001 -1559 -2900 1634 2753 -1916 -2922 1946 2548 -1949 -2427 1996 2081 -2297 -2089
3852b089M859r11m239N23M612j188m536J904L839j580m151K060L742k205l988
$$ -2089 2770 1859 -2380 -1857 2755 1567 -2969 -1065 2774 1194 -2957 -897 2845 640 -3348
3867c348K879L818l168l339L005L636l828k883L833K518l836k568M040J989l871
$$ -3348 -469 3349 181 -3158 -153 3483 -345 -3228 605 3123 -713 -3281 759 2748 -1123
3882a123j682M054J748m344j329M126J342m440r96M789M83m709M2M298O3m652
$$ -1123 -2805 1249 2997 -1347 -2676 1450 2792 -1648 -2644 2145 2628 -2081 -2039 2259 2322 -2330
3898b330J16M673m67m554R62M167j392m105J545M135j718l818J906L905k527l444
$$ -2330 -2214 2459 1992 -2562 -1600 2567 1175 -2930 -1385 2750 1032 -2786 -880 3025 498 -2946
3914b946K509L221k735k975L221K712l392k722L606K367l503k356L733K321m062
$$ -2946 -437 2784 49 -2926 295 3007 -385 -3107 499 2866 -637 -2993 740 3061 -1001
3929a001j908L907J571l955j366M212J101m439n36M204N28m654J15M325k94m171
$$ -1001 -2909 998 2569 -1386 -2752 1460 2561 -1878 -2414 1790 2318 -2336 -2221 2104 1810 -2361
3945b361K80M529o24m247Q93M333j586l969J463M270k063l876K289L607k267l526
$$ -2361 -2081 2448 1824 -2423 -1530 2803 1217 -2752 -1289 2981 918 -2958 -669 2938 671 -2855
3961b855K388L376k528l485K899L131l325k548L314K350l104k296L571J736l831
$$ -2855 -467 2909 381 -3104 -205 2926 -399 -2947 367 2717 -387 -2683 888 2624 -1207
3976a207j385L582J738m106r88L822J068m126o95M221O5l982o7M371l51m285N19
$$ -1207 -2592 990 2728 -1378 -2366 1456 2524 -1602 -2297 1924 1989 -1993 -2060 2311 1960 -2325 -1806
3993a806M071o39m105J062M023j538l690J438L876j759l727J977L590k378l209
$$ -1806 2265 1626 -2479 -1417 2606 1068 -2622 -1184 2692 933 -2794 -817 2773 395 -2814
4008b814K730K745k461l236L347K646l108k684L232K240l274k139L741J593l677
$$ -2814 -84 2661 200 -3036 311 2957 -151 -2835 397 2637 -637 -2776 965 2558 -1119
4023a119j589L920J296l670j254L948N51l614o82M050J51l989J83L828m80l949
$$ -1119 -2708 1212 2508 -1162 -2416 1532 2083 -1531 -2213 1837 1988 -2001 -1818 2010 1530 -2419
4039b419P18L996o08m049J113L740j362l754J719L321j288l845K335L059k174
$$ -2419 -1701 2295 1687 -2362 -1249 2491 1129 -2625 -906 2415 1127 -2718 -383 2676 502
4054E02l395K728L063k978k689K697L133l451k267L126K083l355k034L661J645
$$ 502 -2893 -165 2898 -80 -2769 -72 3061 -390 -2657 469 2552 -803 -2837 824 2469
4069B469l513j412L739R87l498q75L670P61l853n18M068j8l752j62M143l12l921
$$ 2469 -1044 -2456 1283 2270 -1228 -2103 1567 2328 -1525 -2043 2025 2007 -1745 -1907 2236 1924 -1997
4086a997N75L741o96m045J172L690j085m134J770L623j836l276J891L242k447
$$ -1997 -1422 2319 1623 -2422 -1250 2440 1355 -2779 -1009 2614 778 -2498 -607 2635 188
4101A88k810K536K968l003k597K914K634k990k525L153K346l490j616L083K016
$$ 188 -2622 -86 2882 -121 -2718 196 2830 -160 -2685 468 2814 -676 -2292 791 2807
4116B807l966j293L755J011l671q84L726P26l697p97L959p5l597K02L858l25m006
$$ 2807 -1159 -2452 1303 2314 -1357 -2241 1485 2211 -1486 -2283 1676 1601 -1996 -1794 2064 1739 -2267
4133b267O42L785r35l543J004L706j454l542J602L550k117k918K077K873j944
$$ -2267 -1625 2160 1225 -2318 -1314 2392 938 -2604 -1002 2548 431 -2487 -410 2463 519
4148E19k899K272K936k757k660K688K431k889k154L097J882l207j981L598J346
$$ 519 -2380 -108 2828 71 -2589 99 2530 -359 -2513 584 2466 -741 -2722 876 2222
4163B222l384j204L510R71l304r23L497N38l782pL824l04l648K70L835m67l663
$$ 2222 -1162 -2366 1144 2115 -1189 -2112 1385 1923 -1859 -1866 1958 1654 -1994 -1724 2111 1644 -2019
4180b019O79L719j233l604J515L504j774l394J928K955j710l037K040K753k159
$$ -2019 -1340 2379 1146 -2458 -943 2561 787 -2607 -679 2276 566 -2471 -431 2322 163
4195A63k671K409K549k623k437K957J821k571k071K984K058l311j604L449J161
$$ 163 -2508 -99 2450 -173 -2610 347 2168 -403 -2474 510 2568 -743 -2347 1102 2263
4210B263l205j244L492R36l695n94L448N58l582k87L718j5l621J97L656o02l350
$$ 2263 -942 -2186 1306 2242 -1453 -2047 1401 1959 -1623 -1910 1808 1793 -1828 -1631 2025 1423 -1927
4227a927O10L441j070l370J269L405j221l603K017K949j893l049J967L038k436
$$ -1927 -1317 2124 1054 -2316 -1047 2358 1137 -2466 -449 2500 607 -2442 -475 2563 127
4242A27k423K142K792k554k686K797K295k730j866K404J913l007j440L128J302
$$ 127 -2296 -154 2638 84 -2602 195 2490 -240 -2106 298 2211 -796 -2236 892 2194
4257B194l346r05K925J190l242q89L654J80l135k40L112j07l189L47L341n90l220
$$ 2194 -1152 -2057 868 2058 -1184 -2073 1581 1761 -1374 -1614 1498 1391 -1798 -1451 1890 1300 -1920
4274a920N24L405r69l164J282L005j481l125J968K982j992k764J764K923k187
$$ -1920 -1396 2009 1040 -2124 -842 2163 682 -2443 -475 2507 515 -2249 -485 2438 251
4289B51k746K510K277k537j927K446K192k934j978L092J623l176j237L107J441
$$ 251 -2495 15 2292 -245 -2172 274 2466 -468 -2446 646 2269 -907 -2144 963 2404
4304B404l526j048L385Q09l303l91L150K85l308j78L324L0l522O48L305p90l268
$$ 2404 -1122 -2170 1215 2024 -1279 -1670 1480 1765 -1543 -1721 1603 1633 -1889 -1241 2064 1274 -1994
4321a994N40L402j076l006J369K801j296l135J896K875k371k357K190K461k390
$$ -1994 -1454 1948 872 -2134 -765 2036 740 -2395 -499 2376 5 -2352 -162 2299 -91
4336i1k158K438K155k366k422K997J689k639j981K855J950l225j424L182J152
$$ -91 -2249 189 2344 -22 -2444 553 2242 -397 -2378 477 2427 -798 -2222 960 2112
4351B112l100j401L579N22l043o19L333J70l319J67K969J7l287L44L515p83l205
$$ 2112 -988 -2389 1190 1712 -1331 -1950 1383 1553 -1766 -1599 1370 1387 -1900 -1556 1959 1176 -2029
4368b029J029L033r64k960J265K806j650k628J652K785j946k736K350K361k296
$$ -2029 -1000 2033 1069 -1891 -626 2180 530 -2098 -446 2339 393 -2343 7 2368 72
4383G2k591K493K397k512k320K735J873k558j772K569J744l034j255L105J014
$$ 72 -2519 -26 2371 -141 -2461 274 2147 -411 -2183 386 2130 -904 -2159 946 1960
4398A960l024q90L202N11l074k68K913O48l511n4L192j3l306N03L224r49k852
$$ 1960 -1064 -1954 1248 1759 -1315 -1583 1330 1978 -1533 -1587 1605 1592 -1714 -1211 2013 1064 -1788
4415a788O31L260j186l142J470K939j478k780J499K674j842k628K064K382j956
$$ -1788 -1157 2103 917 -2225 -755 2184 706 -2074 -575 2099 257 -2371 -307 2075 119
4430A19k295K196K158k523k062K746J791k681j304K472J541k830j298K987J133
$$ 119 -2176 20 2178 -345 -2407 339 2130 -551 -1855 617 2158 -672 -1970 1017 2150
4445B150l335r24L189N77l017n79L094K42k781m95L231Q4l140K12L404p76l049
$$ 2150 -1185 -2109 1080 1657 -1360 -1939 1155 1397 -1384 -1879 1352 1436 -1704 -1492 1912 1136 -1913
4462a913J051K930j190k897J248K808j381k918J694K520j577k571K207K187k175
$$ -1913 -862 2068 878 -2019 -771 2037 656 -2262 -568 1952 375 -2196 11 2198 23
4477B3j822J852J911k234j949K562J778k641j589K751J250k845j141K944Q52k670
$$ 23 -1799 53 1964 -270 -2219 343 2121 -520 -2109 642 1892 -953 -2094 850 1702 -968
4493i68p76K750P89k995o17L248Mk844K83K680l89k931N43L216r09l145J200K770
$$ -968 -1744 1006 1795 -1200 -1817 1431 1435 -1409 -1126 1554 1165 -1766 -1223 1993 1084 -2061 -861 1909
4511A909j141k534J012K709j666k384J718K529j869k391J938K251k242j936K240
$$ 1909 768 -1766 -754 1955 289 -2095 -377 2152 283 -2108 -170 2081 -161 -2097 143
4526A43J857k317j549K189J868k750j381K831J208k777j188K972N84k763p02L059
$$ 143 2000 -317 -1866 323 2191 -559 -1940 891 2099 -678 -1866 1106 1690 -1073 -1775 1284
4542A284N16l370J6K876N8k866jL024l59l059N85K877m93k996R37K875r18l004
$$ 1284 1800 -1570 -1554 1322 1380 -1486 -1487 1537 1178 -1881 -1296 1581 1088 -1908 -971 1904 986 -2018
4560b018J466K560j059k858J384K781j856k478J905K268j876k094K093J769k088
$$ -2018 -552 2008 949 -1909 -525 2256 400 -2078 -173 2095 219 -1875 218 1987 -101
4575a01k243K978J333k561j330K342J371k372j245K685Q27k733o56K839N26k913
$$ -101 -2344 634 1967 -594 -1924 418 1789 -583 -1828 857 1684 -1049 -1705 1134 1660 -1253
4591a253n9K658K74k947k10L057k50k865P12K771j070k772J067K760j211k523
$$ -1253 -1312 1346 1620 -1327 -1537 1520 1270 -1595 -883 1888 818 -1954 -887 1873 662 -1861
4607a861J193K487j263k594J785K097j749k141K097J799j937j692J741J891k284
$$ -1861 -668 1819 556 -2038 -253 1844 95 -2046 51 1850 -87 -1779 -38 1853 -431
4622d31j611K445J500k507j464K980R80k657r61K753O43k930k13K570K92k725
$$ -431 -2042 403 1903 -604 -2068 912 1892 -765 -1726 1027 1670 -1260 -1473 1097 1389 -1336
4638a336m4K784K4k943J54K775m17k592N03K716p10k999J079K780j123k348R90
$$ -1336 -1380 1404 1428 -1515 -1361 1414 997 -1595 -1092 1624 914 -2085 -1006 1774 651 -1697 -707
4655g07K587j512k315J536K425j866k035J991J833j946j796K087J665k286j675
$$ -707 1880 368 -1947 -411 2014 148 -1887 104 1937 -9 -1805 282 1947 -339 -2014
4670b014K503J344k504j272L008P13k674r62K653O88k834l02K794M13k926j7K564
$$ -2014 489 1833 -671 -1943 1065 1778 -896 -1858 795 1483 -1351 -1653 1141 1554 -1372 -1389 1175
4687A175nk715K72K837m56k871N13L041p19k810J051K423j017k353R36K685j645
$$ 1175 1170 -1545 -1273 1564 1108 -1763 -1250 1791 1072 -1738 -687 1736 719 -1634 -698 1987 342
4704C42k242J524K135j494k100J827J951k151j727K179J464k256j687K712J361
$$ 342 -1900 -376 1759 265 -1835 -8 1943 -208 -1935 244 1708 -548 -2235 477 1838
4719A838k577r75K501R97k504q73K584L74k155n99K895O5k677k02K674J6k666
$$ 1838 -739 -1714 787 1784 -720 -1593 991 1365 -790 -1389 1506 1571 -1106 -1308 1366 1382 -1284
4736a284L55K742n45k844O14K718r97k749J349K243j044k401J199K368j169k449
$$ -1284 -929 1813 1268 -1576 -962 1756 759 -1990 -641 1602 558 -1843 -644 1724 555 -1894
4752a894J675K085j880j835J827J894j908j878K253J626k423j440K738J128k421
$$ -1894 -219 1866 -14 -1849 -22 1872 -36 -1914 339 1965 -458 -1898 840 1968 -453
4767d53j115K278J151k853n60K623M68k977n5K562M04k774jK785l06k638J38K859
$$ -453 -1568 710 1861 -992 -1552 1071 1539 -1438 -1493 1069 1473 -1301 -1302 1483 1177 -1461 -1323 1536
4785A536n88k727R28K548r63k287Q36K563j171k149J044K221j549j986J652J942
$$ 1536 948 -1779 -851 1697 734 -1553 -717 1846 675 -1474 -430 1791 242 -1744 -92 1850
4801A850j885j974K169J685k196j586K097J617k065j373K268J104k387j026K401
$$ 1850 -35 -2009 160 1845 -351 -1937 160 1777 -288 -1661 607 1711 -676 -1702 699
4816F99R43k770k97K577R9k553M3K384J89k338o2K253O0k611J57K615l87k637
$$ 699 1642 -1128 -1425 1152 1251 -1302 -1259 1125 1314 -1024 -1086 1167 1227 -1384 -1227 1388 1001 -1636
4834a636O11K480o52k471R01K549j420k172J283K144j324k116J492K104j830j691
$$ -1636 -1025 1455 803 -1668 -767 1782 362 -1810 -527 1617 293 -1823 -331 1773 -57 -1748
4850a748J793J843k128j536K072J413k016j475K249J471k700r15K696O35k385
$$ -1748 45 1888 -240 -1776 296 1709 -307 -1782 467 1938 -762 -1677 1019 1654 -731
4865g31j128K670O61k532k90K525o0k251m55K997l32k597K75K652m67k338L85
$$ -731 -1859 811 1472 -1060 -1350 1175 1115 -1136 -1591 1406 1074 -1523 -1248 1404 937 -1401 -1016
4882a016K505q38k376Q81K560j114k573J902J831j628j756J419J979j747j915
$$ -1016 1489 651 -1725 -844 1716 602 -1971 -69 1762 134 -1622 -203 1776 29 -1886
4897a886J936J964k246j319J696J494k061j408K146J412k297j135K494Q93k751
$$ -1886 50 2014 -232 -1551 145 1639 -422 -1830 316 1728 -569 -1704 790 1683 -1068
4912a068m27K340M63k282k59K432O4k520l14K807k22k354N09K480o89k608O72
$$ -1068 -1495 845 1308 -974 -1233 1199 1263 -1257 -1571 1236 1014 -1340 -831 1649 960 -1648 -976
4929i76K457q15k247Q81K351j248k138J408K037j400k421J998J829j532k292K062
$$ -976 1481 666 -1581 -700 1651 403 -1735 -327 1710 310 -2111 -113 1716 184 -2108 -46
4945d6J800k160j483K128J556k461r22K253R73k253j010K313Q40k244p10K314
$$ -46 1754 -406 -1889 239 1795 -666 -1588 665 1638 -615 -1625 688 1528 -716 -1426 888
4961H88P17k688k97K399K29k395j8K405j79k432L31K525n90k637Q96K624j211
$$ 888 1605 -1083 -1380 1019 1248 -1147 -1165 1240 1061 -1371 -1040 1485 895 -1742 -846 1778 567
4978E67k031Q74K297j322k005J438K025j673j854J648J775j480j959J815J493
$$ 567 -1464 -590 1707 385 -1620 -182 1843 170 -1684 -36 1739 259 -1700 115 1608
4993A608j808j463J912J493k197j312K021J365k337r74K295R19k344p97K415N95
$$ 1608 -200 -1663 249 1742 -455 -1767 254 1619 -718 -1692 603 1522 -822 -1619 796 1391
5009A391k473l33K333K54k654K54K543n7k634K50K793r00k338O79K565q79k253
$$ 1391 -1082 -1415 918 1172 -1482 -1228 1315 1258 -1376 -1126 1667 767 -1571 -892 1673 794 -1459
5026a459P93K325j303j828J253J869j483k012J554K172j861j876K252J288j887
$$ -1459 -666 1659 356 -1472 -219 1650 167 -1845 -291 1881 20 -1856 396 1684 -203
5041b03j590K125J363k401p16K045Q69k115j173K574P40k553m84K637L32k669
$$ -203 -1793 332 1695 -706 -1422 623 1492 -623 -1796 778 1518 -1035 -1519 1118 1450 -1219
5057a219M8K358K50k687l1K656k16k811N63K285l78k240Q21J972o61k110P02K477
$$ -1219 -1171 1187 1437 -1250 -1281 1375 1159 -1652 -1089 1196 818 -1422 -601 1371 710 -1400 -698 1779
5075A779j405j988J135K342j681j980J572J997j746j770J819J766k023j355K080
$$ 1779 374 -1614 -479 1863 182 -1798 -226 1771 25 -1745 74 1840 -183 -1538 542
5090E42R86k188r73K238J115k318j062K503P93k745l98K587K90k618m0K453j11
$$ 542 1528 -660 -1633 605 1720 -598 -1660 843 1636 -1109 -1507 1080 1370 -1248 -1288 1165 1054
5107A054k193r5K607l55k415M72K529n91k447P16K251q07k291J098K236j346k198
$$ 1054 -1139 -1234 1373 1018 -1397 -925 1604 1013 -1434 -718 1533 726 -1565 -467 1769 423 -1775
5124a775J378K287j612k047J552K036j988j814K211J337j640j644K009J196k072
$$ -1775 -397 1890 278 -1769 -217 1819 -169 -1983 228 1565 -75 -1719 290 1486 -586
5139e86r91K219Q69k353p33K327O03k176o96K335N86k539j15K326J05k301Q8K417
$$ -586 -1577 642 1511 -842 -1575 752 1355 -821 -1517 818 1404 -1135 -1250 1076 1181 -1120 -1032 1385
5157A385j58k611K32K561n56k419P07K381r51k204J173K088j076k236J389K044
$$ 1385 1227 -1384 -1152 1409 853 -1566 -859 1522 571 -1633 -460 1628 552 -1684 -295 1749
5173A749j452j939J805J538j845j750K094J546k002j303J876J549k481j058K065
$$ 1749 297 -1642 163 1701 -144 -1894 200 1746 -256 -1559 317 1866 -615 -1673 392
5188C92J399k461q95K212Q08k336l24K124K98k357k20K562k95k117K04K238l29
$$ 392 1791 -670 -1565 647 1455 -881 -1205 919 1217 -1140 -1360 1202 907 -1210 -1006 1232 903
5205I03k360O27K159n49k223Q18K287j132k049J049K063j125k209J372K079j521
$$ 903 -1457 -830 1329 780 -1443 -625 1662 530 -1519 -470 1593 468 -1741 -369 1710 189
5221A89j878J578J893j974j471J804J255j623j525J998J166j874j228K294J006
$$ 189 -1689 -111 1782 -192 -1663 141 1396 -227 -1752 246 1412 -462 -1690 604 1610
5236A610k425q46K223O55k286k14K470K69k677k94K702J11k322r7K521m30k144
$$ 1610 -815 -1661 562 1217 -1069 -1283 1187 1456 -1221 -1515 1187 1298 -1024 -1121 1400 970 -1174
5253a174K94K162o21k076P46K319j139k035Q80K360j421j860J268J885j394j829
$$ -1174 -880 1282 661 -1415 -669 1650 511 -1524 -644 1716 295 -1565 -297 1588 194 -1635
5269a635J766J660j910j853K097J604j867j588K271R15j904j089J951J228k251
$$ -1635 131 1791 -119 -1972 125 1729 -138 -1726 545 1460 -444 -1533 418 1646 -605
5284f05q84K197R25k492n19K560j03k278l2K311R5k329J0K437l38k393O08K317
$$ -605 -1489 708 1633 -859 -1378 1182 1079 -1199 -1231 1080 1175 -1154 -1144 1293 955 -1438 -830 1487
5302A487o67k286Q21J985q26k226J135K064q51k198J450J641j318j882J811J512
$$ 1487 820 -1466 -645 1340 514 -1712 -577 1487 636 -1562 -112 1529 211 -1671 140 1652
5318A652j809j487J763J536j763j664J889J505k168r80J914J137k271q26K217
$$ 1652 -157 -1644 119 1655 -108 -1772 117 1622 -546 -1526 388 1525 -746 -1572 645
5333F45P00k356l41K580rk275j84K382k0k335L80K177k16k781Q76K391n86k489
$$ 645 1345 -1011 -1352 1228 1219 -1056 -1240 1142 1122 -1213 -833 1344 1128 -1653 -777 1614 1028 -1461
5351a461Q11K198j051k339J210K014j076k005J629J485j267j925J617J633j539
$$ -1461 -650 1548 497 -1842 -632 1382 306 -1699 -70 1415 148 -1777 -160 1473 -66
5366f6j559J802J489j942j067J660J285k108j169K420R14k058j062K077P80k245
$$ -66 -1625 177 1666 -276 -1343 317 1602 -506 -1675 745 1659 -399 -1461 616 1396 -849
5382h49n79K506L94k478m39K610j45j962j50K380J5k806M94K359n87k300R23J998
$$ -849 -1428 1078 1472 -1006 -1445 1165 1020 -942 -1092 1288 1303 -1503 -1009 1350 763 -1537 -614 1384
5400A384o40k340J225J927j280j956J553J691j542j901J865J560j707j539J722
$$ 1384 744 -1596 -371 1556 276 -1680 -127 1564 22 -1879 -14 1546 -161 -1700 22
5415B2J793k091j499K247J016j842j086J987J090k451l46J934L86k294l27K428
$$ 22 1815 -276 -1775 472 1488 -354 -1440 547 1637 -814 -1160 774 1160 -1134 -1461 967
5431I67J34k021k70K495k56k115J64K159l34k328O74K027l30k464P64K395j059
$$ 967 1101 -920 -1190 1305 1049 -1066 -902 1257 923 -1405 -731 1296 966 -1498 -734 1661 602
5448F02k016R53J992j146k236J736J631j243j820J422J747j811j376J885J536
$$ 602 -1414 -461 1531 385 -1851 -115 1516 273 -1547 -125 1622 -189 -1565 320 1856
5463A856k086j596K251Q63k064p21K050P85k049n43K166N75k374l12J947P41k253
$$ 1856 -230 -1826 425 1288 -776 -1497 553 1338 -711 -1254 912 1487 -887 -1199 748 1489 -764
5480g64k64K223m9k283q7K565o31k041M17K161o76k125Q72J953n43j863P17J665
$$ -764 -1028 1195 1146 -1137 -1224 1341 710 -1331 -914 1247 571 -1554 -682 1271 728 -1135 -418 1247
5498A247r31j932J327J949j611j558J366J701j521j692J861J432j718j527J999
$$ 1247 316 -1616 -289 1660 49 -1509 -143 1558 37 -1655 206 1638 -80 -1607 392
5513C92J032j653j089J977P12k027p04K085R00k301n62K191K65k202Q0K214m90
$$ 392 1424 -229 -1318 659 1371 -656 -1360 725 1625 -676 -1238 953 1218 -984 -904 1310 820
5530H20k101J8K310l24j971L69K006k72k363J089J914r73k049J200J968j295j938
$$ 820 -1281 -1263 1047 723 -1248 -879 1127 855 -1508 -419 1495 522 -1527 -327 1641 346 -1592
5547a592J453J873j439j929J584J678j653j711J973J273j814j340J810J331j787
$$ -1592 -139 1734 295 -1634 -50 1628 -25 -1736 237 1510 -304 -1644 166 1497 -290
5562b90j367K362O00j914q62K351O54k178n92K260J98k171k00K486k19k128N6
$$ -290 -1657 705 1305 -609 -1471 880 1534 -644 -1236 1024 1222 -949 -1149 1337 1118 -1010 -954
5579i54K192m32k239M09K256l55k264Q19K114o69k314R47J899j270j600J189J840
$$ -954 1238 806 -1433 -1024 1232 877 -1387 -568 1546 877 -1437 -490 1409 139 -1461 -272 1568
5596A568j485j528J252J626j490j422J685J329j651j316J933R94k057q76K056
$$ 1568 83 -1445 -193 1433 -57 -1479 206 1535 -116 -1432 501 1495 -562 -1438 618
5611F18P30j633j134K170M57k011n34K239K43k330p2K232L4k294J71K318p5k361
$$ 618 1348 -285 -1419 751 1208 -803 -1337 902 1145 -1185 -1257 975 1009 -1285 -1114 1204 1129 -1232
5629a232M74K225n92k091M74K250p73k264J111J836j185j771J419J726j655j459
$$ -1232 -758 1467 875 -1216 -742 1508 735 -1529 -418 1418 233 -1538 -119 1607 -48 -1507
5645a507J497J503j398j670J614J361j875j021J916J147k222r04K289N44k050
$$ -1507 -10 1493 95 -1575 39 1400 -475 -1496 420 1567 -655 -1559 730 1274 -776
5660g76n74K147L35k018l62K241K27k043k76K251J02k453J90K037j13j967K75
$$ -776 -1350 797 1132 -886 -1248 993 1220 -823 -1099 1152 1254 -1199 -1009 1028 915 -1052 -777
5677g77J770k65k064O86K019r45k027R14K125j381j724J342J779j377j788J565
$$ -777 993 728 -1336 -650 1369 424 -1603 -689 1436 55 -1669 -327 1452 75 -1713 -148
5693a48J752j791j423J680J227j404j643K019R20j336j082J943N51j970q12K345
$$ -148 1604 -187 -1610 70 1297 -107 -1750 269 1189 -147 -1229 714 1265 -705 -1517 828
5709H28N59k097k50J832K80k051m14K300R7k016QK081k54k113L84K063l75k327
$$ 828 1387 -710 -960 872 1152 -899 -1313 987 1084 -932 -924 1157 903 -1210 -826 1237 862 -1465
5727a465R75J778p37k077J136J742r27j648O60K035j280j667J412J618j389j742
$$ -1465 -490 1288 551 -1526 -390 1352 425 -1223 -563 1472 192 -1475 -63 1555 166 -1576
5743a576J554J477j768j284J961J025j906j036K020Q96j773r62K132O85k231n13
$$ -1576 -22 1455 -313 -1597 364 1389 -517 -1553 467 1363 -410 -1372 760 1445 -786 -1299
5759a299K326M22k133m13K182l1k310L39K217k71k385O38J846m75j929N80J947
$$ -1299 1027 1449 -684 -1097 1085 1054 -1256 -917 1300 1029 -1356 -718 1128 653 -1276 -696 1251
5776A251o56k017Q82K078j190j747J017J678j139j747J543J446j446j437J567
$$ 1251 595 -1422 -540 1538 348 -1399 -382 1296 157 -1590 -47 1399 -47 -1484 83
5791H3J533j663j394J633J536k108j097K070J157k115q58K081M94k113n13K004
$$ 83 1616 -47 -1441 192 1728 -380 -1477 593 1750 -365 -1223 858 1352 -761 -1274 730
5807G30M04k001k24J819N23k522M73K108m42k201M50K186q60j679L44J915l87
$$ 730 1134 -867 -1091 728 1251 -1271 -798 1310 868 -1333 -883 1303 443 -1236 -892 1023 636
5824F36j999J037J712j205j461J085J629j294j389J345J074r75j788J643J471
$$ 636 -1363 -326 1386 181 -1280 -195 1434 140 -1249 96 1170 195 -1593 50 1521
5839A521j627j326J768R53j693j021J881J110k169r59K181P51k571j09K082O24
$$ 1521 -106 -1432 336 1289 -404 -1425 456 1566 -603 -1562 619 1370 -1201 -1310 772 1396
5855A396k381j13K112J90j915k49K050l84j740J34K229l66k265O66K190r66j751
$$ 1396 -985 -1098 1014 1204 -711 -960 1090 706 -1034 -900 1329 963 -1302 -636 1554 588 -1163
5872a163N69J932j026k056J278J907j184j895J622J312j236j644J525J415j445
$$ -1163 -594 1338 312 -1744 -466 1441 257 -1638 -16 1296 60 -1584 -59 1356 -89
5887h9j337J716R22j657j027J684R00j583r72K024P01j833o81K121K21k035k39
$$ -89 -1426 290 1212 -445 -1472 212 1112 -471 -1443 581 1282 -551 -1232 889 1110 -925 -1164
5904a164K080K13k208j08K253m57j754J27K067l29j880N93J763o35j694P54J725
$$ -1164 916 1129 -1079 -1187 1066 609 -1145 -1018 1049 720 -1160 -567 1196 561 -1133 -379 1346
5921A346q81j885Q62J987j220j661J437J479j357j126J327R59j200j367J490R19
$$ 1346 465 -1420 -558 1429 209 -1452 -15 1464 107 -1019 308 1267 67 -1300 190 1109
5937A109j219j077J573Q79j773q02J966O52j880o04J711P56k185j25K000m4j914
$$ 1109 -110 -1187 386 1265 -508 -1310 656 1308 -572 -1176 535 1291 -894 -1019 981 937 -977
5954i77m1K221k17k185K99K223l88k033K28K240r17j752J023J793r85j875J122
$$ -977 -1018 1203 986 -1199 -900 1323 935 -1098 -870 1370 453 -1299 -276 1517 532 -1343 -221
5971b21J482r51j660J052J477j042j608J232J537j574j013J452J379j641j354
$$ -221 1261 310 -1350 -298 1179 137 -1471 -239 1298 -276 -1289 163 1542 -99 -1453
5986a453J979R04j897o92J861O88k063m45J959M13j882n04K256j47j832P8J589
$$ -1453 526 1430 -467 -1159 702 1390 -673 -1118 841 1254 -628 -1132 1124 977 -855 -777 812
6003H12J65j977P5K019j45k260M83K034o47j865N84K098j063j549Q27J621r75
$$ 812 977 -1000 -925 1094 949 -1311 -828 1206 559 -1306 -722 1376 313 -1236 -409 1212 237
6020B37j617J265J524j250j639J569J133j272j048J503J125j768j044J857P49
$$ 237 -1380 -115 1409 159 -1480 89 1222 -50 -1098 405 1530 -238 -1282 575 1324
6035A324j824j134K314N58j904p16K019K69j943P4J808K60k078r9K270l02k020
$$ 1324 -500 -1634 680 1238 -666 -1382 637 906 -1037 -963 845 1105 -973 -1072 1198 896 -1124
6052a124M55J836m63j897N74J867n84j949N55K087p60j852R52J636j088j828J518
$$ -1124 -669 1167 704 -1193 -619 1248 664 -1285 -730 1357 597 -1255 -303 1333 245 -1583 -65
6069f5J390j030j479J092J424j465j080J315J424j775j192J785Q99j718r25J820
$$ -65 1325 295 -1184 -92 1332 -133 -1213 102 1526 -249 -1441 344 1243 -475 -1400 420
6085D20R32j857o52J806N59k023j58J772K60j985j83K203j71j867j4J937k04j786
$$ 420 1352 -505 -1157 649 1208 -815 -973 799 1059 -926 -1109 1094 923 -944 -958 979 775 -1011
6103a011K01J892n65j666P03J557p69j666J145J583j156j581J167J445j244j199
$$ -1011 -810 1082 517 -1149 -446 1111 342 -1324 -179 1404 248 -1333 -166 1279 35 -1164
6119a164J183J412j531j210J551J023j594j078J850Q14j808p19J713R66k020o55
$$ -1164 19 1431 -100 -1310 241 1264 -330 -1408 442 1256 -552 -1271 442 1408 -612 -1267
6135a267K009R0j596k02J649L83j825k36J864J58k322L85J965j38k301L51K273
$$ -1267 742 832 -764 -966 683 1066 -759 -995 869 1027 -1295 -910 1055 917 -1384 -1033 1240
6152A240o35j856N70K172r72k023J238J417j010j451J244J513j300j531J592J231
$$ 1240 605 -1251 -681 1491 519 -1504 -266 1151 141 -1310 -66 1447 147 -1384 208 1439
6168A439j478j570J892J213j777j171J721J037j727q40J830Q38k096j81J577L06
$$ 1439 -39 -1609 283 1496 -281 -1452 269 1306 -421 -1261 569 1407 -689 -870 707 1013
6184A013j782j58J728L72j958m7J747m9j946L65J671l02j859L96K069n66j760
$$ 1013 -769 -927 801 1173 -785 -832 915 866 -1080 -715 956 654 -1205 -809 1260 694 -1066
6201a066M00J957q20j427Q23J349r71j608J057J679j249j481J261J502j394j441
$$ -1066 -666 1291 471 -956 -133 1216 245 -1363 -306 1373 124 -1357 -96 1406 12 -1429
6217a429J522J289j381j419J851P73j566o38J608O43j947o00J746Q10k256k73
$$ -1429 93 1382 1 -1418 433 1206 -360 -998 610 1253 -694 -1294 452 1262 -994 -1267
6233a267J848L65j816l73K179Qj910L04J873m72j956O09J599k04j766L46J817
$$ -1267 581 946 -870 -1243 936 944 -966 -662 1211 739 -1217 -608 991 787 -979 -633 1184
6250A184n91j624N70J653p05j639J083J386j141j501J374J328j531j067J301J160
$$ 1184 593 -1031 -461 1192 487 -1152 -69 1317 176 -1325 49 1377 -154 -1221 80 1240
6266A240j559p99J367R62j586j038J926O68j563o03J530N84j758m88K063J26j743
$$ 1240 -319 -1118 249 1211 -375 -1413 513 1181 -382 -985 545 1129 -629 -1117 946 1072 -671
6283f71l62J670L43j909l0J670R2j658J27J685k95j766M73J976q21j616P04J529
$$ -671 -1033 637 980 -929 -959 711 803 -855 -728 957 662 -1104 -631 1345 524 -1092 -388 1141
6301A141q35j594Q66J580r62j477R83J338r02j521J514J029j498q03J521Q59j638
$$ 1141 306 -1288 -422 1158 196 -1281 -298 1040 138 -1383 131 1160 -338 -1141 380 1239 -399
6318c99p74J443R45j871l98J828L96j931m47J945L37j944k16J941j59j812L94
$$ -399 -1173 270 1215 -656 -1054 774 1170 -761 -1208 737 1074 -870 -1086 855 696 -1116 -722
6335g22J548r1k045P54J522m46j447M29J640q67j687J108J575q84j657P87J752
$$ -722 826 735 -1310 -556 966 520 -927 -498 1142 275 -1412 -304 1271 387 -1270 -483 1269
6352A269j091j484J230J480j465j173J251J027j358j000J367J066j363r87J621
$$ 1269 178 -1306 -76 1404 -61 -1234 17 1044 -314 -1314 53 1119 -244 -1231 390
6367C90N71j352p55J576P96j941m23J828K90j604m78K113n9j897RJ803k27j537
$$ 390 961 -391 -1146 430 1226 -715 -1138 690 980 -624 -1102 1011 952 -945 -936 867 640 -897
6385h97K67J557k17j728L17J881o67j761M76J971q70j729R76J535j079j325J148
$$ -897 -630 927 710 -1018 -701 1180 513 -1248 -772 1199 329 -1400 -424 1111 32 -1293 -145
6402a45J371j156j142J130J190j381j275J424J218j609m71J288P18j622n81J503
$$ -145 1226 70 -1072 58 1248 -133 -1408 16 1234 -375 -846 442 1160 -462 -1043 460
6418D60N28j527o43J996K06j676m77J854J4j838L22J673m03j318J7J924o21j518
$$ 460 988 -539 -1182 814 1020 -656 -1133 721 735 -1103 -781 892 489 -829 -812 1112 491 -1027
6436a027J43K280o58j873N77J802p95j628Q01J545r73j440J365J273j356j120
$$ -1027 -884 1396 738 -1135 -558 1244 449 -1179 -378 1167 194 -1246 119 1392 36 -1084
6452a084J214R00j057j293J792O42j429r15J479Q83j581o67J779J92j501l68J720
$$ -1084 130 1030 -27 -1320 472 1114 -315 -1230 249 1132 -449 -1116 663 855 -646 -1014 706
6469G06q3j210l94J777n8j656J63J416L06j717J27J610k68j556M74J410o28j604
$$ 706 623 -587 -981 796 738 -918 -755 661 967 -750 -623 987 719 -837 -363 1047 419 -1185
6487a185Q22J616j140j320Q10J313q41j318J205J108r54j354J367J223j470j176
$$ -1185 -363 1253 113 -1207 -397 916 75 -1243 -38 1070 116 -1238 129 1352 -118 -1294
6503a294J520Q15j254p91J278Q94j840n45J770N08j737m10J686K20j354m09J844
$$ -1294 226 1041 -213 -1004 274 1168 -672 -1217 553 1061 -676 -1086 600 820 -534 -943 901
6520I01j65j518l7J618l22j616L11J711k32j752N34J595n40j635O50J510o82j406
$$ 901 736 -782 -819 799 477 -1139 -828 883 651 -1101 -567 1028 488 -1147 -497 1013 331 -1075
6538a075P59J423j074j127J048J363j252j375J365J244j511r47J199J022j319
$$ -1075 -316 1107 33 -1094 -46 1317 65 -1310 55 1299 -212 -1159 40 1062 -257
6553b57p81J410Q15j703n26J403P01j679m56J517K84j341m16J700L22j769k82
$$ -257 -1038 372 1187 -516 -1042 361 1062 -617 -1073 444 728 -613 -1029 671 993 -776 -1058
6570a058J931l26j419J34J651k69j663K59J959o30j683O94J468o92j438O67J567
$$ -1058 873 547 -872 -738 913 644 -1019 -760 1199 569 -1114 -420 1048 356 -1082 -415 1152
6587A152p42j480J150J046r01j298J243Q51j236q91J510P72j282j125J608P58
$$ 1152 410 -1070 80 1126 225 -1073 170 1021 -215 -1106 404 1176 -106 -1231 377 1135
6603A135j571n86J507N78j688j60J495J52j689n9J626J7j583P8J783l48j617R3
$$ 1135 -436 -1022 485 1063 -625 -785 710 862 -827 -886 740 757 -826 -748 1035 687 -930 -837
6621h37J968o16j508N23J348l04j662O43J499r38j218O88J538p45j457J063J216
$$ -837 1131 515 -993 -470 878 574 -1088 -445 1054 116 -1102 -414 1124 379 -1078 -15 1201
6638A201j055j404J304J099j250q64R35J109j269j061J268R84j244o70J302N37
$$ 1201 146 -1258 46 1145 -105 -969 -34 1075 -194 -1255 13 997 -247 -917 385 922
6654I22j701j09J521J74j226l60J419L00j760OJ857l89j171RJ428k08j654L03
$$ 922 -779 -888 633 807 -419 -779 640 940 -820 -814 1043 654 -517 -508 920 712 -942 -639
6672f39J579m54j415O59J327n46j441N88J608r25j607J242J044q23j354J165J194
$$ -639 940 486 -929 -270 1057 511 -930 -342 1266 341 -1266 -24 1020 197 -1157 8 1202
6689A202j325r20J252P53j326q54J472O45j484k82J359M97j704r4J377M45j559
$$ 1202 -123 -1043 209 962 -364 -1218 254 899 -585 -867 492 989 -715 -809 568 1013 -546
6706e46O5R84N06j731K02J209j0j467J71J234M3j681K26J576m44r85J5J582n94
$$ -546 -481 503 1009 -722 -520 689 679 -788 -617 617 660 -1021 -795 781 337 -648 -633 949 355
6725C55j577R69J272p81j424J041J154j026j054J150R39q91j124J149Q18j022
$$ 355 -1222 -253 1019 238 -1186 -145 1009 -17 -1071 79 1018 127 -997 152 970 -52
6741e2p46Q16J054j513n99J425P19j713j93J317M01j703m0J331O08j624k40J581
$$ -52 -798 18 1072 -441 -1040 385 1104 -609 -802 515 916 -787 -827 504 1112 -512 -752 829
6759H29k88j286J54J419l31j133K7J527l65j467L93J715q75j321P61J133o87j137
$$ 829 541 -745 -591 828 497 -636 -609 918 553 -914 -521 1194 319 -1002 -241 892 205 -932
6777i32O27J517j080j090Q83J251j367q36J281J014j566n00R09O93j299o41J722
$$ -932 -305 1212 132 -958 -75 1176 -191 -1027 254 1268 -298 -798 111 804 -495 -1136 586
6794E86K31j363m71J667K00j392j81J213Q1j143rJ448l43j417M3J593j7j613M93
$$ 586 817 -546 -1017 650 850 -542 -723 490 571 -572 -581 867 524 -893 -850 743 726 -887 -394
6813c94J377o42j365O18J278m91j316O21J198o52j493J005J172q03j148R14J290
$$ -394 983 341 -1024 -406 872 381 -935 -314 884 232 -1261 -256 916 113 -1035 -121 1169
6830A169j098q13Q10R83j337q09J464O90j483n99J179N70j226o96J549N08j311
$$ 1169 71 -742 68 1051 -286 -1095 369 1059 -424 -1023 156 726 -500 -1196 353 861 -450
6847d50m71J383M15j586K5J491l89j284L32J454m61j431L88J465n56j229M75J483
$$ -450 -921 462 877 -709 -684 807 418 -866 -534 920 459 -972 -584 881 325 -904 -429 1054
6865A054o88j378Q36J296q18j231Q40R79p34j247Q37J308j198q32J048Q23q86
$$ 1054 366 -1012 -176 1120 302 -929 -89 890 156 -1091 -254 1054 -144 -976 72 895 9
6882Ij000J099P63j111o83J235N31j179n76J644J6j448q9J479J2j458J21J466
$$ 9 -991 108 871 -240 -923 312 843 -336 -912 732 748 -700 -789 690 702 -756 -635 831
6900H31j64j312QJ450k24j496N26J199l44j363M39J200n97j243P31J174p81r00
$$ 831 667 -645 -637 813 589 -907 -381 818 474 -889 -450 750 153 -1090 -359 815 34 -866
6918h66M72J506j130j044J071Q21p64j173J068R91r93r47J352O77j317n66J245
$$ -866 -394 1112 -18 -1062 9 830 66 -1107 -39 952 -41 -988 364 1041 -276 -842 403
6935D03M19j232n33J375N54j700n1J190L79j292k44J572m3j254l89J703l79j494
$$ 403 822 -410 -943 432 986 -714 -765 425 804 -488 -732 840 797 -457 -846 857 478 -1016
6953a016L84J312l25j224N64R61k80j324P48J076o66j095J047P62p60r38O71R13
$$ -1016 -632 680 355 -869 -305 656 376 -948 -200 876 210 -885 162 924 164 -774 -103 810
6971H10r46q38J185N91r34r72P82R97q53j001J577M85j459k91J272K06j366J43
$$ 810 -136 -974 211 802 -132 -1104 -322 675 -178 -1179 398 883 -576 -867 405 611 -755 -612
6989f12J041K96j377K7J261j38j138J48J413l30j261L52J143m86r56J41J279n27
$$ -612 429 725 -652 -625 636 498 -640 -492 921 591 -670 -318 825 339 -617 -476 803 276
7007B76j263O96J227q08p60M80R40m75j246Q29J204j220q21J248N09q04r27J102
$$ 276 -987 -291 936 128 -632 -152 788 313 -933 -104 1100 -120 -941 307 816 12 -915 187
7025A87O37j029q14J463O71j407k79R88M17j532j48J421j33j012j31J117J47j038
$$ 187 824 -205 -1019 444 1115 -292 -571 417 834 -698 -846 575 442 -570 -701 416 563 -475
7043d75qR94j10j181M04J145l75j234M50J180n62q76N03J093r46j018J008P74
$$ -475 -483 511 401 -780 -376 769 394 -840 -390 790 228 -648 -145 948 2 -1016 -8 766
7061G66p79p32P18Q68p84q97Q16R03j142n68J046P14j349m04J120N50j254m26
$$ 766 -13 -745 -27 841 57 -840 -24 879 -263 -831 215 929 -420 -824 296 846 -408 -834
7079h34J034N25j093l85J138K26j202M5J197L6j205J59J033l62o56j54J201m00
$$ -834 200 725 -368 -753 385 611 -591 -546 651 687 -518 -359 674 312 -344 -498 703 303
7097C03r26J92J077m75j005M37J075m21r81O30J095j123o46M67J159q82q58R56
$$ 303 -623 -431 646 171 -834 -397 678 257 -724 -94 1001 -122 -768 -301 858 -24 -882 74
7115G4O26p62o67Q51O87r35n57J061L17j247l98J107O00j188j77J040N9j339L66
$$ 74 700 -62 -729 122 809 -126 -683 378 695 -552 -950 157 757 -431 -608 432 491 -848 -482
7134d82Q78J46j249J73J152j43j117K50Q80j07j105K24J327n16j031M21R32m12
$$ -482 396 542 -707 -534 618 475 -642 -392 488 381 -724 -500 827 311 -720 -299 633 221
7152B21j106P20R44p51o63O78R42r77o53O57P26r71k94P52L99o68o52J008P31
$$ 221 -885 -165 779 28 -635 43 985 8 -645 12 738 -233 -527 225 624 -44 -696 312 1043
7171A043j293m79J065L90j151k12R26K66j208J24R94Q2j064j80J496k99j233M44
$$ 1043 -250 -729 336 726 -425 -637 289 555 -653 -529 465 547 -517 -697 799 500 -733 -289
7189b89J103l17j170M50R73l23j220N42J009n45j117P15Q49p19m59M44Q61r85
$$ -289 814 497 -673 -223 750 427 -793 -251 758 213 -904 -189 660 -59 -518 -74 787 -198
7207a98p20R19Q08p81r22J125N97j124m67J043O21j302k29J093N0j185R8R93J04
$$ -198 -918 1 809 28 -894 231 828 -296 -763 280 901 -401 -630 463 513 -672 -574 419 523
7226E23j076J22P86P7j253K65J117k06j149K14J212j84j102j3J306n84q82O25
$$ 523 -553 -431 355 432 -821 -556 561 355 -794 -580 632 448 -654 -667 639 55 -827 -202
7244b02P44l25j074Q08N22m46q73R27N38r89k03P37O51j194n39R91O27q66l94
$$ -202 542 217 -857 -49 473 27 -846 81 619 -370 -573 164 815 -379 -918 73 700 -166 -560
7263e60Q34M23r91m93R51L38q16k34R83K45j049q4R03P5r50j74J080k1j187K26
$$ -560 274 697 -294 -787 164 502 -314 -548 435 680 -369 -453 450 525 -425 -599 481 460 -727 -501
7283e01J187l83q67J45J238n36q12L36Q15o65n73K99J091n19j212R77O68p25p88
$$ -501 686 303 -564 -419 819 283 -529 -193 622 -43 -616 -317 774 255 -957 20 688 -37 -825
7302h25J083N77j039m11Q39N26r87n35R93N05r46k42Q26M81j233j27P85J01r20
$$ -825 258 835 -204 -615 224 750 -237 -772 221 726 -220 -462 364 845 -388 -515 270 371 -549
7321e49P1J092j11q74j36J119J69j530L62R43p8j263N35R02o05o00J10J070m87
$$ -549 -478 614 503 -371 -507 612 781 -749 -387 556 478 -785 -250 652 47 -553 -443 627 140
7340A40r08M95R87m81j018N11J029p15q53R52N02q45m53N50Q41p64o98R83M60
$$ 140 -768 -273 714 233 -785 -274 755 40 -813 139 641 -204 -657 -107 734 -30 -728 255 715
7359G15r12l90Q99L26j091j7R39L8j115J99N76N39j380M08R47m48n98N4R68l30
$$ 715 -197 -587 312 638 -453 -470 469 507 -608 -409 167 706 -674 -266 681 233 -365 -311 657 327
7379C27p06K06R22p63o71N94P02m54q77O52Q25r21p05O36R62q11n29O41N16o25
$$ 327 -379 -173 749 -14 -685 -91 611 157 -720 -68 757 -164 -869 -233 729 -82 -611 30 546 -79
7399g9p05J189L35r13l33Q54L22j180j46R77L96j155m4J003p7r41j36R81L11r70
$$ -79 -784 405 740 -173 -506 348 670 -510 -656 321 717 -438 -482 521 444 -497 -633 348 659 -311
7419c11j59R13m0j073N13N49k81j022P33P55j74j020L80Q91l97r76N16J056r03
$$ -311 -470 443 403 -670 -157 392 111 -911 -178 577 403 -617 -237 654 257 -719 -203 853 -50
7438e0n94N67P58p38m72M86O12o77n07Q50M61r13o36J038K70p13n4O92P7p34n0
$$ -50 -644 -77 681 -57 -529 -43 569 -108 -615 235 696 -217 -853 185 455 -258 -312 380 457 -277 -327
7459c27Q97j52r99L54O39L8q15l6Q82k70r16M48Q64m22q54M37R03l98q53K74J131
$$ -327 570 418 -581 -227 412 450 -365 -401 481 211 -705 -257 607 185 -669 -232 671 273 -580 -306 825
7480H25q69n97P26M60n17p67O68Q65r22m53M55Q95j131k95P65K73o66o5N25M23
$$ 825 -44 -641 85 545 28 -739 -71 794 -128 -581 -126 769 -362 -657 108 381 -285 -350 175 598
7500E98j017j03Q56M31j168l84R45M40r65M2R33j39r34R0R74j21r13O4J103k80
$$ 598 -419 -522 334 765 -403 -787 158 598 -367 -325 608 469 -465 -375 599 478 -435 -371 732 452
7520D52j038M45N72j53q07M93N99m63p31N73L73k90p72Q32N09q60k92P40N07r07
$$ 452 -586 -141 431 278 -529 -36 563 100 -631 -58 315 25 -747 85 594 -266 -558 182 689 -218
7540b18m66P18O26j013m58J131K60p12l15O73L32q01j89P53O0r18L37P28k59q90
$$ -218 -684 34 660 -353 -811 320 580 -132 -447 226 558 -243 -432 321 381 -537 -200 528 269 -621
7560f21K19Q00N6r95Q8J027k79o32M00M22m67m46M16P06l92j388J042Q64o60o63
$$ -621 -402 398 454 -541 -453 574 295 -337 63 485 18 -428 -12 694 302 -1086 -44 820 160 -503
7580e03N66M55n80n36N23N53q64k40Q41M18j151j76R16K22o00k01O00m1n40k3
$$ -503 63 518 -62 -598 -75 478 -386 -626 215 633 -518 -694 222 444 -156 -357 243 202 -338 -361
7600c61Q18J9o94l12J012L0j001J82O18j00n72J51P61m58m70O9Q23l33o12K23
$$ -361 457 476 -218 -530 482 512 -489 -307 311 211 -361 -210 551 93 -377 -308 515 182 -430 -207
7620b07O45k78q54N31R40n83p09N30O59q84m23O10L72q41l09Q11O80q85j32M38
$$ -207 438 160 -694 -163 777 194 -515 15 674 -210 -633 -23 349 -492 -801 10 690 -195 -327 111
7640A11N16j104J59N30K41o72m30J077j2q27J0J023l00o82P9Q46k52p14K35N73
$$ 111 627 -477 -318 212 453 -219 -649 428 416 -411 -401 622 322 -360 -281 565 313 -401 -166 407
7660D07j19o92J12O70k77p60M99Q04p12l32L48M04n82n01Q13K53m67k63N24M50
$$ 407 288 -404 -292 378 101 -659 -160 644 -68 -400 -52 352 -230 -731 82 335 -132 -395 129 579
7680E79o29m60O30M53m26p46Q75J01n15j51P05K60q56k22P85k6o97l8N34j1n20
$$ 579 -50 -510 120 573 147 -599 276 377 -138 -289 416 676 -180 -402 383 357 -340 -378 156 145 -375
7701c75L6P82j77q21M61O11m45l88L8J005p73l40L80O19l91q45O61N18o10m18
$$ -375 -339 443 266 -555 -94 517 72 -316 -278 727 -46 -386 -6 613 222 -623 38 556 -54 -472
7721d72L72Q41o49o71P34J86m68l83N28M56p27l00Q89J23p48m33Q48L46q43k11
$$ -472 -100 741 92 -579 155 341 -127 -510 18 474 -253 -553 336 459 -289 -722 126 472 -371 -582
7741e82O63L94p15k13Q78r8q46kJ024m5j177K22P82m4o41J39P73l62o70M38M18
$$ -582 81 475 -240 -453 425 327 -519 -521 503 458 -719 -497 285 241 -400 -261 512 150 -520 -82 336
7762C36j20p14P52M85p83l01M73N35n48p70R21L85p87k42N46K46n56m01P52M28
$$ 336 216 -498 254 739 -44 -345 128 663 115 -655 266 651 -136 -378 168 414 -142 -543 209 637
7782F37o79k81N26N2o61J28O32k68n64O0P41j79m79J37O50p6r20M21M76m2p85
$$ 637 -42 -323 203 255 -406 -278 354 86 -478 -418 323 144 -335 -198 452 376 -544 -123 353 311 -474
7803d74L17Q65m87n72O7P76k58o63L77M51j62p71O62L12m65l65O01K24q11p9N04
$$ -474 -157 708 221 -351 -284 492 234 -429 -52 399 237 -534 128 440 -25 -390 211 435 -376 -455 49
7824D9M76p07k78P63on89j45P22J50m43k69P27j11q08P1Q46j1r41q7R96k8j062
$$ 49 525 -182 -460 303 297 -292 -437 285 435 -8 -277 450 339 -469 -398 448 437 -504 -591 405 377 -685
7846f85M47O78j63o96M10M97l44n67K35P57n08m81M71N8ln20M60N41n78n66P48
$$ -685 -238 440 277 -419 -9 488 144 -423 -188 569 61 -420 51 109 106 -414 46 587 9 -557 191
7867A91J08n00j61L43K29k43k61O72J95p82q5M83J56q10P4J036m62q31K60R29
$$ 191 299 -201 -362 -19 210 -33 -294 378 573 -209 -294 189 345 -465 -391 645 183 -648 -388 541
7887E41k39r24K84P50j73p37L42N84l47n64J05J002o06m04K25P67n00o72P13L56
$$ 541 302 -622 -338 412 239 -498 -156 428 81 -483 -378 624 18 -386 -161 606 106 -566 147 503
7907E03k38r22O26O48l95p51N86K67n46j3J53M97p18j9O53J91q83oP99j41n75
$$ 503 265 -657 -31 617 222 -529 57 324 -222 -235 -82 415 -303 -322 331 522 -361 -367 432 291 -284
7928b84j77P46L5o20j33O31K47r34O6J041k79q46L31M31o3l62J40M49l53m77L04
$$ -284 -461 285 320 -300 -433 198 445 -489 -423 618 339 -507 -176 255 192 -170 -30 419 66 -411 -107
7949a07O58m74n91K99N36l63k90L91K53p06n4M48N04n65k45J95P18o75l70O35
$$ -107 551 77 -514 -215 321 -42 -332 59 312 -394 -448 0 504 -61 -306 -111 607 -68 -438 197
7969A97K05n14l14O18J09n38j87N85J37p87J19O43j62k48J41K32lm56j70O80j89
$$ 197 402 -112 -426 192 301 -237 -424 161 298 -489 -370 273 111 -137 4 236 233 -223 -393 287 98
7990I8j02l36P51j35m75M0O64m58m69L65N51l94n26N40K60l05l92O59J14o87k05
$$ 98 -4 -340 411 276 -199 -159 505 47 -422 -57 494 100 -426 114 374 69 -323 336 450 -237 -442
8011d42N05M51q01j72O42K33n47p9M22J10o52l17P07K54o31L4N34o1n07J35O79
$$ -442 63 514 -287 -459 183 416 -131 -210 212 322 -330 -647 60 314 -317 -283 251 190 -317 -182 497
8032D97m82n64K23O53p1p78O41P0J1n53J69N71m05n78M43P24n28p64P40K74k75
$$ 497 15 -549 -326 327 256 -522 119 189 200 -353 -184 387 -18 -596 -153 571 43 -721 19 293 18
8053A8l29L73K65k42m52L33M00m69N1K39N7m28l62Q73J21j101N06M81k57l01j60
$$ 18 -311 62 327 85 -367 -34 366 -103 -52 187 244 -184 -546 327 448 -653 -147 334 77 -224 -384
8074c84N64J42o82J98M53j5n70l0O34j28n40K18O47m59k93K12L05l50m13L91K88
$$ -384 180 322 -360 -162 291 276 -294 -324 310 182 -358 -140 507 48 -245 -33 272 -78 -491 -100 188
8095A88j8o39N70M14l30o37M81K04n25q6N32K18n19j10K76L01n61q3N33K69n46
$$ 188 170 -469 101 515 185 -452 29 233 -292 -378 154 372 -147 -257 19 320 -241 -324 209 478 -68
8116f8j93N62J94j019K44M08J26o40k8O59j95l46J18O51j87n34mN27l55k73L09
$$ -68 -261 301 495 -524 -280 128 254 -386 -414 245 50 -296 -178 473 286 -248 -252 275 -80 -353 -44
8137d4K57k50l05N64N0k11m95K46P59m31o89M62L43m54j86M83K69n33k58N35J43
$$ -44 213 -37 -342 222 272 61 -434 -188 571 140 -549 -87 256 -198 -384 99 368 -165 -423 112 255
8158B55n91J74M74K72r77K76M13j28l88N2M80j17m34QN45J14p41Q2M67k9m77K95
$$ 255 -336 -162 312 584 -393 -117 296 168 -220 -168 312 195 -239 -231 314 428 -313 -231 236 207 -270 25
8180B5J28rl93N26p5O0p36K80P01l86n53
$$ 25 153 144 -249 277 202 262 -474 -194 507 121 -432
8191d32
$$ Imaginary data points
##PAGE= N=2
##DATA TABLE= (X++(I..I)), XYDATA
0@%%%%%%%%%%%%%%Qj6J6j6J6k1K9l2L7m5M8n6P2q0Q8j04J20j36J52j73J97k21
$$ 0 0 0 0 0 0 0 0 0 0 0 0 0 0 0 8 -8 8 -8 8 -13 16 -16 21 -24 24 -32 40 -40 48 -56 64 -72 80 -93 104 -117
36a17K49k79L12l47L86m29M75n28N82o40P11p85Q63r52J049j155J273j404J552
$$ -117 132 -147 165 -182 204 -225 250 -278 304 -336 375 -410 453 -499 550 -605 668 -736 816
55H16j720J909k126K380k682L044l487M047m781N786p250R592j3913K4380r3452
$$ 816 -904 1005 -1121 1259 -1423 1621 -1866 2181 -2600 3186 -4064 5528 -8385 15995 -77457
70g7457q5474K98920K6571l07256l0952L43164J5933l48876j7158L63460O128
$$ -77457 -162931 135989 162560 -144696 -175648 167516 183449 -165427 -182585 180875 187003
81A87003l60432m028L60193r679l50269J7112L41330l5410l28032M8003L14473
$$ 187003 -173429 -177457 182736 173057 -177212 -160100 181230 145820 -182212 -134209 180264
92A80264o7724k99793Q3560K85929j03113k70048J20779K57122j38668k41136
$$ 180264 112540 -187253 -103693 182236 79123 -190925 -70146 186976 48308 -192828
102a92828J57041K28863j72806k13186J88986K01235k02815j85605K16115J71587
$$ -192828 -35787 193076 20270 -192916 -3930 197305 -5510 -191115 25000 196587
112A96587k27580j56328K37455J39563k46393j24544K52104J07172k59020r1434
$$ 196587 -30993 -187321 50134 189697 -56696 -181240 70864 178036 -80984 -172418
122a72418K61762P2960k65128n6541K65825L8413k66280k0360K64719L008k60894
$$ -172418 89344 162304 -102824 -159365 106460 144873 -121407 -141767 122952 125960 -134934
133a34934J4919K58175l0396k52129M8092K47113o2645k39593P8784K32517r2920
$$ -134934 -120015 138160 107764 -144365 -96273 150840 88195 -151398 -72614 159903 66983
144F6983k23484J06437K14611j20542k04940J32186J93320j44824j83640J54590
$$ 66983 -156501 -50064 164547 44005 -160935 -28749 164571 19747 -163893 -9303
154i303J71141j65618j60161J74258J46942j83437j34026J90989J21148j97315
$$ -9303 161838 -3780 -163941 10317 157259 -26178 -160204 30785 151933 -45382
164d5382j07118K03857R4109k08440p8617K13669O5551k16074m9897K18829L6080
$$ -45382 -152500 51357 145466 -62974 -141591 72078 137629 -78445 -128342 90487 126567
175A26567k19943k0876K19915O347k19369P654K16691k2475k14909L5574K09791
$$ 126567 -93376 -114252 105663 112010 -107359 -99705 116986 94511 -120398 -84824 124967
186A24967n0276k05572O2396J99181p5568j93102Q7246J85366r8653j76871J09940
$$ 124967 74691 -130881 -68485 130696 55128 -137974 -50728 134638 35985 -140886 -30946
197c0946J69189j19668j58819J30088J49783j37945j38424J46647J28845j53787
$$ -30946 138243 18575 -140244 -10156 139627 1682 -136742 9905 138750 -15037
207a5037j16853J60534J05866j66927r4193J71322Q2395j77383p0852J80568N7548
$$ -15037 -131890 28644 134510 -32417 -126610 44712 127107 -50276 -121128 59440 116988
218A16988j84637m5921J86238L2574j88292k0643J88965P750j88895N151J88386
$$ 116988 -67649 -113570 72668 105242 -83050 -103693 85272 93022 -95873 -90722 97664
229I7664j6970j86020L0010J83945m1154j79757N3828J76286o4465j70469P6114
$$ 97664 80694 -105326 -75316 108629 67475 -112282 -58454 117832 53367 -117102 -40988
240d0988J64839q6277j58629R6322J50681j06149j42952J13741J34052j23233
$$ -40988 123851 37574 -121055 -24733 125948 19799 -123153 -9412 124640 1407
250A407j25522J29572J15481j36885j06462J42493R6116j48258q5507J53115P5073
$$ 1407 -124115 5457 120938 -15947 -122409 20084 116200 -32058 -117565 35550 110623
261A10623j56663o4052J60862N3782j62902m1615J65551L1494j66614j9506J68075
$$ 110623 -46040 -110092 50770 104552 -58350 -99965 65586 97080 -69534 -89040 79035
272G9035Q731j68251K742J67412j3781j67055K4741J64142l6088j62435M6173
$$ 79035 87766 -80485 -77743 89669 75888 -91167 -66426 97716 61628 -100807 -54634
283e4634J58076n7777j54501O7301J48994p7130j43832Q6988J37644r5770j30085
$$ -54634 103442 45665 -108836 -41535 107459 30329 -113503 -26515 111129 15359 -114726
294a14726J04055J23421j11414j14515J19370J06889j24943r7279J31189Q8486
$$ -114726 -10671 112750 1336 -113179 6191 113080 -11863 -109142 22047 110533
304A10533j35993p8667J40250O9146j44351n9292J46528M8805j49807l9226J50677
$$ 110533 -25460 -104127 36123 105269 -39082 -98374 48154 96959 -52848 -92074 58603
315E8603K8633j52433j9367J52300Q831j52816J153J52364j1266j50933K1481
$$ 58603 87236 -65197 -84564 67736 76567 -76249 -75096 77268 66002 -84931 -63450
326f3450J49623l1056j46095M0632J44138m9445j39775N9509J36262o8070j31193
$$ -63450 86173 55117 -90978 -50346 93792 44347 -95428 -35919 100343 32273 -98920
337i8920P7032J26158q5395j20313R2645J13173j00500j06843J06903R8752j13509
$$ -98920 -21888 104270 18875 -101438 -8793 104380 3880 -102963 3940 102692 -10817
348a0817r1614J18244Q2935j24102p4726J28241O5797j32191n6179J35074M7716
$$ -10817 -102431 15813 98748 -25354 -100080 28161 93958 -38233 -94412 40662 88378
359H8378j37037l7738J39274K8951j39720j8702J40771R631j39734j33J39326
$$ 88378 -48659 -86397 52877 81828 -57892 -76594 64177 73808 -65926 -66059 73267
370G3267r134j37851J7871J35976k7263j33680L5326J30422m4616j27921N2362
$$ 73267 64133 -73718 -55847 80129 52866 -80814 -45488 84934 40318 -87603 -35241
381c5241J23182o0584j19526O8026J14584p5727j09338Q2818J04017q9521r7427
$$ -35241 87941 27357 -92169 -24143 90441 14714 -94624 -11806 92211 2690 -94737
392i4737R6306R1487j01337q3978J07481P7185j11994o9143J16933O1228j19957
$$ -94737 1569 93056 -8281 -92259 15222 92407 -19587 -88730 28203 89431 -30526
403c0526n3141J22873M4917j26018l6567J27244K7408j29160j9266J29018J0096
$$ -30526 -83667 39206 84123 -41895 -78462 48782 76190 -52970 -72236 56782 66878
414F6878j29696k081J28956o850j27989J5109J26289k2951j23708L1380J21104
$$ 66878 -62818 -64899 64057 57207 -70782 -55673 70616 47665 -76043 -44663 76441
425G6441l8361j17519M6677J14406n3525j09945O1225J05962o7637j01072P4699
$$ 76441 38080 -79439 -32762 81644 28119 -81826 -20601 85361 17724 -83348 -8649
436h649R5342q0598r0323Q6046Q4014r2053p8546R6766P1400j01974o5113J05830
$$ -8649 86693 6095 -84228 1818 85832 -6221 -84767 11999 83399 -18575 -83688 22142
448B2142N7634j10022n0247J13071M2783j16103l4347J17935K7157j19119j8369
$$ 22142 79776 -30246 -80493 32578 75361 -40742 -75089 42846 70003 -49116 -67485
459f7485J20542J1098j20403k558J20618n197j19146J2672J18601k0712j16406
$$ -67485 53057 64155 -56248 -58806 61812 56615 -62531 -49859 68742 48030 -68376
470f8376K7639J14043l5758j11048M1964J07101m9132j04157N5186R9779o2136
$$ -68376 -40737 73306 37548 -73500 -31536 75565 26433 -77724 -22538 77241 15105
481A5105r5422O7623R0464p3033q5067P8272Q0310q3505p4005Q8608O8522r2376
$$ 15105 -80317 -12694 77770 4737 -80330 -2058 78252 -5253 -79258 9350 77872 -14504
493a4504o1345R6755N5539j00158m8204J03423M1388j05919l4809J08350K7093
$$ -14504 -75849 20906 76445 -23713 -71917 31506 72894 -33025 -67834 40516 67609
504F7609j10502j9940J11033J2101j12422m849J11732l242j11729J0050J11112
$$ 67609 -42893 -62833 48200 60301 -52121 -56970 54762 51520 -60209 -50159 60953
515F0953j7909j09253K5000J07304l1705j04870L9217J02267m5085r8182N1910
$$ 60953 43044 -66209 -41209 66095 34390 -70480 -31263 71004 25919 -72263 -20353
526b0353R4838n7730r0066O3384Q6013o8761q0832P3551P5378p7980p0480Q1968
$$ -20353 74485 16755 -73311 -9927 76086 7325 -73507 44 75422 -2558 -73038 8930
538H930O4289q6293n8853Q9191N2298r3059m6195R5438L9733r7773l3741J00032
$$ 8930 73219 -13074 -71927 17264 69562 -23497 -69692 25746 65479 -32294 -66035 33997
$$ [...]
8191A49
##END NTUPLES=NMR FID
##END=
