##TITLE=1H_ART-deoxy-2(Zn)
 CDCl3
 8 sc, 
 27.6.2024
##JCAMPDX= 6.0         $$ Bruker NMR JCAMP-DX V2.0
##DATA TYPE= NMR FID
##DATA CLASS= NTUPLES
##ORIGIN= UXNMR, Bruker Analytische Messtechnik GmbH
##OWNER= root
$$ XWIN-NMR		Version 3.5
$$ Thu Jun 27 13:57:28 2024 Russian Standard Time (UT+4h)  she@DPX200
##.OBSERVE FREQUENCY= 200.1313
##.OBSERVE NUCLEUS= ^1H
##.DELAY= (6, 6)
##.ACQUISITION MODE= SIMULTANEOUS
##.ACQUISITION SCHEME= undefined
##.AVERAGES= 8
##.DIGITISER RES= 18
##SPECTROMETER/DATA SYSTEM= spect
##.PULSE SEQUENCE= zg30
##.SOLVENT NAME= CDCl3
##.SHIFT REFERENCE= (INTERNAL, CDCl3, 0, 15.7039)
##AUDIT TRAIL= $$ (NUMBER, WHEN, WHO, WHERE, WHAT)
$$ ##TITLE= Audit trail, XWIN-NMR		Version 3.5
$$ ##JCAMPDX= 5.01
$$ ##ORIGIN= Bruker BioSpin GmbH
$$ ##OWNER= she
$$ F:/spectra/data/she/nmr/H-F/1/audita.txt
$$ ##AUDIT TRAIL=  $$ (NUMBER, WHEN, WHO, WHERE, WHAT)
(   1,<2024-06-27 13:56:10.84 +0400>,<she>,<DPX200>,
      <created by zg, POWCHK disabled, PULCHK disabled
       configuration hash MD5:
       00 E9 B6 7A A2 85 ED C7 34 08 36 98 17 FE 4E 26
       data hash MD5: 16K
       95 EA B9 33 B6 A7 E4 0F 76 D6 40 2C FD BA 00 AA>)
$$ ##END=
$$ 
$$ hash MD5
$$ 4D 7F AA 86 53 DE 81 CD C1 B6 89 77 5A AE 17 A4
##$RELAX= 
##$RELAX= 
##$RELAX= 
##$RELAX= 
##$RELAX= 
##$RELAX= 
$$ Bruker specific parameters
$$ --------------------------
##$DU= <F:/spectra>
##$EXPNO= 1
##$NAME= <H-F>
##$PROCNO= 1
##$TYPE= <nmr>
##$USER= <she>
##$AMP= (0..31)
100 100 100 100 100 100 100 100 100 100 100 100 100 100 100 100 100 100 
100 100 100 100 100 100 100 100 100 100 100 100 100 100 
##$AQSEQ= 0
##$AQ_mod= 1
##$AUNM= <au_zg>
##$AUTOPOS= <>
##$BF1= 200.13
##$BF2= 200.13
##$BF3= 200.13
##$BF4= 200.13
##$BF5= 200.13
##$BF6= 200.13
##$BF7= 200.13
##$BF8= 200.13
##$BYTORDA= 1
##$CFDGTYP= 0
##$CFRGTYP= 5
##$CHEMSTR= <none>
##$CNST= (0..31)
1 1 145 1 1 1 1 1 1 1 1 1 1 1 1 1 1 1 1 1 1 1 1 1 1 1 1 1 1 1 1 1 
##$CPDPRG= <>
##$CPDPRG1= <>
##$CPDPRG2= <>
##$CPDPRG3= <>
##$CPDPRG4= <mlev>
##$CPDPRG5= <mlev>
##$CPDPRG6= <mlev>
##$CPDPRG7= <mlev>
##$CPDPRG8= <mlev>
##$CPDPRGB= <>
##$CPDPRGT= <>
##$D= (0..31)
0 1.2 0 0 0 0 0 0 0 0.06 0 0.03 0 0 0 0 0.0002 0 0 0 0 0 0 0 0 0 0 0 0 
0 0 0 
##$DATE= 1719482170
##$DBL= (0..7)
120 120 120 120 120 120 120 120 
##$DBP= (0..7)
150 150 150 150 150 150 150 150 
##$DBP07= 0
##$DBPNAM0= <>
##$DBPNAM1= <>
##$DBPNAM2= <>
##$DBPNAM3= <>
##$DBPNAM4= <>
##$DBPNAM5= <>
##$DBPNAM6= <>
##$DBPNAM7= <>
##$DBPOAL= (0..7)
0.5 0.5 0.5 0.5 0.5 0.5 0.5 0.5 
##$DBPOFFS= (0..7)
0 0 0 0 0 0 0 0 
##$DE= 6
##$DECBNUC= <off>
##$DECIM= 32
##$DECNUC= <off>
##$DECSTAT= 4
##$DIGMOD= 1
##$DIGTYP= 9
##$DL= (0..7)
0 120 120 120 120 120 120 120 
##$DP= (0..7)
150 150 150 150 150 150 150 150 
##$DP07= 0
##$DPNAME0= <>
##$DPNAME1= <>
##$DPNAME2= <>
##$DPNAME3= <>
##$DPNAME4= <>
##$DPNAME5= <>
##$DPNAME6= <>
##$DPNAME7= <>
##$DPOAL= (0..7)
0.5 0.5 0.5 0.5 0.5 0.5 0.5 0.5 
##$DPOFFS= (0..7)
0 0 0 0 0 0 0 0 
##$DQDMODE= 0
##$DR= 18
##$DS= 0
##$DSLIST= <SSSSSSSSSSSSSSS>
$$ [...]
##$SUBNAM2= <"">
##$SUBNAM3= <"">
##$SUBNAM4= <"">
##$SUBNAM5= <"">
##$SUBNAM6= <"">
##$SUBNAM7= <"">
##$SUBNAM8= <"">
##$SUBNAM9= <"">
##$SW= 18.0517328524113
##$SWIBOX= (0..15)
0 0 2 0 0 0 0 0 0 0 0 0 0 0 0 0 
##$SW_h= 3612.71676300578
##$TD= 16384
##$TD0= 1
##$TE= 0
##$TE2= 300
##$TE3= 300
##$TEG= 300
##$TL= (0..7)
0 120 120 120 120 120 120 120 
##$TP= (0..7)
150 150 150 150 150 150 150 150 
##$TP07= 0
##$TPNAME0= <>
##$TPNAME1= <>
##$TPNAME2= <>
##$TPNAME3= <>
##$TPNAME4= <>
##$TPNAME5= <>
##$TPNAME6= <>
##$TPNAME7= <>
##$TPOAL= (0..7)
0.5 0.5 0.5 0.5 0.5 0.5 0.5 0.5 
##$TPOFFS= (0..7)
0 0 0 0 0 0 0 0 
##$TUNHIN= 0
##$TUNHOUT= 0
##$TUNXOUT= 0
##$USERA1= <user>
##$USERA2= <user>
##$USERA3= <user>
##$USERA4= <user>
##$USERA5= <user>
##$V9= 5
##$VALIST= <valist>
##$VCLIST= <CCCCCCCCCCCCCCC>
##$VD= 0
##$VDLIST= <DDDDDDDDDDDDDDD>
##$VPLIST= <PPPPPPPPPPPPPPP>
##$VTLIST= <TTTTTTTTTTTTTTT>
##$WBST= 1024
##$WBSW= 4
##$XGAIN= (0..3)
0 0 0 0 
##$XL= 0
##$YL= 0
##$YMAX_a= 214864
##$YMIN_a= -249723
##$ZGOPTNS= <>
##$ZL1= 120
##$ZL2= 120
##$ZL3= 120
##$ZL4= 120
##$ABSF1= 10
##$ABSF2= 0
##$ABSG= 5
##$ABSL= 3
##$ALPHA= 0
##$AQORDER= 0
##$ASSFAC= 0
##$ASSFACI= 0
##$ASSFACX= 0
##$ASSWID= 0
##$AUNMP= <proc_1d>
##$AZFE= 0.1
##$AZFW= 0.1
##$BCFW= 1
##$BC_mod= 2
##$BYTORDP= 1
##$COROFFS= 0
##$CY= 11.3945322036743
##$DATMOD= 1
##$DC= 2
##$DFILT= <>
##$DTYPP= 0
##$F1P= 15.6554695791079
##$F2P= 12.8336369535428
##$FCOR= 0.5
##$FTSIZE= 0
##$FT_mod= 4
##$GAMMA= 1
##$GB= 0.15
##$INTBC= 1
##$INTSCL= 1
##$ISEN= 128
##$LB= 0.24
##$LEV0= 0
##$LPBIN= 0
##$MAXI= 10000
##$MC2= 0
##$MEAN= 0
##$ME_mod= 0
##$MI= 1.114404
##$NCOEF= 0
##$NC_proc= 0
##$NLEV= 6
##$NOISF1= 3.799351
##$NOISF2= 2.8
##$NSP= 1
##$NTH_PI= 0
##$NZP= 0
##$OFFSET= 15.70392
##$PC= 1
##$PHC0= -25319.29
##$PHC1= 12.58748
##$PH_mod= 1
##$PKNL= yes
##$PPARMOD= 0
##$PSCAL= 0
##$PSIGN= 0
##$REVERSE= no
##$SF= 200.130013532006
##$SI= 16384
##$SIGF1= 3
##$SIGF2= 2
##$SINO= 400
##$SIOLD= 16384
##$SREGLST= <1H.CDCl3>
##$SSB= 0
##$STSI= 0
##$STSR= 0
##$SW_p= 3612.71676300578
##$SYMM= 0
##$S_DEV= 0
##$TDeff= 0
##$TDoff= 0
##$TI= <>
##$TILT= no
##$TM1= 0
##$TM2= 0
##$TOPLEV= 0
##$USERP1= <user>
##$USERP2= <user>
##$USERP3= <user>
##$USERP4= <user>
##$USERP5= <user>
##$WDW= 1
##$XDIM= 8192
##$YMAX_p= 0
##$YMIN_p= 0
$$ End of Bruker specific parameters
$$ ---------------------------------
##NTUPLES= NMR FID
##VAR_NAME=  TIME,          FID/REAL,        FID/IMAG
##SYMBOL=    X,             R,               I
##VAR_TYPE=  INDEPENDENT,   DEPENDENT,       DEPENDENT
##VAR_FORM=  AFFN,          ASDF,            ASDF
##VAR_DIM=   8192,          8192,            8192
##UNITS=     SECONDS,       ARBITRARY UNITS, ARBITRARY UNITS
##FACTOR=    0.0002768,     1,               1
##FIRST=     0,             0,               0
##LAST=      2.2672688,     0,               0
##MIN=       0,             -249723,         0
##MAX=       2.2672688,     214864,          0
$$ Real data points
##PAGE= N=1
##DATA TABLE= (X++(R..R)), XYDATA
0 0 0 0 0 0 0 0 0 0 0 0 0 0 0 0 3 -8 8 -8 8 -8 15 -16 16 -21 24 -28 32 -38 42 -48 55 -63 70 -79 90 -101 114
37 114 -126 139 -155 174 -191 213 -234 259 -286 315 -346 382 -421 464 -511 564 -625 690 -766
56 -766 854 -958 1079 -1225 1403 -1628 1924 -2323 2894 -3777 5292 -8373 16935 -86141 -249723
71 -249723 133721 156304 -185924 -76099 176197 -26136 -149381 68632 93630 -70663
81 -70663 -25404 45592 -8231 11559 41384 -34444 -17547 58101 -3974 -45719 39555 24798
93 24798 -62668 -12862 51955 -10172 -43477 1249 5286 -8958 7036 -284 -16371 1975 13184
106 13184 2965 4381 8952 3981 -4264 -1332 24739 24446 -32769 -28979 48208 20515 -62263 -1076
120 -1076 55458 -46944 -56017 70484 22714 -94801 3330 79064 -41347 -44966 72192 7520
132 7520 -73055 40149 69506 -51536 -26470 64070 -3558 -46302 36178 27260 -49741 -14332
144 -14332 33135 -7996 -24650 61 -5301 -6936 3925 -6206 -804 12232 -11178 -7893 33819
157 33819 13170 -28075 9633 34963 -11415 -12652 26767 1205 -28635 6575 17980 -17722
169 -17722 -19305 2511 -1951 -10113 -4551 -454 -1314 -6813 -2694 17108 10242 -14497 6135 28323
183 28323 -4398 -9121 29974 5413 -32574 13956 30502 -32288 -25134 30403 -8149 -43926
195 -43926 14050 21651 -37447 -16777 32123 395 -21581 13279 17272 -3302 4537 11299 8066
208 8066 10146 -4436 -6353 21742 5130 -33515 776 26979 -29818 -33444 31279 2359 -52771
221 -52771 7794 41218 -30948 -26772 45794 13843 -36956 19546 43912 -17475 -16714 35419 14160
234 14160 -25422 -1674 18136 -7309 -21812 -4694 6974 -9891 -24751 -3714 15806 -10820
246 -10820 -22490 16125 20505 -17393 -2750 33365 6895 -16361 16985 23579 -10738 -6491 14846
259 14846 -500 -14698 -3661 -1081 -9144 -11896 -9706 -1192 -1355 -14329 -3057 16296 -3178
272 -3178 -13249 22669 21085 -18132 5074 38679 -5255 -23780 28438 18886 -36033 -6313 29953
285 29953 -19355 -35898 15652 7221 -34895 -8229 20260 -10168 -17100 14568 12416 -5499 4282
298 4282 15570 9728 2618 3596 9412 8731 -6339 -6282 9547 -3122 -22552 -2471 8344 -20848
312 -20848 -19038 12949 -697 -23391 4821 19218 -8243 -5905 21323 11424 -5420 8538 15939
325 15939 2423 -1917 3403 3809 -1508 -9673 -7512 2100 -7715 -19237 -1743 6462 -16295 -11807
339 -11807 16181 2587 -16071 12640 22130 -8116 -1106 26398 5843 -13081 13402 15099 -14631
352 -14631 -7433 12365 -6569 -20355 -611 3356 -14926 -13099 4012 2744 -9906 -4544 12509
365 12509 9129 -8068 2708 23822 5609 -13788 13144 23641 -13628 -15021 21676 4289
377 4289 -30549 -2963 19097 -18007 -25572 11933 6672 -22324 -4346 16711 -1698 -8651 10296
390 10296 12132 1140 2322 7921 7882 3522 -2363 1081 6966 -5089 -12978 3172 4040 -18605 -10557
405 -10557 12072 -5786 -21503 8119 15989 -16138 -8351 26386 7232 -19465 11610 28004
417 28004 -10081 -13991 23634 11621 -24683 -3689 21919 -9610 -26290 8105 11481 -22369
429 -22369 -13096 16477 35 -19944 5146 17387 -6174 -6773 15328 9359 -6318 3705 12244
442 12244 -80 -4973 3192 2528 -3735 -4933 -3492 -1193 -3173 -7718 -3786 3663 -3341 -8916 5035
457 5035 9229 -7175 -2769 15841 4408 -10603 8481 16442 -8549 -8354 16482 3370 -18610
470 -18610 1990 13899 -13484 -15543 12694 2946 -20830 -110 16243 -9467 -13263 15705 9319
483 9319 -14962 2122 19168 -3447 -10356 13335 10044 -12480 -2285 12672 -3250 -12050 3680
496 3680 4152 -9466 -5581 4015 -1150 -5865 -860 2141 810 -790 -357 3425 5350 -1656 -1377 8542
512 8542 3744 -7846 1819 11460 -5901 -11142 9453 6459 -16114 -4750 14970 -5606 -18531
525 -18531 9513 13396 -16823 -8685 20066 2276 -19071 8604 19677 -12419 -10896 20614 7586
538 7586 -19309 2277 17712 -8995 -12982 12166 4782 -16572 -2210 10910 -5897 -9183 4722
551 4722 2063 -5829 1120 4017 -1064 307 1432 282 5028 3346 -4535 1887 8822 -4181 -6343
566 -6343 9251 1736 -14524 1519 12934 -11197 -13788 12702 4191 -18405 1627 17017 -9748
579 -9748 -14301 16812 11457 -16841 -1264 20220 -1797 -14245 11626 12875 -14367 -7841 16056
592 16056 2052 -17379 57 10614 -8867 -11236 8396 3640 -12968 -1830 11342 -527
604 -527 -5891 5243 5092 -2038 2796 6061 717 35 1058 -507 2538 1268 -7525 -3035 5316 -5283
620 -5283 -9633 5665 1872 -14698 120 15409 -6680 -12345 15057 9948 -14459 3872 20424
633 20424 -6913 -12391 16859 9172 -17144 -1467 13679 -8521 -12843 8672 2132 -15668 -2377
646 -2377 9349 -4939 -7751 6377 4197 -5386 2637 9952 1265 -3718 5358 7889 -1008 -2468
660 -2468 3845 1162 -5906 -2486 2624 -3636 -8564 -1983 1368 -2725 -3943 -604 1431 919 123 2235
676 2235 6535 2530 -2763 5304 10104 -2434 -5775 8256 3384 -11980 -619 9409 -10615 -13730
690 -13730 9329 2149 -17705 -48 13083 -9505 -9660 16108 6109 -13485 5674 17838 -4677
703 -4677 -6653 13308 5051 -10381 1016 8267 -5678 -9072 958 245 -6580 -4989 -705 -916
717 -916 -2876 -2761 2744 4242 -1803 -334 9114 5460 -3435 3639 9614 -1894 -4769 6300 3451
732 3451 -9489 -4423 5124 -3211 -11309 -1501 4540 -5854 -8259 4701 6445 -5905 -3072 11841
746 11841 5943 -7299 3769 14144 -1848 -7613 9333 6758 -11681 -3797 9146 -5336 -12731
759 -12731 3034 3571 -11243 -4777 6735 -1613 -6662 3700 6670 -1072 300 6421 5307 312
773 312 504 4293 3916 -2791 -3878 3522 379 -9342 -3411 4371 -5723 -9794 2919 3493 -8368
788 -8368 -2030 9054 400 -4810 5921 8451 -1647 226 7465 2935 -3135 592 3346 -1382
802 -1382 -5086 -1845 594 -4152 -6814 -493 1421 -5515 -3230 5212 944 -4473 4441 7763 -2190
817 -2190 -355 9196 3016 -5086 3712 6230 -4949 -4674 4373 -699 -8652 -1914 2806 -4470 -6808
832 -6808 989 3261 -3682 -3338 4988 4903 -2730 -155 8461 3485 -4636 2697 7935 -2445 -5481 4523
848 4523 2364 -7969 -3007 3896 -4130 -7202 1332 1853 -4917 -1600 3890 1106 -1818 2035 4936
863 4936 2002 -876 2265 5714 435 -4339 2579 4925 -5969 -6553 5505 950 -11232 -1554 7726
878 7726 -5255 -9513 6230 5958 -7915 -1593 10151 700 -5575 5447 7537 -3850 -1921 6557
892 6557 1135 -5122 291 3211 -3787 -4983 1580 1017 -5694 -3250 3878 120 -4742 660 5291
907 5291 -1140 -2856 4777 4995 -2540 -1726 5000 3216 -3626 -1712 3410 287 -4964 -1539 3256 -1774
923 -1774 -6548 343 4992 -3648 -5451 4786 3783 -6186 605 8894 -1898 -6316 7053 5549
937 5549 -7464 -905 8632 -3139 -8176 5847 4698 -9386 -3249 7317 -1716 -7154 3018 3948
951 3948 -4915 -2177 5286 1099 -3120 541 2725 804 212 -17 761 858 -908 -589 1874 20 -3610
968 -3610 -53 2799 -2124 -3153 2023 824 -4103 705 4425 -2542 -4660 4208 4277 -4309 -1360 6290
984 6290 -447 -6079 4211 6752 -5492 -5142 6461 2350 -7394 44 6185 -4263 -5975 5884
998 5884 3073 -7689 -1586 6317 -1792 -4512 4720 2316 -5117 677 6024 -1271 -3473 2787 1984
1013 1984 -2002 770 2266 -1878 -2173 900 551 -183 -1334 -2963 -204 2284 -1289 -2734 2572 1410
1029 1410 -3965 1325 6810 -2471 -5366 5542 5166 -5637 -724 7110 -2554 -7263 5656 5439 -8628
1044 -8628 -4123 7485 -683 -7934 3320 5340 -7239 -3304 9020 1549 -7481 2241 7025 -2685
1058 -2685 -2422 6304 1937 -5790 689 5282 -1774 -4153 569 647 -2954 -1058 565 -1100 -1870 -703
1074 -703 865 1926 -260 -1881 1927 4449 -822 -1146 4654 1461 -4284 1520 5992 -3726 -6558
1089 -6558 3587 2976 -7016 -2253 5359 -3492 -7328 5023 5080 -6883 -2390 8061 637 -4998 5098
1104 5098 6028 -5309 -1533 7846 535 -6284 1633 3619 -4772 -2999 3545 -1569 -6329 352 2422
1119 2422 -2426 -1648 1990 624 -296 1945 1878 969 1359 499 1053 2707 648 -2506 907 1869 -3260
1136 -3260 -2601 2165 -1671 -5441 867 3012 -4216 -3343 4416 1448 -3654 2597 5693 -1932 -1946 6262
1152 6262 3259 -4211 603 4937 -2590 -4150 3298 837 -6935 -2197 3657 -2864 -5475 1821 2491
1167 2491 -4424 -874 5190 562 -2991 3127 4819 -889 -349 3707 1243 -2042 128 1086 -1198
1182 -1198 -2370 -2073 -652 -519 -2767 -2679 830 507 -3323 404 4429 -367 -2345 4689 4721 -2848 209
1199 209 6231 -42 -4404 2726 3068 -5592 -2799 4084 -2161 -6707 958 2772 -4550 -2945 4593
1214 4593 999 -3943 1733 5633 -526 -1695 4320 3662 -2510 -409 3909 275 -3884 -298 1943
1229 1943 -2825 -4052 141 440 -3045 -2200 1543 710 -1878 153 2550 1726 -516 1375 3519 1005
1245 1005 -1442 1753 3049 -2125 -2770 2535 286 -5169 -1630 3139 -3034 -5110 2502 2492 -4508 -822
1261 -822 5310 272 -3550 3528 4842 -1907 -581 4783 1344 -2947 524 2666 -2070 -3083 346
1276 346 321 -3091 -2544 852 -32 -2530 -716 2546 394 -1487 2054 3591 -886 -620 3328 1831
1292 1831 -2371 654 2902 -1263 -2653 974 845 -3127 -1914 992 -743 -2582 -289 1475 -270
1307 -270 -1483 1209 2649 167 -735 2713 2590 -1433 -309 3143 -35 -3095 1107 2004 -2883 -2406
1323 -2406 1822 -511 -3831 -190 2010 -1717 -1721 2364 1453 -1100 474 2882 729 -964 974 2247
1339 2247 -147 -2062 812 1412 -2029 -1984 1788 -216 -3925 105 2462 -2622 -2732 2968 1387 -3224
1355 -3224 418 3824 -459 -1990 3245 2362 -2544 -341 2785 -432 -2489 370 965 -1478 -1777 300
1371 300 488 -1156 -1747 951 1189 -1239 -1051 2923 1507 -2359 424 3811 -859 -2739 2505 2603 -3114
1388 -3114 -1249 3354 -153 -4103 691 2803 -2444 -2788 2251 1606 -3265 -646 3470 -530 -2934
1403 -2934 1519 3447 -2075 -1984 3235 1246 -3095 211 3209 -1449 -2646 2073 1578 -2478 -814 2250
1419 2250 -672 -2445 918 1440 -958 -854 724 510 -470 -366 273 1341 -131 -1368 1530 1841 -1908
1436 -1908 -1320 3029 488 -3420 886 3236 -2519 -2438 3809 1035 -4573 608 3693 -2267 -2831 3430
1452 3430 1538 -4040 280 3783 -1412 -2796 2695 1835 -2525 -266 3076 -611 -2443 1336 2219
1467 2219 -1972 -1458 1449 -21 -1663 -84 1202 -1092 -1236 764 563 -464 -373 198 471 681 225
1484 225 29 967 582 -1024 682 1246 -1543 -1420 1725 105 -2942 286 1385 -2596 -1789 3100 304
1501 304 -3741 1530 3527 -2189 -1461 4599 907 -4128 1735 4132 -2726 -2955 3380 697 -4158 510
1517 510 2881 -2772 -2995 2219 1054 -2526 -243 1865 -569 -617 1752 953 -923 -65 1536 861 -72
1534 -72 -32 -243 83 -426 -711 -237 -20 -1720 -1204 1283 237 -2380 -387 2341 -463 -1559 2329 2098
1552 2098 -2553 217 4685 -80 -3254 1961 3076 -3103 -1808 3568 -895 -4772 1040 3152 -3414
1567 -3414 -2490 3158 181 -3286 1674 3567 -2180 -1124 3790 1441 -1951 872 1974 -991 -648
1582 -648 1691 -84 -2051 -371 -273 -542 -492 -986 -783 23 336 -837 756 1452 -1005 -308 2969 1239
1600 1239 -1802 1002 3014 -974 -1774 2448 360 -4195 -309 2871 -2313 -3838 1449 1120 -3482
1615 -3482 -363 3584 -690 -3043 2693 3328 -1783 -386 3262 391 -1697 1637 2239 -2332 -1624 1524
1631 1524 -407 -2301 -235 107 -1845 -819 939 -218 -932 392 891 637 1247 539 84 1031 716
1648 716 78 787 907 -1400 -939 1127 -304 -2679 -109 979 -2057 -1815 2059 -1 -2721 921
1664 921 3045 -1219 -1347 3025 1385 -2078 1279 3639 -1534 -2213 2209 920 -3302 -568 1918 -1735
1680 -1735 -2385 1445 832 -2674 -746 1856 332 -1050 1150 1361 -67 155 1645 1001 -351 -42
1696 -42 544 268 -712 -992 -676 -272 -1323 -491 223 -710 -1581 202 1203 -738 -618 1931 1288 -1166
1714 -1166 582 2818 97 -1682 1282 1922 -2040 -1499 2169 -205 -3312 162 2005 -2110 -2374 1763
1730 1763 875 -2328 89 2527 -357 -1079 2132 1899 -1398 99 1961 363 -1347 469 784 -983
1746 -983 -1161 18 182 -1471 -1162 133 275 -913 -683 1299 589 -846 137 2116 329 -1179 1039
1763 1039 1583 -1014 -1066 1249 -69 -2123 -87 798 -1706 -1714 881 263 -1600 -91 1714 -266 -1181
1780 -1181 1137 1453 -840 -361 1758 834 -1223 86 1794 -300 -1853 645 845 -1352 -1088 924
1796 924 142 -1679 -425 1099 -492 -1092 653 871 -157 -76 955 491 -351 354 493 -78 -888 124
1814 124 501 -667 -908 862 -14 -1327 197 1094 -614 -1355 1134 728 -1340 -361 1811 133 -1204
1831 -1204 606 1602 -808 -981 585 586 -1156 -779 763 233 -1111 31 1145 -68 -1085 223 1207
1848 1207 -628 -633 1339 662 -1110 205 1293 -485 -1239 1129 1003 -1624 -483 1806 -481 -1705
1864 -1705 726 1473 -1060 -792 1526 326 -1191 113 1231 -35 -687 594 920 -779 -990 737
1880 737 23 -1193 -94 898 -18 -1017 364 650 -401 -589 737 594 -522 42 916 78 -767 -252
1898 -252 1034 -353 -1053 386 721 -866 -1073 1284 523 -1634 -203 1852 -453 -1360 1392 1309 -1950
1915 -1950 -466 1993 -350 -2315 867 1232 -1914 -1019 1577 -276 -1905 550 956 -940 -481 1044
1931 1044 248 -509 378 920 -192 27 -46 330 149 -59 -124 534 -3 -925 -144 635 -806 -873 610 595
1951 595 -1030 -125 1123 -146 -944 729 997 -1067 -239 1674 345 -1919 326 1440 -777 -1466
1967 -1466 1199 207 -2129 -145 1624 -545 -1764 1246 1330 -1214 -39 2264 -223 -1315 1471 1209
1983 1209 -1110 -243 1089 -530 -989 311 225 -1360 -265 363 -588 -152 29 -307 37 908 -225 193
2001 193 1066 595 -392 578 1100 -917 -284 1474 -292 -1596 309 887 -1949 -736 1269 -367 -1654
2018 -1654 485 1603 -1114 -382 2016 218 -1412 1371 1894 -814 -485 1727 452 -1477 486 1203
2034 1203 -1263 -1550 913 21 -1842 -426 1204 -597 -833 888 668 -322 304 762 189 72 307
2051 307 208 60 170 -189 -195 2 -619 -1164 376 371 -1468 -368 1230 -607 -1448 1566 1034 -1714 123
2070 123 2306 -186 -1466 1482 1496 -1619 -328 2087 -608 -2157 731 1144 -1694 -862 1297 -148
2086 -148 -1753 415 1364 -785 -397 1302 533 -601 699 894 -128 -393 400 367 -239 -311 -280 -138 -463
2105 -463 -230 -479 7 -163 -402 133 761 21 -347 784 790 -708 412 1320 -46 -592 1269 790 -1753
2124 -1753 -44 1426 -887 -1882 695 713 -1908 -347 1608 -613 -1712 1156 1218 -1114 17 1656
2140 1656 -156 -866 1212 1048 -1006 -294 974 -367 -1035 -38 -59 -1051 -546 422 -201 -196 376 139 93
2159 93 782 23 351 600 122 -205 692 407 -465 -154 902 -413 -1259 -116 415 -1004 -713 879 21
2178 21 -1555 226 1131 -686 -428 1914 808 -1075 595 1564 -675 -661 1006 658 -1490 -260 946
2195 946 -953 -1382 720 155 -1138 -229 941 -246 -762 464 732 -228 101 696 175 -274 318 332
2213 332 -104 -136 -283 -129 30 -659 -737 111 -71 -766 -54 640 -361 -352 1230 523 -1244 26 1198 -222
2233 -222 -851 827 675 -783 -583 791 -15 -1210 90 629 -467 -659 729 329 -835 96 973
2250 973 -184 -622 553 802 -331 -45 842 396 -215 169 413 -733 -735 204 120 -271 -386 223 -41 -337
2270 -337 56 559 147 -505 399 590 54 -393 357 380 -586 -244 536 -5 -873 -177 532 -530 -688 445
2290 445 444 -579 -176 766 48 -821 408 374 -542 -205 579 259 -642 79 615 -536 -444 133 159 -881
2310 -881 -319 428 -94 -432 122 674 136 -514 239 696 -137 -192 753 183 -585 -138 685 -410 -620 21
2330 21 408 -529 -201 634 -130 -623 217 564 -565 110 314 123 -315 95 394 -17 -452 270 -117 -90
2350 -90 -304 332 228 -482 -121 595 109 -320 258 614 -265 -344 320 569 -500 -430 699 82 -872 -178
2370 -178 406 -223 -523 428 497 -934 -220 624 -168 -899 292 890 -335 -66 814 439 -571 311 734
2389 734 -332 -644 542 -43 -613 -370 299 -199 -394 145 258 102 -285 257 421 80 88 181 679 333
2409 333 -423 308 430 -323 -539 637 -359 -717 282 396 -532 -578 596 36 -823 422 872 -466 -298
2428 -298 1003 519 -792 -130 1034 -232 -639 414 410 -642 -599 725 -182 -1045 -155 236 -424 -422 695
2447 695 15 -426 114 667 181 18 285 486 151 55 1 -65 162 -36 -593 151 -155 -600 -235 148 -97
2468 -97 -105 617 117 -558 355 1030 -73 -264 800 318 -665 390 879 -824 -744 574 90 -1204 5
2487 5 703 -927 -469 416 42 -925 361 1137 -251 -396 913 385 -572 414 639 46 -560 213 7
2506 7 -341 -262 -322 -264 -406 -101 -132 -59 286 -692 183 245 198 58 735 672 -124 -247 526 -153 -905 304 568
2529 568 -559 -713 509 23 -1165 175 386 -733 -430 893 332 -647 505 998 -474 -136 1155
2546 1155 -22 -1122 374 736 -923 -727 705 -400 -788 295 287 -549 -436 373 -27 -362 559 238
2564 238 391 178 393 103 430 328 -212 179 329 -650 -828 149 -149 -539 -295 574 -519 -528 620 233
2584 233 -578 17 1132 141 -567 657 591 -648 -8 854 -196 -666 129 267 -1096 -552 623 -250
2602 -250 -1026 171 786 -279 -245 695 77 -312 791 508 -311 -50 400 -127 -195 93 -97 -569 7 -146
2622 -146 -417 -163 -125 -360 -31 502 8 -394 354 179 -601 41 798 -713 -345 936 250 -757 -71
2641 -71 484 -339 -994 611 14 -702 -192 551 -364 -598 553 532 -186 96 858 16 -648 465 378 -516
2661 -516 36 667 22 -389 16 108 -375 -247 442 -25 -219 74 -2 1 -42 181 291 367 116 -83 110 188
2683 188 -25 -265 189 -397 -725 35 333 -364 -339 550 18 -498 226 439 -249 -440 1061 -2 -623 430
2703 430 774 -244 -124 298 -27 -754 -134 56 -433 -370 340 89 -602 -83 479 81 -160 214 360 -396
2723 -396 -72 110 433 18 -306 159 -34 -101 -105 125 -58 -345 -39 410 -142 -291 29 462 -74 -140 510
2744 510 140 -392 216 593 -176 -516 320 466 -579 -516 216 -161 -683 -102 392 -886 -505 472 11 -209
2764 -209 -18 331 7 -303 268 365 -112 -87 79 -88 -238 -66 78 -563 -463 216 -50 -233 -5 266 431
2785 431 -243 -111 389 272 -375 -98 425 251 -260 148 -11 -440 3 250 -99 -253 153 55 -358 -216
2805 -216 305 322 -299 82 508 -27 -311 -22 169 -130 -136 568 183 -259 71 31 -236 -432 -3 45 -429 -124
2827 -124 327 6 -212 16 203 -79 -379 99 233 -292 -7 24 -1 -193 -161 180 -426 -398 247 -26 -196
2848 -196 -205 131 -328 -168 44 437 -84 -52 549 294 -196 91 245 184 -209 -203 34 -120 -477 -7 56 -438
2870 -438 -494 -34 67 -228 192 237 333 76 264 41 -350 -91 226 161 -480 -301 432 -465 -538 186 -28 -455
2892 -455 -341 342 156 -559 143 288 -291 18 456 161 13 75 141 -78 -58 -52 -348 -223 50 176 4 -220
2914 -220 -40 517 -59 -11 -87 208 115 -64 -45 390 -9 -59 380 331 -299 128 365 -495 -353 -113 -87 -392
2936 -392 -319 -41 194 -672 -44 692 203 -360 663 523 -675 -175 412 0 -552 374 240 -621 -346 432
2956 432 -532 -437 180 447 -385 -115 31 145 -337 217 172 90 268 84 35 -24 559 114 121 139 -477 -466 278
2979 278 -151 -327 -56 282 -382 -313 319 -29 -368 335 336 -119 -74 637 -12 -575 331 591 -322 -427 276
3000 276 -63 -586 236 281 -303 -361 572 96 -238 -110 259 8 287 579 313 -327 -224 548 -148 -140 0
3021 0 -117 -356 -186 -142 -290 106 188 -220 -46 161 -145 -140 304 47 -44 -284 212 77 -23 212 82 -525
3043 -525 156 139 -388 -151 191 105 -511 169 488 -405 -259 836 -24 -633 376 423 -356 -177 774 -52
3063 -52 -302 27 357 -565 -478 9 -23 -630 75 304 -463 -183 103 -17 -64 -30 65 -216 191 162 -37 130
3085 130 168 111 -155 336 -68 -341 -77 -82 -490 23 517 -109 -429 79 208 -304 -75 646 -105 -237 343
3106 343 344 -523 -25 440 -192 -463 39 180 -718 -54 434 85 -128 73 -20 -95 83 286 33 -216 251
3127 251 342 -199 166 147 -18 -351 187 -210 -56 141 -198 -265 205 198 -161 121 47 123 132 525 11 59 245
3150 245 572 -26 -241 403 60 -470 -48 44 -285 -279 36 93 -277 -198 470 -171 -371 305 -7 -343 -9 470
3172 470 -317 -286 127 172 -437 -73 328 -235 -170 121 -73 -276 -311 197 162 -37 190 250 91 155 39 -91
3194 -91 166 -143 -270 -97 -20 -233 -34 43 -13 -102 46 -33 -325 -298 205 68 -581 -52 282 -257 -211 357 200
3217 200 -148 92 -27 -273 -254 361 141 -410 -413 -3 -257 -411 -38 123 -271 -125 289 -118 -259 210 211 -209
3239 -209 195 186 8 -135 80 -114 179 64 -82 -232 95 -253 -68 35 -179 129 -208 289 147 -157 146
3260 146 310 -100 -20 245 -144 -274 160 60 -359 -12 221 -265 -313 -35 140 -205 -374 563 197 -322 118
3281 118 244 59 179 196 198 3 -199 117 -37 -222 -229 -5 -17 60 115 197 63 -171 210 380 204 -97 87
3304 87 157 150 -133 108 358 88 -227 51 -278 -147 -87 25 -378 -153 -27 17 -225 110 229 9 149 442
3326 442 33 103 305 198 -159 101 73 -318 -169 93 42 -19 -281 -117 33 -225 -134 -101 135 -69 246 45
3348 45 265 -70 71 293 -163 -44 364 122 -654 68 323 -209 8 37 -110 16 -144 124 70 -186 352
3369 352 116 51 -135 86 -46 -53 -152 138 396 -24 -91 -1 -86 133 44 30 -180 -310 34 -30 -54 -27 420 60
3393 60 -99 -135 33 -90 -129 376 162 -79 16 424 57 28 -128 -117 -148 -195 43 61 129 257 208 -130 99 289
3417 289 104 -12 -80 194 -1 -367 38 43 -18 -88 -133 -286 -278 27 -126 -42 -162 -361 -33 -116 168 176 66 40
3441 40 -168 -136 224 -139 -70 91 19 -365 51 99 -172 -425 108 454 -176 -120 208 -16 -281 208 -5 210
3463 210 -98 478 234 -413 -46 -73 -196 -61 262 -21 -332 -185 -234 185 -236 -23 67 77 58 -260 -325 419
3485 419 85 -53 58 52 42 -227 -25 21 -178 123 -68 -278 212 73 92 -302 200 -14 -38 -381 184 -1
3507 -1 -238 42 166 -196 -155 331 -355 -211 71 -209 -277 -27 420 -56 -158 277 -121 -175 39 119 305 -127
3529 -127 180 84 178 113 261 -202 -239 289 -305 -248 -101 -38 -192 -87 -6 -10 389 345 29 5 428 39 -22 135
3553 135 100 3 -211 314 -193 -329 351 -9 -175 -182 -143 77 -187 -250 230 -336 -69 228 60 -172 26 369
3575 369 -257 -7 332 -21 -433 -73 105 -148 -133 74 -60 44 -93 95 -309 176 90 -161 74 64 14
3596 14 19 87 108 -157 -75 30 -81 10 138 -142 -230 90 95 -67 -201 252 -327 -306 130 181 -204 -184 120 150 -313
3621 -313 335 -11 -45 -113 17 -157 -121 -145 212 -177 -309 265 -225 -176 -94 458 -423 -107 -64 4 175 519 36
3644 36 24 -3 422 -237 -105 65 40 35 -172 30 -56 22 -100 51 -113 184 119 -234 58 354 191 58 274
3667 274 101 -123 257 124 -131 -15 52 -78 -229 215 0 -101 -118 436 -269 -190 292 -80 1 77 339 -31
3689 -31 -212 283 -104 -300 -274 75 -76 -75 -125 -85 -79 103 -236 -86 142 227 195 -19 244 -22 -92 370 240 -110
3713 -110 -5 -175 31 -13 -45 -146 105 -6 167 -66 -170 348 -116 6 451 205 82 162 76 177 51
3734 51 8 115 -397 92 -172 32 -175 -54 203 37 -520 121 222 -38 141 136 -19 -151 -20 293 56
3755 56 40 -86 84 141 -45 -53 -33 -172 -46 -142 56 -272 -29 -171 -128 -199 208 97 -132 74 156 261 -399
3778 -399 -60 -82 -30 -159 37 53 -243 20 141 139 -27 -64 99 -131 87 328 154 72 189 345 164 -9
3800 -9 169 -15 -55 121 19 267 -174 82 20 25 9 82 2 74 -45 -3 -6 -136 -59 170 -230 -146 50 31 51 -163
3826 -163 -5 12 -20 -14 76 28 24 -110 208 -19 -31 -125 178 -17 -154 157 13 314 33 -61 102 -7 258 450
3850 450 -147 184 -2 -139 -181 -200 -29 -3 -51 212 218 -35 26 115 -42 -158 248 184 -240 -80 328 -121 -30
3873 -30 -2 -126 -43 -152 12 60 95 93 279 -114 161 173 -117 43 -142 227 131 154 104 134 15 -212 18 56
3897 56 -78 -75 158 -64 -214 -144 97 -5 253 146 15 151 -144 1 248 -61 -152 172 158 165 -303 107 199
3920 199 99 128 -128 -34 -160 172 -355 -31 206 34 -148 -145 -138 324 -21 -224 33 -7 38 48 64 -84 218
3943 218 -282 -310 -10 -58 -162 109 94 -35 -65 5 -112 250 79 -72 -74 16 10 -192 -88 -20 -27 71 -167 16 -75
3968 -75 -104 -22 87 -165 -35 114 -275 -247 87 168 -144 -49 137 -182 -83 -41 -81 -138 -93 161 144 18 54 106 -36
3993 -36 -74 110 20 41 -123 -154 -126 -60 139 193 -61 165 -12 275 107 58 96 9 52 -258 71 140 101 8 145
4018 145 138 340 -275 175 -232 -192 137 135 -111 146 -21 0 -261 -76 60 -34 -130 89 -104 -41 -59 29 -107 177
4042 177 63 -101 53 -7 -134 -72 96 16 -69 -79 -234 -67 17 -77 96 -86 474 12 -71 11 -20 -161 41
4065 41 271 249 31 63 28 227 -79 15 -11 153 -151 11 222 333 102 32 -252 -140 57 132 -253 41 164
4088 164 114 106 119 -99 44 27 -27 -162 -226 90 -247 26 323 -73 -370 148 -39 -75 226 -9 -85 160 60
4111 60 -90 -60 7 -14 90 53 101 268 372 -291 -181 -284 -55 118 37 -161 90 331 17 289 -286 169
4133 169 86 199 406 13 152 32 -29 -68 232 32 -148 191 -255 -116 -9 -32 -22 110 40 -152 -61 -26 48
4156 48 -65 -216 -36 167 -122 -139 168 -11 -61 -14 -136 6 108 -116 -145 -22 -65 -61 -204 -65 -215 -170 40
4179 40 -70 81 113 159 -208 -167 62 -70 -186 -264 61 34 -20 -156 87 -108 90 -87 -17 300 79 -106 22
4202 22 33 158 -57 15 70 75 -81 28 50 218 -247 -220 -94 -244 -54 50 -223 122 204 144 81 54 -53 43
4226 43 263 127 50 -197 286 329 -198 -142 -193 53 277 212 177 -141 6 130 176 51 56 -52 -37 440 -201 10
4250 10 -165 10 -413 123 -187 -104 62 -142 59 -84 -109 -131 -169 -142 88 5 163 182 -49 54 -93 29 58
4273 58 112 -337 -340 -27 -250 73 117 106 -34 249 -19 -31 -143 -138 58 151 139 291 -65 136 96 -57 184 33
4297 33 -35 37 -38 169 -46 134 -282 -201 -34 35 -172 86 280 137 -144 86 -127 -69 -114 267 48 44 182
4320 182 -63 -199 -129 -245 93 -57 87 -276 -74 213 329 -198 37 -228 -56 -57 -41 122 26 -32 81 -10
4342 -10 127 239 -134 173 -105 -62 258 -72 45 -36 -44 -49 230 -136 -16 -123 -23 -17 63 336 -63 74 -114
4365 -114 193 -207 60 171 182 -141 79 -140 77 51 -264 -129 216 -17 82 -7 -34 -56 189 -81 -4 85 -86
4388 -86 -105 -160 126 -284 -74 12 276 -139 4 -52 84 73 24 -308 49 -72 36 83 -115 -45 -67 -39 -70 96
4412 96 4 180 84 -150 -200 212 110 -67 22 153 15 109 85 286 123 -166 414 68 -279 91 86 13 146
4435 146 -97 -315 189 -190 -74 -78 232 -18 -117 110 156 -52 195 284 219 12 91 -70 153 77 -155 -8 -2
4458 -2 115 40 28 228 -83 25 40 58 170 56 226 -140 18 -141 38 259 73 72 147 257 -135 37 -55
4481 -55 -216 -205 25 -119 100 32 155 115 81 -38 -188 110 163 -87 34 368 -167 -228 427 119 -99 63
4503 63 168 -176 60 7 73 -49 -18 -52 -63 171 54 7 -59 -133 -74 -405 13 -102 -166 337 62 14 8 -189 198
4528 198 -160 -188 199 178 -34 97 217 -81 162 52 -17 -149 243 38 117 -205 108 -62 31 71 -77 93
4550 93 -234 90 248 -69 5 -18 184 -65 -11 -151 506 130 -76 -296 -108 -160 -38 6 -58 -28 70 21 229
4573 229 243 5 -182 103 213 -85 -5 187 58 -40 108 -151 -81 8 -172 -106 258 60 15 -93 15 -181
4595 -181 -160 -63 28 -3 -71 -30 35 -73 81 10 -18 55 -107 -324 218 43 13 -107 -121 217 162 47 115 118 -158
4620 -158 -232 116 -30 56 5 64 279 144 -210 86 126 125 -336 114 154 -3 -102 -221 -1 -28 65 -80 55 -42
4644 -42 21 -75 -140 -42 39 -72 -70 -245 -173 207 76 100 126 -87 -26 470 249 -45 153 -34 33 58 323 -139 187
4669 187 215 127 60 138 -43 87 183 -34 67 59 -172 23 265 226 -98 -267 -77 62 176 -97 143 37 -67
4692 -67 -61 -123 -70 165 35 -205 -34 -166 39 -120 -24 101 -21 142 -74 -58 67 -157 -387 23 156 235 -83
4715 -83 -162 -7 20 -63 264 125 -115 70 176 164 -318 -90 145 -77 -188 19 300 76 -30 -119 116 31
4737 31 73 107 12 2 0 12 188 86 -12 -243 -186 -383 -186 -53 -28 -46 12 71 -21 -207 129 74 -6 252 -143 74
4763 74 76 -212 -24 -304 -129 -257 8 21 249 -115 -279 63 -116 -79 143 123 -150 83 144 -103 121 221
4785 221 -137 60 -237 -68 -145 98 13 -119 51 -71 -156 -9 41 53 161 113 116 -51 56 -33 53 -217 -356
4808 -356 153 23 24 -82 117 78 -181 -18 66 -336 -38 -175 -82 -107 193 -114 114 292 -73 -190 -17 -135
4830 -135 108 70 -82 -104 23 349 -7 -26 331 -281 -70 170 14 -5 58 150 -241 6 87 -30 219 -9
4852 -9 -78 -136 -173 267 -206 -125 -64 317 -1 263 -69 -54 63 -117 357 -82 -236 -50 -164 -66 56 -45 77
4875 77 -22 78 -2 28 -135 66 -209 313 -53 -145 110 83 -152 -125 265 85 -49 -128 52 25 18 90 -2 137
4899 137 -173 130 -364 63 132 53 -354 -250 37 136 -160 -15 166 -122 164 135 147 152 63 16 29 -102 -201 74
4923 74 -54 130 -56 -122 -21 -11 104 -71 61 -253 165 105 16 -218 71 -149 -54 -35 158 -181 -107 -149 -391
4946 -391 145 161 -89 -90 49 -148 149 53 379 30 66 77 -44 -177 212 -177 -303 -233 225 -128 92 19 67
4969 67 -3 -11 -70 32 -36 306 114 1 -37 127 7 -2 -47 -86 83 44 8 -250 -106 47 -122 -29 110 162 79
4994 79 -202 63 218 159 184 54 -163 -300 40 -59 -136 73 89 160 42 -104 122 -66 65 -78 -153 298 69
5017 69 196 50 1 -194 -137 68 -54 21 130 75 -34 136 46 -76 32 -65 172 -55 155 -60 125 23
5039 23 -15 206 35 119 142 5 -87 -35 28 48 -101 -353 230 57 217 23 -172 17 178 -182 -153 -175 52
5062 52 -228 146 70 -35 16 0 -64 68 -63 -49 185 -47 -256 94 -119 -290 28 -215 121 -162 120 -1
5084 -1 -25 -254 -68 57 -150 131 104 -137 -113 128 168 188 5 -56 -37 -121 -101 265 -74 74 220 -172 -60 -8
5108 -8 38 11 339 210 -183 -39 106 -2 -85 -13 119 -179 -161 145 -162 101 121 270 30 112 -111 37 188
5131 188 -20 20 113 80 253 -72 20 382 -151 305 -23 -141 -48 128 -144 -67 6 -11 84 -186 -211 -104 277
5154 277 110 -88 96 76 18 179 -8 -154 -60 171 -96 -40 49 81 173 -16 -100 -120 199 -70 87 110 33 -22
5178 -22 -38 -19 141 -126 -52 -2 45 106 51 94 57 68 -133 47 65 -105 38 -47 -74 -179 33 -230 -164 209 6
5203 6 -58 98 -3 -138 46 39 -26 -43 -148 -79 96 -83 147 11 -158 37 52 -50 68 67 170 -105 108 115
5227 115 73 -41 53 -96 162 -119 168 22 251 -13 -184 131 5 -109 52 264 67 -94 -139 175 22
5248 22 31 -74 78 -8 135 -91 178 -30 205 -8 217 -148 316 -174 38 331 116 209 38 541 171 -8
5270 -8 -78 -46 22 66 -62 4 -12 -302 -130 61 -111 241 -81 -137 33 -205 -92 46 62 -103 147 43 -175
5293 -175 -222 58 161 179 -260 -46 -50 173 160 -82 124 -100 198 -139 -44 -299 19 -13 214 42 94 -180 -112
5316 -112 140 238 58 159 -1 107 52 -67 12 -228 65 145 279 -98 -207 -117 116 57 -36 154 -21 163
5338 163 -211 100 -23 -56 -193 83 -63 60 -21 175 -2 199 95 -184 40 -126 213 61 -17 11 134
5359 134 -188 -215 74 -27 -15 173 -96 -151 118 23 41 277 -101 14 -86 -28 188 -125 105 127 -321 -353 -5
5382 -5 154 148 339 -28 -34 225 -8 112 35 89 145 -237 122 -264 -225 -160 25 9 -2 -129 159 -335 -98 -16 -176
5407 -176 267 -39 -158 -327 355 -23 -65 128 -103 60 235 195 -93 38 19 -27 -31 -26 -246 -13 155 207 -10
5430 -10 42 51 228 8 20 265 -64 90 -166 -61 27 -26 -4 -31 -197 -172 101 -46 176 64 -112 -38 -40 -60 -193
5455 -193 223 66 -50 -133 3 -108 238 79 207 132 -22 11 109 -18 -98 -19 -218 -4 -340 50 66 -55
5477 -55 109 -95 107 -23 -6 -186 127 210 281 52 -232 -52 24 59 390 15 134 -64 170 174 -190 -61 -140
5500 -140 -104 -61 -71 61 -103 -229 -33 152 160 -46 4 11 140 64 43 114 174 -239 305 79 22 -73 -273 85 -37
5525 -37 -74 -16 303 -6 -363 38 -40 52 8 22 177 -68 49 315 -174 44 6 -98 196 -153 -22 -15 -113 57
5549 57 170 68 -224 26 49 4 -334 -100 119 86 -17 -110 164 -6 -155 41 -92 302 -116 282 73 -113
5571 -113 -94 -149 -262 -75 -22 116 -65 176 51 -180 71 74 63 -93 3 121 155 -237 220 207 205 -209 -136 298
5595 298 -81 223 3 -392 8 135 -78 108 130 86 36 106 136 121 36 97 -195 225 -120 -107 74 -135 -15
5618 -15 2 217 -92 -3 -41 -99 199 61 -27 207 177 55 -138 -37 76 -350 -48 -99 -71 -43 -107 -10 -159 166
5642 166 50 -209 -78 25 -247 -148 -108 67 -97 -239 -205 -204 108 202 -38 249 -371 142 105 -106 -72 63 3
5665 3 -15 -218 90 135 -83 -118 -136 7 -84 16 -39 245 39 48 97 -111 -113 152 8 -280 -56 133 161 91 -58
5690 -58 79 189 194 -190 -324 4 -294 83 29 48 37 -165 211 -92 147 302 58 -8 200 60 61 109 -97
5713 -97 -23 225 125 -143 -70 -189 103 -39 -174 168 -280 -173 151 126 113 127 26 -186 323 -77 -219 216
5735 216 -182 -41 -38 -60 -120 88 -92 -110 -4 242 212 -98 120 10 82 19 -35 -211 -246 3 -32 -57 -92 164
5759 164 -109 94 267 50 -148 103 36 -103 120 -40 -78 157 73 1 -31 26 215 -22 -12 122 -322 -289 -3
5782 -3 21 151 153 -108 -84 93 -100 119 192 -102 -48 138 -139 -131 37 108 -89 -146 42 266 7 326 358 -27
5806 -27 237 458 -44 -53 -48 -111 -205 83 -60 15 -41 170 -5 8 -92 -16 -193 178 293 226 -206 -65 317 -76
5830 -76 -107 -11 -236 -36 -55 373 -113 -275 -121 6 6 -97 -5 -127 107 215 -67 -182 -185 -32 189 20 222
5853 222 24 -79 140 263 -64 -137 28 -132 156 228 53 -78 183 148 268 115 -9 160 -144 475 188
5874 188 24 -119 79 -159 -24 169 170 -26 -316 119 49 -79 -105 87 236 -55 -229 96 -201 -63 36 -95
5896 -95 -118 -99 63 -135 -23 -197 165 6 207 -69 -132 202 -107 -60 40 87 -145 51 -61 45 -133 384
5918 384 -296 14 95 -142 206 32 -89 91 -116 -24 31 281 -192 -64 41 -167 125 -24 3 -41 -54 138
5940 138 -59 325 5 50 16 124 264 -176 -194 -1 230 17 236 -120 -61 -40 -136 67 -84 -33 -8 55 251
5963 251 24 142 117 176 356 -150 -111 17 -116 -166 56 226 147 89 0 -130 -79 77 -191 124 -137 146 39
5986 39 -19 238 64 27 114 365 33 266 -128 25 212 -129 -70 -217 -120 216 108 -112 42 -181 -27 -297
6008 -297 155 -66 -37 -69 -121 50 -111 -87 -199 -20 91 228 -172 -57 97 -83 16 -30 -540 -31 382 -58
6030 -58 187 305 -49 -123 -201 -113 196 -184 98 50 155 -238 -137 -115 119 -278 -364 -34 118 145 -216 142 -187
6053 -187 328 163 39 147 67 42 -168 -153 70 200 103 -2 -9 -38 20 86 -156 -54 35 -307 -126 -81 132 -83
6077 -83 -14 236 167 -11 -231 -12 189 -227 168 21 69 -146 -144 -121 -102 -2 -152 -205 -157 -108 92 -175 75 52
6101 52 -185 -66 -46 -237 17 80 -115 -297 -46 162 132 -101 -10 234 -162 141 9 -41 -176 214 192 41
6123 41 -183 -32 93 -61 -11 -60 -335 -101 242 -146 -212 124 74 170 335 270 -116 -223 -283 -86 -274 29 -141
6146 -141 -115 62 -21 63 -155 151 54 -85 30 108 -36 -100 47 16 137 305 -189 -161 194 285 66 -53 -159
6169 -159 32 119 23 297 186 3 -88 -176 103 10 136 -102 -143 73 103 -48 -140 4 -166 105 -37 -93 150
6192 150 13 -234 -77 -1 -41 88 118 69 353 70 -254 120 57 75 -11 173 -72 201 -1 -261 172 -240
6214 -240 -126 -20 234 287 -77 -48 -40 38 -73 2 -112 -122 -153 -39 -37 -34 -135 22 -106 11 47 166 -24 105
6238 105 -116 16 86 20 -85 -209 -27 49 -211 5 31 -118 109 -9 -153 1 -213 -75 -138 -209 172 137
6260 137 170 8 98 -112 -175 50 -271 111 -46 158 -259 -116 54 -218 -48 -239 -36 34 -138 -210 -59 -62
6282 -62 130 106 -88 -218 61 175 10 304 89 364 57 10 -334 109 -39 72 -138 -23 138 -2 -95
6303 -95 -152 110 -48 1 67 -156 19 83 -23 84 317 95 238 85 80 89 307 -284 -82 188 -16 31 23 362
6327 362 95 -119 -403 -8 130 111 41 -102 -76 99 -88 148 0 237 -67 281 50 -340 146 138 186 78
6349 78 -215 -377 3 15 296 -124 5 -3 -400 -26 25 140 101 -143 175 44 22 -83 -76 271 -72 123 -80
6372 -80 -86 29 -96 76 -8 -70 229 -66 -84 -158 112 319 -69 26 -91 21 126 -220 -249 -9 99 53 169
6395 169 -8 -88 -64 161 88 -150 -315 -167 -63 -178 192 -6 -72 43 -439 163 159 96 134 24 -118 -99 225
6418 225 -155 -158 313 -25 -153 100 431 -98 -48 365 -115 -6 -39 -77 -61 -50 -162 -88 55 33 111 27 51 133
6442 133 3 115 16 94 84 11 -136 -10 -141 -39 76 -51 22 -138 217 115 -178 24 168 -112 -5 -147
6464 -147 -166 -195 20 15 -43 121 -64 -39 -55 -106 -96 -218 69 76 21 114 238 -62 111 243 177 -19 163 168 -18
6489 -18 153 -46 26 42 78 -74 -35 -184 41 213 -73 -40 -3 49 267 -146 42 156 42 -119 -118 287 -59
6512 -59 -131 23 -66 176 50 -139 -152 44 105 29 79 -54 66 -331 -212 -59 353 150 21 -49 -162 53 24
6535 24 -123 -98 10 41 -15 -272 -38 -209 25 165 -42 183 119 -276 446 250 137 -131 -37 -157 -24 180
6557 180 -70 233 1 117 -10 -151 -94 -26 118 -74 59 251 -48 -7 -71 29 134 -70 3 92 -16 31
6579 31 -13 278 -90 -73 -65 173 27 27 12 148 -1 -20 -64 51 147 32 -17 153 6 -135 133 -351 -82 38
6603 38 13 -49 -33 -7 9 -339 286 -83 23 -14 277 -17 13 167 225 93 94 -202 -38 18 264 -92 -1 34 79
6628 79 -37 304 233 268 138 2 99 -65 -160 39 -173 77 -125 17 -308 22 -76 -170 -45 148 -186 -113 113
6651 113 178 -120 -83 169 -58 234 -216 -60 -24 -115 339 144 -55 -12 82 -368 -46 -385 255 -405 -31 280
6673 280 18 161 14 38 76 -13 -128 -102 -224 128 -203 -107 -113 228 -42 -97 -184 -64 -344 147 86 -169 -249 -130
6697 -130 -31 249 108 -222 -34 88 30 -263 -33 -24 -27 -128 18 -191 97 12 -8 51 113 15 156 -257 -37 -51
6721 -51 -74 -78 -3 5 43 242 -310 123 396 132 96 176 149 69 47 -70 -120 101 101 78 20 79 121 -55 -84 -365 -114
6748 -114 -74 -61 75 -82 88 -19 286 108 -134 -189 253 -120 166 70 -72 63 100 91 -144 131 101 64 -9
6771 -9 155 255 -15 -91 108 101 -125 42 -1 -41 -60 -121 290 -308 -218 -208 296 217 278 250 68 -33 -171 -23 14
6796 14 116 88 37 17 -48 -11 87 -97 -65 -3 -87 420 71 -39 36 -92 152 164 -64 17 114 -58 159 -43 230
6821 230 124 -137 -38 253 114 149 93 127 -13 298 -23 185 337 -66 64 -93 -113 26 -47 -139 127 183 -84
6844 -84 -151 -123 -5 122 55 -117 44 21 -61 -30 -111 -137 -62 -17 -53 67 -251 106 -134 95 -55 -74 -59 -120 -38
6869 -38 -67 -46 33 117 -172 -71 143 -137 12 32 -150 -157 118 -86 -166 -210 59 -189 -52 -106 -220 193 131 12
6893 12 -46 22 187 -271 -49 50 -159 16 -93 -181 136 -285 -19 97 -123 -169 122 -98 4 -181 -35 -111
6915 -111 -39 -185 66 77 -330 121 -327 -49 -384 134 67 152 297 -73 42 -87 -199 161 119 -66 -32 -221
6937 -221 38 49 274 -130 -11 200 -145 319 180 -163 -79 29 -18 222 -18 -237 -4 -261 18 48 133 17
6959 17 106 70 5 -47 55 -122 11 188 12 -50 35 -61 -65 147 68 272 -21 -58 202 -191 -201 92 -157 -5
6983 -5 51 34 26 76 10 142 -143 27 66 -111 -93 291 409 11 31 -190 -73 -173 -128 60 -34 106 251 -73
7007 -73 -31 59 -274 -200 173 12 66 -38 52 -6 -210 -133 23 -45 108 -142 238 -90 161 100 350 -91 32
7030 32 43 -20 127 90 8 -252 68 95 124 35 -144 -45 -148 -29 -114 98 -169 3 -116 -273 -100 -35 103 128
7054 128 19 164 -248 -224 -224 -55 1 -115 171 -40 43 -41 122 -149 -157 271 18 49 -16 -50 -97 144 -22 35
7078 35 -89 -94 133 -43 10 58 21 -63 77 -169 297 347 -89 285 -9 -203 24 41 41 160 -80 -4 25 203
7102 203 -57 -229 21 155 -7 -286 158 8 28 136 -87 -188 14 285 -220 132 199 -30 130 -27 110
7123 110 71 -127 29 58 54 56 -125 63 76 -209 -19 115 125 -10 -130 -51 40 -149 -1 -59 93 55 -32 -157
7147 -157 78 -33 109 -116 63 19 -38 32 127 -71 63 -67 -168 25 -143 93 68 170 -20 -131 -237 -187
7169 -187 -23 -50 61 119 93 40 89 237 131 -100 2 25 -303 -181 62 -356 289 51 -81 -72 10 -61 127
7192 127 -76 -319 -36 -19 176 -78 -59 -99 161 215 -311 -132 -179 -71 52 -76 -45 -29 44 388 8 -47 211
7215 211 100 -119 -25 -26 -262 57 162 -8 -40 -94 -18 -95 108 -40 55 99 -211 186 146 87 43 89 -7 26 -52
7240 -52 -318 131 -74 166 60 191 88 -213 49 -1 101 61 83 -119 45 96 164 198 187 100 120 -151 -69 304
7264 304 -242 26 -92 72 226 -80 105 185 -178 -165 132 114 -102 63 209 23 -47 -42 -27 -16 -154 -24 198
7287 198 -62 36 -30 -424 75 363 -63 102 -135 -44 -304 -80 232 29 -111 107 59 -198 -274 -169 217 251
7309 251 135 343 181 115 32 -269 29 -219 -396 -60 -122 -6 -90 58 -171 253 -22 141 -123 -45 -156 -144
7331 -144 125 89 60 69 -9 -154 -113 61 -25 -142 314 -24 131 -326 130 170 -26 -66 -120 15 1 -54 72 88
7355 88 -8 -8 221 34 -94 -52 -116 -136 -164 161 78 -89 -219 11 -242 -121 -79 191 33 -64 -111 44 215 -21
7379 -21 158 -125 131 302 -99 -309 53 45 109 121 31 161 -131 -157 -155 136 141 -62 63 317 -52 101 -88 -19
7403 -19 136 63 -92 -73 81 -77 90 -15 142 85 -80 141 -85 -83 169 70 -9 47 87 153 19 92 294 -127
7427 -127 15 65 199 -206 -83 46 -178 -114 -74 -32 -142 105 -68 94 48 283 1 34 -161 -211 88 462
7449 462 -165 -143 -156 -68 -121 -124 -1 296 -23 -330 35 -29 96 79 -256 -221 28 -6 133 13 155 93 -98 -46
7473 -46 106 107 2 102 -15 -155 -34 -4 122 -2 -37 -208 -14 -37 -257 96 143 294 11 -604 -144 101
7495 101 173 86 -93 -136 -21 328 -312 -57 54 301 -114 36 46 145 69 196 138 41 138 -5 15 130 -34
7518 -34 394 72 -457 -152 85 -140 -98 -89 -9 127 -43 137 62 101 46 202 58 -37 -137 -76 50 -207 -264 -9
7542 -9 63 5 85 -6 83 50 -98 135 110 -22 -144 335 -60 -160 -102 -133 -168 -49 -93 132 -114 -132 274 134 -21
7567 -21 -30 285 105 90 123 115 10 128 -123 165 237 -75 153 174 -86 -116 266 -298 115 61 -136 -153 -3 17
7591 17 64 -96 220 153 18 33 99 138 114 175 -252 33 167 -28 63 255 30 44 210 -27 -242 -36 38 110
7615 110 118 167 -233 90 110 42 -93 355 339 -187 148 -389 82 24 -31 -40 125 -41 -68 99 114 110 -52 81 -144
7640 -144 220 78 74 285 -3 -108 33 -326 -130 -28 56 195 -134 -188 65 235 -102 -23 -265 144 240 -26
7662 -26 -40 1 -26 38 105 -31 287 -190 15 -237 5 -86 41 -210 -20 -111 -217 -55 -172 184 -37 167 -201
7685 -201 -51 90 -208 -75 67 68 100 65 -343 -152 -200 -66 -5 -46 90 -80 101 -268 -348 171 125 -132 68
7708 68 137 246 26 173 116 42 65 181 -52 310 -264 -105 131 45 -29 -47 44 -203 17 -48 119 -312 31
7731 31 -224 -5 98 -112 -43 -10 -29 110 52 -269 -205 -13 66 -217 -359 195 -113 -164 -105 -206 -81 113 -271
7754 -271 -105 18 145 -7 -33 -26 -130 -16 32 -81 -84 188 -101 -81 186 131 325 57 -80 366 30 5 -33
7777 -33 105 42 -186 22 163 -164 14 -27 51 -237 -45 -101 -36 -15 -56 69 -46 111 187 -20 -43 72 -45
7800 -45 -214 -291 -85 -193 -330 -133 -114 -104 -220 -85 -158 -82 213 140 -114 46 132 161 90 -37 -175 -204 62 111
7824 111 -173 170 -35 349 -90 -225 66 -21 -85 -14 -267 -148 -85 140 8 -177 -38 -97 -81 -121 -202 31 210
7847 210 6 -105 -130 -124 19 134 345 311 80 -134 -87 139 2 289 -1 87 -149 55 -161 -131 -219 -212 7
7870 7 -171 -33 -60 -201 131 -6 -17 -49 22 -165 -92 94 -166 156 -145 199 -138 48 -152 -116 -348 -242 -65
7893 -65 57 -7 101 -202 -54 -184 -153 -19 106 -310 -2 209 -414 -69 -58 122 118 258 152 105 103 3 40
7916 40 -132 174 -208 25 -82 13 -54 25 31 87 52 -238 -135 180 5 -68 -17 28 -25 40 12 15 122 -29 13 -142
7942 -142 -268 -78 98 83 268 -15 237 147 134 179 100 -102 98 76 -39 -53 84 -240 -24 -234 -19 -169
7964 -169 41 -163 61 28 -447 -217 239 -185 250 -123 186 343 209 41 321 120 -3 273 69 350
7984 350 213 166 19 -189 110 154 -165 -88 123 64 -79 -175 -123 -324 -216 1 -72 -133 41 158 -163 255 80
8007 80 -14 -157 -98 246 166 -153 -20 -342 -88 47 -12 93 -2 162 -74 43 201 137 0 -6 151 158 204 -53
8031 -53 46 -97 133 198 -72 97 89 -35 -127 -25 -211 18 266 21 -86 131 -32 -81 -126 -88 123 -280 135
8054 135 -68 -94 131 79 83 -49 -252 37 -62 144 -5 194 -28 30 203 -261 125 34 148 44 33 -58 -16
8077 -16 -87 -228 -98 178 59 -11 -115 41 -99 -71 -187 -51 102 -45 -101 145 44 -38 -75 41 -149 -88 94
8100 94 221 102 -103 294 -168 190 369 -29 154 141 -75 -96 24 -321 147 52 -7 44 -89 166 -299 64
8122 64 263 -133 -112 -55 -169 101 67 -111 -116 -195 140 42 -123 -36 -63 317 -191 54 -34 -98 66 -103 39 153
8146 153 -141 235 -163 168 -292 -6 231 -176 113 120 -61 45 -356 -64 208 32 -93 -26 -56 -156 -20
8167 -20 143 166 -103 243 -168 -99 -87 -130 5 138 -3 -146 -232 162 141 -63 -88 -114 -97 291 122 115 14 56
8191E6
$$ Imaginary data points
##PAGE= N=2
##DATA TABLE= (X++(I..I)), XYDATA
0 0 0 0 0 0 0 0 0 0 0 0 0 -8 8 -8 8 -16 16 -16 24 -30 32 -40 48 -56 64 -80 89 -104 120 -137 160 -183 207
33 207 -233 264 -297 334 -374 419 -467 521 -578 642 -712 787 -867 958 -1057 1165 -1282 1413
51 1413 -1557 1715 -1893 2093 -2316 2567 -2858 3197 -3592 4067 -4646 5372 -6315 7586 -9413
66 -9413 12263 -17362 29267 -119363 57278 214864 -187489 -113822 175311 29659 -166850
77 -166850 66780 130425 -57981 -47209 78702 16459 -3740 34652 -18515 -33880 47647
88 47647 54 -62729 9433 23251 -69042 -31078 47615 -8844 -56643 4518 24611 -340
100 -340 9877 15485 -1100 15480 29461 13454 5883 10640 3687 -4865 -4460 7890 3408 -39986
114 -39986 -40815 27639 14760 -67538 -21899 54232 -25515 -56581 64109 47842 -76357 591
126 591 102761 -10614 -52778 68087 33635 -70971 19089 72200 -53388 -57848 50138
137 50138 136 -68441 10511 26693 -53988 -25672 40575 2493 -26065 10784 17131 5776
149 5776 16967 11628 5992 18524 2468 -6800 24663 9988 -36926 -8659 25108 -20305 -34660
162 -34660 10154 -2368 -36138 -1642 21356 -13217 -16679 15399 15106 1910 8615 13237 9864
175 9864 4673 5066 15619 8012 -17063 -6048 16848 -12085 -27665 9307 -266 -39791 -2033
188 -2033 28611 -26402 -29385 34382 12761 -32812 18369 40988 -19321 -12378 42736 13322 -24360
201 -24360 8627 18891 -11751 -9701 2362 -5519 -7396 -11983 -15227 7435 3091 -30408 -3984
214 -3984 32749 -12008 -27229 36873 24296 -37319 8528 53976 -15751 -32323 41035 20493
226 20493 -44300 81 37139 -24665 -35900 22005 9948 -35200 -10526 19990 -3961 -18916
238 -18916 3525 16824 1592 -11050 7017 25072 956 -16210 15586 23519 -17096 -13582
250 -13582 23915 1749 -28868 1677 16567 -18061 -18196 10728 983 -15580 -642 7924 -1035
263 -1035 -2572 2709 8283 7874 -3057 1059 17673 1651 -15110 12437 17006 -22737 -10976 26842
277 26842 -7450 -35016 14884 20592 -34402 -13859 33986 -6081 -32624 19840 23774 -24604
289 -24604 -5450 30257 -136 -17424 14079 15211 -10585 -4080 9909 939 -7401 -4207 1248
302 1248 960 -9120 -8941 7364 1606 -16550 293 16387 -8795 -13167 18341 10599 -17800 3621
316 3621 22378 -6262 -12066 15837 8971 -13820 -809 10398 -3751 -9444 167 1860 -3289
329 -3289 -7029 -4159 4941 -313 -11565 1797 12995 -7053 -9419 16820 8329 -15732 5942
342 5942 20377 -9577 -10967 19278 4418 -19690 4622 14405 -14908 -12374 13025 -773 -18149
355 -18149 1393 10542 -8587 -9141 8573 7058 -6953 -2962 11926 8636 -8017 -1500 18026
368 18026 4112 -17482 5007 20377 -13057 -19947 17317 8946 -28616 -6184 22833 -10045
380 -10045 -25166 13449 14455 -18528 -5579 20320 2357 -10994 8565 12863 -1961 -1440 6196
393 6196 4727 -409 -4007 -1429 3978 -4084 -12552 1113 5736 -14053 -10719 12836 331 -18983
407 -18983 6185 19157 -11638 -10586 24360 11080 -19927 5556 27724 -8202 -19227 18608
419 18608 13423 -25318 -9205 21443 -6224 -28371 5203 15278 -18841 -15393 18043 5696
431 5696 -18679 4015 20915 -3003 -8578 14865 12252 -7418 443 12237 -184 -7907 1067
444 1067 2033 -6196 -6983 -3724 -2879 -3927 -6756 -3903 3352 -1070 -6688 5186 11621 -2877 -2520 16172
460 16172 8436 -9384 5612 17238 -6703 -11935 12274 4387 -20744 -4706 12571 -12526 -19539
473 -19539 9229 5916 -19535 -3195 18747 -3891 -12763 16074 15867 -11101 1088 21671 1116
486 1116 -12340 10548 11486 -13612 -7775 10019 -4122 -16596 -1023 3586 -10860 -8374 4195
499 4195 341 -5626 1307 6584 3746 2610 3659 6751 7671 1694 -282 7204 3808 -8860 -2623
514 -2623 6957 -7544 -16362 2865 4427 -17237 -9490 12940 -2020 -17277 8894 18353 -10698
527 -10698 -7189 23414 10163 -15616 7243 22632 -8552 -14601 16864 8050 -22895 -6198 14404
540 14404 -10345 -20058 6777 5190 -17426 -4815 13506 -1219 -7821 8342 9326 -1335 4508
553 4508 9628 2370 1130 3794 843 1369 453 -7655 -4605 3361 -6835 -12297 2468 862 -14547
568 -14547 -1507 13941 -6096 -11762 14880 13181 -11744 2700 22152 -2304 -12982 15663
580 15663 13837 -17509 -7712 16532 -3599 -21111 2888 9497 -17119 -13421 13307 3461 -17429
593 -17429 -559 15915 -1627 -7911 12467 11128 -7302 422 15176 2396 -7689 3301 4481
606 4481 -5910 -3665 1073 -5043 -6608 -2744 -2932 -1311 -294 -5336 -1947 8195 1839 -5118 8608
621 8608 9423 -7238 1854 17927 -1952 -13540 10926 10646 -16804 -5325 14674 -8621 -19849
634 -19849 9261 8239 -19660 -6305 15504 -3296 -12220 10798 9924 -10309 540 15740 1195
647 1195 -6558 6832 6628 -5936 -1289 6169 -2586 -9116 -655 3372 -5400 -7205 744 634 -5013
662 -5013 -1262 5443 632 -3657 3076 7128 1903 -661 2709 3830 1305 -521 32 2062 -800
677 -800 -6404 -1083 4927 -5444 -9615 4207 4020 -10528 -1913 11705 -4121 -10557 11972 9739
691 9739 -12118 472 17277 -4127 -11250 13262 7869 -16133 -1212 14826 -6744 -13924 7701
704 7701 4678 -13229 -2469 9618 -3953 -8249 4316 5224 -2743 -1263 4248 3152 -254 -520
718 -520 3239 3542 -2391 -3037 4896 2372 -7148 -1569 5905 -3713 -7862 3955 4027 -8108 -3872 8011
734 8011 1199 -7688 1607 8657 -1707 -5889 5445 7496 -5546 -4827 8991 4213 -9797 -1633
748 -1633 10411 -3006 -11073 5481 7116 -10847 -5445 10609 -604 -11213 4319 8457 -7330
761 -7330 -4091 9467 1329 -6940 3318 6687 -2559 -2945 4053 2614 -2721 -2250 1944 1972 -3635 -3824
777 -3824 3036 1970 -6667 -2318 6334 -1703 -7682 4274 6444 -6258 -3127 8833 2192 -6638
791 -6638 3719 7231 -3483 -3634 5029 1850 -5040 -1229 3244 -1311 -4491 -438 2443 -1577 -4416
806 -4416 1180 3353 -3185 -2622 5410 2202 -4967 2251 7138 -2211 -3190 6810 2665 -6555 1183
821 1183 6104 -4619 -6076 4254 1263 -7828 -1837 4618 -2636 -5831 2092 4399 -2775 -2980 4740
836 4740 4685 -2776 -1646 6617 3303 -5135 650 6999 -2292 -6826 3352 3247 -7130 -3784 4692
851 4692 -2178 -6916 1346 3510 -3931 -2198 4697 1737 -2277 1584 4729 1712 -1196 1693 4685
866 4685 95 -4484 1021 4843 -4870 -7259 4349 2140 -10225 -3196 7996 -2839 -9712 5541
880 5541 7900 -6614 -2571 10420 2708 -6215 4350 8206 -3571 -3618 6194 1819 -6297 -1089 2801
895 2801 -4007 -5736 914 762 -5475 -3335 3676 959 -4467 1319 6198 587 -2332 5107 6248
910 6248 -1658 -1801 5131 2985 -3965 -2530 2597 -527 -5812 -2985 2006 -1649 -6889 -831 5133
925 5133 -2313 -5419 4901 5900 -3837 70 9910 705 -5707 6044 7729 -6503 -3369 7729
939 7729 -1933 -9676 2789 4148 -9928 -5985 6773 -620 -8299 1715 5732 -3603 -1688 6719
953 6719 3273 -1912 1967 4921 1796 235 327 170 127 -1536 -1701 -509 -2130 -5171 -1912 1581 -2321
970 -2321 -4126 1414 2193 -2499 1514 5923 268 -2519 5683 6575 -2728 -1934 6110 246 -6328 1361
986 1361 4909 -6436 -8033 3990 1923 -8877 -2807 5799 -2662 -5972 5808 5843 -5219 -306
1000 -306 9259 1874 -3470 5059 4332 -4566 -650 5533 -2085 -6291 232 1056 -4416 -2580 698 -2791
1016 -2791 -3055 966 1489 61 408 583 2388 4652 1512 -858 3383 2976 -2683 275 5409 -2713
1032 -2713 -7498 2733 3432 -7573 -4798 4901 -2315 -7978 3816 6344 -6669 -3615 9676 3348
1046 3348 -6302 4173 8079 -4214 -3583 8824 2731 -8704 -657 6226 -4127 -6607 2827 668
1060 668 -7667 -1543 4950 -1620 -4563 1990 3225 -515 632 2955 1569 339 1539 2399 1975 -437
1076 -437 -2382 350 2202 -2691 -4395 1103 -89 -5636 -1192 4535 -2641 -6421 4263 5669 -4687
1091 -4687 -1653 7602 488 -5332 5465 7104 -5665 -4043 7155 841 -7622 1119 4217 -6209
1105 -6209 -4954 5665 413 -7963 187 5157 -2956 -2768 5365 1835 -3859 2041 5264 -671 -1715
1120 -1715 2431 1212 -1516 216 440 -1455 -1204 -1064 -1243 85 -936 -3184 163 2594 -1701 -1790
1136 -1790 3472 1353 -2781 2098 4928 -1882 -2878 4696 2600 -4347 101 4312 -3087 -4586 3254
1151 3254 1618 -5512 -1561 4525 -1707 -4497 3235 2879 -4713 -821 5885 245 -4275 2811 4331
1166 4331 -3007 -1443 4761 196 -4696 939 3655 -2630 -3033 1972 771 -2878 -559 1584 -431
1181 -431 -1444 68 1145 752 -593 -1052 1936 1569 -2261 -486 3692 -484 -4051 2303 3410 -3934
1197 -3934 -2237 4334 -80 -5470 1788 4089 -4255 -2907 5250 485 -5250 1797 4686 -2802 -2730
1212 -2730 4596 1742 -4715 212 4911 -1300 -3838 2683 2790 -3277 -1923 3341 507 -3847 -98
1227 -98 2809 -1052 -2868 1329 1934 -1680 -1355 2063 1002 -1676 -634 2275 669 -1706 -16 2263
1243 2263 -119 -2244 660 2626 -1772 -2906 2639 1702 -4149 -1435 4076 -1103 -4595 2165 3479
1258 3479 -3977 -2008 5059 740 -4459 1829 4444 -2474 -2417 3888 1336 -3670 104 3126 -1471
1273 -1471 -3110 818 1061 -2351 -2134 1352 536 -2230 -805 2617 577 -2092 1362 3057 -777 -1641
1289 -1641 2914 2000 -2354 -193 2780 -779 -2887 718 1691 -2790 -1964 1273 112 -2333 -378 1490
1305 1490 32 -1425 1155 2461 -390 -1071 2095 2389 -1355 -748 2966 345 -3042 283 2265 -2747
1321 -2747 -3078 1701 -40 -3633 -723 2427 -1134 -2242 1808 2017 -1187 16 2886 976 -709
1336 -709 806 2197 34 -1806 303 1312 -1976 -2451 1338 -121 -3731 -766 1976 -1548 -3173
1351 -3173 2306 2139 -2890 142 4563 316 -2032 3036 3076 -1809 -234 2914 35 -2845 78 939
1367 939 -2109 -2121 -144 121 -1583 -1882 381 1213 -759 -737 2691 2412 -1497 632 4189 610 -2309
1384 -2309 2307 3259 -2899 -2257 2853 -110 -4710 -852 2201 -2776 -3720 1693 1590 -3028 -849 3456
1400 3456 741 -2509 1639 4308 -767 -1625 3390 2561 -2969 -505 3151 -1727 -4103 636 1278 -3298
1416 -3298 -2501 1410 -693 -2815 670 1862 -363 -62 1895 1736 408 539 1116 1563 277 -1050
1432 -1050 566 1384 -2185 -2512 1389 -427 -4683 -737 2578 -2379 -3335 2963 1688 -3677 685 5228
1448 5228 -201 -2412 3930 3170 -2535 -144 4071 -1134 -3760 1475 1200 -3437 -2247 1689 -1033
1463 -1033 -3469 534 1683 -1680 -1331 2464 1502 -1017 1153 2754 510 -348 1623 1408 -616 -567
1479 -567 173 -292 -628 -923 -1158 -452 -772 -1453 -379 784 -1420 -1383 2387 1645 -1596 997 3345 -432
1497 -432 -1055 3362 1358 -3540 472 3393 -2207 -3282 2789 279 -5365 102 3394 -2806 -3828
1512 -3828 3173 2059 -3287 453 4203 -855 -1999 3356 2765 -2036 -345 2540 -110 -1568 451
1527 451 160 -2238 -1101 359 -113 -1090 -734 -285 -122 218 2 586 1117 176 150 1893 1507 -1451 -251
1546 -251 2511 -151 -2302 1093 1414 -3397 -1668 2868 -766 -4637 453 3197 -2176 -1970 3760 935
1562 935 -3678 1380 4452 -1755 -2687 3500 1662 -3190 685 3142 -2599 -2848 2552 1159 -3679 -813
1578 -813 1709 -1273 -1090 1560 624 -1543 420 1203 549 487 232 -23 775 840 -460 81 1095 -917
1596 -917 -1303 1600 267 -2769 -407 2415 -1242 -2222 2081 1227 -3048 42 3866 -302 -3130 1885
1612 1885 2704 -2549 -989 3153 -244 -3693 1384 2765 -2418 -2176 2022 69 -2677 557 2009
1627 2009 -1827 -1707 2076 898 -1961 282 1528 -828 -802 1417 737 -1249 44 696 61 -226 -171
1644 -171 -485 328 190 -861 22 703 -699 -741 1650 711 -1929 53 2258 -997 -1522 1841 678
1661 678 -2494 179 2613 -1246 -2246 2116 1424 -2512 203 3007 -1184 -2264 2170 1962 -2799 -947
1677 -947 2605 -883 -2467 1486 1438 -1998 -1116 2016 237 -1787 368 1389 -744 -421 1128 403
1693 403 -588 -58 813 501 -360 -442 167 167 -409 -462 1007 13 -1164 263 1416 -480 -1330 1256 1126
1712 1126 -1240 -38 2217 -43 -2172 1163 2117 -1662 -1627 2056 363 -2598 117 2344 -1373 -2622
1728 -2622 1687 1071 -2306 -561 2433 -90 -1727 1417 1859 -1222 -696 2059 669 -1291 454 1087
1744 1087 -795 -976 441 15 -906 -883 248 446 -852 -1104 662 710 -709 -20 1931 363 -1347
1761 -1347 762 1960 -742 -1191 1646 543 -1711 -82 1172 -1200 -1962 544 364 -1685 -769 1475
1777 1475 -181 -1514 891 1806 -849 -191 1779 1109 -1008 -266 2174 -112 -1253 340 957 -1035
1793 -1035 -1708 744 308 -1843 -884 1025 -156 -1028 504 1082 -287 -37 1209 993 -138 179 983
1810 983 332 -269 235 211 -733 -1060 151 140 -1722 -454 732 -522 -1506 765 1323 -964 -252 2102
1828 2102 836 -823 761 1901 -180 -862 726 826 -1340 -726 562 -131 -1762 -809 593 -368
1844 -368 -1269 -88 962 -394 -472 1320 1156 -818 286 2153 238 -1210 1040 1144 -1577 -886 1348
1861 1348 -285 -2119 36 896 -1679 -1372 994 204 -1466 65 1444 263 -519 1109 1489 -462
1877 -462 -317 1123 894 -880 -320 857 -511 -1419 -146 434 -1002 -1392 145 522 -820 -107 917
1894 917 576 -524 845 1527 367 -473 609 1289 -445 -945 774 358 -1558 -554 1264 -928 -2477
1911 -2477 498 1303 -1828 -1036 2374 313 -1942 930 2402 -703 -507 2385 815 -1881 789 1540
1927 1540 -1103 -1169 605 9 -1615 -606 -37 -695 -543 48 81 90 -355 -197 735 645 -119 159 885 83
1947 83 -299 947 772 -993 -527 813 -799 -1773 154 787 -1510 -1258 1374 469 -1399 200 1873
1964 1873 -111 -934 1566 1403 -960 -133 2267 -341 -1633 737 1144 -1833 -1015 1290 -647 -1979
1980 -1979 554 1236 -1376 -647 1189 -20 -694 1128 1106 -407 478 1007 93 -83 172 -177 -299 394
1998 394 -506 -573 237 -149 -979 180 631 -896 -760 1049 307 -1296 839 1515 -555 -573 1764 138
2016 138 -1601 602 1355 -1182 -1080 1452 -211 -2245 37 1318 -1156 -1554 1582 555 -1442 248
2032 248 1723 -538 -1122 1615 1126 -1276 -228 1161 -444 -1076 578 697 -792 -405 612 -426
2048 -426 -554 319 -20 26 176 146 27 645 -123 -452 506 1024 -761 -405 1513 -186 -1443 474 1376
2067 1376 -1451 -750 2112 -194 -2187 661 1429 -1345 -1069 2214 379 -2063 856 1813 -1297 -1222
2083 -1222 1679 231 -1551 258 1327 -1131 -1118 1208 178 -920 -271 765 -361 -873 449 540
2099 540 -46 -191 495 11 214 -62 -29 -8 80 -163 -164 373 -286 -656 243 430 -756 -265 1090 -271 -1005
2120 -1005 505 582 -731 -420 1378 -321 -1206 885 1051 -1442 -560 1573 -218 -1834 625 1030 -1431
2137 -1431 -586 1615 100 -1593 785 1148 -952 -602 1084 145 -956 274 609 -657 -411 -34 14
2154 14 -448 -176 -98 33 -185 -51 307 288 163 -142 233 754 -368 -73 750 426 -788 184 536 -966
2174 -966 -829 734 -41 -1093 173 1028 -591 -940 1034 682 -1109 122 1506 -398 -985 1051 937
2191 937 -916 -387 1276 -296 -1305 535 503 -1236 -740 411 44 -689 -10 758 -473 91 697 226
2209 226 10 178 661 178 -251 17 96 -26 -595 -552 206 -41 -621 -191 632 -457 -923 598 452 -701
2229 -701 -338 1452 191 -960 899 1319 -855 -634 973 264 -1108 161 756 -706 -891 533 82
2246 82 -1284 -191 1121 -35 -631 541 588 -469 -76 1086 585 -588 129 809 -32 -460 318 410
2264 410 -387 -671 168 -116 -925 -313 417 -268 -296 48 606 -118 -420 633 664 -222 -197 690 396 -594 140
2285 140 837 -303 -593 109 613 -890 -381 377 -161 -805 -62 762 -278 -270 834 637 -321 93 1129
2304 1129 -175 -490 279 302 -604 -383 374 -294 -646 -336 398 -180 -601 152 417 -298 -203 941 440 -346
2324 -346 357 1008 167 -166 155 587 -541 -205 332 -79 -544 -347 113 -491 -429 194 46 -260 171 693
2344 693 342 49 498 416 334 -107 300 347 -159 -159 149 -417 -898 -157 285 -126 -872 140 611 -469 -173
2365 -173 544 535 -446 241 1176 -104 -299 477 551 -390 -429 592 77 -946 -97 750 -546 -854 438 344
2385 344 -950 -208 761 -155 -409 628 748 -309 -141 688 254 -447 444 414 -265 -482 -136 -124 -247 -293
2405 -293 -60 291 63 -318 38 320 -235 -6 962 502 -109 302 965 -181 -348 864 320 -878 -309
2424 -309 427 -594 -917 753 60 -865 -196 993 -210 -729 545 841 -303 -254 752 561 -184 219
2442 219 613 -267 -348 281 -126 -577 -226 211 69 -450 -223 177 -157 -150 477 119 338 142 234 381 188
2463 188 -53 262 288 -245 -604 290 -12 -669 93 532 -402 -703 769 433 -783 121 1039 -373 -454 1088
2483 1088 487 -761 -36 784 -355 -669 1018 360 -1126 -98 531 -293 -702 277 460 -480 99 578
2501 578 -55 -371 533 531 52 255 162 23 178 -121 42 -57 -135 -333 -151 200 -71 -561 229 396 -388 -250
2523 -250 741 247 -570 425 829 -372 -681 690 396 -623 184 949 -762 -621 812 377 -1106 -120
2541 -120 1024 -415 -221 1349 327 -933 669 1099 -334 -384 934 155 -743 124 783 -499 -580 231
2559 231 154 -38 -66 -216 -169 287 231 -139 206 417 22 -47 293 -253 -445 172 395 -137 1 733 -603
2580 -603 -692 356 541 -780 -480 709 -143 -702 547 574 -499 -128 811 211 -989 544 1037 -491
2598 -491 -561 984 -34 -981 175 340 -477 -812 422 182 -670 218 739 -236 -179 676 368 -68 244
2617 244 108 -461 66 199 -432 -11 92 -398 -80 553 -181 -361 245 322 -481 63 790 -179 -446 649
2637 649 770 -793 -36 1167 -115 -671 678 273 -544 -478 406 -350 -781 239 357 -817 -120 611
2655 611 283 -457 393 241 -300 -323 521 209 -323 541 230 -451 -335 317 11 -254 -39 -178 -125 -73 52
2676 52 -238 -22 -168 -103 190 566 -17 -77 371 290 -305 231 440 -609 -486 454 186 -763 26 615 -647
2697 -647 -363 749 213 -427 265 812 -64 -314 652 552 -514 -92 618 -227 -535 11 316 -761 -292
2716 -292 281 -244 -408 -181 -58 -445 -203 325 277 179 98 217 324 60 114 195 143 -401 -384 50 -111 -218
2738 -218 -206 -55 -366 -528 206 -45 -502 141 578 228 49 281 502 -160 -329 683 395 -522 -21 515
2758 515 -256 -658 209 160 -605 -287 263 15 -353 391 558 -185 374 534 79 -181 485 570 -269 32 -146
2779 -146 184 -141 -294 -41 96 -439 -373 -148 31 -199 -174 547 -100 -146 221 525 27 204 501 294 -191
2800 -191 77 491 -176 -441 166 79 -536 -330 439 -36 -430 1 142 -138 -125 503 257 -116 337 584 237
2821 237 -332 289 143 -224 -366 248 73 -225 -44 345 -91 -302 186 493 -91 -353 494 94 17 184
2841 184 423 -29 -281 128 339 -361 -223 198 -26 -686 73 145 -374 -133 174 -70 -225 -70 208 254 26
2862 26 219 170 -8 -28 127 -152 -330 -69 -266 -126 -198 -363 226 -35 -214 41 114 -214 -41 193 63 -405
2884 -405 208 634 42 -69 307 370 -290 -310 302 33 -597 9 312 -520 -557 359 86 -330 19 229 -125
2905 -125 109 531 370 88 -82 116 170 -380 58 70 -156 -195 -80 68 -217 -219 -265 9 -194 -135 175 349
2927 349 -172 -18 305 293 -370 375 485 -316 -205 475 138 -523 109 419 -237 -707 218 382 -468 -146
2947 -146 752 -189 -369 304 273 -168 -165 502 3 -237 4 355 -524 -223 471 -188 -574 29 -27 -244 -400
2968 -400 128 135 -89 18 81 172 443 28 243 269 70 -255 -43 57 -464 -308 452 -85 -547 54 320 -183
2990 -183 -408 377 304 -275 300 518 -42 -231 707 211 -410 -130 366 -232 -491 342 227 -583 30 331
3010 331 -145 -332 256 92 -368 -36 426 -1 -324 221 251 -56 173 159 -301 -196 347 -112 -127 69 -60
3031 -60 -350 101 -95 -392 18 399 167 -124 348 209 -218 140 518 -118 28 86 88 -665 3 397 -472
3052 -472 -333 592 -129 -748 332 602 -175 -562 471 112 -372 -21 189 -318 54 427 99 -356 57
3071 57 250 -413 -240 180 -149 -175 -53 -288 -25 -57 177 -68 115 203 -88 53 346 295 -298 -4 193 -172
3093 -172 -276 262 -1 -864 -177 158 -591 -303 459 52 -426 234 471 -282 -234 618 50 -479 217 443
3113 443 -243 -228 227 -205 -450 27 571 -62 -243 95 11 14 125 146 -51 169 242 56 19 -6 135 -61 183
3136 183 106 -275 -47 -166 -288 139 23 -11 -207 25 257 -525 -54 221 222 -22 378 179 -471 17 354
3157 354 128 -472 243 195 -219 -128 199 -66 -626 126 366 -307 -53 313 -130 -254 273 204 -156 169 67
3178 67 -48 -248 36 184 -35 -17 -15 51 -251 -29 -94 -299 -32 139 120 64 46 -95 312 366 -15 -43 407 47
3202 47 -282 140 -20 -297 -441 87 73 -466 -82 115 -233 -350 104 348 -279 -153 56 211 -268 329 266
3223 266 -333 130 396 -329 -225 195 192 -394 -291 95 -152 -310 -12 188 103 -252 246 11 -33 52 172 303
3245 303 -61 295 8 343 -291 -126 -243 21 -269 -173 245 -303 -151 13 229 -302 -37 310 55 -42 -20
3266 -20 324 90 -45 182 97 -108 -35 173 -319 9 33 -273 -452 -32 -97 -134 -168 85 87 -18 119 70 247
3289 247 -60 252 352 75 -5 -178 -118 -31 -80 27 -39 -213 -147 47 -308 -13 -373 295 316 -445 -84 61
3311 61 -23 9 410 87 -86 -59 145 3 -448 -265 -137 -174 38 -38 133 -30 -48 205 -201 -40 -6 249 -77
3334 -77 -70 376 72 -60 170 361 -215 -254 -41 -127 -264 30 175 -18 -317 -78 299 30 -66 76 171 -136
3356 -136 130 424 72 5 263 -54 -135 -110 194 -190 -221 -121 82 -182 -110 277 -74 218 -10 344 -179 366
3378 366 286 -115 107 -233 -76 35 -77 -71 58 -174 142 -128 -160 -211 -205 -8 -56 21 -70 222 238 4 -95 120
3402 120 -63 23 91 251 -177 -177 52 179 -136 -78 325 -146 -4 339 -24 -50 290 -96 -307 -8 361 171
3424 171 -12 88 86 -217 200 273 -110 -151 -109 -367 -94 -116 266 -365 14 163 -45 -71 71 -85 -108 242 -17
3447 -17 -79 -108 -32 -112 -332 30 237 -290 -45 181 18 -72 215 234 -424 -279 166 137 -229 190 193 51 90 169
3471 169 -8 -209 99 56 -351 -211 130 -134 28 37 63 -319 -162 -109 -56 86 139 -220 -157 -28 85 -74 94
3494 94 281 13 29 -156 -144 -212 277 -6 -349 -159 212 -138 -177 284 -119 124 -158 392 163 -238 192 121
3516 121 -359 -35 129 -342 -174 -18 80 -200 -63 80 -276 28 79 56 -310 373 100 -294 74 141 -73
3537 -73 204 113 137 -171 -160 126 -67 -356 59 46 -1 113 52 -199 56 337 99 -52 57 156 -83 194 128
3560 128 -51 -84 442 -37 -276 141 110 -5 -282 249 161 -48 -91 332 99 -31 258 258 93 60 413 85
3582 85 -95 207 -116 -157 -196 243 -149 50 125 156 -123 -13 -131 74 97 -111 153 89 67 0 -279 167 324
3605 324 -65 -68 -166 -147 -198 210 46 -415 -256 244 -83 -66 286 37 -126 292 197 -97 83 339 119 -76
3627 -76 156 377 -246 -211 23 10 -139 29 258 -193 -277 -16 -105 -108 139 148 -83 -55 7 76 -252 239 350 -159
3651 -159 40 -40 -163 -91 174 -126 -92 -205 -55 -67 150 -312 38 -198 255 97 -147 561 49 -184 32
3672 32 357 43 -106 -130 68 -293 161 81 -10 -461 149 -115 -2 62 -11 -134 -339 457 -22 -8 -188 -11
3694 -11 130 284 82 -165 10 24 -41 -59 116 182 -150 -8 -144 -40 342 85 -40 -127 186 -9 379 -54
3716 -54 -113 66 43 -140 112 -23 -79 -1 -141 37 -227 22 46 -348 327 -63 40 47 389 53 -215 372 -95
3739 -95 -403 145 -16 -76 -320 100 98 11 175 -102 -275 6 109 -247 -61 -74 128 -137 263 61 -77 185
3761 185 217 -112 63 -382 114 -212 369 11 -303 64 101 -343 -124 259 45 -140 20 63 -88 -79 42 76
3783 76 134 10 167 212 -135 -161 -58 -277 -74 -164 114 -15 -74 65 8 -97 -34 -169 63 -200 126 52 -239
3806 -239 -357 -5 -193 -84 166 129 23 -342 0 -377 34 -81 131 14 142 -209 -134 214 -140 199 -70
3827 -70 -229 286 -60 -109 -44 170 101 -176 20 114 -190 -172 -130 -5 109 269 109 -74 113 -200 140 317
3849 317 136 48 156 47 -54 -259 -176 -44 5 254 413 -182 -29 -68 130 29 80 27 18 56 -302 318 147
3872 147 40 -89 103 -127 -60 -133 -312 79 -64 -113 -369 -135 -156 53 -193 251 112 -114 356 3 122
3893 122 -66 -75 270 -132 87 -135 107 -114 -48 -318 -34 -263 -322 44 -108 -103 -202 358 365 48 -37 157 -73
3916 -73 -338 -54 -95 77 -85 138 -148 -87 -137 25 -132 -108 170 -237 -253 44 256 -119 -13 261 143 176
3938 176 39 53 -49 -84 254 24 -42 -76 124 -105 -108 112 -126 25 -148 71 -56 -5 -27 233 118 122 -106
3961 -106 87 -55 16 -246 43 -154 -453 109 -198 -186 -246 337 121 -413 112 154 -11 0 115 231 -20 113
3983 113 -262 -57 195 -80 -170 -258 177 181 -214 136 -46 -90 -31 213 -72 -47 -228 215 -110 142 -219 37
4005 37 -192 214 108 176 275 192 166 -31 14 10 -198 -217 47 -117 14 140 186 -74 216 29 79 120 -167 262
4029 262 -191 32 315 -278 195 -195 96 -116 -279 -293 -203 17 68 -161 -2 72 205 90 -97 410 -105
4050 -105 84 159 139 -21 47 -99 -21 -120 -302 -124 -77 -68 -50 50 42 90 -268 141 -60 -190 -200 68 -130 194
4074 194 -74 -114 -162 -19 -138 -153 4 -5 -7 -127 -230 -113 183 -2 -222 -114 -201 -118 152 154 -123 173 24 -153
4098 -153 108 175 113 125 231 185 -330 -312 40 105 -91 -58 -4 -235 -175 -88 99 -25 86 5 -212 306 157 -131
4122 -131 -68 1 -143 -339 -54 233 -212 -124 238 -53 -226 136 -172 -87 207 -79 75 14 -362 -38 -150 -53
4144 -53 -97 261 -59 -153 -265 -324 99 143 105 -88 -84 -150 16 140 164 -202 79 -60 80 -61 215 18 -65 -29
4168 -29 283 18 2 46 -3 -90 138 -378 -52 149 25 189 -188 -58 98 -24 -95 28 -132 -299 146 100
4190 100 -185 125 106 -172 -38 185 -20 136 -89 -84 75 -91 -43 169 -237 -102 -47 190 -187 139 116 -126
4212 -126 57 25 -51 -81 -101 -268 -197 98 -258 -130 83 110 134 62 94 107 -66 161 13 33 -75 116 22 103
4236 103 -60 -254 25 -122 -146 -175 32 248 -2 -128 15 6 -248 164 120 51 -101 -10 22 -9 -283 17 -128
4259 -128 -130 -153 279 16 56 177 172 -107 -88 73 172 108 172 -128 12 219 352 -10 -212 191 -39 -62 103 31
4283 31 -54 -187 67 -17 -127 42 -65 75 -166 -275 -181 -138 -33 81 -37 -32 91 90 192 -455 -13 -159 9
4306 9 -263 -278 227 44 77 -209 243 169 -77 -118 108 -175 -50 -217 15 293 42 105 124 -3 127 -4 120
4329 120 -173 270 108 5 -70 185 26 -33 -44 53 -189 -56 252 196 -31 30 -131 -268 -61 1 192 -100
4351 -100 72 -121 -290 -171 -82 49 183 93 70 101 -145 -29 -208 -130 4 441 -68 124 -23 83 43 -23
4373 -23 -86 -244 -159 38 23 76 135 -134 33 -40 -135 -46 41 166 -83 204 241 -109 -161 -19 -374 -207 -223 -184 77
4398 77 -233 55 -44 -362 55 8 -104 36 234 226 -87 -17 286 -21 -144 3 -248 37 -127 -71 51 -342
4420 -342 -182 -29 -269 -24 -287 154 270 -104 -35 -197 122 63 -64 -104 213 107 25 204 80 -65 -81 187
4442 187 -64 -218 308 -301 -7 370 -124 -22 190 196 149 4 -140 4 176 -79 -47 -88 51 50 -119 169
4464 169 75 50 136 -90 -25 127 47 -9 -195 -37 -19 -69 322 -47 18 -333 31 65 -239 34 178 32 -131
4487 -131 -36 5 27 97 -182 5 291 152 335 -259 53 121 118 76 133 81 4 178 9 -146 -243 119 5 -204
4511 -204 27 181 145 72 38 47 7 105 24 16 -83 -63 197 8 10 -68 -99 196 -257 -374 -48 67 -59 44 -111
4536 -111 -16 106 7 73 36 -80 -148 148 -34 61 232 -209 19 -41 75 106 -66 201 91 -101 -93 27 1 3
4560 3 -33 -94 26 109 15 -46 54 64 93 -84 53 178 -83 -284 -31 262 123 -267 209 121 -164 -62 88
4583 88 52 205 194 19 246 -54 -17 147 -278 151 -225 -18 -121 -221 129 -7 -112 154 -35 80 53 99
4605 99 -131 252 182 115 186 -112 105 57 -51 -145 1 -125 -93 -85 42 0 -94 -38 -96 23 291 12 -306 -302 -32
4630 -32 -126 142 52 22 -156 90 123 -17 271 99 -141 44 125 241 48 22 -199 -134 -129 -74 127 -109 25 59
4654 59 -196 -77 88 -152 239 -6 86 -25 195 -19 71 -257 -29 -115 -86 62 300 -212 -48 -34 -157 -45
4676 -45 211 251 -14 39 -148 -82 -70 -210 -109 -125 12 86 313 123 28 55 -63 36 4 -66 135 117 -59 -1 311
4701 311 -23 77 102 37 109 18 -263 75 -69 -69 154 110 -310 262 283 -287 157 -62 -247 -20 391 57 17
4724 17 -297 12 -136 25 10 -46 -88 -38 -48 64 66 -144 109 -84 55 -48 278 60 169 -57 33 -59 397
4747 397 156 -125 31 18 3 -42 242 -192 -105 101 83 66 52 -6 61 28 -125 -91 130 59 147 -77 -134 -12 172
4772 172 -60 -108 36 34 102 -92 -254 82 106 155 43 123 36 -30 166 197 -95 171 80 163 -138 66 134 86 9
4797 9 -7 30 -132 -9 -115 96 -56 -111 49 -56 -103 245 -3 93 30 176 152 -65 -13 233 189 143 -99 111
4821 111 16 -311 165 157 151 -70 -94 97 79 -335 316 72 186 117 -54 190 49 -37 -216 290 -246 -154 1
4844 1 219 2 -204 -14 68 139 -87 8 30 -49 188 65 8 -281 21 238 89 -270 227 32 -12 329 -247
4867 -247 76 35 -72 -47 53 -54 151 201 17 33 -57 -116 35 -10 24 52 -39 7 14 -5 68 193 -2 45 33 -91
4893 -91 -50 25 78 5 198 173 -351 155 14 -77 140 -116 56 33 106 242 -32 8 223 -252 -278 -19 -153 -172
4917 -172 -52 125 160 349 31 96 52 0 154 -48 128 -84 43 -44 -281 -3 -269 81 -9 106 151 34
4939 34 16 125 208 -78 163 28 -135 68 -103 -239 99 99 -29 -69 129 127 -99 -111 87 -225 -243 -170 28 -2
4963 -2 60 -24 -87 -114 -24 303 123 -44 -356 29 85 277 53 -113 0 -77 139 25 -262 66 310 -46 -51 -305
4987 -305 -58 48 161 -72 171 197 -85 -187 -113 -221 168 -49 167 -140 -218 -185 -238 94 63 -109 19 64
5009 64 26 -17 40 72 -41 -40 120 255 156 7 274 127 27 83 -68 -273 -158 -149 -80 -242 -108 -26 -160 -54
5033 -54 52 130 68 -84 -14 21 -235 28 212 63 30 -56 64 -35 3 79 295 8 220 149 133 163 85 191 -58
5058 -58 -112 -172 -57 86 -43 48 94 30 -240 2 106 -41 -264 49 -15 -43 88 -127 192 -13 -214 52 -89
5081 -89 49 124 -79 52 -116 4 -88 -304 65 86 231 290 229 116 -51 -59 126 -21 220 235 114 -102 -256
5104 -256 227 -112 116 -268 14 162 16 -7 -81 239 53 -122 -238 -37 284 -43 152 -51 -30 258 -218
5125 -218 -203 79 -150 60 168 -77 140 -133 275 -20 -106 -10 74 29 -104 166 94 261 -123 148 214 261 -39
5148 -39 107 146 -130 -258 -179 24 -13 -137 43 -92 117 -32 28 69 19 1 104 0 53 276 -69 19 -188
5171 -188 139 101 53 -50 168 -20 -135 -62 92 -157 -89 39 143 -267 -62 80 -96 -10 -108 -3 -99 42
5193 42 6 146 104 -29 -97 -265 -65 45 -11 141 -111 -103 184 107 235 -56 35 -151 -47 -19 42 -96 -135 27
5217 27 -296 -252 -146 -87 -221 61 87 -131 -34 33 106 -106 -202 176 8 -85 -101 21 174 -60 46 -38 165 185
5241 185 114 104 155 -306 13 -241 -278 226 249 -78 -146 212 -73 45 -15 223 -34 154 56 -100 -123 80 -54
5264 -54 217 -136 -44 128 -127 -53 43 27 48 159 -113 -209 63 -117 88 9 -231 103 11 -52 163 -96 59
5287 59 53 -73 -34 181 22 -313 -39 -47 158 -114 177 -48 -105 -193 -123 -124 -228 -87 -384 256 -58 182 -99 31
5311 31 304 -210 385 -160 175 4 -50 -141 22 161 35 -267 424 -210 270 -151 -284 -69 49 -148 5
5332 5 -74 158 124 83 251 44 3 90 62 64 -27 -16 -73 -41 120 -136 121 25 77 -351 198 -67 162 142 200 70
5358 70 199 -199 202 -153 -293 -56 91 93 -167 -290 15 14 24 -8 -246 194 40 55 29 -80 -2 -23 120 259
5382 259 72 -242 -295 194 -78 164 72 -186 -241 -164 23 -388 -101 136 70 -60 -255 -156 246 200 -72 -114 76
5405 76 -21 245 83 -2 109 54 -87 28 -30 -27 -217 -81 -34 326 -172 -121 27 22 29 -38 28 70 261 350 -197 5
5431 5 264 216 -29 151 258 -356 -162 -17 117 77 48 182 -156 -153 83 75 121 -10 -269 -72 25 85 -148 -69
5455 -69 -134 290 -34 -28 154 -278 106 -242 86 -216 -353 -191 252 -37 -47 49 36 83 47 -231 97 -236 87
5478 87 -109 134 4 -59 168 -158 -341 -231 96 81 255 -12 74 -67 -3 -128 -187 138 -154 47 -158 -4
5500 -4 4 35 -106 -93 108 72 168 -247 216 71 -78 69 66 -118 -303 44 233 -206 163 272 278 102 35 -49 133
5525 133 55 56 83 15 -208 -96 -157 247 171 50 -178 32 114 77 131 139 -138 -5 -228 51 -74 79 114 -19
5549 -19 226 82 -101 -12 -190 2 106 182 39 -58 23 -7 -30 78 -189 -17 -203 61 138 -239 -114 -201 91
5572 91 -87 -263 -217 -12 -192 132 -185 -50 -23 8 6 -84 138 23 19 -81 62 -49 109 -253 290 -127 -104
5595 -104 64 -305 -266 145 -1 -26 -20 112 -1 -4 -159 20 105 -71 243 293 -81 140 -21 80 47 140 -9
5618 -9 42 -231 87 19 -316 -58 -201 122 21 -37 -156 -66 -180 -153 -266 231 -66 162 177 -79 -2 -14 -37 -166
5642 -166 -155 -57 -158 -25 -160 -208 -145 -37 128 -13 276 352 233 -39 212 -105 105 -90 -276 -40 70 127
5664 127 -51 85 -152 -263 159 175 205 151 104 -2 -134 -42 376 169 -146 110 189 -121 106 -127 -243 55
5686 55 -12 -104 12 105 1 -276 -55 -50 -33 141 216 -73 -198 50 90 226 7 -51 160 -94 -48 188 -136 -153
5710 -153 -155 46 -230 0 -81 38 -14 -40 -71 98 -121 -21 -108 -2 -117 57 -137 143 74 -147 121 88 170
5733 170 38 -132 -262 -13 40 5 -36 22 69 -48 214 287 50 84 -23 -127 -90 152 112 53 106 30 -221 125
5757 125 -3 -60 -215 10 -90 14 -203 -86 65 46 -107 73 -9 73 85 -3 79 46 241 -76 -150 -292 -100
5780 -100 -41 57 -109 -125 106 85 -51 220 94 18 -317 -232 79 -69 95 33 46 59 262 20 158 84 -80
5803 -80 34 134 58 -118 -359 -173 -85 236 60 117 105 -57 225 -136 -33 -70 135 173 -14 1 -52 -172 151
5826 151 113 207 50 -109 -241 169 -240 177 74 46 50 -93 146 41 -159 77 -7 69 -147 -183 -245 -81 226
5849 226 56 -38 -22 -46 14 -60 -29 -3 -37 71 173 -101 -159 204 -135 105 -123 90 -81 -267 -257 1 -22 36
5873 36 -231 87 73 -160 19 209 -117 177 179 75 301 -39 49 -267 -62 -2 187 -108 184 280 -180 32
5895 32 204 -344 440 291 229 104 -4 134 -117 -27 171 -173 -76 -165 116 157 -201 66 -110 -59 68 43 99
5918 99 -130 -107 49 168 -91 113 -156 -119 -106 156 -280 38 160 -134 37 95 87 3 -75 -123 -71 127 -145 -249
5942 -249 107 141 -114 41 10 1 -139 68 -143 -165 -118 -38 -215 -21 156 -99 187 106 -229 -195 -107 -155 -135 -262
5966 -262 -147 -60 271 -86 70 177 -69 38 101 45 -218 -34 -4 -13 9 256 -220 60 -38 89 26 -31 41 -32
5990 -32 43 97 -91 -51 -55 191 127 -98 -291 139 354 17 65 -51 203 -205 333 226 24 -4 -161 54 -232
6013 -232 31 174 -205 -39 -46 -9 33 -26 -83 315 -47 192 -79 -84 0 60 -85 -288 320 36 -17 5 18 143
6037 143 35 -79 -186 -247 12 0 -150 -207 -13 -91 18 -47 -83 44 4 206 108 -189 325 107 65 162 49
6060 49 54 206 52 -95 -20 -231 -55 77 -1 96 -164 -127 28 -189 -6 -60 200 113 -119 28 -84 18 54
6083 54 -81 -152 116 -291 30 47 15 18 -98 84 -215 -123 -132 -52 -33 73 129 116 74 -169 -69 248 113 -155 -52
6108 -52 6 52 34 -65 58 -46 -3 178 -17 -7 16 165 -244 -118 166 -91 -95 -79 62 -92 43 -148 -171 10
6132 10 130 67 8 -47 138 146 33 213 -11 8 -87 6 -91 -28 34 27 -86 -63 55 -14 -122 122 -90 -3 239 -338
6158 -338 -26 198 52 -113 123 129 -8 -144 -16 -257 -114 20 -220 286 -136 3 -5 4 112 -215 37 221
6180 221 -5 29 -325 -35 -115 -186 47 164 55 -195 -212 82 2 -119 -30 69 300 15 86 54 108 -45 22 37
6204 37 90 -244 -34 69 -62 -199 70 -25 -5 -288 -206 184 -139 137 -78 201 99 198 207 -5 -20 64 77 200
6228 200 150 -173 -157 130 44 170 -52 348 -95 59 45 194 382 -12 -190 -122 111 -83 32 48 18 49 66
6251 66 12 241 -7 220 -139 249 210 -78 -40 51 111 -272 45 -76 82 195 57 -111 -7 -60 28 -178 216
6274 216 -147 266 228 101 -76 -37 -108 -138 -261 12 191 -47 -105 179 -27 204 -170 -112 -75 125 -12 160
6296 160 -35 -253 -106 69 93 -118 -43 -23 65 182 -17 56 -208 -209 -271 212 23 181 6 167 105 -138 8
6319 8 -309 -117 77 260 76 86 -108 -141 176 220 23 -36 213 -99 -277 84 -140 298 -90 14 -213 -301
6341 -301 104 -145 -65 72 19 161 -41 -252 102 85 -162 93 17 41 -103 -28 50 35 158 -199 99 30 -93
6364 -93 -49 18 175 -10 -86 35 238 110 182 125 -23 -92 5 -102 308 -8 46 -89 -211 79 64 85 -380 -113
6388 -113 -50 67 -115 -21 50 359 -14 27 -229 -71 -91 -93 -150 -27 130 189 108 -47 -141 51 -59 46 69 58
6412 58 44 -123 22 -90 93 -14 -180 15 -93 211 -180 -172 120 -142 5 -143 -118 -32 -175 28 -31 -222
6434 -222 -16 9 -123 -309 55 -44 158 219 -96 -42 78 -124 -174 -206 98 -9 65 -26 -111 15 306 -181 -193
6457 -193 -1 -62 133 28 88 -315 -83 38 236 -217 24 100 -182 -21 335 62 -40 -52 -386 -76 72
6478 72 -113 226 187 -106 -67 40 8 124 -198 -81 189 -85 -32 7 165 74 112 -66 -220 -200 54 32 84 -303
6502 -303 10 282 15 -46 196 210 -71 10 25 -85 -247 275 -82 110 61 -23 327 -57 -113 -197 -182 -204 100
6525 100 -75 -111 83 -236 -35 -85 -7 131 -47 34 -14 -333 258 108 92 -145 190 62 -69 67 -135 -88
6547 -88 80 -34 -125 -37 -142 -86 68 -126 67 83 -7 -126 42 -277 40 -27 62 -190 -140 -191 -45 269 23
6570 23 90 -11 181 -231 -60 -126 117 294 110 -42 177 315 161 146 -52 28 160 4 -151 -40 -57 281
6592 281 169 -197 -114 -7 11 -171 150 176 -140 -116 -21 -148 -97 7 15 -30 212 -68 308 -112 215 -264 209
6615 209 55 -110 54 18 -108 -149 138 -8 -91 69 -84 22 -38 157 7 -153 160 -1 -50 46 -212 -25
6637 -25 118 104 95 -146 -61 411 1 47 98 104 -249 94 59 12 102 158 61 216 -128 -88 84 34 -45 -43 262 207 45
6664 45 160 -31 -122 223 -58 100 19 69 183 -6 -248 -12 131 -1 64 -97 216 26 164 460 -59 72
6686 72 94 62 -87 322 -129 81 88 116 -94 37 -101 -51 55 -96 18 -126 -134 79 -98 104 59 70 -258 -284
6710 -284 -95 -461 140 -157 -146 70 -111 51 -24 16 -46 -31 -10 -136 227 9 89 68 -59 262 -280 156 -73
6733 -73 69 248 -106 63 16 97 -232 70 44 -78 73 -194 121 -88 12 -69 242 -86 -340 172 -17 -39
6755 -39 72 119 39 -56 -77 -211 251 -253 -61 185 -157 152 33 55 19 68 -60 -146 -299 169 -72 -176 -24
6778 -24 108 88 -231 -105 -196 -266 -142 14 -70 190 -93 280 105 -47 -169 -137 -58 -67 -75 -36 -80 -231 227 3
6802 3 69 1 -19 221 -216 125 -70 -105 129 -222 -80 -201 -62 47 85 206 -122 101 3 71 -209 171 205
6825 205 -310 97 152 53 87 68 -131 7 35 -71 91 -14 45 17 -56 -31 -42 186 -122 91 131 -64 -266 92
6849 92 48 -250 19 -103 187 -147 51 35 61 98 -213 -61 -134 37 -54 119 -9 -45 32 -40 -98 318 101 118
6873 118 191 26 -113 -96 -253 -159 -124 26 -17 24 -108 140 -193 19 147 -43 -134 103 54 -35 -14 -277 113
6896 113 -177 -135 -36 298 -104 -85 76 -175 103 124 55 176 -216 -23 168 -112 22 88 -47 -106 -197 -64 -95
6919 -95 -45 359 232 -336 -60 94 109 68 127 -68 -153 -106 8 132 -94 38 -72 359 109 -70 39 -6 -77
6942 -77 -53 70 -26 29 147 21 -16 -66 -487 57 -32 -83 78 103 -1 -3 32 -45 -56 -11 -277 -223 -199 151 216 107
6968 107 -79 39 6 285 114 111 256 -213 215 -99 50 212 -123 -88 -282 100 -102 -30 80 -74 -129 18
6990 18 27 -156 -12 46 -51 -91 -180 -490 -34 32 86 -156 103 116 -100 128 60 -158 -98 -185 -56 -201 256 -48
7014 -48 360 152 -87 -19 17 141 44 315 -124 199 -13 221 -107 -245 7 76 -298 122 -70 -8 -145 -63
7036 -63 30 -69 33 159 -78 -302 174 1 189 67 101 -184 110 -13 15 39 -21 -100 17 -40 100 76 102 -21
7060 -21 102 -207 73 -125 185 124 -4 114 -185 -182 -106 -254 198 103 225 -254 212 -1 -44 -410 107 -37
7082 -37 -157 47 139 74 -81 178 -98 126 -68 33 -79 2 -192 229 468 -151 56 20 187 -8 -58 -102
7104 -102 -291 74 215 156 134 76 -12 48 -82 -158 32 -50 228 4 -148 -39 270 167 -141 -359 -92 -13 150
7127 150 22 -312 -24 228 -164 8 -79 -62 -42 -156 213 7 -143 -85 -77 53 95 -103 176 -18 -6 -331 143
7150 143 145 45 3 72 -6 -306 110 -107 248 -117 104 -64 -143 5 -237 -62 -192 -175 -14 -184 -144 23 -164
7173 -164 -293 -133 -258 161 -141 150 14 -240 37 -32 52 116 71 -192 -35 -95 64 9 -118 78 19 59 -8
7196 -8 67 93 50 206 -292 363 -183 56 123 68 -14 -11 11 234 218 62 -130 -125 -104 120 192 -128 -11 103 -85
7221 -85 -113 -256 251 -54 -107 45 6 -58 -149 28 -26 128 154 -311 -190 -112 61 104 -68 13 114 -101 25 -31
7245 -31 -344 -215 143 125 -218 24 150 26 164 -38 4 84 93 -212 225 -99 4 130 -246 -46 -44 -63 71
7268 71 -52 -189 63 -148 -112 40 221 -143 -128 58 -17 -20 -224 -29 -39 -116 -228 -218 121 97 112 283 152 -158
7292 -158 44 -32 62 216 31 -87 -280 0 55 -10 -18 -247 -59 8 -23 90 33 -51 129 -26 -193 85 -62
7315 -62 65 -144 114 70 139 295 153 169 -174 216 0 210 -166 -127 -151 -53 -5 119 194 -130 35 151 203
7338 203 -139 -144 -332 -109 -195 23 -82 183 27 -48 69 78 -127 123 -224 238 92 129 -107 -39 178 23 -42
7361 -42 118 129 -46 -90 22 289 71 -66 66 152 101 118 -20 48 183 -133 156 -26 11 259 216 -35 -140
7384 -140 -23 -75 58 156 -131 -12 -20 -298 234 46 54 13 -61 163 -37 -49 -2 8 213 80 239 23 335 2
7408 2 16 80 69 -13 51 59 237 146 123 158 -150 -208 0 71 136 -71 -17 21 189 -96 75 175 56 -86 96 219
7434 219 169 -211 41 -244 -14 92 -137 45 15 -140 173 -109 61 65 -86 29 167 -3 23 -147 15 28
7456 28 -309 -211 34 8 -7 -63 -134 -33 -126 -201 51 87 64 92 -161 -51 110 162 -13 178 99 323 -118 -98 -69
7481 -69 -164 -200 340 104 91 -177 34 -29 -1 -120 -69 130 -163 62 -108 18 -9 318 -147 188 35 84 155
7504 155 -168 48 -22 151 -113 245 173 -104 265 20 -28 48 -69 210 -299 46 -70 -31 102 154 227 -200
7526 -200 115 -235 -235 160 -199 19 105 6 30 -29 200 -58 111 163 -173 -28 -255 98 6 -232 54 110 -204
7549 -204 -24 -137 -76 -30 -15 47 270 39 -123 -156 -158 54 81 -84 -243 -334 128 -34 -114 79 58 -30 -260 -97
7573 -97 297 -344 3 -125 -87 -172 -257 -97 85 -37 -220 37 112 -260 -287 -37 -209 -2 -81 51 27 196 198
7596 198 110 -95 -128 332 -13 -134 172 71 -50 72 57 5 122 -289 -57 -164 -108 -203 -34 -511 224 -55
7618 -55 30 -182 126 270 -214 -119 186 226 -41 92 254 -93 -96 -138 57 -140 105 364 33 47 52 -143 70
7641 70 -78 23 98 106 201 -39 -100 148 259 27 -143 -20 110 -47 -164 -155 112 -110 -221 -157 -88 69 -111
7664 -111 38 167 -161 -154 -65 -16 -177 -409 192 266 83 268 210 54 150 53 -50 78 -86 74 157 -104 125
7687 125 125 -103 -29 -84 103 32 -57 -9 -5 -156 18 301 49 -166 115 187 -244 143 -186 -31 -37 -6 -11 -153 -61
7712 -61 -98 3 -208 -223 72 -167 -83 76 -10 252 -50 -19 75 12 -6 141 64 186 -86 -16 -77 78 145 -66
7736 -66 -112 280 22 144 79 34 271 289 -211 -111 111 -119 -58 51 180 -7 135 38 200 78 48 18 -33
7759 -33 99 278 -86 199 79 -59 -48 -70 180 132 2 -158 -104 -248 -176 -274 -150 -158 -96 130 45 53 109 -130 4
7784 4 150 121 -156 81 -16 55 -279 -100 -7 156 -32 -269 84 -67 -11 -187 143 39 93 -3 108 -210 342
7807 342 206 136 -88 -57 63 -100 42 162 19 151 -147 51 -4 234 262 -70 -40 -131 -35 -126 -90 -83 -107 0
7831 0 -11 -105 229 -55 161 241 265 -54 -53 129 -291 -145 70 -165 -43 -129 -111 -41 -150 238 -172 160 98 44
7855 44 96 40 144 -190 -38 214 244 -85 -24 145 120 -89 15 -228 -47 144 -126 -34 -12 7 -244 185 40
7878 40 -126 61 250 -82 142 -12 -160 -111 142 -56 101 -126 129 -134 -50 64 173 218 -31 -376 79
7899 79 -184 -26 -228 -104 24 -7 -89 -256 43 87 102 -298 104 22 -210 367 17 143 114 118 191 -196 204
7922 204 -37 -120 168 -155 176 -36 -161 -425 -183 139 -243 -114 -115 21 11 52 -196 -284 -110 -107 -79 -200 -162
7945 -162 -255 -48 112 -54 254 30 19 -23 -137 -30 -96 -254 179 -112 180 78 -72 -439 -16 114 -9
7966 -9 -71 174 -99 56 -89 226 -23 95 136 91 78 9 142 -260 352 -222 -97 89 -40 56 105 -174 -29
7989 -29 100 -90 -189 -266 -223 73 167 -1 3 74 123 -147 -22 43 70 70 -71 -136 -120 -227 167 132 132 -10 -56 -12 -210
8016 -210 47 77 181 62 128 -147 -221 75 -86 -195 137 -215 48 -71 114 -94 -171 -226 287 -248 -18 -80
8038 -80 212 30 30 -36 -26 82 -92 177 36 -81 95 -240 56 36 288 -59 -38 24 277 78 -246 -81 21
8061 21 39 48 27 -479 229 137 81 34 90 -79 65 -101 181 61 -43 87 1 135 -406 -181 -157 -304 -71 -116
8085 -116 -126 -23 137 -82 245 -117 -283 -68 98 -18 51 -139 111 -142 -75 24 -74 -115 138 271 62 175
8107 175 164 117 233 34 -7 -44 33 74 161 -104 -123 6 -114 300 -82 31 -182 -196 100 -109 -58 -114 -96 -286
8131 -286 -85 40 58 -63 63 31 -38 -59 283 213 -207 28 -95 179 -183 -48 -125 -124 -244 48 -174 47 44
8154 44 -219 109 113 32 -304 -105 264 34 -44 -256 -154 253 94 43 40 -77 52 53 234 21 59 -370 19 -146
8178 -146 -394 172 11 -128 -21 -162 63 172 46 72 11 -112 -6
8191f
##END NTUPLES=NMR FID
##END=
