##TITLE=1H_ART-OOH(10g)-f4-7
 CDCl3
 8 sc, 
 27.4.2024
##JCAMPDX= 6.0         $$ Bruker NMR JCAMP-DX V2.0
##DATA TYPE= NMR FID
##DATA CLASS= NTUPLES
##ORIGIN= UXNMR, Bruker Analytische Messtechnik GmbH
##OWNER= root
$$ XWIN-NMR		Version 3.5
$$ Sat Apr 27 15:49:58 2024 Russian Standard Time (UT+4h)  she@DPX200
##.OBSERVE FREQUENCY= 200.1309
##.OBSERVE NUCLEUS= ^1H
##.DELAY= (6, 6)
##.ACQUISITION MODE= SIMULTANEOUS
##.ACQUISITION SCHEME= undefined
##.AVERAGES= 10
##.DIGITISER RES= 18
##SPECTROMETER/DATA SYSTEM= spect
##.PULSE SEQUENCE= zg30
##.SOLVENT NAME= CDCl3
##.SHIFT REFERENCE= (INTERNAL, CDCl3, 0, 15.7039)
##AUDIT TRAIL= $$ (NUMBER, WHEN, WHO, WHERE, WHAT)
$$ ##TITLE= Audit trail, XWIN-NMR		Version 3.5
$$ ##JCAMPDX= 5.01
$$ ##ORIGIN= Bruker BioSpin GmbH
$$ ##OWNER= she
$$ F:/spectra/data/she/nmr/H-F/1/audita.txt
$$ ##AUDIT TRAIL=  $$ (NUMBER, WHEN, WHO, WHERE, WHAT)
(   1,<2024-04-27 15:48:24.06 +0400>,<she>,<DPX200>,
      <created by zg, POWCHK disabled, PULCHK disabled
       terminated by command 'halt'
       configuration hash MD5:
       00 E9 B6 7A A2 85 ED C7 34 08 36 98 17 FE 4E 26
       data hash MD5: 16K
       35 93 B6 B8 A9 58 5E 3B 86 A4 B6 C1 F9 CF 99 48>)
$$ ##END=
$$ 
$$ hash MD5
$$ 5D 57 F1 70 29 34 57 94 80 67 08 7A 3F 42 E6 B5
##$RELAX= 
##$RELAX= 
##$RELAX= 
##$RELAX= 
##$RELAX= 
##$RELAX= 
$$ Bruker specific parameters
$$ --------------------------
##$DU= <F:/spectra>
##$EXPNO= 1
##$NAME= <H-F>
##$PROCNO= 1
##$TYPE= <nmr>
##$USER= <she>
##$AMP= (0..31)
100 100 100 100 100 100 100 100 100 100 100 100 100 100 100 100 100 100 
100 100 100 100 100 100 100 100 100 100 100 100 100 100 
##$AQSEQ= 0
##$AQ_mod= 1
##$AUNM= <au_zg>
##$AUTOPOS= <>
##$BF1= 200.13
##$BF2= 200.13
##$BF3= 200.13
##$BF4= 200.13
##$BF5= 200.13
##$BF6= 200.13
##$BF7= 200.13
##$BF8= 200.13
##$BYTORDA= 1
##$CFDGTYP= 0
##$CFRGTYP= 5
##$CHEMSTR= <none>
##$CNST= (0..31)
1 1 145 1 1 1 1 1 1 1 1 1 1 1 1 1 1 1 1 1 1 1 1 1 1 1 1 1 1 1 1 1 
##$CPDPRG= <>
##$CPDPRG1= <>
##$CPDPRG2= <>
##$CPDPRG3= <>
##$CPDPRG4= <mlev>
##$CPDPRG5= <mlev>
##$CPDPRG6= <mlev>
##$CPDPRG7= <mlev>
##$CPDPRG8= <mlev>
##$CPDPRGB= <>
##$CPDPRGT= <>
##$D= (0..31)
0 1.2 0 0 0 0 0 0 0 0.06 0 0.03 0 0 0 0 0.0002 0 0 0 0 0 0 0 0 0 0 0 0 
0 0 0 
##$DATE= 1714218503
##$DBL= (0..7)
120 120 120 120 120 120 120 120 
##$DBP= (0..7)
150 150 150 150 150 150 150 150 
##$DBP07= 0
##$DBPNAM0= <>
##$DBPNAM1= <>
##$DBPNAM2= <>
##$DBPNAM3= <>
##$DBPNAM4= <>
##$DBPNAM5= <>
##$DBPNAM6= <>
##$DBPNAM7= <>
##$DBPOAL= (0..7)
0.5 0.5 0.5 0.5 0.5 0.5 0.5 0.5 
##$DBPOFFS= (0..7)
0 0 0 0 0 0 0 0 
##$DE= 6
##$DECBNUC= <off>
##$DECIM= 32
##$DECNUC= <off>
##$DECSTAT= 4
##$DIGMOD= 1
##$DIGTYP= 9
##$DL= (0..7)
0 120 120 120 120 120 120 120 
##$DP= (0..7)
150 150 150 150 150 150 150 150 
##$DP07= 0
##$DPNAME0= <>
##$DPNAME1= <>
##$DPNAME2= <>
##$DPNAME3= <>
##$DPNAME4= <>
##$DPNAME5= <>
##$DPNAME6= <>
##$DPNAME7= <>
##$DPOAL= (0..7)
0.5 0.5 0.5 0.5 0.5 0.5 0.5 0.5 
##$DPOFFS= (0..7)
0 0 0 0 0 0 0 0 
##$DQDMODE= 0
##$DR= 18
$$ [...]
##$SUBNAM2= <"">
##$SUBNAM3= <"">
##$SUBNAM4= <"">
##$SUBNAM5= <"">
##$SUBNAM6= <"">
##$SUBNAM7= <"">
##$SUBNAM8= <"">
##$SUBNAM9= <"">
##$SW= 18.0517689322627
##$SWIBOX= (0..15)
0 0 2 0 0 0 0 0 0 0 0 0 0 0 0 0 
##$SW_h= 3612.71676300578
##$TD= 16384
##$TD0= 1
##$TE= 0
##$TE2= 300
##$TE3= 300
##$TEG= 300
##$TL= (0..7)
0 120 120 120 120 120 120 120 
##$TP= (0..7)
150 150 150 150 150 150 150 150 
##$TP07= 0
##$TPNAME0= <>
##$TPNAME1= <>
##$TPNAME2= <>
##$TPNAME3= <>
##$TPNAME4= <>
##$TPNAME5= <>
##$TPNAME6= <>
##$TPNAME7= <>
##$TPOAL= (0..7)
0.5 0.5 0.5 0.5 0.5 0.5 0.5 0.5 
##$TPOFFS= (0..7)
0 0 0 0 0 0 0 0 
##$TUNHIN= 0
##$TUNHOUT= 0
##$TUNXOUT= 0
##$USERA1= <user>
##$USERA2= <user>
##$USERA3= <user>
##$USERA4= <user>
##$USERA5= <user>
##$V9= 5
##$VALIST= <valist>
##$VCLIST= <CCCCCCCCCCCCCCC>
##$VD= 0
##$VDLIST= <DDDDDDDDDDDDDDD>
##$VPLIST= <PPPPPPPPPPPPPPP>
##$VTLIST= <TTTTTTTTTTTTTTT>
##$WBST= 1024
##$WBSW= 4
##$XGAIN= (0..3)
0 0 0 0 
##$XL= 0
##$YL= 0
##$YMAX_a= 342578
##$YMIN_a= -382004
##$ZGOPTNS= <>
##$ZL1= 120
##$ZL2= 120
##$ZL3= 120
##$ZL4= 120
##$ABSF1= 10
##$ABSF2= 0
##$ABSG= 5
##$ABSL= 3
##$ALPHA= 0
##$AQORDER= 0
##$ASSFAC= 0
##$ASSFACI= 0
##$ASSFACX= 0
##$ASSWID= 0
##$AUNMP= <proc_1d>
##$AZFE= 0.1
##$AZFW= 0.1
##$BCFW= 1
##$BC_mod= 2
##$BYTORDP= 1
##$COROFFS= 0
##$CY= 11.3945322036743
##$DATMOD= 1
##$DC= 2
##$DFILT= <>
##$DTYPP= 0
##$F1P= 15.6554695791079
##$F2P= 12.8336369535428
##$FCOR= 0.5
##$FTSIZE= 0
##$FT_mod= 4
##$GAMMA= 1
##$GB= 0.15
##$INTBC= 1
##$INTSCL= 1
##$ISEN= 128
##$LB= 0.24
##$LEV0= 0
##$LPBIN= 0
##$MAXI= 10000
##$MC2= 0
##$MEAN= 0
##$ME_mod= 0
##$MI= 1.114404
##$NCOEF= 0
##$NC_proc= 0
##$NLEV= 6
##$NOISF1= 3.799351
##$NOISF2= 2.8
##$NSP= 1
##$NTH_PI= 0
##$NZP= 0
##$OFFSET= 15.70392
##$PC= 1
##$PHC0= -25299.04
##$PHC1= 4.187311
##$PH_mod= 1
##$PKNL= yes
##$PPARMOD= 0
##$PSCAL= 0
##$PSIGN= 0
##$REVERSE= no
##$SF= 200.130013532006
##$SI= 16384
##$SIGF1= 3
##$SIGF2= 2
##$SINO= 400
##$SIOLD= 16384
##$SREGLST= <1H.CDCl3>
##$SSB= 0
##$STSI= 0
##$STSR= 0
##$SW_p= 3612.71676300578
##$SYMM= 0
##$S_DEV= 0
##$TDeff= 0
##$TDoff= 0
##$TI= <>
##$TILT= no
##$TM1= 0
##$TM2= 0
##$TOPLEV= 0
##$USERP1= <user>
##$USERP2= <user>
##$USERP3= <user>
##$USERP4= <user>
##$USERP5= <user>
##$WDW= 1
##$XDIM= 8192
##$YMAX_p= 0
##$YMIN_p= 0
$$ End of Bruker specific parameters
$$ ---------------------------------
##NTUPLES= NMR FID
##VAR_NAME=  TIME,          FID/REAL,        FID/IMAG
##SYMBOL=    X,             R,               I
##VAR_TYPE=  INDEPENDENT,   DEPENDENT,       DEPENDENT
##VAR_FORM=  AFFN,          ASDF,            ASDF
##VAR_DIM=   8192,          8192,            8192
##UNITS=     SECONDS,       ARBITRARY UNITS, ARBITRARY UNITS
##FACTOR=    0.0002768,     1,               1
##FIRST=     0,             0,               0
##LAST=      2.2672688,     0,               0
##MIN=       0,             -382004,         0
##MAX=       2.2672688,     342578,          0
$$ Real data points
##PAGE= N=1
##DATA TABLE= (X++(R..R)), XYDATA
$$ [...]
1906E3J9J46l74L00k01L35j9m4m55O6L16k17J55J4K6k01K4K31l93m0M10j14o9
$$ 53 72 218 -156 144 -57 278 259 215 -240 -174 142 -75 80 94 120 -81 -57 174 -219 -259 151 37 -32
1929c2L77l64k4L56o54K44j2K48J28k20k93M22j71j98K91J5n16K73J26M7l7M3
$$ -32 345 -19 -43 313 -341 -97 -109 139 267 47 -246 176 5 -193 98 113 -403 -130 -4 43 6 49
1951D9mL05p78L02K9M21l45K6j28M84j92l18k3J09q0j04K21J41k91j46L13J5J50
$$ 49 45 350 -428 -126 -97 324 -21 5 -123 361 169 -149 -172 -63 -143 -247 -26 115 -176 -322 -9 6 156
1974A56m20J64k6N4J42l08J61p2J33n3L0k0J32j94L1K3j98R1J77K29k22j16L8
$$ 156 -264 -100 -126 -72 70 -238 -77 -149 -16 -69 -39 -59 73 -121 -90 -67 -265 -174 3 232 10 -106 -68
1997f8K78J28k44m8J2p9J58j16j52J81J54j76J08K7L8l3j82j12K46k77k7M29k15
$$ -68 210 338 94 46 58 -21 137 21 -131 50 204 28 136 163 201 168 -14 -126 120 -157 -184 245 30
2020C0K38m12J12Q5j65K52l18O0J96L21l87JJJ4O7n6oK0k96L82l95K41K00n6j70
$$ 30 268 -144 -32 53 -112 140 -178 -118 78 399 12 13 14 28 95 39 33 53 -243 139 -256 -15 185 129 -41
2045d1L87m17k2O8O9R6j66q5K4K79l9j46J7L50m09L44l53j3m2o5M0L33m8m05l4
$$ -41 346 -71 -93 -25 44 140 -26 -111 -87 192 153 7 24 374 -35 309 -44 -57 -99 -164 -124 209 161 -244 -278
2070b78L83Q1j12k97J04M65k16k00p1K67r3K6j97J85Q9J13l36p9k89O99k60Q6
$$ -278 105 186 74 -223 -119 346 130 -70 -141 126 33 59 -138 47 136 249 -87 -166 -455 244 -16 70
2092G0j31k77L88R4j41j84K54k96J52L1K5j15N9L65Ql19q8K83k90R7kj74K33l16
$$ 70 -61 -338 50 144 3 -181 73 -223 -71 -40 -15 -130 -71 294 302 -17 -105 178 -112 -15 -17 -191 42 -274
2116b74O7k3K17p5j44N32k25k29L6R2K42l94Q5K97j87j02K77m16J54R6jm4m8r4
$$ -274 -207 -230 -13 -88 -232 300 75 -154 -118 -26 216 -178 -93 204 17 -85 192 -224 -70 26 25 -19 -67 -161
2140a61J76J87J06k30J29K52n22O6L6k20J79k61L06k0J66m46K66q2m7J54k2J30
$$ -161 15 202 308 78 207 459 -63 3 39 -181 -2 -263 43 23 189 -257 9 -73 -120 34 12 142
2162A42j58K56k75K2j43J31j32J41j03l9J2J83ok35J58L44k06J44k56N9kk1j06
$$ 142 -16 240 -35 -13 -156 -25 -157 -16 -119 -158 -146 37 31 -204 -46 298 92 236 -20 39 37 16 -90
2185i0j86M65j12j56Q9K28m79M32k83R1o0K1kl9J94q8j05J08L9J63r6k55K5L62
$$ -90 -276 189 77 -79 10 238 -241 191 -92 -1 -61 -40 -42 -81 113 25 -80 28 67 230 134 -121 -96 266
2209B66m68M32J35m56J4N9N0j61j94M15j25q2K15k15L4k5m8K29P5k64j27J65p5
$$ 266 -202 230 365 -91 -77 -18 32 -129 -323 92 -33 -115 100 -115 -81 -106 -154 75 150 -114 -241 -76 -151
2232a51J71O2J1k33J0J90K26k18r5n7J20k15O5J28O3k43N2q5RO3o2K95j12N7K34
$$ -151 20 82 93 -140 -130 60 286 68 -27 -84 36 -179 -114 14 77 -166 -114 -199 -190 -127 -189 106 -6 51 285
2257B85k10k2N6j19P2r7M3n8j9P1o9j56K69k7K25m85L53K63k90k20L48M8n0r3
$$ 285 75 53 109 -10 62 -35 8 -50 -69 2 -67 -223 46 19 244 -241 112 375 85 -135 213 261 211 118
2281A18J01m22K55l15J37O0j49L30n2K51l42K33l50J75K95o30N37k4j58j23J10
$$ 118 219 -203 52 -263 -126 -66 -215 115 63 314 -28 205 -145 30 325 -305 232 208 50 -73 37
2302C7j14J0q5K94k20L9J57l11M66k05O4k19Q9j6O1j06k41K24J12j14N7J63n08
$$ 37 -77 -67 -152 142 -78 -39 118 -193 273 68 132 -87 2 -14 47 -59 -300 -76 36 -78 -21 142 -366
2325c66L33j5N2p6O2K8n4j20l9K42j1k1K1q1J48j96l0J9Kj37J45k4q1K25r9J22
$$ -366 -33 -48 4 -72 -10 18 -36 -156 -195 47 36 15 36 -45 103 -93 -123 -104 -102 -239 -94 -118 -199 26 -73 49
2351D9K90k61j50M3J00k05J30Q4p0j21Q0M7J0j70L27Oj6k54J42j77M33k72k05
$$ 49 339 78 -72 -29 71 -134 -4 80 10 -111 -31 16 26 -144 183 189 173 -81 61 -116 317 45 -160
2374a60L07M1j42m7J07k67J99O2M5n1Q6j64K40Qj32l21rK12O7l9k14L35k21J12
$$ -160 147 188 46 -1 106 -161 38 100 145 94 180 16 256 264 132 -189 -198 14 81 42 -172 163 -58 54
2398E4j56j91L50l0l24K38n4PJ18J64k04l3K6P9p3j1J05N8r8j7lN7m66L77j0J70
$$ 54 -102 -293 57 27 -297 -59 -113 -106 12 176 -28 -61 -35 44 -29 -40 65 123 25 8 5 62 -404 -27 -37 133
2424A33l43K81n9j59k30M71j32Jj22J60l1j2j1K08J23m65N30p22L44K18k26J89
$$ 133 -210 71 12 -147 -377 94 -38 -37 -159 1 -30 -42 -53 155 278 -187 343 -379 -35 183 -43 146
2446A46j39k10J63M8M3l8j67K73j63J53j52J20M4k81K58K62l02j74O8l84O51n53
$$ 146 7 -203 -40 8 51 13 -154 119 -44 109 -43 77 121 -160 98 360 58 -116 -48 -432 219 -334
2468c34J83J91j60RO8J16J46l88J50j18K31m5j37J11l10L90j97L49m56M10j81
$$ -334 -151 40 -120 -111 -43 73 219 -169 -19 -137 94 49 -88 23 -287 103 -94 255 -201 209 28
2489B8m3M1r6L27k57L4P0p7k59L18Mj41m9Q3q0J70Q1k30K63k82J04P7j37L32k91
$$ 28 -15 26 -70 257 0 34 104 27 -232 86 90 -51 -100 -17 -97 73 154 -76 187 -95 9 86 -51 281 -10
2514a0K17r4k08K49k05J34R1m21J76J90r1k99j47N82Qk7l00K79m5n4k22J95l0
$$ -10 207 113 -95 154 -51 83 174 -247 -71 119 28 -271 -418 164 172 145 -155 124 79 25 -197 -2 -32
2537c2J33m2K22l61k7J13j44K35j04PJ46p1O4l68K56m4q9l0J86j05j9j31L05l22
$$ -32 101 59 281 -80 -107 6 -138 97 -7 0 146 75 139 -229 27 -17 -106 -136 50 -55 -74 -205 100 -222
2561b22R0O9J8K26k16l44N93k03Jo8n7N4K07k75L20j34L2j33k49K55L8n6j56J59
$$ -222 -132 -63 -45 181 -35 -379 214 11 12 -56 -113 -59 148 -127 193 59 91 -42 -291 -36 2 -54 -210 -51
2585e1J77n12L73O1J3j13J95J11k41L0q6M16m48J4P2l08J66J4J09j14K28Jl53
$$ -51 126 -386 -13 48 61 -52 143 254 13 43 -43 373 -75 -61 11 -297 -131 -117 -8 -122 106 107 -246
2608b46L74j77R1J67j62j88P8N7j01j33nK24m6nP5l3o8J93k64J94O5k8j37k3k58
$$ -246 128 -49 42 209 47 -141 -63 -6 -107 -240 -245 -21 -67 -72 3 -30 -98 95 -169 25 90 62 -75 -98 -356
2633c56L52N9O2k61K41l56M09n75L36L4K4N1l05L36j29J03kJ1R2j24l5N1m4J02
$$ -356 -4 55 117 -144 97 -259 150 -425 -89 -55 -31 20 -285 51 -78 25 23 34 126 2 -33 18 -26 76
2657G6q2N0q7p5J55j39K27j64j47L14k9R2l13J75o9K63m44M13k69q0q7pK26P0
$$ 76 -6 44 -43 -118 37 -102 125 -39 -186 128 99 191 -122 53 -16 247 -197 216 -53 -133 -220 -227 -1 69
2681F9K83n14L7J60j40R4j1J25k29L47m64J85l2L48k37L10k34j99O6p4k9M48l64
$$ 69 352 -162 -125 35 -105 -11 -22 103 -126 221 -243 -58 -90 258 21 331 97 -102 -36 -110 -139 309 -55
2704e5j30K05j9M4o2j70K00m3kl4R9j09p1j0M0L07j64N5k98J99K4k72J74J89k
$$ -55 -185 20 1 45 -17 -187 13 -30 -32 -66 33 -76 -147 -157 -117 190 26 81 -217 -18 6 -266 -92 97 95
2729I5J47k99j27J8K52k47oM48n60J84L31m90M15l47r3J23j25K54K75l66J31J34
$$ 95 242 -57 -184 -166 86 -161 -167 281 -279 -95 236 -254 161 -186 -279 -156 -281 -27 248 -118 13 147
2751A47j62QJ9k2l5K68p0j44j33l0J28J16k37R0o9j32K96k52O37n71L16m36J58
$$ 147 -15 -7 12 -10 -45 223 153 9 -124 -154 -26 90 -147 -57 -126 -258 38 -214 423 -148 168 -268 -110
2774a10M43k71P1J02k28o6J7k58L99k85L42k02J13L7p1J23k25J67k59L77l66Q7
$$ -110 333 62 133 235 7 -59 -42 -300 99 -186 156 -46 67 104 33 156 -69 98 -161 216 -150 -63
2796f3j23K25Q5k38k34L67K30o7l8P5l84m1K70n3j8j4J26o4j90K44R2j52l50L01
$$ -63 -186 39 124 -114 -348 19 249 182 144 219 -165 -206 64 11 -7 -21 105 41 -149 95 187 35 -315 -14
2820a4j4k4j49L25p7K4J5j6K15l37o0K31j32j05L80o8j58K32k63p1m5R7k2K90
$$ -14 -28 -52 -201 124 47 71 86 70 285 -52 -112 119 -13 -118 262 194 36 268 5 -66 -111 -14 -36 254
2844B54m45j2J52J18J9j92K8J56p2k38K98J77K2l3j91r1L08j55k30M9l6J94k29
$$ 254 -191 -203 -51 67 86 -106 -78 78 6 -232 66 243 265 232 41 -50 258 103 -127 -78 -114 80 -149
2867a49M01k47J3l1k25K24j25J20J45j82L7J11j84J05K1L2K8n7nJ39j54K23j6
$$ -149 252 5 18 -13 -238 -14 -139 -19 126 -56 -19 92 -92 13 34 66 94 37 32 171 17 240 224
2890B24k36K08j97Qj9L02n63L07j69p4J69q8J74K90l55P0j07j99J92J02o8K5j05
$$ 224 -12 196 -1 7 -12 290 -273 34 -135 -209 -40 -128 46 336 -19 51 -56 -255 -63 39 -29 -4 -109
2913a09K17j10j54L16J30n4l51l0K79k79P0J47j44j75p8M60l0l99J12K31J39j46
$$ -109 108 -2 -156 160 290 236 -115 -145 134 -145 -75 72 -72 -247 -325 135 105 -294 -182 49 188 42
2935D2PP9j56M1mJ37k56K4R1l5k1K40j80N6J97m3jl50k80N31R9k83J46j55l38
$$ 42 49 128 -28 13 9 146 -110 -86 5 -30 -51 189 9 65 262 219 218 -132 -412 119 218 -65 81 -74 -412
2960d12N63k49J25J4j60m8K26o5J4P2o7L27l84m1N3L64k11j37O1Lj30j05J33J73
$$ -412 151 -98 27 41 -119 -167 59 -6 8 80 13 340 -44 -85 -32 332 121 -16 45 48 -82 -187 -54 119
2984A19l76K19J52j25M28m72M83m90K21j52K51j04k6l23J52K79m22N12q8k88N10
$$ 119 -257 -38 114 -11 417 -55 428 -62 159 7 258 154 128 -195 -43 236 -186 326 238 -50 460
3005D60n83K29O5l66K71Kk34L64l9q5M9j13k55M73k15l08N64k39N7j50%J53J47
$$ 460 -123 106 171 -195 76 78 -156 208 169 84 133 20 -235 238 23 -285 279 40 97 -53 -53 100 247
3028B47r0k8m30L01K02N4k09j2K17j84O2l45L44j29J65j45p2J99k05o2J99p6p7
$$ 247 157 129 -301 0 202 256 47 35 252 68 130 -215 129 0 165 20 -52 147 -58 -120 79 3 -74
3051g4J80ok74J55L57m40J00J7M1P0k04J35l64k17L94J55k3J28K07m04J15k75
$$ -74 106 100 -174 -19 338 -102 -2 15 56 126 -78 57 -307 -524 -130 25 2 130 337 -67 48 -227
3073b27N79m09r7K85j81J36j97l41L34K19k28K06k25Q5J90k01L1j0l3L83k68j29
$$ -227 352 -57 -154 131 -50 86 -111 -452 -118 101 -127 79 -146 -61 129 -72 -41 -51 -84 299 31 -98
3095i8M4K17m52L12r5J60j01JK70k41k67K35R3ko2J81j99m5J04o1l27J82M7L9
$$ -98 -54 163 -289 23 -72 88 -13 -12 258 17 -250 -15 78 76 14 195 -4 -49 55 -6 -333 -151 -104 -65
3119f5K96j64L%L6k61K06j94k5lK42j76J35J05j29k50J17Q0lj35K32r4L19k25
$$ -65 231 67 70 70 106 -155 51 -143 -168 -171 71 -105 30 135 6 -244 -127 -47 -50 -185 47 -47 272 47
3143D7q4J80k20J36j22L18l81R7p6L6N7J90k19K21jj96J17j83K09M5j57J75j19
$$ 47 -37 143 -77 59 -63 255 -126 -29 -105 -69 -12 178 -41 180 179 -17 100 -83 126 171 14 189 70
3166G0J10l80J34j29p8L28m0k09L16j67rJ65J28l56K11k66K47J0m3r5j26K35q3
$$ 70 180 -200 -66 -195 -273 55 15 -194 122 -45 -54 111 239 -117 94 -172 75 85 42 -53 -179 56 -27
3189b7J45m17L56K69m42P1J15j80J14j53L45N4%k2j08m86J09L77r5j35L62j54
$$ -27 118 -299 57 326 -116 -45 70 -110 4 -149 196 250 250 228 120 -366 -257 120 25 -110 252 98
3211I8K3r9j80M5K77j27k7j43M4j20L02j43L9J06P4j94j34K17n7r9M8KP1k19L56
$$ 98 121 22 -158 -113 164 37 10 -133 -89 -209 93 -50 -11 95 169 -25 -159 58 1 -98 -50 -48 23 -196 160
3236A60k99M55j29k89J75k09L26l49K20R6N9j16j98J04L57l89j23K69k57L51l16
$$ 160 -139 316 187 -102 73 -136 190 -159 61 157 216 100 -98 6 363 -26 -149 120 -137 214 -102
3257a02J84j86J50k82L54k06K16Q2J9j21j03m3k38K03K02j02M09m09r1M8P7J53
$$ -102 82 -104 46 -236 118 -88 128 210 229 108 5 -38 -276 -73 129 27 436 27 -64 -16 61 214
3279B14r3K16n16K69j13Mj10k5L94r5l4k28K75l4m8j51N9J94r1j43K53k16J23
$$ 214 121 337 -179 90 -23 -19 -129 -154 240 145 111 -117 158 124 76 -75 -16 178 87 -56 197 -19 104
3302A04k07q2o2J59K76j5j21l2K39l64J14L61l95j3r0K76J6l60J10p6J93K40j79
$$ 104 -103 -185 -247 -88 188 173 52 20 259 -105 9 370 -25 -38 -128 148 164 -196 -86 -162 31 271 92
3325I2Q2k03j04P8M1J51j16j65J83R3j12j19M72l63J03J31k94QkM9j79L2K83m09
$$ 92 174 -29 -133 -55 -14 137 21 -144 39 132 20 -99 373 10 113 244 -50 -42 -44 5 -174 -142 141 -268
3349b68K27N7J14j85k16R9J73J58K31n75LR4m9K81r7K3l1J39j99K00l51M36k95
$$ -268 -41 16 130 -55 -271 -172 1 159 390 -185 -182 -88 -137 144 47 70 39 178 -21 179 -172 264 -31
3372c1Q9J11j62m7J95J8j1k22J9o2K24P1p3m73J43J42L78m3l46K77l92m7J19J65
$$ -31 58 169 7 -40 155 173 162 -60 -41 -103 121 192 119 -354 -211 -69 309 266 -80 197 -195 -242 -123 42
3396D2j77K47j6j5j40P9Oo9m6J0m9J08j46K5K16Q6n42P00k5l94K74Oj28o0J88
$$ 42 -135 112 96 81 -59 20 26 -43 -89 -79 -128 -20 -166 -141 75 161 -381 319 294 -100 174 180 52 -8 180
3421A80Qj31m5k18M2L01r2j30J73k41J92Ql86O37k28j34k7K64l09J32R1J98m28
$$ 180 188 57 12 -206 -164 137 45 -85 88 -153 39 47 -339 298 70 -64 -91 173 -136 -4 87 285 -143
3444a43J8L8k55M29l20R1j03K01j20K96o51N94o4J14j60NM06l52J78l57J39p6
$$ -143 -125 -87 -342 87 -233 -142 -245 -44 -164 132 -519 75 11 125 -35 -30 376 24 202 -155 -16 -92
3466i2N76l87k3K4n3n4l49O8L92K7R6k58k1K13M6k99J09K4l44K52m4J21L76k97
$$ -92 484 97 74 98 45 -9 -358 -290 102 129 225 -33 -54 159 205 -94 15 39 -305 -53 -97 24 400 103
3490A03k82M0j88M02R6j86m2O4L9k92K74K8k9j03L62m19q5M75k95J33k11P1k03
$$ 103 -179 -139 -327 75 171 -15 -57 7 46 -246 28 56 27 -76 286 -133 -218 257 -38 95 -116 -45 -248
3513b48J82O2k83M53ok15o0j20K45j22r8J72j02j43M44p4j35j80L25k09J51J48
$$ -248 -66 -4 -287 166 160 -55 -115 -235 10 -112 -210 -38 -140 -283 161 87 -48 -228 97 -112 39 187
3535A87k24q6p3N01j18j09k3l19L60l51K51m5j60j36M05j8j28M4J7J04j26J93
$$ 187 -37 -123 -196 305 187 78 55 -264 96 -255 -4 -49 -209 -345 60 42 -86 -42 -25 79 -47 146
3557A46m32K17N8J06m27P3J60L59q5j64K07j16j88r5R7n7L64l65Q4j68J99K25
$$ 146 -286 -69 -11 95 -332 -259 -99 260 175 11 218 102 -86 -181 -84 -141 223 -142 -58 -226 -27 198
3579A98p5k64K66n3l03N0J31K3M06n98M5kR4J82k21J36O0j65j97J33O1J27r9J52
$$ 198 123 -141 125 72 -231 -181 -50 -27 379 -219 -174 -176 -82 100 -121 15 75 -90 -287 -154 -93 34 -65 87
3603H7j5O6j90j44oM2J89m37N67j92J98L3j61k41M04k18l3P7k6p9k01L27j43K41
$$ 87 72 138 -52 -196 -202 -160 29 -408 159 -33 165 198 37 -204 200 -18 -51 26 0 -79 -280 47 -96 145
3627A45j17K70n71N23m83J86J20k44L23K1J61j95l16q7J65n4K73r6K8j25M6N8
$$ 145 28 298 -273 250 -233 -47 73 -171 152 173 334 139 -177 -264 -99 -153 120 24 52 -73 -27 31
3649C1j6M02l45J43k8j48r2J13k41J14J09j5k0n4J44j66r7K48K2j36N7k53K80
$$ 31 15 417 72 215 187 39 -53 60 -181 -67 42 27 7 -47 97 -69 -166 82 104 -32 25 -228 52
3672E2O2k02J22L7j14K2J00j99L99j54p0k63k18M25j13R0p5L20j42K6k70M18J7
$$ 52 114 -88 34 71 -43 -21 79 -120 279 125 55 -208 -426 -1 -114 -24 -99 221 79 105 -165 253 270
3695B70m57J71p6J19j04P9K1J17k37J73j7L64m32k4k2R2m39K24J91K49l13L8J4
$$ 270 -187 -16 -92 27 -77 2 23 140 -97 76 59 423 -9 -33 -55 37 -402 -178 13 262 -51 -13 1
3718AJN0m6k91L1J77L95l57N0n5J32m34L07NQ0k38J47M0j98L31J29l03O7m4O4
$$ 1 2 52 6 -285 -254 -77 318 -39 11 -44 88 -346 -39 -34 46 -192 -45 -5 -203 128 257 -46 21 -23 41
3743D1o3j03K55K7O0m38N26k13k5j50n9M3J32j62J44J23k87L43l88J73j58K8N
$$ 41 -22 -125 130 157 217 -221 305 92 67 -83 -142 -99 33 -129 15 138 -149 194 -194 -21 -179 -151 -146
3766a46L38j88p4O2p0m53K57M15l2p0m0J41j23j22j49M02k63N5N3L7j37J68j61
$$ -146 192 4 -70 -8 -78 -531 -274 141 109 39 -1 140 17 -105 -254 148 -115 -60 -7 30 -107 61 -100
3789a00o1K61j03j56O3m0Q9j4k11J15O0j9K5R5K21j96K19m04j82M36k26L25Ql48
$$ -100 -161 100 -3 -159 -96 -136 -47 -61 -272 -157 -97 -116 -91 4 225 29 248 -156 -338 98 -128 197 205 -143
3813a43l9J01K60j37R0r5M04m95K40j88J84m63K20R2k10k17L74P5l60L52j01j12
$$ -143 -182 -81 179 42 132 37 441 -54 186 -2 182 -281 -61 31 -179 -396 -22 53 -307 45 -56 -168
3835a68K31joJ17j05j34J73O8j81j93R0K52j83M8J76j76N4N2m9j95K47R4p5j31
$$ -168 63 62 56 173 68 -66 107 175 -6 -199 -109 143 -40 8 184 8 62 114 65 -130 117 211 136 5
3859EJ02o4J37m8j56m2N9K81k64L72n80K42j12O8P9N1P7j60J38J6l99K58k62L22
$$ 5 107 43 180 132 -24 -66 -7 274 10 382 -198 44 -68 0 79 130 207 47 185 201 -198 60 -202 120
3883A20j55Q4l1j15L43m57L87k32m2Q6j85J99J33j7k35m8R6q8J39K18k91K16j03
$$ 120 -35 49 18 -97 246 -211 176 -56 -98 -12 -197 2 135 118 -117 -165 -69 -157 -18 200 -91 125 22
3906B2k79K85L6j26L7j68L23qJ26k36j21K18k73L30k84J78j56J82j34j65J53q9
$$ 22 -257 28 64 -62 -25 -193 130 122 248 12 -109 109 -164 166 -118 60 -96 86 -48 -213 -60 -149
3928a49J45K0K6j96K10j79M3J66o5lj29P9n5J37J37j59J17k28J27p6o5J11k1J63
$$ -149 -4 16 42 -154 56 -123 -80 86 21 18 -111 -32 -87 50 187 28 145 -83 44 -32 -97 14 -7 156
3952A56j16j02q4K65k75K48r9K53N3l03J53k3k25L73m93k1L74P4N9m14M74m06
$$ 156 40 -62 -146 119 -156 92 -7 246 299 -4 149 126 -99 274 -219 -240 134 208 267 -147 327 -79
3974g9J13K36l04J62j2j18J48m4j56M7P6j30L54k53J23l81M05o2J18j29k02J33
$$ -79 34 270 -34 128 116 -2 146 102 -54 -7 69 -61 293 40 163 -218 187 125 243 114 -88 45
3996D5J56q4l53J40k1J61n3K04n7j07k17K21n2r2Q0J10k23Q9j74K72J77j39J2
$$ 45 201 117 -236 -96 -117 44 -9 195 138 31 -186 35 -17 -109 -29 81 -142 -53 -227 45 222 83 95
4019I5m89O41q9k50P6j07Q7RL56m22L31l21K76Ok76J05J38o2r6l29K18K87L1k24
$$ 95 -394 247 158 -92 -16 -123 -36 -27 329 -93 238 -83 193 199 -77 28 166 104 8 -321 -103 184 215 -9
4043ik3M8M16k51j68r8J06r9J28J92r7k87K22k70J01J08j52L28j17J06l85L71
$$ -9 -32 16 432 181 13 -85 21 -78 50 242 145 -142 80 -190 -89 19 -133 195 78 184 -201 170
4065A70l10J14R3n8J41J03n2J00l32N1J60k90L48o36K74J65K19k88K11N4j28O1
$$ 170 -140 -26 67 9 150 253 201 301 -31 20 180 -110 238 -398 -124 41 260 -28 183 237 109 170
4087A70m3k54L56k45K4j35j06K02R1k69K45j01Q3l06K39K78q7J22j76p9n5J1P7
$$ 170 127 -127 229 -16 8 -127 -233 -31 60 -209 36 -65 18 -288 -49 229 142 264 88 9 -46 -35 42
4110D2m5J00k16n6M6k11M20K3mk41j58K83K59l33k47L11K67l27p4L23r9o2K11
$$ 42 -3 97 -119 -175 -129 -340 80 103 99 -142 -300 -17 242 -91 -338 -27 240 -87 -161 162 63 1 212
4133B12k11j54l8L04L13k27j26j86J39j40K98k50L00o5k60L1O4o1K33k06M0j42
$$ 212 1 -153 -191 113 426 199 73 -113 26 -114 184 -66 234 169 -91 -60 4 -57 176 -30 10 -132
4155a32N7L54o79L54J16l7qO7O8r4R4l60J45j88K29j76p8K49o6j21K23m7Q5L45
$$ -132 -75 279 -400 -46 70 33 25 92 160 66 160 -200 -55 -243 -14 -190 -268 -19 -85 -206 17 -30 55 400
4179D00o16L09n1j46J64m6J82J53j72k15r8K58k42k84K09J45J88j54J09M5k34
$$ 400 -216 93 42 -104 60 14 196 349 177 -38 -136 122 -120 -404 -195 -50 138 -16 93 138 -96
4200i6o2K20j09K4K07m54J23K20q1j10K41L3O1m23K47r5J60k69K06L7PQ5k87L85
$$ -96 -158 62 -47 -23 184 -270 -147 73 -8 -118 123 156 217 -206 41 -54 106 -163 43 80 87 172 -115 270
4224B70o05O44l15j25K9K01O9n45L80L25k88j2J54r8J05j20j58m0J80M3N6l14
$$ 270 -335 309 -6 -131 -102 99 168 -377 3 328 40 28 182 84 189 69 -89 -129 51 94 150 -164
4246a64L63j25k2l41J54M63k50k35l7J35L03l05j16L32j63j66J68J80k84L62j56
$$ -164 199 74 52 -289 -135 328 78 -157 -194 -59 244 -61 -177 155 -8 -174 -6 174 -110 252 96
4267I6o5K59k85l1J56j05J16k82P0O0J54q2J9j44J42k23K67j66M16m63K70m97
$$ 96 31 290 5 -26 130 25 141 -141 -71 -11 143 61 80 -64 78 -145 122 -44 372 -91 179 -318
4289c18M85j27K25k92l5k45L37m59M09J9m95L58O7m7N9Qj27qM06l82K57l5K26
$$ -318 167 40 265 -27 -62 -307 30 -429 -20 -1 -496 -138 -71 -118 -59 -51 -178 -186 220 -162 95 60 286
4312B86n92M27k30L1K00j02j64M49l48j07J96r5N8k16J13j01K38r7L01k6m76J99
$$ 286 -306 121 -109 -78 122 20 -144 305 -43 -150 46 -49 9 -207 -94 -195 43 -54 247 221 -255 -56
4334e6nM9J9q8N9k53K94M8m30K97R4J83Rl30J28R3O2j50J25j25Q8k40N4NP0j01
$$ -56 -61 -12 7 -81 -22 -275 19 67 -363 -66 28 211 220 -110 18 111 173 23 148 23 111 -129 -75 -70 0 -101
4360a01P3J49k6k38J61J7j85rJ71m9k29L66J11j64j2j08J82Qj09L0o1J00r0J50
$$ -101 -28 121 95 -143 18 35 -150 -159 12 -37 -266 100 211 47 35 -73 109 117 8 38 -23 77 -13 137
4384A37l98L01k14K01l41M03r7j05L86l12J61k26Q2j25J73Q9J20j89j54K83j31
$$ 137 -261 40 -174 27 -314 89 -8 -113 273 -39 122 -104 -22 -147 26 115 235 46 -108 175 44
4405D4k17L39j91L04k95O2j01r9K11m17M22q4J1j0k44K19J50J34k05j96P7J4O0
$$ 44 -173 166 -25 279 -16 46 -55 -154 57 -360 62 -22 -11 -21 -265 -46 104 238 33 -163 -86 -72 -12
4428a2M9J45m27L28J12m7k92N09j21k07p0j85K2L92j74No8N9L4R1k36m8M44l69
$$ -12 37 182 -245 83 195 148 -144 365 244 37 -33 -218 -196 196 22 27 -41 18 52 143 -93 -141 303 -66
4452f6J34N4K81m20J82r7p4K7p0K54k72J6J70J2j6K14k72j35Q1k16M40l81M23
$$ -66 68 122 403 -17 165 68 -6 21 -49 205 -67 -51 119 131 115 329 57 -78 3 -213 227 -154 269
4475B69M2k97ml3o9l01J31N02m7j19q4K15l37k2M4J84m4j21K10l4l88L95j85K61
$$ 269 311 14 10 -23 -92 -393 -262 240 193 74 -10 205 -132 -154 -110 74 30 -91 119 85 -303 92 -93 168
4499A68k87M05j40q1k89J25M1Q0j54L22q8k1j07k01L08j18M5n3NL27n15K91K9
$$ 168 -119 286 146 65 -224 -99 -58 22 -132 190 102 81 -26 -227 81 -37 8 -45 -40 287 -228 63 92
4522I2r3j90P9nJ88j76j62L13l06N66r1m29N16m53M9J80l0J43q4J11k55M0j95
$$ 92 -1 -191 -112 -117 71 -105 -267 46 -260 306 215 -214 302 -151 -102 78 48 191 107 218 -37 3 -192
4545a92j0K00Q2r7j5L8k18M22J14l15j29K82J5r3q5J31j73Mk38L27Nj16j68K12
$$ -192 -202 -2 80 -17 -32 6 -212 210 324 9 -120 162 177 84 -1 130 -43 -39 -277 50 55 -61 -229 -17
4569a7J82l1l53L33j35j10J56n3k5J26j29j16o2M03o7l09M20j02o4j28J45j82
$$ -17 165 134 -219 114 -21 -131 25 -28 -53 73 -56 -172 -234 169 102 -207 213 111 47 -81 64 -118
4591a18J34p5K12j76J85j46l5J20j94K75j11r7j45K73j80J09k8P2k05J39J3j65
$$ -118 16 -59 153 -23 162 16 -19 101 -93 182 71 -26 -171 102 -78 31 3 75 -130 9 22 -143
4613a43J0j73O18k40P8n1o2j86K58k21L50l90K37j96J75j54P9R3j79J02k94K95
$$ -143 -133 -306 312 72 150 99 37 -149 109 -112 238 -152 85 -111 64 -90 -11 82 -97 5 -289 6
4635Fk34L01M3m24R5L15K13o9l98L59M3j05R7j77j19M5m7j33P2P9J50J48j50l11
$$ 6 -228 73 116 -308 -213 102 315 246 -152 207 250 145 242 65 -54 -9 -56 -189 -117 -38 112 260 110 -201
4659b01L92q8l92L70k18j00K02Q8j69J06o7J05Ll2n1j0j09o2K64R0K68l20m1o0
$$ -201 191 103 -289 81 -137 -237 -35 53 -116 -10 -77 28 31 -1 -52 -62 -171 -233 31 121 389 69 28 -32
4683c2K03k64J44oqp6j1L6J76j16J65j67Ol5j9l75J64K49j63L10k74qL29k50O8
$$ -32 171 -93 51 45 37 -39 -50 -14 162 46 211 44 50 15 -4 -379 -215 34 -129 181 -93 -101 228 -22 46
4708D6J92o9j78o6K02l27J68O3J93Ll97j42J80O7J69K09q2k70J38o7r4qP8P7k88
$$ 46 238 169 -9 -75 127 -200 -32 31 224 227 -170 -312 -132 -65 104 313 231 -39 99 32 -62 -70 8 85 -203
4733b03L52J57n63K54L82n04P7J93j36p6J30n1M0n3K35l57J1K68l23K16p9pN4
$$ -203 149 306 -257 -3 379 -125 -48 145 9 -67 63 12 52 -1 234 -123 -112 156 -167 49 -30 -37 17
4756A7k15J0J60N2K18k86K46j74m9J6k5J97l97J34j89J29K91l2j53R4j30K54l28
$$ 17 -198 -188 -28 24 242 -44 202 28 -21 -5 -30 167 -230 -96 -285 -156 135 103 -50 44 -86 168 -160
4779a60L04k68j45K00K36r1M05m92q6k00O83n33p8J45k1J82R2K21o96L57k9j54
$$ -160 144 -124 -269 -69 167 76 481 -11 -97 -297 386 -147 -225 -80 -101 81 173 394 -302 55 26 -128
4801a28J57K0R6N6l93L04j94J27K25k75K49M1k19Q3L9k08m85M77k00J36J61k03
$$ -128 29 49 145 201 -192 112 -82 45 270 -5 244 285 66 149 188 -20 -505 -28 -228 -92 69 -134
4823a34l5K76j19k9j96Q6K51j83J9QP9O7Mk60L97j34l40J59Q0K4J2k05K05k42
$$ -134 -169 107 -12 -41 -237 -151 100 -83 -64 -56 23 90 94 -166 231 97 -243 -84 -4 20 32 -173 32 -210
4847b10K96m9P6j7k17K25m09M24M9q1M0M4l38L55k19J56j91J71n5j96M52m16R1
$$ -210 86 37 113 96 -121 104 -305 119 168 87 127 171 -167 188 -31 125 -66 105 50 -146 306 -110 -19
4870a9K52l77K17n1j41J6L1Q3n4K11k68J95J9K46m82J23l08K13R0m34p4N18q8
$$ -19 233 -144 73 22 -119 -103 -72 11 -43 168 -100 95 114 360 -122 1 -307 -94 -4 -438 -512 6 -82
4893h2J56O7m7l48K52k08O0L06j92Q3K21q7l37J12r2M00k85L48j99k05J56j49
$$ -82 74 141 94 -254 -2 -210 -150 156 -36 47 268 181 -156 -44 -136 264 -21 327 128 -77 79 -70
4915g0j39j29L93j65K98n58M18j20j07L04m22K28M7j31K62k17O5P4j12K55j78
$$ -70 -209 -338 55 -110 188 -370 48 -72 -179 125 -297 -69 -22 -153 109 -108 -43 31 -81 174 -4
4936dJ38k26M59m02j16J16n0K10j52m7n0JJ61Q5m23M81j17P2j03j92K80l5J12
$$ -4 134 -92 367 -35 -151 -35 -85 125 -27 -74 -124 -123 38 123 -300 181 64 136 33 -159 121 86 198
4959A98J00k31n8P3j09RP8l9LO6j14M3q1K4Q8J32N9k30J79k47M18n07n1J54N12
$$ 198 298 67 9 82 -27 -18 60 21 24 90 -24 19 -62 -38 50 182 241 11 190 -57 361 -146 -197 -43 469
4984D69n13N3q4J05K32k11q5mK9Q4k86L20j47L10n75M77m23J82J18o0J73k99P7
$$ 469 -44 9 -75 30 262 51 -34 -38 -9 75 -211 109 -38 272 -303 174 -249 -67 51 -9 164 -135 -58
5007e8M8O6k59M3K66J51o7j47M0K6M9k16K07k55o7j25k4K09j81K67j48K40k57
$$ -58 -10 56 -203 -160 106 257 190 43 83 109 158 -58 149 -106 -173 -298 -322 -113 -294 -27 -175 65 -192
5030a92K26K6M3j97K91n23K43j3k5L03k64L2J9R7j06p3J37O3j70J71L0o4k98r8
$$ -192 34 60 103 -94 197 -326 -83 -96 -121 182 -82 -50 -31 66 -40 -113 24 87 -83 88 118 54 -244 -342
5054c42J22J31J61k0k05L3J9Q3L2j76J61qM2j12J63j92L26j13P1k4n0N9q7j04
$$ -342 -220 -89 72 52 -153 -120 -101 -18 14 -162 -1 -9 33 -79 84 -108 218 105 176 152 102 161 74 -30
5078c0j41K01J50K02o73K46j01k46O47l22j51L72J20l50p3N4L65m07L97l19p5
$$ -30 -171 30 180 382 -291 -45 -146 -392 255 -67 -218 154 274 -76 -149 -95 270 -137 260 -59 -134
5099a34Q5K45l6l37J32M0L3r9J88j87K7K62j95j27R3p3N6j3l7q3J52J57l80K27
$$ -134 -49 196 160 -177 -45 -5 28 -71 117 -70 -43 219 24 -103 -10 -83 -27 -40 -77 -160 -8 149 -231 -4
5123dk09K15j14J26l40K76J33j65K78l45o4J09m6J46l9L5j59K57j84Q5L05k53
$$ -4 -213 2 -112 14 -326 -50 83 -82 196 -149 -213 -104 -150 -4 -43 -8 -167 90 -94 -9 296 43
5145D3k04K13R8j07j67R8K1k25J55M7r6P5J93l95K19jO0NJ48m28J93J11R1k91
$$ 43 -161 52 150 43 -124 -26 -5 -230 -75 -28 -124 -49 144 -251 -32 -33 27 32 180 -248 -55 56 147 -144
5169a44J54j87ML39k92J64J51L6r4j73KJ16m08J46L16j01j84L17j80J85j60L13
$$ -144 10 -177 -173 166 -126 38 189 225 131 -42 -40 76 -332 -186 130 29 -155 162 -18 167 7 320
5191C20m51J10J81j29K9q1r7J18L00m13K50J5p7k2k90L29R8j81K66k66j88J13
$$ 320 -131 -21 160 31 60 -21 -118 0 300 -113 137 152 75 53 -237 92 190 9 275 9 -179 -66
5213f6J07L0m43M18j50L5j48Q0K21o8np4o6K76Q7k59K14j12o6k58K80j40K7J19
$$ -66 41 71 -372 46 -104 -69 -217 -137 84 16 11 -63 -129 147 234 -25 189 77 11 -247 33 -107 -80 39
5237C9k16J62M1N1kk8j29k02Q3R6K3j04M8K76K12l45k36O28n47J21J98m34M00
$$ 39 -177 -15 26 77 75 47 -82 -284 -201 -105 -82 -186 -138 138 350 5 -231 397 -150 -29 169 -265 135
5260A35L8J2l53P5k0n1J54k6n6K17K55Qm64K41j12n3R0j31J1Q8J35l43L20ll58
$$ 135 173 185 -168 -93 -113 -164 -10 -36 -92 125 380 388 -76 165 53 0 90 -41 -30 58 193 -150 170 167 -191
5285a91J51K15k34r6L19j63k6K22j81Oj81L12j38j85j81K12Q4K28j33k34K24k6
$$ -191 -40 175 -59 -155 164 1 -25 197 16 22 -159 153 15 -170 -351 -139 -55 173 40 -194 30 4
5307Dp8j50M9Q0p1K14Q0r8J36k65J88j66J11N4p9K69l17J80m8mj79N9O1J55l7
$$ 4 -74 -224 -175 -95 -166 48 128 30 166 -99 89 -77 34 88 9 278 -39 141 93 89 -90 -31 30 185 148
5332A48k45k39n8K29J27O3j2j40J0j40M61j12J41k14J13l4j43O2J0j54J74k56
$$ 148 -97 -336 -394 -165 -38 25 13 -127 -117 -257 204 92 233 19 132 98 -45 17 27 -127 47 -209
5354b09L31j59n1K78k36p1L24l46J35J73k54N6J15k58J5K47j94j86K46K8J21j75
$$ -209 122 -37 -88 190 -46 -117 207 -139 -4 169 -85 -29 86 -172 -157 90 -104 -290 -44 -16 105 -70
5376g0J53l5k11K06J20k96K20o1O7R6j75q8M8J97l79L07j06j05J74L86m32J80
$$ -70 83 48 -163 43 163 -133 87 26 93 189 14 -74 -26 171 -208 99 -7 -112 62 448 16 196
5398A96j01J67n04M19k20Q2j62J80J67k97j29J96r0K59l46P4L63j48J15k54K62
$$ 196 95 262 -242 177 -43 39 -123 57 224 -73 -202 -6 -96 163 -183 -109 254 106 221 -33 229
5419B29j32j96P0P6p7N6j24L28k9j45j89K02J1P3M0l47K48p2J39m11K1L56m43
$$ 229 97 -99 -29 47 -30 26 -98 230 201 56 -133 69 80 153 193 -154 94 22 161 -250 -229 127 -316
5442c16L66O9k10J16j41K59k13J93o7k2R8j15N3Q4j49J34j14J29k99K54R8j86
$$ -316 50 119 -91 25 -116 143 -70 123 56 34 132 17 70 154 5 139 25 154 -145 109 207 21
5464B1M7K6K3j69P8N1J33m44J02J40N6J3n40M92K6j01K97k69P3j97K09J46j88
$$ 21 68 94 117 -52 26 77 210 -234 -132 8 64 77 -463 29 55 -46 251 -18 55 -142 67 213 25
5487B5l07L66k32j77M21%l86L04K77k61j74L05J93n75K76J17j1k51J41J86k45
$$ 25 -282 84 -148 -325 96 96 -290 14 291 30 -144 161 354 -221 55 172 161 -90 51 237 -8
5508hk57k1M53j12K0R0k30p4l2M8J50j18q5J75j03K94o54N58j4o3J05j00J13j63
$$ -8 -265 -286 167 55 75 165 -65 -139 -171 -123 27 -91 -176 -1 -104 190 -464 94 80 17 122 22 135 -28
5532b8Q7J29m69j17N36m35N00l14J94r0J27j71K18k65L7p4J21J77J38j84J0k65
$$ -28 59 188 -281 -398 138 -297 203 -111 83 -7 120 -51 167 -98 -61 -135 -14 163 301 117 127 -138
5554a38n0L03l01R3L03l0l03J85K56k55J55J00m44K89p4P4k15K1o8K47j57p5L43
$$ -138 -188 115 -186 -93 210 180 -123 62 318 63 218 318 -126 163 89 163 -52 -31 -99 148 -9 -84 259
5577B59l03L00j63n5j43J01R0j25J84j20j22Q3M2K85l55L48j79l60K43j13K9K91
$$ 259 -44 256 93 38 -105 -4 86 -39 145 25 -97 -14 28 313 -42 306 127 -233 10 -103 -74 217
5599B17l28L03J81m24q6L91k47j54K41N9J69l49J67l4r1l0k81J47P6p4K98j1k8
$$ 217 -111 192 373 -51 -137 254 7 -147 94 153 322 -27 140 106 15 -15 -296 -149 -73 -147 151 140 112
5622A12n6j59L46m13K7j53M11l6p2O5Jj22J35J45j35k10M1J14k81K31r6O5j25
$$ 112 56 -103 243 -170 -143 -296 115 79 7 72 73 -49 86 231 96 -114 -73 41 -240 -9 -105 -40 -165
5645a65J94k14Q6L61k63j32J55J58k44J32j7l04J48J61p8J3j66J84O0j77K38p4
$$ -165 29 -185 -99 262 -1 -133 22 180 -64 68 51 -253 -105 56 -22 -9 -175 9 69 -108 130 56
5667E6J90l19j26M16j67j91L67j95k91L69O9o6R2l28R0J03j53K40k63o2J70m64
$$ 56 246 -73 -199 217 50 -141 226 31 -260 109 178 112 204 -124 -34 69 -84 156 -107 -169 1 -463
5689d63K97K31k24o3K21j33QJ79j12K73j02L68m45q0L12l17o4j7K05j54K19R4
$$ -463 -166 65 -159 -222 -1 -134 -126 53 -59 214 112 480 35 -45 267 -50 -114 -131 74 -80 139 233
5711B33k19L7O9l25J15O8n7R5j42K22j90jm0K04j62K53J64l45J02j22J45n8j7
$$ 233 14 51 120 -205 -90 -22 -79 16 -126 96 -94 -95 -135 69 -93 160 324 -21 81 -41 104 46 29
5734B9r0j60M0K62K7j06n1J39j94%N3jL9R6j38K4j79K30j6J34j90j55J88J29j9
$$ 29 -61 -221 -181 81 108 2 -49 90 -104 -104 -51 -52 -13 83 -55 -31 -210 20 4 138 -52 -207 -19 110 91
5759I1J83k85k23M39l73J47NK34l55P9L49j93J30j60J48j09J32k78R4J3n7Nqq7
$$ 91 274 -11 -234 205 -168 -21 -16 218 -137 -58 291 98 228 68 216 107 239 -39 55 68 11 16 8 -79
5783g9KK9k05K53j88P8k32K11J65R0j21j74O7J53oL2O8k30L62m96J8J36O5k7j25
$$ -79 -77 -48 -253 0 -188 -110 -342 -131 34 124 3 -171 -104 49 43 75 143 -87 275 -221 -203 -67 -2 -29 -154
5808a54J07l5J07K54l73q7R2k97M81N5k47J47r1l18J87K95j73N9R3o0m1K4J03
$$ -154 -47 -82 25 279 -94 -181 -89 -386 95 150 -97 50 -41 -359 -172 123 -50 9 102 42 1 25 128
5831A28m4K2l09J57R5M7J77l55M61k71k53L85M3k65j78J02k15j43K48K19k58o7
$$ 128 84 106 -203 -46 49 96 273 -82 379 108 -145 240 283 18 -160 -58 -273 -416 -168 51 -207 -274
5853b74Q2N00p62N51n9M2j01k42L32j48J25j10K45j14n8O5R0j18k03K50J74m13
$$ -274 -192 308 -454 97 38 80 -21 -263 69 -79 46 -64 181 67 9 74 164 46 -157 93 267 -146
5875a46R2J1K85m78N32k88l5n8K42j69j32j70J22J23l59O09O4k16l66J10M0j3
$$ -146 -54 -43 242 -236 296 8 -27 -85 157 -12 -144 -314 -192 -69 -428 181 245 29 -337 -227 -187 -200
5897b00M5J56k57M24l57n7K18k2J30k19L1K73k64N02m24M9n0l8P2J34j53K23l89
$$ -200 -155 1 -256 168 -189 -246 -28 -50 80 -139 -108 165 -99 403 -21 28 -22 -60 12 146 -7 216 -173
5920a73J11J0K39M4n33K30j14M01j64o9K31k02o3n9J18K2J12p9o2P2j38K54l26
$$ -173 -62 -52 187 231 -302 -72 -186 215 51 -18 213 11 -52 -111 7 29 141 62 0 72 -66 188 -138
5943a38oJ24P9l05M18j93n3J22j17RL83l98K07k98J67J19o7j01j9L25j78q7J6
$$ -138 -144 -20 59 -246 172 -21 -74 48 -69 -60 323 -75 132 -166 1 120 53 -48 -67 258 80 -7 9
5966Ij10J7j7J39j01Q8k75K90R2k61J15k1k1m5k59K33N1l2J9J80r4Q7R9L6k54
$$ 9 -101 -84 -101 38 -63 25 -250 40 132 -129 -14 -35 -56 -101 -360 -127 -76 -108 -89 91 -3 84 183 219 -35
5991c5K96k35r4o6j00K33k6j4mK22j04r1j04J88m6J05K86n95L43l88L9L40j93
$$ -35 261 26 -68 -134 -234 -1 -27 -41 -45 177 73 -18 -122 66 20 125 411 -184 159 -229 -190 150 -43
6014d3N4j94K90M4p4k18K3R8K50j67k5k09J01J51j09j85L00M6j99o2J60N0J04
$$ -43 11 -183 107 151 77 -141 -118 -20 230 63 38 -171 -70 81 -28 -213 87 133 -66 -128 32 82 186
6037A86k79J23l1K95m31K29j93K05n6J1Jj65K79j26j84r8L15k29L12j08N2n8q7
$$ 186 -93 30 -1 294 -137 92 -101 104 48 59 60 -105 174 48 -136 -234 81 -148 164 56 108 50 -37
6060c7n5K15l73K15L7k50J92J95j78J35q7l20M49k34m1l8P8o5J04j00K36M7k71
$$ -37 -92 123 -250 -35 2 -248 -56 139 -39 96 9 -311 138 -96 -137 -175 -97 -162 -58 -158 78 125 -146
6083a46j80N65m01K00J39l52k7J23k4J90Q1j42j47J08r2K00O0k4k86J73J72l90
$$ -146 -326 239 -162 38 177 -175 -202 -79 -103 87 168 26 -121 -13 -105 95 155 131 -155 18 190 -200
6105b00K10l9R7k75K49J41l06O9P9J22l40J25j10q8L90j88K34k07k13L01j23k24
$$ -200 10 -29 68 -207 42 183 -123 -54 25 147 -193 -68 -178 -266 124 -64 170 -37 -250 51 -72 -296
6127b96J99N6K56l51o9R7J92p7J26P8j25q0O2r2K13j82J40j25j5J50k81R7l1J04
$$ -296 -97 -41 215 -136 -205 -108 84 7 133 211 86 6 68 -24 189 7 147 22 7 157 -124 -27 -58 46
6151D6j37L5O0j07K46l23K97j58K6j24L6K83k60R8k10K8m5K35P4P3l88J45k5j62
$$ 46 -91 -56 4 -103 143 -180 117 -41 -15 -139 -103 180 -80 18 -192 -164 -209 26 100 173 -215 -70 -95 -257
6175b57K42Nj4o1L43j56M1j13L91n54J9O6J56Jl12J35O8l0O7j12k6J58O2j93N3
$$ -257 -15 -10 -24 -85 258 102 143 30 421 -133 -114 -48 108 109 -203 -68 0 -30 37 -75 -101 57 119 -74 -21
6200b1K80o3j4m15R5J2K88m60K36K7J51r9P7k34K32q9K7m3J41Q5l6J0j46N7j05
$$ -21 259 196 182 -233 -138 -126 162 -298 -62 -35 116 17 94 -140 92 3 30 -13 128 213 177 187 41 98 -7
6225gk01P5J49o0J61L9p5j94L13j97k5P0j62P7Q7j26P0mn9P6L87n16K61j3M3K3
$$ -7 -208 -133 16 -44 117 156 81 -113 200 3 -22 48 -114 -37 50 -76 -6 -10 -69 7 394 -122 139 126 169 192
6251A92k03k11L48k74L2q4O9K74m31J22L84J1l68J79j82k9J88N3O2k21k37M23
$$ 192 -11 -222 126 -148 -116 -200 -131 143 -288 -166 218 229 -139 40 -142 -171 17 70 132 -89 -326 97
6273I7j1J7l12l6K49j81J47O2j82K47j12J13K7l21M06j92K15k93p9M3o5J62l87
$$ 97 86 103 -209 -245 4 -177 -30 32 -150 97 -15 98 125 -196 210 18 233 -60 -139 -96 -161 1 -386
6296c86M68l75K63J8p9N5L4L5k8k21J59J94O7k83J42j73J62J18k68M3R8l76J04
$$ -386 82 -293 -30 -12 -91 -36 -2 33 5 -216 -57 137 204 -79 63 -110 52 170 -98 -55 43 -333 -229
6319b29L08J17j75k48K46O4j31K38k05rj00L87j51o5j37Jj3J09N8l0K46m95L42
$$ -229 79 196 21 -227 19 83 -48 190 -15 -24 -124 263 112 47 -90 -89 -102 7 65 35 281 -214 128
6342A28J23l74J6K41j45O8j49m0K03l48P6N8K86J8m42L48K09j5o6j58j95L76l33
$$ 128 251 -123 -107 134 -11 57 -92 -132 71 -277 -201 -143 143 161 -281 67 276 261 195 37 -158 218 -115
6365a15J44L8k43M77l26kK06K3lr4J21k73K2K45m05j74J46L32k51O0J03N3j0j44
$$ -115 29 67 -176 301 -25 -27 179 202 199 105 226 -47 -25 220 -185 -359 -213 119 -132 -72 31 84 74 -70
6389g0R3j5J59l01K06k03K38O3l30j27L82l11N07m34O1K60r1j12j8M2k65J47n2
$$ -70 23 8 167 -134 72 -131 107 170 -160 -287 95 -216 291 -143 -82 178 87 -25 -43 -1 -266 -119 -171
6412a71L98l70R9j42K35J23Q7l93RL43k25l5K62l75NJ51k06K24j35M12o12K06
$$ -171 227 -143 -44 -186 49 172 259 -134 -125 218 -7 -42 220 -155 -150 1 -205 19 -116 296 -316 -110
6434a10J58j60P9J05j08j40M26l1j43k19n1J80q9P6J92k47K38l31J07j61n0J27
$$ -110 48 -112 -33 72 -36 -176 250 219 76 -143 -194 -14 -103 -27 165 -82 156 -175 -68 -229 -279 -152
6456a52J94k05J78j81K56J20l16R0j5P3j6j05mQ5j49J09j13O9l7P8K47l80r1L68
$$ -152 42 -163 15 -166 90 210 -106 -16 -31 42 26 -79 -83 2 -147 -38 -151 -82 -119 -41 206 -174 -265 103
6480A03k04J36J07k51k16N28M6k25j18L07k76j01K13k37J84J78k60L77l78j7q
$$ 103 -101 35 142 -109 -325 203 249 24 -94 213 -63 -164 49 -188 -4 174 -86 291 -87 -104 -112
6501a12J52oM9j6l95L23j73k0M12j6j12K22m50j0j45L67j97J42k2l3j3K60j30
$$ -112 40 34 83 67 -328 -5 -178 -198 214 198 86 308 -142 -152 -297 70 -127 15 -7 -40 -53 207 77
6524G7j71K84m72J04K24J14N1j20p5P8k14o1L01L5k00J54k37K21J28j87j85J44
$$ 77 -94 190 -282 -178 46 160 211 91 16 94 -120 -181 120 155 -45 109 -128 93 221 34 -151 -7
6546gKL23k67n2k58M8L46j91K85l51k6L87Q6l40N8o0n2j15L58l26J81j37M2m2
$$ -7 -5 318 51 -1 -259 -211 135 -56 229 -122 -148 239 325 -15 43 -17 -69 -184 174 -152 29 -108 -66 -108
6570a08L27k45N2k7r5m9J92k3n6K96j68O9p2j73J67j25l17M25k7k33m5K73p1j79
$$ -108 219 -26 26 -1 -96 -145 47 24 -32 264 96 165 93 -80 87 -38 -355 70 43 -190 -235 38 -33 -212
6594b12L54k42L63k39P1Kk22Q1j27q5J74J23J07k16J16J57j01j6j47r9n7J29K4
$$ -212 142 -100 263 24 95 97 -125 -44 -171 -256 -82 41 148 -68 48 205 104 88 -59 -158 -215 -86 -62
6617f2j73K47j19K2j22L28l25M70j66l9R7l22J91P7Pk3j11J43l62M98j28j63J30
$$ -62 -235 12 -107 -85 -207 121 -204 266 100 61 158 -164 27 104 111 88 -23 120 -242 256 128 -35 95
6640I5N9k22J32m6j21K74Jj81J03J24k18Q8m09M33j40J67j75n7k52L03J9KK21
$$ 95 154 -68 64 18 -103 171 172 -9 94 218 0 88 -321 112 -28 139 -36 -93 -345 -42 -23 -21 200
6663B00m18J50J84Kn0L2N0k93O7k6K86k3j45K59k33n05M48K1j90K38kRj30L5r3
$$ 200 -218 -68 116 118 68 100 150 -143 -76 -102 184 161 16 275 42 -463 -15 6 -184 54 52 61 -69 -34 -127
6688a27o5K16M6j33j33%K31J0P5l19M39l31L4K62l50K32m40M17j09m3lK43l25
$$ -127 -192 24 70 -63 -196 -196 35 45 120 -199 240 -91 -57 205 -145 87 -353 64 -45 -88 -91 152 -173
6711a73J16J38j17j15J68N8l0K5j35j36K96k78L02j6n0r1N56o16K42r3k23K51
$$ -173 -57 81 -36 -151 17 75 45 70 -65 -201 95 -183 119 103 53 -38 518 -98 144 51 -172 79
6733G9p4o0J96p0k94M36j76jL6j41J52K8o3m3k5J45j83K51j71k3m1j12L04n55
$$ 79 5 -55 141 71 -223 213 37 36 72 -69 83 111 48 5 -20 125 -58 193 22 -1 -42 -154 150 -405
6757d05N9J91J73k6K29m81P5K33J60q3j8l77L53j78J94k85K41k65N2M5N8j4j40
$$ -405 -346 -155 18 -8 221 -260 -185 48 208 125 107 -270 83 -95 99 -186 55 -210 -158 -113 -55 -69 -209
6780b09O2J90m9l1O2m5j53K7l0L20j77K2l16L80k80Q5J03MJ48m8RJ3J20m08R7
$$ -209 -147 43 -6 -37 25 -20 -173 -146 -176 144 -33 -11 -327 53 -227 -142 -39 -35 113 65 74 87 207 -201 -104
6805a04K01r4N5l20L50K9j50J5J10j44J22j32j77M24k09K81j93m0p5RL41m24J49
$$ -104 97 3 58 -262 88 117 -33 -18 92 -52 70 -62 -239 185 -24 257 64 24 -51 -42 299 -125 24
6828B4j8k22O0N1J34qp2j53K67k22l8K9J6L5M9L1J5K54n1m38j13K77L42m3j37
$$ 24 6 -216 -156 -105 29 21 -51 -204 63 -159 -197 -168 -152 -117 -68 -37 -22 232 181 -257 -370 -93 249 206 69
6853F9j4j33J79L3m23L67j32j50M59n74M38k31n6O3mK28m94O15m31L74k00Q7j95
$$ 69 55 -78 101 134 -289 78 -54 -204 255 -319 119 -112 -168 -105 -109 119 -375 240 -191 183 -17 70 -125
6876a25L07M6j98J62l64K36O0J79j42j99j48J86J18N8l23P4K38k80Q0Kk9K45l29
$$ -125 182 228 30 192 -172 64 124 303 161 -38 -186 0 118 176 -147 -73 165 -115 -35 -33 -62 183 -146
6899a46l2J01J17j71K37j90K1n6J1J40k80M33l23L50m86K19k1k33K90J6q5J2j09
$$ -146 -178 -77 40 -131 106 -84 -63 -119 -108 32 -248 185 -138 212 -274 -55 -76 -309 -19 -3 -88 -76 -185
6922a85J34N7k7k4R8j18K03l48JJ47j92J94j42N47l89o3O1o2K61k41K08k01K05
$$ -185 -51 6 -21 -45 53 -65 138 -210 -209 -62 -254 -60 -202 345 -44 -107 -46 -108 153 -88 120 -81 124
6945A24Oj25j30K88L73m18p0R7N3r6q4J58j22J12j34K78l70j43J20j63M12j1j99
$$ 124 130 5 -125 163 536 118 48 145 198 102 18 176 54 166 32 310 -60 -203 -83 -246 166 155 -44
6968d4J30j85R8L03j75k61L11k41J65J72p4j35J78m8l73K8M5J42r5J59l16l0L09
$$ -44 86 -99 -1 302 127 -134 177 -64 101 273 199 64 242 194 -179 -151 -106 36 -59 100 -216 -246 63
6991F3k24J67j5l1L93l97RJ57k07J61j23m6j4N6J41k54J80J63k83J36R0k82J15
$$ 63 -161 6 -9 -40 353 -44 -35 122 -85 76 -47 -93 -107 -51 90 -164 16 179 -104 32 122 -160 -45
7014d5o5J27k70J61n9J82M9l2j81J06k1K10n9M9j58j51R3J69j03J47J31j11j27
$$ -45 -110 17 -253 -92 -151 31 80 48 -133 -27 -48 162 103 152 -6 -157 -64 105 2 149 280 169 42
7037D2j64K06n6j94J3J48j89L45m26P6K08K05m96O20n08J32Q5k02J95P8k87R6
$$ 42 -122 84 28 -166 -153 -5 -194 151 -275 -199 9 214 -282 338 -170 -38 47 -155 40 118 -169 -73
7059g3J38J08J63m99J88j19J83l5J01j96J12K39j07l59J62pp7k05L02q3J69l01
$$ -73 65 173 336 -163 25 -94 89 54 155 -41 71 310 203 -156 6 -1 -78 -283 19 -64 105 -196
7081a96K18M29n92K77pq4K68m44OJ11J68k86M69n09n1K76m9j50j28K8N74m11j09
$$ -196 22 451 -141 136 129 45 313 -131 -125 -14 154 -132 337 -172 -223 53 4 -146 -274 -246 328 -83 -192
7104a92M63l03J53k55J60j20K95M9k86J42j76j96K90j7l18J63J93l01L5O41n04
$$ -192 271 -32 121 -134 26 -94 201 250 -36 106 -70 -266 24 7 -311 -148 45 -256 -221 420 -84
7125h4jJ80j49K09N6j66N7K39l92L4j5p4J67j93k79N26k49K85l4j88k54J78%K20
$$ -84 -85 95 -54 155 211 45 102 341 -51 -17 -32 -106 61 -132 -411 115 -134 151 117 -71 -325 -147 -147 73
7149G3L5n87M14K06j82O9m4mK42k42M0k7L12n52O7J57l1K03k25R5j39L0K06m27
$$ 73 108 -479 -65 141 -41 28 -16 -20 222 -20 20 -7 305 -247 -180 -23 -54 149 -76 19 -120 -90 116 -311
7173c11M88j61k37K9N72m90m2q2L14j96J7j73Q7M3Q4K85r5k21O0J13q6p2j34K39
$$ -311 177 16 -221 -192 380 -110 -152 -234 80 -116 -99 -272 -185 -142 -58 227 132 -89 -29 84 -2 -74 -208 31
7197C1j94j09K30J57J99j90l15K40j15J11m8J92k90Q6j00R6P3k37J50k5O1j71
$$ 31 -163 -272 -42 115 314 124 -191 49 -66 45 -3 189 -101 -15 -115 -19 54 -183 -33 -58 3 -168
7219a68j10K07o3J05J21J11J22o26M25O2k97K92p1rk14N4J35j98K33j58J36l10
$$ -168 -278 -71 -134 -29 92 203 325 -301 124 186 -111 181 110 101 -113 -59 76 -122 111 -47 89 -221
7241b21J99N3J46l88k43K69L54L1l11q0oL84l14l1K37j76J34P1n6P8k01J21q7
$$ -221 -22 31 177 -211 -454 -185 169 200 -111 -191 -197 187 -127 -158 79 -97 37 108 52 130 -71 50 -37
7264c7j43L45l73K23J43j73j72J88R5O8j02p7j16J90M6k0M0M3n2j1m1m2J72k26
$$ -37 -180 165 -208 15 158 -15 -187 1 96 164 62 -15 -131 59 105 85 125 168 116 105 64 22 194 -32
7288c2M4k34K73k9j0r3m0J61l06L46m21L11q6L44k26K32j18k33J71L5q8j1j3j7
$$ -32 12 -222 51 22 12 -81 -121 40 -266 80 -341 -30 -116 228 2 234 116 -117 54 89 1 -10 -23 -40
7312d0N0N1M1j38L35m37M42k79J55m35J67Q1L2j06o3J22J54l56M45K7k2n6k99
$$ -40 10 61 102 -36 299 -138 304 25 180 -255 -88 -7 25 -81 -144 -22 132 -224 221 248 226 170 -129
7335a29L02l70N0l5J66J99j83k9m8K98k34J2J50m9j33L45n27L77j68j8l11J44
$$ -129 173 -197 -147 -182 -16 183 0 -29 -77 221 -13 -1 149 100 -33 312 -215 162 -6 -24 -335 -191
7357a91M22p8K9l54O6Q3L8m1l14M41j09jJ43k51K57l11P9L87m16P6k61M50p8K0
$$ -191 231 153 182 -172 -106 -23 15 -26 -340 101 -8 -9 134 -117 140 -171 -92 295 -121 -45 -306 144 66 86
7381H6k45J13O3J71k44j20j9K1J70L40j92l05K33p3K9J64k80J48J8N5j59m8L7
$$ 86 -159 -46 17 188 -56 -176 -195 -174 -4 336 144 -161 72 -1 28 192 -88 60 78 133 -26 -74 -37
7404c7K46j79k04l4K60P6k0j31j23K5M1J2MR4Jm11L29k0R5k7j61J35O4k70K99
$$ -37 209 30 -174 -208 52 128 108 -23 -146 -121 -80 -68 -64 30 31 -380 -51 -71 24 -3 -164 -29 35 -235 64
7429F4l66M16j32KJ47k89J06j28K70R8j81p8k72M21K9Rn4l35K48J65J45j89o4
$$ 64 -302 114 -18 -16 131 -158 -52 -180 90 188 7 -71 -343 78 107 116 62 -273 -25 140 285 96 32
7452C2m7J99K1j29K9m82L24L2j36L28j73J83k22K56n19L95J45o63K16R6L1KR5
$$ 32 -15 184 205 76 105 -377 -53 -21 -157 171 -2 181 -41 215 -304 91 236 -427 -211 -115 -84 -82 13
7475A3m1N2k2J41k27J02J02j96o8J41J1m03K05J42j86J70j11L5L48k27l29J12
$$ 13 -28 24 2 143 -84 18 120 -76 -144 -3 8 -395 -190 -48 -234 -64 -175 -140 208 -19 -348 -236
7497b36M47k83J08J50R0l58j99J41K03J48j46k91J01PK62j40k77K92j87L22k15
$$ -236 211 -72 36 186 276 -82 -281 -140 63 211 65 -226 -125 -118 144 4 -273 19 -168 154 -61
7518f1K26j90K3k49J68J18J28J0l41p7K87J11j07o9l39K35j85M47k72J43K32k93
$$ -61 165 -25 -2 -251 -83 35 163 173 -168 -245 42 153 46 -23 -362 -127 -312 135 -137 6 238 -55
7540e5k2J56M2L5k66K18J4m82M88q2P3j44j26P2q6L33l07K24k2j77K6k70L60m9
$$ -55 -77 79 121 156 -110 108 122 -360 128 46 119 -25 -151 -79 -165 168 -139 85 63 -114 -88 -358 2 -47
7564d7K09j87l03N01k2J63k49M8j62p4J86J92l22o9R0m00N77j01P8j1j08K03j97
$$ -47 162 -25 -328 173 151 314 65 113 -49 -123 63 255 -67 -136 -46 -446 131 30 108 97 -11 192 -5
7587eN9j83J73o3Kj71J52o3J51J10o30N75k04J84k61r9Q5K9J55J01j00K3m3N6
$$ -5 54 -129 44 -19 -17 -188 -36 -99 52 162 -468 107 -97 87 -174 -273 -188 -159 -4 97 -3 20 -23 33
7611C3r1K72l85n4N52k17J13J00q8l75J08k2M0j59k13L34j6k7J63j95j54K93j37
$$ 33 -58 214 -171 -225 327 110 223 323 235 -140 -32 -54 -14 -173 -386 -52 -68 -95 68 -127 -281 12 -125
7634a25J25k6k5L56p1j89K5m8j63R6N1l5j2O2pJ29j97j3K41n17M46j10l7l3J17
$$ -125 0 -26 -51 305 234 45 70 22 -141 -45 6 -29 -41 21 14 143 -54 -67 174 -343 103 -7 -44 -77 40
7659D0j16J48k80K80j63L5k25J66m2m5K01j09k4O6m4L23n37L6J51K06l6j23J03
$$ 40 -76 72 -208 72 -91 -56 -281 -115 -157 -202 -1 -110 -134 -68 -112 211 -326 -290 -139 67 31 -92 11
7682A1j04Qj1R6J09P9Rl17q7K75J23j24j36j70J48K64k60P1j20J62L39n96L87
$$ 11 -93 -85 -96 0 109 188 197 -120 -207 68 191 67 -69 -239 -91 173 -87 -16 -136 26 365 -231 156
7705A56j42L9K22l65K5J41mP0q0J31k54M11k44l2j61P8p1m8K56r0k12K42j24J93
$$ 156 14 53 275 -90 -65 76 72 142 62 193 -61 350 106 74 -87 -9 -80 -128 128 38 -174 68 -56 137
7729A37q5K49m82O9j1K81m24J07J80o2L50l00K68k39j06J94m26m0L20j23Q2M8
$$ 137 52 301 -181 -112 -123 158 -266 -159 21 -41 309 9 277 38 -68 126 -300 -340 -20 -143 -61 -13
7751a3L7K5R7m72K11j4P4J50m01L73k74K67O1l23j42L09j7l0K47l48P5j65K70
$$ -13 24 49 146 -326 -115 -129 -55 95 -306 67 -207 60 121 -202 -344 -35 -52 -82 165 -183 -108 -273 -3
7774cq2M7J74l91L41j34O6m56J02K59N9l4K99K41l71j38J58j37K80l05J13j2k16
$$ -3 -85 -38 136 -255 86 -48 18 -438 -336 -77 -18 -52 247 488 117 -21 137 0 280 -25 88 76 -140
7797a40m5K48j56K37k15J06l0k06P1N7J40l3q8P8o2K5J11j31M2Q0J05j74p1K65
$$ -140 -185 63 -93 144 -71 35 5 -201 -130 -73 67 34 -54 24 -38 -13 98 -33 9 89 194 20 -51 214
7821B14j76K8J13m27J26K36j36J59k98J76j59J00K48j85p8j05K32M5J17l45j43
$$ 214 38 66 179 -248 -122 114 -22 137 -161 15 -144 -44 204 19 -59 -164 68 113 230 -115 -258
7842b58J40J69k3p1K64k19K0k34K9L01k05j35J60j65J67Mo1R3j3oo0m9L41m31
$$ -258 -118 51 28 -43 221 2 22 -212 -183 118 -87 -222 -62 -227 -60 -56 -117 -24 -37 -43 -103 -152 189 -242
7866b42K37Q7l23K65r4N6j35K06j14RJ43k12P7K40k79K93m08Q4l3L13q7k01N0
$$ -242 -5 82 -241 24 -70 -14 -149 57 -57 -48 95 -117 -40 200 -79 214 -194 -110 -143 170 83 -118 -68
7889f8j37L18k24J93p7J84n34L85Rj62J75j86J04j84j0n9P0L44j78K79k86j10
$$ -68 -205 113 -111 82 5 189 -345 40 49 -113 62 -124 -20 -204 -214 -273 -203 141 -37 242 -44 -154
7911a54L11j83O6K64l54J26j68o9l4j55K82PM6J27j19L84k41l0j07K90j33O4l44
$$ -154 157 -26 40 304 -50 76 -92 -161 -195 -350 -68 -61 -15 112 -7 377 136 106 -1 289 156 220 -124
7934a24MQ8J59l04N3o9L68J85k17r0k7pK8J39j35k05K52k43K1O6K43j92R0j96
$$ -124 -120 -32 127 -177 -124 -193 175 360 143 53 26 19 47 186 51 -154 98 -145 -124 -58 185 -7 83 -113
7958a13K68j06Q3j74K31p2j04J40m48M95j93n6J50j05R7K4k93L5k9LK62j33m8
$$ -113 155 49 132 -42 189 117 13 153 -295 200 7 -49 101 -4 93 117 -176 -141 -170 -167 95 -38 -86
7981h6L89k19k30J4L5J49J26k08L08j18k20J24n3K41m97K93j13q0L5j42K13j27
$$ -86 303 84 -146 -132 -97 52 178 -30 278 160 -60 64 11 252 -245 48 -65 -145 -110 -252 -39 -166
8003a66Lp8O37m28Oj68J43K45l75J38K52m41K80J2j71K05j43q2Q2J13l36M23j63
$$ -166 -163 -241 396 -32 -26 -194 -51 194 -181 -43 209 -232 48 60 -111 94 -49 -131 -49 64 -272 151 -12
8026a2j68Q6K71k7j57j07K11l30JMO4j79L31J70j77J83L0qL5k15J01m07L21J90
$$ -12 -180 -94 177 150 -7 -114 97 -233 -232 -228 -164 -343 -12 158 -19 164 194 186 221 6 107 -300 21 211
8050B11k67J42O0o5J7n1L3L7l39K99l8j11J8j8Q0m6l6Q0n4K2l36J38K96k14K36
$$ 211 -56 86 146 81 98 47 80 117 -222 77 39 -72 -54 -72 8 -38 -74 6 -48 -26 -362 -224 72 -142 94
8075I4J8J85l30N2K1l81N05k71k35K97o6m1K12Q2j05j49O3pL3J69M2n35K75L61
$$ 94 112 297 -33 19 40 -341 164 -107 -342 -45 -111 -152 60 142 37 -112 -49 -56 -23 146 188 -347 -72 289
8099B89l99J93k05J73P1l54K30J92k06j6j81L52k45J65k31L19K83n44K71l9j76
$$ 289 -110 83 -122 51 122 -232 -2 190 -16 -32 -213 139 -106 59 -172 147 430 -114 157 118 -58
8120e8L2J22p9j66J34J6O6j71l5L93k75L49k48J22j15j46K00r1J69l06j36K18
$$ -58 -26 96 17 -149 -15 1 67 -104 -139 254 -21 328 80 202 87 -59 141 50 219 -87 -223 -5
8142ek50N15k30K41l92j45L33K9l3l73L79k60J69J88l37J74L3P0Q2p4N6l86K86
$$ -5 -255 260 30 271 -121 -266 67 96 63 -310 69 -191 -22 166 -171 3 36 106 188 114 170 -216 70
8165G0J16o1J29RO0r7l96K48N0k03m7J04K4m5j09J68J88o4j16M8q7j78J07J04
$$ 70 186 125 254 263 323 226 -170 78 128 -75 -122 -18 6 -39 -148 20 208 144 28 76 -11 -189 -82 22
8189B2J9k83
$$ 22 41 -242
8191b42
$$ Imaginary data points
##PAGE= N=2
##DATA TABLE= (X++(I..I)), XYDATA
0@%%%%%%%%%%J0k0K0k0L0m0M0n0P0q0R0j10J30j60J90k20K60l00L43l94M52n18
$$ 0 0 0 0 0 0 0 0 0 0 0 10 -10 10 -10 20 -20 20 -30 40 -40 50 -60 70 -90 100 -120 140 -160 183 -211 241 -277
32b77N90o68P55q50R58j076J203j342J494j662J846k045K263k502K763l050L361
$$ -277 313 -355 400 -450 508 -568 635 -707 787 -875 971 -1074 1189 -1313 1450 -1600 1761
49A761l702M079m493M952n462O030o669P395q226R187j0314J1656j3289J5326
$$ 1761 -1941 2138 -2355 2597 -2865 3165 -3504 3891 -4335 4852 -5462 6194 -7095 8231
63H231j7949K1470k6480L4229m7946P9465k90287l7762N42322P024l04965k62203
$$ 8231 -9718 11752 -14728 19501 -28445 51020 -239267 -277029 265293 272317 -32648 -294851
75b94851J68100K50288M8871j94345r9586O9274J16222l0614q2139j8908P6419
$$ -294851 -126751 123537 172408 -21937 -121523 -52249 63973 33359 -48780 -67688 8731
86H731M2838j2957m1249j8531k0237P96K5429K4813l5288m6846K3551R6837M0458
$$ 8731 51569 38612 -2637 -21168 -41405 -40609 -15180 9633 -25655 -72501 -48950 47887 88345
99H8345p4428r2896K4463R9507K5594r3690p3700N2119J00359N326q0176l0555
$$ 88345 13917 -78979 -54516 44991 70585 -23105 -96805 -44686 55673 60999 -19177 -49732
111d9732P0885O3762l7805q3081j0001N9509K6707m4879l7665L1369N2064k34
$$ -49732 21153 84915 47110 -35971 -45972 13537 40244 -4635 -42300 -10931 41133 40899
123D0899m1099k3176J1415J4808K980r27m761j5396r775K2526M1459R484m0542
$$ 40899 -200 -23376 -11961 2847 5827 4900 139 -15257 -25032 -2506 38953 48437 7895
136G895l6491K3170M9371q248o7609l1240N6519O4720j9037o7344j0421O1587
$$ 7895 -28596 -5426 43945 35697 -31912 -63152 -6633 58087 39050 -28294 -38715 22872
148B2872L8939m2381o3370J833N7099K5715m0240m4518J4610M8761J4237l1398
$$ 22872 61811 19430 -43940 -42107 14992 40707 467 -44051 -29441 19320 33557 2159
160B159k4992J1698K0816k661j7381o036P941R515P113M278n562j3741n854J3457
$$ 2159 -22833 -11135 9681 7020 -10361 -16397 -8456 1059 8172 12450 6888 -6853 -12707 750
174G50J3693j1736k8345m405K9423K2591j8493l3930M188M3651K4991k8803m3660
$$ 750 14443 2707 -25638 -30043 -620 21971 3478 -30452 -26264 17387 42378 13575 -30085
187c0085P91L8573J7640k9074k9975J2505L4057P825k4647j8952J0002K1585N368
$$ -30085 -29294 9279 26919 -2155 -32130 -19625 14432 22257 -2390 -21342 -11340 10245 15613
200A5613j5041j5034J400J4064J0067k368p810k838O821J0990K237j4402k0793
$$ 15613 572 -14462 -13062 1002 11069 8701 891 -1947 4874 15864 18101 3699 -17094
213a7094r46K1560J6239j1081j9791K743K1527R893j5163j7376M150J7910K568
$$ -17094 -18040 3520 19759 8678 -11113 -8370 13157 23050 7887 -9489 -5339 12571 15139
226A5139j9606j7192J0210K4420P987j4789j1636P467J3416r81j3656p650O101
$$ 15139 -4467 -21659 -11449 12971 20958 6169 -5467 2000 15416 14435 779 -6871 -770
239g70J1374L012n590n307M71M112K569k411n936n029n35J581j517l304J267J0024
$$ -770 10604 13616 8026 2719 3190 7302 9871 7460 1524 -3505 -4040 -2459 -3976 -7280 -6013 4011
255D011J0362n08j1319r199L794J0589O07j1107o509P223J1759J97r049l717O872
$$ 4011 14373 13865 2546 -6653 -2859 7730 8337 -2770 -9279 -2056 9703 9900 851 -2866 4006
270D006P536k554j2771q515L252R797J874o217k521P351P653l653j2229p131M407
$$ 4006 11542 8988 -3783 -12298 -9046 751 2625 -3592 -6113 1238 8891 5238 -6991 -14122 -9715
285i715R298M089n374o754K219J1754P372m134p743j983L443P80n955o919m19
$$ -9715 -417 3672 -1702 -8456 -6237 5517 12889 8755 1012 -971 2472 3252 -2703 -9622 -10041
300a0041P781P654o22p061l820M058M837k149o678k635M254O511J731l629k251
$$ -10041 -2260 5394 4772 -2289 -6109 -2051 2786 637 -6041 -8676 -4422 2089 3820 191 -2060
315b060K775M537J020n242o613n06M096K176k422k334L449O804L911l251o640
$$ -2060 715 5252 6272 1030 -5583 -6089 -1993 183 -2239 -4573 -1124 5680 9591 6340 -300
330c00m260K107M709M48m822l827J715N032K343p16k038q75J218L22k023k858
$$ -300 -4560 -2453 2256 2704 -2118 -5945 -4230 802 3145 2429 391 -484 734 1056 -967 -3825
346c825J45M323L593p85k282J325K532p00l910l869q04J870K294J81j117L69J389
$$ -3825 -3680 643 4236 3451 1169 2494 5026 4326 416 -3453 -4257 -2387 -93 88 -1029 -660 729
363G29N52L34O11O07j962m074k215J918L462J637j783q34R71J651l93k315j849
$$ 729 1281 1615 2226 2833 871 -3203 -5418 -3500 -38 1599 -184 -1018 -47 1604 1211 -1104 -2953
380b953P57K140K38j435j398R80J826J449k45j584r81m65K96J82q40j470J253
$$ -2953 -2196 -56 182 -1253 -2651 -1671 155 1604 1359 -225 -1206 -1671 -1375 -1193 -2033 -3503 -2250
397b250L305J689j375k677k13J532Q30j464k640j001J536K029m40j963q7L274
$$ -2250 1055 2744 1369 -1308 -1521 11 841 -623 -3263 -4264 -2728 -699 -1139 -3102 -3189 85
413H5K651n23k541j830K26J776J157m32j275J099K293q8l253j510R73J643k89
$$ 85 2736 2213 -328 -2158 -1932 -156 1001 569 -706 393 2686 2598 -655 -2165 -1192 451 162
430A62j944j627L08J808K047K39p34N61J568m88k516j885N75J820Q57K81n42k8
$$ 162 -1782 -3409 -3101 -1293 754 993 259 820 2388 1900 -616 -2501 -1926 -106 751 1032 490 462
448D62N80O29J15m78n60l17j23o98j087l05J284J749M44o13j383r87L65k12q47
$$ 462 1042 1671 1786 1308 748 431 308 -390 -1477 -1782 -498 1251 1695 1082 -301 -1288 -923 -1135 -1982
467a982L4J591J478K49p14n1J734O73j390r75k35n26j149q13Q06J266J730O17
$$ -1982 -1948 -357 1121 1370 656 605 2339 3012 1622 647 412 -114 -1263 -2076 -1270 -4 1726 2343
485B343q25j312p03k2r39oN45O76p14O29J048P38r97K31M22J78j387j862p7J895
$$ 2343 1518 206 -497 -519 -1458 -1464 -919 -243 -957 -328 720 1458 461 692 1114 1292 -95 -1957 -2034 -139
505a39J514P0k45K81R92l98k201k270L02K186M20k187k23J319J551k01j31J56
$$ -139 1375 1445 1200 1481 2473 2075 -126 -2396 -2094 92 512 -1675 -1898 -579 972 771 640 796
523G96P16n49j633q10N73R12J019n57R41M01o33j297j57L17J08q79r56J117J881
$$ 796 1512 963 -670 -1480 -907 5 1024 467 1408 1809 1176 -121 -278 39 147 -732 -1688 -571 1310
542A310j11j298L20J273O33j444j832N1L10K08n97J57J343J264m9j504L4Q10J54
$$ 1310 1199 -99 221 1494 2127 683 -1149 -1098 -788 -580 -1177 -1020 323 1587 1538 34 68 878 1032
561A032j120o42P22P61n36k09K91Q68k40j516L1O20k39p13m49L30J484N29n68
$$ 1032 -88 -730 -8 753 217 8 299 1167 927 -589 -558 62 -177 -890 -1339 -1009 475 1004 436
580D36J53P86p5j643r55M47J448l01j334n41J551J248n05j282N10J231nj542j072
$$ 436 589 1375 1300 -343 -1298 -851 597 296 -1038 -1579 -28 1220 715 -567 -57 1174 1169 -373 -1445
599a445J260Q06k9o27K20P48K91p81j188K24O48o0p68J14Q77n34l61M63J124N33
$$ -1445 -185 621 592 -35 185 933 1224 443 -745 -521 127 67 -701 -587 290 -244 -605 -142 982 1515
619A515j196r97K54M35l5m86j4P61R12K12j709KJ279K00m66j381m2O53r5n99o0
$$ 1515 319 -678 -424 11 -24 -510 -524 237 1149 1361 -348 -346 933 1133 667 -714 -756 -103 -198 -797 -857
640h57R08M53k84m51O4j59n06o2N18Q47J19n27n6L36K95k82q11N44KL5r76m83
$$ -857 51 504 220 -231 -167 -326 -832 -894 -376 471 590 63 7 343 638 356 -455 89 91 126 -850 -1333
662a333Q85O70J39J40n3K91o86q47k96M38L97k82l40j37Q59L42l49R3k4O52j45
$$ -1333 -448 222 361 501 448 739 53 -794 -1090 -652 -255 -537 -877 -1014 -155 187 -162 -69 -93 559 414
683D14j102m62N52R88l04k64R41R5l87n32p22p0J06L07k05J10K93K86k15K30K18
$$ 414 -688 -1150 -598 390 86 -178 763 858 471 -61 -783 -853 -747 -440 -645 -535 -242 44 -171 59 277
704B77J75k92r90N44J05J43m11K95R35M60q96m98n0P5J32m35j80L08O96l77M2
$$ 277 452 160 -830 -286 -181 -38 -449 -154 781 1241 345 -153 -203 -128 4 -431 -611 -303 393 16 58
725E8p5J93M84l66p11j60R7J5j47N36J94L53M4J45q8l68l26j92K14J08j06k96
$$ 58 -17 176 660 294 -417 -577 -480 -465 -612 -76 118 471 515 660 572 204 -122 -314 -100 8 -98 -394
747c94J94L38L28j30m06k18N05m84j29q5L69M39j86Q5K5L07p45k31L38P7j53n97
$$ -394 -200 138 466 336 -70 -288 217 -267 -396 -481 -112 327 141 226 251 558 -187 -418 -80 -3 -156 -753
769g53K96L54N80qk07n43M41L24o34r3K0J82j44K16j79L38k8l96K58m3N2o48M78
$$ -753 -457 -103 477 469 262 -281 160 484 -150 -243 -223 -41 -185 31 -148 190 162 -234 24 -19 33 -615 -137
792a37J02K31j91j34J58N8L93k56j8o0n72J09K78J2l6L65pK12l28M3J61k27P6
$$ -137 -35 196 5 -129 29 87 480 224 206 146 -426 -317 -39 -27 -63 302 295 507 179 222 383 156 232
815B32N0m79j30K22J8K55J44k08p8M20K23m51m62k65N00N38l50M0J86k59ro6L7
$$ 232 282 -197 -327 -105 -87 168 312 104 26 446 669 218 -244 -509 -9 529 179 219 405 146 137 71 108
838A08K77j01l75N8k97L58j0N73j52q4j87k91j44K77k30Qj15L81K50l61o9K68
$$ 108 385 284 -91 -33 -330 28 18 591 439 355 168 -123 -267 10 -220 -212 -327 54 304 -57 -126 142
860A42J98L5j88l73K83K6OR8j13J75P7J24n27k78K14q2J55k76M0N04j49j26J20
$$ 142 340 375 187 -186 97 123 129 227 114 289 366 490 -37 -315 -101 -183 -28 -304 -264 240 91 -35 85
883H5k24Q8L04j25l09J93n35M06J45k50J23J49L77l36j47nm04K44L9K44j71k42
$$ 85 -139 -51 253 128 -181 12 -523 -117 28 -222 -99 50 427 91 -56 -61 -465 -221 -182 62 -109 -351
905c51O42k8p6m56j6M84j28m00k03l9M55L34K20j38k78L57l84J59j03l49K84J15
$$ -351 291 263 187 -269 -285 199 71 -329 -532 -571 -116 218 438 300 22 379 -5 154 51 -298 -14 101
927A01j05J88j89J4J18K03k96k92j11L76j5j98j65M36j58N62j74k29m95K13P9
$$ 101 -4 184 -5 9 127 330 34 -258 -369 7 -8 -206 -371 65 -93 469 295 66 -429 -216 -137
948a37J04j70m3K42J21J92j44R6J92j74m16j99R3L0J05M0N6J14N8J30j48k38Q3
$$ -137 -33 -203 -246 -4 117 309 165 261 453 279 -137 -336 -243 -213 -108 -68 -12 102 160 290 142 -96 -13
971a3k73K4K65J59M4l92L41l55l1N6j21K19j1J34l60l2N46J92n16j99J85K18N0
$$ -13 -286 -262 3 162 206 -186 155 -200 -231 -175 -296 -77 -88 46 -314 -346 200 392 -124 -323 -138 80 130
994A30l96q2K23QLj92J87j12O9k6O1J48j14J62l1j66j16P9J44K83J2j64l47R6
$$ 130 -266 -348 -125 -117 -114 -306 -119 -231 -162 -188 -127 21 -93 69 38 -128 -244 -165 -21 262 274 110 -237 -141
1018a41K91k15J93O9k75L77k48J01k50L78r6k7l65P6j43P6L19k07j65J75J66K12
$$ -141 150 -65 128 197 -78 299 51 152 -98 280 184 157 -208 -132 -275 -199 120 -87 -252 -77 89 301
1040C01k18l77M24J83j96o0l49K01L40j19MO0k08l8K92j26l16KK78Ro2o3q9J83
$$ 301 83 -294 130 313 117 57 -292 -91 249 130 134 194 -14 -52 240 114 -202 -200 78 87 25 -38 -127 56
1064E6K99j92J25l14N4n5K85l18j0q9O33l23p5L7J9k78J96l6n0M6L7J95Kj89l22
$$ 56 355 163 288 -26 28 -27 258 -60 -70 -159 474 151 76 113 132 -146 50 14 -36 10 47 242 244 55 -267
1089b67O4L67l77J00J94K0j78K30j99m0R2j44K30r1j54j02J04M7K38j70J36l42
$$ -267 -203 164 -213 -113 81 101 -77 153 -46 -86 6 -138 92 1 -153 -255 -151 -104 134 -36 100 -242
1111b42K45k5j46J87J30j54R7J19m46K71m0K9j5R2j56j64M8M44n08J82j31N00
$$ -242 3 -22 -168 19 149 -5 92 211 -235 36 -4 25 10 102 -54 -218 -170 274 -234 -52 -183 317
1133C17m68R6L22n8j57k73K19J57k22pK20j58M0M4k31L76m99L35J35p3J67k10
$$ 317 -151 -55 267 209 52 -221 -2 155 -67 -74 146 -12 28 72 -159 217 -282 53 188 115 282 72
1155G2j87j95K55M0J95l22K7P4J17j86K69K14k81R6m35J77J27j89J80j00K1r4
$$ 72 -115 -310 -55 -15 180 -142 -115 -41 76 -110 159 373 92 188 -247 -70 57 -132 48 -52 -31 -125
1177a25OR8j89o8K19J06J06q0j20qK30l35K71K5l06K56J0l1j00qk09M03l78M57
$$ -125 -119 -21 -210 -278 -59 47 153 73 -47 -55 175 -160 111 136 -170 86 96 65 -35 -43 -252 151 -227 230
1201B30k14k15M23j95j14l1J70k29L03Nm9M3R5q6m0j88Q2J5k48M37n99K32K93
$$ 230 16 -199 224 29 -85 -116 54 -175 128 133 84 127 222 136 96 -92 -10 5 -243 194 -405 -173 120
1224A20k53K04j40j77o1R1L57l27J62p5J97nJ08k20K77k96J44l5m3J01j89J37
$$ 120 -133 71 -69 -246 -307 -216 141 -186 -24 -99 98 93 201 -19 258 -38 106 71 28 129 -60 77
1246G7q3j66J44L47j49j15q2j70M81l07J0m6Q8K62k38K28j07k61Q1l7j95m4r7
$$ 77 -6 -172 -28 319 170 55 -27 -197 284 -23 -13 -59 29 291 53 281 174 -87 -6 -43 -238 -282 -379
1269c79O11l30K62j97o0O5j51N21o40L88p6J76l08L22j73k37M75j70l13K5J93
$$ -379 232 -98 164 -33 -93 -28 -179 342 -298 90 14 190 -118 204 31 -206 269 99 -214 -189 4
1290Dm38O22j67m9J3k58N89j07l00lJ61K55j56k33r3J30j0K15k07L2l3R7l65K23
$$ 4 -434 188 21 -28 -15 -273 316 209 -91 -94 67 322 166 -67 -160 -30 -40 175 -32 0 -33 64 -301 -78
1314g8j31K09nP7j32J27k09L0j33M15j91J55j71K7j16Q6J35Q8J73k58j65n0J78
$$ -78 -209 0 -5 72 -60 67 -142 -112 -245 170 -21 134 -37 -10 -126 -40 95 183 356 98 -67 -117 61
1337F1k83L13m85n7M19L8p4K08k06O9L27k54m38N1M17k61j12J67J69j17R9K21
$$ 61 -222 91 -394 -451 -32 6 -68 140 -66 3 330 76 -362 -311 106 -155 -267 -100 69 -48 51 272
1359B72l77o5K12j66J18j56L47r4L5k49K76m74qN91k4k91k61J83m1K84j06N6l14
$$ 272 -105 -170 42 -124 -6 -162 185 91 126 -123 153 -321 -329 262 238 -53 -314 -131 -172 112 6 62 -252
1382b52M43j60k34P1O5J89O1l57K08K21N9k59j04m1k40O9K16N9n5m3L63o6J13
$$ -252 191 31 -203 -132 -67 122 183 -174 34 255 314 55 -49 -90 -330 -261 -45 14 -41 -84 279 213 326
1405C26l91J68J35k26J5j90J75o9J30j2k11Q3Q7mJ11j67N9j20l5q1K35m5K84k
$$ 326 -65 103 238 12 27 -163 12 -57 73 61 -150 -67 20 16 127 -40 19 -101 -136 -217 18 -27 257 255
1429B55j06q9j14j46kJ00J81n5j58K16p6l6l9k89K64K93j70l02L2M2L3K03J34
$$ 255 149 60 -54 -200 -202 -102 79 24 -134 82 6 -30 -69 -358 -94 199 29 -273 -241 -199 -166 37 171
1452A71j15p9O5M8k6j31J78q5K39m51o1K09m05O71j67j94j69L00k21l0N1L05n3
$$ 171 56 -23 42 90 64 -67 111 26 265 -186 -247 -38 -443 228 61 -133 -302 -2 -223 -253 -202 103 50
1475E0J75j08j79j50L57j96M7j04K89k52j59K76j03J61L3k11P4P0k26Q3j13L05
$$ 50 225 117 -62 -212 145 -51 -4 -108 181 -71 -230 46 -57 104 137 -74 0 70 -156 -73 -186 119
1497A19l09K91K13l77J99p9r4M3k65K46j81J15j27J56J81n51K70J03o4K75n6r4
$$ 119 -190 101 314 -63 136 57 -37 6 -259 -13 -194 -79 -206 -50 131 -420 -150 -47 -111 164 108 14
1519A4k99N43o9q9l36k8J10J91K37k31N7p1J38j74J23j10M6J64j88pJ41j61jj61
$$ 14 -285 258 189 100 -236 -264 -154 37 274 43 100 29 167 -7 116 6 52 216 28 21 162 1 0 -161
1543a61J3J01K15p5k77J83J02j96J15k03M6J6L1J7jR7P4j49L56l84j71K89j91
$$ -161 -148 -47 168 93 -184 -1 101 -95 20 -183 -137 -121 -90 -73 -74 23 97 -52 304 -80 -251 38 -153
1566a53L9J21j8J80j18q0Q5j06R4o2j74K44q7j10ok0K16O4jK35j44k8j58K83j27
$$ -153 -114 7 -11 169 51 -29 56 -50 44 -18 -192 52 -35 -145 -151 -171 45 109 108 343 199 171 13 296 169
1591A69m05K79k68K11J39r3N5j23J21j05o2J98Ojj87J54J60k10j21J78J64k27
$$ 169 -236 43 -225 -14 125 32 87 -36 85 -20 -82 116 122 121 -66 88 248 38 -83 95 259 32
1613C2M1J12k19K5M46l34j40r6K67l04L83k46J29p7l02J39q6K28j04L05N2r0m0
$$ 32 73 185 -34 -9 437 103 -37 -133 134 -170 213 -33 96 19 -283 -144 -230 -2 -106 199 251 161 121
1636A21P9m79R2K31k02L64k80L47O4m44J58k7L2o6J42k27J04K20k36n3K45l4j38
$$ 121 200 -279 -187 44 -158 206 -74 273 337 -107 51 24 56 -10 132 -95 9 229 -7 -60 185 151 13
1659A3R5j18K20j12n17L99O6L8q3mL1J42k58J45P9j05l20K13K05l32J86j55M19
$$ 13 108 -10 210 98 -419 -20 46 84 1 -3 28 170 -88 57 136 31 -289 -76 129 -203 -17 -172 247
1682B47l08k7P3p4N3pQ9j06K68l37j46K91j94L94K2J7j33l65N49l33l33N10q6
$$ 247 -61 -88 -15 -89 -36 -43 46 -60 208 -129 -275 16 -178 216 238 255 122 -243 306 -27 -360 150 64
1705F4N0J3j66o0J13j21L04m07K1K88k06O5j38M41j68n6j75J29j3R8P8l73L89
$$ 64 114 127 -39 -99 14 -107 197 -210 -189 99 -107 -42 -180 261 93 37 -138 -9 -22 76 154 -219 170
1728A70k87J95J8p8K7K4O0k54J49m1k35J92J00r7j14K31l7L7N6k99N7K56j31k01
$$ 170 -117 78 96 18 45 69 129 -125 24 -17 -252 -60 40 -57 -171 60 23 60 116 -183 -126 130 -1 -202
1752b02K81N5k26J63q0K22l29K30n23O02j72l9M39l81N3L6p7R6k69J56k90J51
$$ -202 79 134 -92 71 -9 213 -116 114 -409 193 21 -18 421 40 93 129 52 148 -121 35 -255 -104
1774a04J98j89L30k29O3j75K58l14K74J07k14Q6j48J13P7O6l26N18j44P3k06l66
$$ -104 94 -95 235 6 69 -106 152 -162 112 219 5 91 -57 56 133 199 -127 391 247 320 114 -252
1796b52K2K6j51M48p0l90M57p5J31m25M43r9j0P8k55j08K49Q4N1l21L22j39J57
$$ -252 -230 -204 -355 93 23 -367 90 15 146 -279 164 65 55 133 -122 -230 19 103 154 -167 155 16 173
1819A73k58j40K07k30K08J44J17j75m9m51M06K16n26M11q4K91q5k68L13j67P7
$$ 173 -85 -225 -18 -248 -40 104 221 46 -3 -454 -48 168 -358 53 -31 260 175 -93 220 53 130
1840A30O7j96J19l21L83J14m52J15R8K0J44k06O6jJ0j81l2L15k92J49m03O42l13
$$ 130 197 1 120 -201 182 296 -156 -41 57 77 221 15 81 80 90 -91 -123 192 -100 49 -354 288 -25
1863b5r9J82R5j48j32m0J9L97k29n3j6K96m18J35M06k22k06K55j50N0p2J23l97
$$ -25 -124 58 153 5 -127 -167 -148 249 20 -33 -49 247 -171 -36 370 148 -58 197 47 97 25 148 -249
1886b49K90k14o4K61R5k20j27K38K38O9N0o46J31J14p5L71l10k28J57R8O9K86
$$ -249 41 -173 -237 24 119 -101 -228 10 248 317 367 -279 -148 -34 -109 262 -48 -276 -119 -21 48 334
1908C34k88j17M47j87k60P8l01L23K40m57j47L57Ln8j32j54K80o6J84K75m85j53
$$ 334 46 -71 376 189 -71 7 -294 29 269 -188 -335 22 25 -33 -165 -319 -39 -105 79 354 -131 -284
1930b84K01K23R3j52kj65M0k23M28k03k3J56n02K54L4N2K40k09k1K42l38L8N1
$$ -284 -83 140 233 81 79 -86 -46 -269 159 -44 -67 89 -413 -159 -125 -73 167 -42 -63 179 -159 -121 -70
1953g0m6K58j02m4J7K7J73l18K39j49k38K30j33L41l0k3j35K96j73k81k0K12m2
$$ -70 -116 142 40 -4 13 40 213 -105 134 -15 -253 -23 -156 185 155 132 -3 293 120 -161 -181 31 -11
1976a1j18l07K11J69o9J77O5j15L20j93m5nr0Q6k76J97m0k66M57m3l11K09J92
$$ -11 -129 -436 -225 -56 -125 52 117 2 322 129 84 79 -11 75 -201 -4 -44 -310 147 104 -207 2 194
1999A94k51J09j16R0l2m2p1P7J88k65O6k62M40l33L92l04J57p9j0J65k89K35j11
$$ 194 -57 52 -64 26 -6 -48 -119 -42 146 -119 -53 -315 125 -208 184 -120 37 -42 -52 113 -176 59 -52
2022e2j5j20K46j30j31K40m7Q8J28j7j87N1j62J11Q5J7k1P4m04Q7J48J62o8l19
$$ -52 -67 -187 59 -71 -202 38 -9 79 207 190 3 54 -108 3 88 105 84 158 -246 -159 -11 151 83 -236
2046b36K79j08k8J03k4J57j10K66J53n36J00p0J14Q7N9l08j59L58p6K0k64J42
$$ -236 43 -65 -93 10 -14 143 33 299 452 -84 16 -54 60 147 206 -102 -261 97 21 41 -223 -81
2068h1j5M38m96nm1J66k12M95l01k17K99K46l24l16M34r9J3mL5N7k14J84Q1k75
$$ -81 -96 342 -154 -159 -200 -34 -246 249 -52 -269 30 276 -48 -364 70 -29 -16 -20 15 72 -142 42 123 -152
2092a52K01k98K47M1n1r2j35J21J55j67K55j71j7K4m22L98P9j0N3K4P6k31Q6K73
$$ -152 49 -249 -2 39 -12 -104 -239 -118 37 -130 125 -46 -63 -39 -461 -63 16 6 59 83 159 -72 14 287
2116B87k1m03q1J69k16M14j35j76p0N4K81j59K14j33J85k40k57N7M32j19j62J30
$$ 287 266 -137 -218 -49 -265 149 14 -162 -232 -178 103 -56 158 25 210 -30 -287 -230 202 83 -79 51
2138E1o58O02J46P3l24p2K33J45l76L4K27k31P0P9K36k70O6J19l64K60j96j42
$$ 51 -607 -5 141 214 -110 -182 51 196 -180 -146 81 -150 -80 -1 235 -35 31 150 -214 46 -150 -292
2160b92J78J51lmO7n2L44j36m97J39j36K08J17N0j82L65o28M51M2k96k00kJ78
$$ -292 -114 37 34 30 97 45 389 253 -244 -105 -241 -33 84 134 -48 317 -311 140 182 -114 -314 -316 -138
2183a38J87K30m19N3P5R3k37N4J34qj17J72j30R9L3k4k28K70L2l74J32qK42j12
$$ -138 49 279 -140 -87 -12 81 -156 -102 32 24 -93 79 -51 48 81 57 -171 99 131 -243 -111 -119 123 11
2207A1k3J85Q5q8l7j13J19k4j92lJ46L06m77J2L10l23j62K44O0O2j85m7L6L9J96
$$ 11 -12 173 258 170 133 20 139 115 -77 -80 66 372 -105 -93 217 -106 -268 -24 36 98 -87 -134 -98 -59 137
2232A37k45J12l6J72Q0k20j63N7Q6j30J32J16j10Oj63K22M2o6o7O5K16j41k76
$$ 137 -108 4 -32 140 220 0 -163 -106 -20 -150 -18 98 -12 -6 -169 53 95 29 -38 27 243 102 -174
2255a74J24j03M19k70J36l0j42J69p4P1Rl1J10l21o1j48N04j18j26N9j1o7K8K37
$$ -174 -50 -153 266 -4 132 102 -40 129 55 126 135 104 214 -107 -168 -316 188 70 -56 3 -8 -75 -47 190
2279A90p5j26k52K70K4o4J40j01k19L18J99j33m28Q7K12m14N24l80K54r7J83p2
$$ 190 115 -11 -263 7 31 -33 107 6 -213 105 304 171 -257 -170 42 -372 152 -228 26 -71 112 40
2301D0q4K69j11j90k64K72L2m0j66L99k65K13J24k48j28J62N2J13k18Rl5q0J77
$$ 40 -44 225 114 -76 -340 -68 -36 -76 -242 157 -108 105 229 -19 -147 15 67 180 -38 -29 -64 -144 33
2324C3K0l45K93L22j82J27k24J63m32K26J49p8j54K82j25o2L38j88l22j10K80
$$ 33 53 -292 1 323 141 268 44 207 -225 1 150 72 -82 200 75 13 351 163 -159 -269 11
2345A1j43O5j0r3r7K19P6l94N60n11K58J95n1k25J42p2J99K82m09L7j95K41jj19
$$ 11 -132 -67 -77 -170 -267 -48 28 -366 194 -317 -59 136 85 -140 2 -70 129 411 2 39 -156 85 84 -35
2369c5J40j34k94J81K26kLp8l89L74K50k22j13J80PLrj91n1K54R2k42M52m74J26
$$ -35 105 -29 -323 -142 84 82 85 7 -382 -8 242 20 -93 87 94 97 88 -103 -154 100 192 -50 402 -72 54
2394E4J84m31L37j82j12P5rj23K54q4R0j85k9J92o1lJ05o2J54l35L62j20j75L6
$$ 54 238 -193 144 -38 -150 -75 -84 -207 47 -37 53 -132 -161 31 -30 -33 72 10 164 -171 191 71 -104 -68
2418f8Q3N6J6j17J63l06K85j87J16j58M2K30p5j40k64N19k15J75L9j68L%L67l52
$$ -68 15 71 87 -30 133 -173 112 -75 41 -117 -75 155 80 -60 -324 195 -20 155 194 26 29 29 396 44
2442D4J98l31p1L74j93k29Q1J82r9L0j52K76k39R8l5K57j21j87q5K49q7P1o5j30
$$ 44 242 -89 -160 214 21 -208 -127 55 -44 -14 -166 110 -129 -31 -66 191 70 -117 -202 47 -40 31 -34 -164
2466a64L32k46q3J0j37N1N7J88O0M9j4j23R0j82L59l78K8K19O1k64rJ06l10J43
$$ -164 168 -78 -161 -151 -288 -237 -180 8 68 117 103 -20 70 -112 247 -131 -103 116 177 -87 -96 10 -300 -157
2490a57L15j21J01j43o2K80k36k37K75K42l05J20k83K62K02k81QL2J74p2L1k6
$$ -157 158 37 138 -5 -67 213 -23 -260 15 257 -48 72 -211 51 253 -28 -20 12 186 114 145 119
2512A19J7l21K83j8L3k55K60j42j29K38q5J18k96M01m22j51L84L8l19L33q2K23
$$ 119 136 -185 98 80 113 -142 118 -24 -153 85 0 118 -178 223 -199 -350 34 72 -247 86 4 227
2534B27l07l8K85l47J25J68j03l8j9j43J92L50n44L19m5k14J54J28J19l30K62
$$ 227 -80 -118 167 -180 -55 113 10 -28 -47 -190 2 352 -192 127 82 -132 22 150 269 -61 201
2555B01l56%K71q0j22j21M71l29j24K60k08P8P0n5K58j62p1O3J06k71N5J37j45
$$ 201 -155 -155 116 36 -86 -207 264 -65 -189 71 -137 -59 11 -44 214 52 -19 44 150 -121 -66 71 -74
2578g4J89j12j70L82l24M0J56l3K26r8j69Q3O1j54R8k68Oj84K33RJ27K6l0l5j6
$$ -74 115 3 -167 215 -109 -69 87 54 280 182 13 96 157 3 101 -167 -161 -345 -112 -103 24 50 20 -15 -31
2603c1j02L31j30l64M04q1Q3j86r3K49p1k2j57L4rp6J09j00L71l16m8K56Q0k15
$$ -31 -133 198 68 -296 108 27 110 -76 -169 80 9 -13 -170 -136 -145 -221 -112 -212 159 -157 -205 51 131 -84
2627h4n4ro8L18l7nr7l3j51K74J64k55o5L4J61k48o8L20k11R2O0L6r7j39K62j04
$$ -84 -138 -147 -215 103 66 61 -36 -69 -220 54 218 -37 -102 -68 93 -155 -223 97 -114 -22 38 74 -23 -162 100 -4
2653dJ35j78P7j81J94j30j53J07K19j34j02N50K3o85J24L31M4k28j24l2m9M36
$$ -4 131 -47 30 -151 43 -87 -240 -133 86 -48 -150 400 423 -262 -138 193 237 9 -115 -147 -196 240
2675B40j86KP7l01L59k14K16q5Rm17K69j16n0L02q8j5J78k60J20n59L68K90N6
$$ 240 54 56 133 -168 191 -23 193 108 117 -300 -31 -147 -197 105 17 2 180 -80 40 -519 -151 139 195
2698A95m18K20q6J33j68J6J40P3n09L99j53J36q3k4P3J91k36L74r6m2n8r1l5J65
$$ 195 -223 -3 -89 44 -124 -108 32 105 -404 -5 -158 -22 -105 -129 -56 135 -101 273 177 135 77 -14 -49 116
2722A16n8LN1k26R8j04Q8J67j79O9k03j41M48k96K94m75L27J30k31K16q0j05Q6
$$ 116 58 61 112 -114 -16 -120 -32 135 -44 25 -178 -319 129 -167 127 -348 -21 109 -122 94 14 -91 -5
2745em6P1O8l46K20K0k5J17K4N7l55K13J02k25J00m4m4J07kJ4j62L20l50Q2J44
$$ -5 -51 20 88 -258 -38 -18 -43 74 98 155 -200 13 115 -110 -10 -54 -98 9 7 21 -141 179 -171 -89 55
2770E5j64K8J86J44j65R7k90k05M43Q6m0R3l28P6P4l98J39M21j10o5j11j01M52
$$ 55 -109 -81 105 249 84 181 -109 -314 129 215 175 268 -60 16 90 -308 -169 252 142 77 -34 -135 317
2793C17n03L31j76J61l35O9J16j64Q5J19j55Q1K02n9k44L16k10O4N2Nj62K18q5
$$ 317 -186 145 -31 130 -205 -136 -20 -184 -99 20 -135 -54 148 89 -155 161 -49 15 67 72 -90 128 43
2816D3k76L93k73J52O3q7l4OJ4m3J05k04R3N0k59K38N9j16jJ71K5m17L87l74M97
$$ 43 -233 160 -113 39 102 15 -19 -13 1 -42 63 -141 -48 2 -257 -19 40 -76 -77 94 119 -298 89 -285 212
2841B12N3l81j83N05l87K02J83j85l9oo6K6R3k0J06Op1M2j69r8M03j74j54L57
$$ 212 265 -116 -299 206 -181 21 204 19 -20 -26 -92 -66 27 7 113 119 48 90 -79 -177 226 52 -102 255
2865B55j63j09J01k76K30k76R5L0R7J29k21j26K17K23j32r8j79J11J06K41j11
$$ 255 92 -17 84 -192 38 -238 -143 -113 -16 113 -108 -234 -17 206 74 -24 -203 -92 14 255 144
2886A44J95l17J88j63r4j87L61l26K45K33q3l75Q0P6J82l8n7R7q5k85J86Mn4J
$$ 144 339 22 210 47 -47 -234 127 -199 46 279 196 -179 -99 -23 159 121 64 161 76 -209 -23 -19 -73 -72
2910g2J37j01K36k37J75k56K4o2O6M17n36L74j20O7j76J73k18RM1J01ol28M97
$$ -72 65 -36 200 -37 138 -118 -94 -156 -90 327 -209 165 45 112 -64 109 -109 -100 -59 42 36 -292 205
2933B05J0k53J71k55J86K25m52J86r9j1M52j31l96K78k49L92nl3j35J98k69J57
$$ 205 215 -38 133 -122 64 289 -163 23 -76 -87 365 234 -162 116 -133 259 254 221 86 284 15 172
2955A72k38K2J7L6o5O3q4J3M2J15k61L69k79K06O8n20L91PR4l08j78L42j56K27
$$ 172 -66 -44 -27 9 -56 7 -77 -64 -22 93 -168 201 -78 128 196 -324 67 74 168 -140 -318 24 -132 95
2979I5J8j71J62n7k85M24r6k02k2J46p3M2k29K91R3l46L52l86L16K9K18m07J18
$$ 95 113 -58 104 47 -238 186 90 -112 -134 12 -61 -19 -248 43 136 -210 142 -244 72 101 319 -88 30
3002C0K8K3k38K50m53M52k83L51l46M00j87J52j33j75O0J43l61J70J60r5J4j39
$$ 30 58 81 -157 93 -360 92 -191 160 -186 214 27 179 46 -129 -69 74 -287 -117 43 -52 -38 -177
3024a77M47j19q9k76M70j44J26j23m24M74l20J17p8K60l0j76m3j13N14m68M30
$$ -177 270 151 62 -214 256 112 238 115 -309 165 -155 -38 -116 144 114 -62 -105 -218 296 -172 258
3045B58l47J97l88K73J52J67m01k69M36j06J23pl1L8Rk07J27J37l40K57j18K73
$$ 258 -89 108 -280 -7 145 312 -89 -358 78 -28 95 88 57 95 104 -103 24 161 -179 78 -40 233
3067B33j35q2j43J42J22l0j01m9J30r3j21K42L5l21L64k26K7j22J63J52rk91q0
$$ 233 98 16 -127 15 137 107 6 -43 87 -6 -127 115 150 -171 193 -33 -6 -128 35 187 178 -113 -193
3090a93K48J38k25L50J10k94k15j35L5L1R0K28l5j72o7N2L65l85K93l40J21N1
$$ -193 55 193 -32 318 428 134 -81 -216 -181 -150 -60 168 133 -39 -106 -54 311 -74 219 -121 0 51
3112E1j09J65k42J35j01j14O8KM29l73P7p2lk8R4j96L41R0k71J17j0j70j38L4
$$ 51 -58 107 -135 0 -101 -215 -147 -145 284 -89 -12 -84 -87 -115 -21 -217 124 214 -57 60 50 -120 -258 -224
3136b24M21r1o9j7j83M23k57L3J09j31rj65K59j49m22N20K22k53k88M47q7l01
$$ -224 197 106 37 20 -163 260 3 36 145 14 5 -160 99 -50 -472 48 270 17 -271 176 89 -212
3158b12J88j12K88q8q0q5R5k97L38j72J32L9j14J74k18r8j74M23j93L8J63j45
$$ -212 -24 -136 152 64 -16 -101 -6 -303 35 -137 -5 34 -80 94 -124 -222 -396 27 -166 -128 35 -110
3180a10K09n1k26K06n8L81k80j44J76j68L04j68j40K25o6k1j69J04J53q2o7J1
$$ -110 99 48 -178 28 -30 351 71 -73 103 -65 239 71 -69 156 90 69 -100 4 157 75 8 19
3202A9K73n3j14j91K65j18j13K2L14l55n9J33j83K40j51L7K84l53J87j00N0j97
$$ 19 292 239 125 -66 199 81 -32 -10 304 -51 -110 23 -160 80 -71 -34 250 -103 84 -16 34 -163
3224a63L49k59J85k09n3K37l79K48k87J00L10k06p1K68j38j43J12K06j14M6K25
$$ -163 186 -73 112 -97 -150 87 -292 -44 -331 -231 79 -127 -198 70 -68 -211 -99 107 -7 39 264
3245B64j86k39K03j46J48O7L03o30M34k3j74J08k34K16o7K0k75M38k20L00m37
$$ 264 78 -161 42 -104 44 111 414 -216 218 195 21 129 -105 111 44 64 -211 227 7 307 -130
3266a30N7M5l9L91l05k2J12j95Q9j45j00r4O88m38Q2q0l9O3L78k94j13K2J95m
$$ -130 -73 -28 -67 324 19 -3 109 -86 3 -142 -242 -336 352 -86 -4 -84 -123 -60 318 24 -89 -67 128 124
3290A24M1j03o7J65J46j20r1L1l64K50k46J16J15J81k55J74j75Q2k55J81m3K90
$$ 124 165 62 -5 160 306 186 95 126 -238 12 -234 -118 -3 178 -77 97 -78 4 -251 -70 -113 177
3312A77J26k03l1o9N9K9j11k38L05j64J2j54N22l70l8N2R3L1j86L20k43q8K20
$$ 177 303 100 69 0 59 88 -23 -261 44 -120 -108 -262 260 -110 -148 -96 -3 28 -158 162 -81 -169 51
3335E1R1j86K6k07M57j96k95Q9J88P6M3p6J41o4j77k93P8K64J1jk2R8k15J5k7
$$ 51 142 -44 -18 -225 232 36 -259 -170 18 94 137 61 202 138 -39 -332 -254 10 21 20 -2 96 -119 -104 -131
3360a31J61k45M41l28M6k2P7j55N0J00j43K74k31J36j56K09j09j87p5L75j7j73
$$ -131 30 -215 226 -102 -56 -78 -1 -156 -106 -6 -149 125 -106 30 -126 83 -26 -213 -288 87 70 -103
3382a03J90n9k56L19k76J85L02l06J85jj98j3LJ92k51J07J6L4K1K77n11K32J86
$$ -103 87 28 -228 91 -185 0 302 -4 181 180 -18 -31 -28 164 -87 20 36 70 91 368 -143 89 275
3405B75l52J58k26M07j94K0k08J45l6j50J26J23m38P3K65k8Q5o0j94O88l42n3
$$ 275 -77 81 -145 262 68 88 -120 25 -11 -161 -35 88 -350 -277 -12 -40 45 -15 -209 479 137 84
3427H4Nn2N4k03K4L6R1p7J40n5o4K47m57j27M24j54J33L4j26J25K00j06n05N15
$$ 84 89 37 91 -112 -88 -52 39 -38 102 47 -17 230 -227 -354 70 -84 49 83 -43 82 282 176 -329 186
3451A86j95R4r8p6j71L86j9j03L7k54M56j92nj36O4j32N8L67rn04M75m02L03k76
$$ 186 -9 85 -13 -89 -260 126 107 4 41 -213 243 51 46 -90 -26 -158 -100 267 258 -246 229 -173 130 -146
3475a46R3K18m2j37l00M60j08j75k07K38j71M30j14l2ql03K86K5l83L68K2Q8K2
$$ -146 -53 165 123 -14 -314 146 38 -137 -344 -106 -277 153 39 7 -1 -304 -18 7 -376 -8 14 102 124
3498A24k50L20m9j89P5k54N6Pn4K91j97J33R9k15K61P3l12J65q7j00M14j9j73
$$ 124 -126 194 145 -44 31 -223 -167 -160 -214 77 -120 13 112 -103 158 231 -81 84 -3 -103 311 292 119
3521A19m04J60J51J09j51P4r1R6N3k19J12r8K17k38J86Q3j02k87k30O26r3j78
$$ 119 -285 -125 26 135 -16 58 -33 63 116 -103 9 -89 128 -110 76 159 57 -230 -460 166 73 -105
3543a05P0l42K97K76k64NK06j19m2J06q5k59M45n0j29j31J2K46l22J11O3L44l34
$$ -105 -35 -377 -80 196 -68 -63 143 24 -18 88 3 -256 189 139 10 -121 -109 137 -185 -74 -11 333 -1
3566ak87J51Q8J12k96P3L25j89J43k61n9L11j61K10n6j35k21J03J70j22K21k09
$$ -1 -288 -137 -49 63 -233 -160 165 -24 119 -142 -201 110 -51 159 103 -32 -253 -150 20 -102 119 -90
3588i0J65j77k20r9N11l4m74L80j6L26l06j48J78J1k2j78L71k07j57M37k19kj81
$$ -90 75 -102 -322 -421 90 56 -418 -38 -54 272 -34 -182 -4 7 -15 -193 178 -29 -186 251 32 30 -151
3611a51K79j78q7J43j99P1J91j12J11J93l79J53j3K7j49k04OK03J83l17L67k24
$$ -151 128 -50 -137 6 -193 -122 69 -43 68 261 -118 35 22 49 -100 -304 -298 -95 88 -229 138 -86
3633h6Pl2J69r8j79J59J32k62J31j91K44j2q4K04k8k58L77m4j10mK35l31J59j34
$$ -86 -79 -111 58 -40 -219 -60 72 -190 -59 -250 -6 -18 -102 102 74 -184 193 149 39 35 270 -61 98 -36
3657c6R7k17n2J08M60l32J27j11k16K97j41K13j24j1J60l27k42L27J32N6p0o2
$$ -36 61 -156 -208 -100 360 28 155 44 -172 125 -16 197 73 62 222 -105 -347 -20 112 168 98 36
3679C6l03M47l9m7k73K81l1q4O0k45J35j07K90L9k41j22M27k25k54N61l94J52
$$ 36 -267 180 141 94 -179 102 71 -13 47 -198 -63 -170 120 159 -82 -204 223 -2 -256 305 -89 63
3701F3K05l84L1R5j06L6J78l02J37j74L05J34j75J21ll04j2Q2L35m58L30k01m0
$$ 63 268 -116 -85 10 -96 -60 118 -184 -47 -221 84 218 43 164 161 -143 -155 -73 262 -196 134 -67 -107
3724a07L15r0l24j29N61j33N8K06l46l1j24J45J30k1m24J76J61j39r7K55r0q2
$$ -107 208 118 -206 -335 226 93 151 357 11 -20 -144 1 131 110 -314 -138 23 -116 -213 42 -48 -130
3746a30q3P4nK45R8m63J32K31j90Q6k75K54p9j21J77p1K05N1k66M9PK85P0k96
$$ -130 -213 -139 -144 101 199 -264 -132 99 -91 -5 -280 -26 -105 -226 -49 -120 85 136 -130 -81 -74 211 281 -15
3770a5k48J59K01k75l6K91M19m21l42J80K57j54k96K95J39J25n39P1N43m11m4
$$ -15 -263 -104 97 -178 -214 77 496 75 -267 -87 170 16 -280 15 154 279 -260 -189 354 -57 -101
3791a01K51k70L68l89O1M8J68j94o7J63J13j12j48N3M3K5k80J60o9J36n3M3O8
$$ -101 150 -120 248 -141 -80 -32 136 -58 -125 38 151 39 -109 -56 -13 12 -268 -108 -177 -41 -94 -51 17
3814A7j58P9M8P5l21RL91jj78l01K76K83k38K0j6O7j3M3k67O7n8R2j08L02o6j76
$$ 17 -141 -62 -14 61 -260 -251 140 139 -39 -340 -64 219 -19 1 -15 52 39 82 -185 -118 -176 -84 -192 110 44 -132
3840a32N4K22j18j88K33j94J81k79K37K20k59j30K61P2N6l75l8J45J4k63M71q3
$$ -132 -78 144 26 -162 71 -123 58 -221 16 236 -23 -153 108 180 236 -139 -177 -32 -18 -281 190 107
3862A07j08m5L28k09j66k9J79K60k48j61p1K54nq3J42j72L3L58m15K4J69R7k55
$$ 107 -1 -46 282 73 -93 -122 57 317 69 -92 -163 91 86 3 145 -27 6 364 -51 -27 142 239 -16
3885a6j1q7k31K89M2o7l3K68J09k22k76L95k2l36K95M2k21k0j8J28k65L02l2J4
$$ -16 -27 -114 -345 -56 -14 -81 -114 154 263 41 -235 160 138 -198 97 139 -82 -102 -120 8 -257 45 13 27
3909B7k2p2K83l85N0k06L44p4p5O3J96k31N4r4O9J76l79K86K65m93L70m31M25
$$ 27 5 -67 216 -169 -119 -325 19 -55 -130 -67 129 -102 -48 -142 -73 103 -276 10 275 -218 152 -279 146
3932A46j57J4q1n4M46j35k01r1L38j22r2j48Q7O2kj77L48o8k49L4J20m5M8R6j90
$$ 146 -11 3 -78 -132 314 179 -22 -113 225 103 11 -137 -50 12 10 -167 181 113 -136 -102 18 -27 21 117 -73
3957g3n0Q3pm0O0J35l2k43K91j20K62n34K87J15j95l4n6MM07m20Q0j02M13j63
$$ -73 -123 -40 -47 -87 -27 108 76 -167 124 4 266 -268 19 134 -61 -95 -151 -147 260 -160 -80 -182 231 68
3981F8l07N12n59M59j02p8p4j8K39l99K08J44o6Q9mj40J9K5L01k56J29k30N0n3
$$ 68 -239 273 -286 173 71 -7 -81 -99 140 -259 -51 93 27 116 112 -28 -9 16 317 61 190 -40 10 -43
4005d3J12j03l4k2k87M90m26K6L15k94K03Jk1J42J1j80L4J14J55k88Q0k4K38j02
$$ -43 69 -34 -68 -90 -377 113 -313 -287 28 -266 -63 -62 -83 59 70 -110 -76 38 193 -95 -15 -39 199 97
4029I7K37o04J42K01L6k96M62j39k28J21K7j2L8M3K35k96J96l30M9P2l57J98P7
$$ 97 334 -270 -128 73 109 -187 275 136 -92 29 56 44 82 125 360 64 260 -70 -21 51 -306 -108 -31
4052c1P8J25M2k67j48N63r7m89L7K39J8p9pl06J55J84J28m8L5j53j0%J65k58o4
$$ -31 47 172 214 -53 -201 362 265 -224 -187 52 70 -9 -16 -322 -167 17 145 97 132 -21 -31 -31 134 -124 -188
4077a88nL05J37j43K25k26j03j27J40K37j49J84k20J2J41L5k62k98L76R9l53J46
$$ -188 -193 112 249 106 331 105 2 -125 15 252 103 287 67 79 220 255 -7 -305 71 170 -183 -37
4099c7J75n2q2j19J32N3k50k24N34p5M7O2o7L15m93J69J91j46J8J9P6m54Q7J56
$$ -37 138 86 4 -115 17 70 -180 -404 130 55 102 164 97 412 -81 88 279 133 151 170 246 -208 -121 35
4123C5k10o7K36j85L0K77k9P0j79J7O5J9q1k01J22R7k0Q1j46r4L15m61M01p2J4
$$ 35 -175 -242 -6 -191 -161 116 87 157 -22 -5 60 79 -2 -203 -81 16 -4 77 -69 -163 152 -309 92 20 34
4148C4j99M2J06j05K50l44J15J20j02L22m31q4R4K77K5k22J87k1R9N2m57M29o7
$$ 34 -165 -123 -17 -122 128 -216 -101 19 -83 239 -192 -276 -182 95 120 -102 85 64 163 215 -242 187 120
4171A20l95L05O3l12J02P8M8J91j95R5j08j2K87m39p6L6M21O1l65m1K04j3P2n57
$$ 120 -275 30 93 -219 -117 -39 9 200 5 100 -8 -20 267 -172 -248 -212 209 270 -95 -136 68 55 127 -430
4195d30O22j69k43N4L22k6Q0m66O14m82j65K33l7K47k3j35P6J71l05K69m14R5
$$ -430 192 23 -220 -166 156 130 210 -256 358 -124 -289 -56 -93 154 131 -4 72 243 -62 207 -207 -112
4217a12J33O3l54N95n45J06p2Q5J89o9k4o1L23l22k40J20J72j94j6QL08N8j02
$$ -112 21 84 -270 325 -220 -114 -186 -101 88 19 -5 -66 257 -65 -305 -185 -13 -207 -223 -215 93 151 49
4240D9L6j07J04j74k80L60j59M4L29K1j74o7J79m32q8M26N9p2K1m1p7J71j09p0
$$ 49 85 -22 82 -92 -372 -12 -171 -127 202 223 49 -18 161 -271 -359 67 126 54 75 34 -43 128 19 -51
4264e1J78k47Rm2K84k99J24K51r5N7j31N0k55L83k31m9J05l1m4r9J71m00K94o
$$ -51 127 -120 -111 -153 131 -168 -44 207 112 169 38 88 -167 216 -15 -64 41 10 -34 -133 38 -362 -68 -74
4288g4J1K00p4n1J37j04J45l8j78L6J96j61n14N42R6k03Q4j06K88k48J14J5n1
$$ -74 -63 137 63 12 149 45 190 152 -26 10 206 45 -469 73 169 -34 50 -56 232 -16 98 113 62
4311F2k8M6j87Q5j97K70K04Ol43r7J53J8Q4k3l22nK91k8N38l71o2P3j14k53o9
$$ 62 34 80 -107 -22 -219 51 255 261 -82 -179 -26 -8 76 53 -269 -274 17 -11 527 156 94 167 53 -200 -269
4336b69N26k15Jj70m3J3K78k22j86J56k55K88J54p1L0K05l62J94N9J02k86J08
$$ -269 257 42 43 -127 -170 -157 121 -101 -287 -131 -386 -98 56 -15 15 220 -142 52 111 213 -73 35
4358C5Mm6j16L26n8k69K67q1j59J47J6k5j17rQ1N8n3Q2k26K80k72J06J24k3j87
$$ 35 39 -7 -123 203 145 -124 143 62 -97 50 66 41 -76 -85 -4 54 1 83 -143 137 -135 -29 95 72 -115
4383a15j08P3N21l20L2j93K80M9l43L65k67J21k80M04n53O3K97j23p0L56K00l12
$$ -115 -223 -150 371 51 83 -110 170 219 -124 241 -26 95 -185 219 -334 -271 26 -97 -167 189 389 77
4405G7j00K93n00l5J55J88k31J3L73n7k73K34k56K61m91K20J74K9k0j44J1L60
$$ 77 -23 270 -230 -265 -110 78 -153 -140 233 176 -97 137 -119 142 -349 -129 45 74 54 -90 -79 281
4427B81k67J19j00l9LKl5J2K17j23r4L8j5nr9j04J89nNL18o08M64q8n39K72K0
$$ 281 14 133 33 -6 -3 -1 -36 -24 193 70 -24 14 -1 -6 -105 -209 -20 -25 -20 298 -310 154 66 -473 -201 -181
4453a81L00n6j12r1p0J34J57mJ25Ol09L05m0j83J58j76J26m57L29j31J65k06K16
$$ -181 119 63 -49 -140 -210 -76 81 77 202 208 -101 204 164 -19 139 -37 89 -368 -39 -170 -5 -211 5
4476EQ9l53K59j40L36M6m16J57L1qJ15k16K5k3J78L3k10J14j12J09P%j76K8k9
$$ 5 94 -259 0 -140 196 242 -174 -17 14 6 121 -95 -70 -93 85 118 -92 22 -90 19 26 26 -150 -122 -151
4501a51k8l7M54k22M06j41k91K17k28L87q2j15j75R5k50j46L31J07L2j43J38l82
$$ -151 -179 -216 238 16 422 281 -10 207 -21 366 284 169 -6 89 -161 -307 24 131 163 20 158 -224
4523b24M2K48J2K55k65O1q3j0j59J01j3N3j22K21j73j62J58L3J69J25m02K94q8
$$ -224 -182 66 78 333 68 129 46 36 -123 -22 -35 18 -104 117 -56 -218 -60 -27 142 267 -135 159 71
4546G1k36J39J71k5j85L11l05J67q1j73mL67m50L00p4k10j45M34j14n4J8J43R1
$$ 71 -165 -26 145 120 -65 246 -59 108 27 -146 -150 217 -233 67 -7 -217 -362 72 -42 -96 -78 65 156
4569A56j96j34M47k63J88k98Q7j98L62J6k58L4%m6L69m77K36j15J09j41r3M8K30
$$ 156 -40 -174 273 10 198 -100 -13 -211 151 167 -91 -57 -57 -103 266 -211 25 -90 19 -122 -215 -167 63
4592F3q5k5J53j68J03j58L71k07k81K20K6j39K33j4p2P1J27k46j62K74J30N0k31
$$ 63 -22 -47 106 -62 41 -117 254 47 -234 -14 12 -127 106 92 20 91 218 -28 -190 84 214 264 33
4615C3J86k71R0N2R6N0l15j97N34j10J40l56P5R3j47O9k26L14r1J51l88J59l7
$$ 33 219 -52 38 90 186 236 -79 -276 258 148 288 -68 7 100 -47 22 -204 110 19 170 -218 -59 -96
4638i6J6j01J09K54k57J90k96J36R3K23k91l50N63p5l7J64p2k29K19q5k03k5J53
$$ -96 -80 -181 -72 182 -75 115 -181 -45 48 271 -20 -370 193 118 81 245 173 -56 163 78 -125 -150 3
4661Cj60J37K85j27j48M7J56n59O55l40m1p4R8J77j48J43p1j58M90j62l8q9l8
$$ 3 -157 -20 265 138 -10 37 193 -366 289 -51 -92 -166 -68 109 -39 104 33 -125 365 203 165 76 38
4684C8P7j40L4K4k03K92J7q5k2k29L17j3j18l63L4M75k37J03j49L69l74L35k06
$$ 38 115 -25 9 33 -170 122 139 54 32 -197 120 107 -11 -374 -340 135 -102 1 -148 221 -153 182 -24
4707b4J56k88L25k71K96q4l79K67o1R8m9Q9k63L30q1J94n97J74l5J76NM8k52J75
$$ -24 132 -156 169 -102 194 110 -269 -2 -63 35 -14 75 -188 142 61 255 -342 -168 -203 -27 -22 26 -226 -51
4731e1k55J59J62j14J93J32j75r4L4j72L1K23n0K7n8r5K71l81j65L38l3L71k06
$$ -51 -306 -147 15 -99 94 226 51 -43 -9 -181 -150 73 23 50 -8 -103 168 -213 -378 -40 -73 298 92
4754I2r0P7j20k21K84J04k03M6K06j24j85j1N29j07k38p3j14M65k35J27k91K04
$$ 92 2 79 -41 -262 22 126 -77 -31 175 51 -134 -145 384 277 39 -34 -148 317 82 209 -82 122
4776A22k65N9K36lo3o4j3o2J68j95J97k47K55n8O0k52L4J70k71J53Rq0k8K56K6
$$ 122 -143 -84 152 149 86 22 9 -53 115 -80 117 -130 125 67 127 -125 -91 79 -192 -39 -30 -110 -138 118 144
4801A44q2j88K69J48k84J1j27K30Q6p7j61N2J6o3K48q1p3O6pkj76m0J22q3j07
$$ 144 62 -126 143 291 7 18 -109 121 207 130 -31 21 37 -26 222 141 68 134 127 125 -51 -91 31 -52 -159
4826a59M87k95l23J64J0P2K4Q2l1q9J15k50o0K67j01N8J71l17L1N1Q8J40j25l67
$$ -159 328 33 -290 -126 -116 -44 -20 62 31 -58 57 -193 -253 14 -87 -29 142 -175 -144 -93 -5 135 10 -357
4850c57L70L6k42K67j40R9K28l22N7j93K19l1j24J30j17J24N8j7q1K10m89M06
$$ -357 13 49 -193 74 -66 33 261 -61 -4 -197 22 -9 -133 -3 -120 4 62 45 -36 174 -315 91
4872I1Lj49L06K5l31k3J37k48N9J53R7p6M2k08M80l20p3K6j24L8J50L39l02M6
$$ 91 94 -55 251 276 -55 -78 59 -189 -130 23 120 44 86 -122 358 38 -35 -9 -133 -95 55 394 92 138
4896A38m38J23K06k53L20j46q4L86k80k41K18j9pJ81j54J51m28L11q2R2k17L02
$$ 138 -300 -177 29 -224 96 -50 -134 252 -28 -269 -51 -70 -77 104 -50 101 -327 -16 -98 -6 -223 79
4918G9j94J51k75J97K00k98P6j01L5L23J09m29J35M5J00p5j42j74L22K0k6lj71
$$ 79 -115 36 -239 -42 158 -140 -64 -165 -130 193 302 -127 8 53 153 78 -64 -238 84 104 78 75 -96
4941i6M6L7r2J38J01j62j19L15j1j74m1K06l20K70j56J48j58J7j20J17L0j5J20
$$ -96 -50 -13 -105 33 134 -28 -147 168 157 -17 -58 148 -172 98 -58 90 -68 -51 -171 -54 -24 -39 81
4964H1j42J3L6P0j35K43N0j44J15m6l9n5j15L24l45j44J99j98L24N8r0m0l5L1
$$ 81 -61 -48 -12 58 -77 166 216 72 187 141 102 47 -68 256 -89 -233 -34 -232 92 150 60 20 -15 16
4988A6J32k46J02J25J3o5q4K7L2L03m51j42K06j11J43j36R2K24j71o5J32j56n5
$$ 16 148 -98 4 129 142 77 -7 20 52 355 -96 -238 -32 -143 0 -136 -44 180 9 -56 76 -80 -135
5011a35L12j53n9K35J71k53j21j49QO6j42M14k55J82n6k65J94j14L65m03j45M79
$$ -135 177 24 -35 200 371 118 -3 -152 -144 -78 -220 194 -61 121 65 -200 -6 -120 245 -158 -303 176
5033A76k7j24j83O9K49k26J49J95l58J75m76L67M0j12M5K98k70J77q3l30L97J6
$$ 176 149 25 -158 -89 160 -66 83 278 -80 95 -381 -14 26 -86 -41 257 -13 164 81 -249 148 164
5055A64m2J24J24l52k50J66J49j21L9j40M6Kj11K94P9j50l9j23K62k7j1j72p6
$$ 164 122 246 370 18 -232 -66 83 -38 1 -139 -93 -91 -202 92 171 21 -18 -141 121 94 83 -89 -165
5078a65K42k2l88M43k65n6J60k00K71M4Q0q5n13L21J28L8p6J97k25Q3n7j13K24
$$ -165 77 55 -333 110 -155 -211 -51 -251 20 64 144 59 -454 -133 -5 33 -43 154 -71 12 -45 -158 66
5101F6J40k86J80j46On2J95k81K93j9Jk59j66K89o0j22K22l4J05J92l9j68l9J08
$$ 66 206 -80 100 -46 -40 -92 103 -178 115 96 97 -162 -328 -39 -99 -221 1 -33 72 264 225 57 18 126
5125A26k24J67l23J58J49k23M9K37k04K07J33k74K88l62J26k00J00r7K22K1k37
$$ 126 -98 69 -254 -96 53 -170 -121 116 -88 119 252 -22 266 -96 30 -170 -70 -167 55 76 -161
5146a61j69N67l60mJ23J22k73J19O6K5N5K2l98L80J0k43J82j46L03l38J61q7o2
$$ -161 -330 237 -123 -127 -4 118 -155 -36 30 55 110 132 -266 114 124 -119 63 -83 220 -118 43 -44 -106
5169a06Q9K80k39R6j64j07L46l9j53Lm7P9l8M4Lj90K94k45P2J82n7J10l29J7K
$$ -106 -17 263 24 120 -44 -151 195 156 3 6 -41 38 0 44 47 -143 151 -94 -22 160 103 213 -116 -99 -97
5194i7J71j72L56l13R4Q5p7O7l17K94j15j23J19R9q5k5K16j15j36K40p8q3l2K3
$$ -97 74 -98 258 -55 39 124 47 114 -203 91 -24 -147 -28 71 -14 -39 177 62 -74 166 88 5 -27 -4
5218dj66K48oo4K91r6j86oo2k11J45K98k30%m0J58J20m23M59j90J12m5j11o3J81
$$ -4 -170 78 72 8 299 203 17 11 -51 -262 -117 181 -49 -49 -89 69 189 -234 225 35 147 102 -9 -72 109
5243A09j04N7J03j61j25J13R2k80NK18J67rO7q9J4k22K47k51M48l34k34n6K85
$$ 109 5 62 165 4 -121 -8 84 -196 -191 27 194 185 252 163 177 -45 202 -49 399 65 -169 -225 60
5266F0m2J16R8j90k82K06L4R6o8J77J2n66M18J60j18k44K31j03N4m10N99k48j27
$$ 60 18 134 232 42 -240 -34 0 96 28 205 217 -349 69 229 111 -133 98 -5 49 -361 238 -10 -137
5289a37j48J86j04L20j65K26l60J81p2nK38k90J95k72K02LO1j09J57k70L9J32
$$ -137 -285 -99 -203 117 -48 178 -182 -1 -73 -78 160 -130 65 -207 -5 -2 59 -50 107 -163 -124 8
5311Hj16J98k33J90K28j94j69Q4j30J31J4j05P0j89M51j92Q3k56L1J44r1m8j25
$$ 8 -108 90 -143 47 275 81 -88 -4 -134 -3 11 -94 -24 -213 238 46 129 -127 -96 48 -43 -91 -216
5334b16L52q6j29J45%j64K87l61L5J56n4K1J42j36j09PJ07L6K97j82k05K67P1
$$ -216 136 50 -79 66 66 -98 189 -172 -137 19 -35 -14 128 -8 -117 -110 -3 33 330 148 -57 210 281
5357B81k93j4J93l12J98m4k27J13R7M9J89n9l78K40J11l59K28L0k67K91k0M0J16
$$ 281 -12 -26 167 -145 53 9 -218 -105 -8 41 230 171 -207 33 144 -215 13 43 -224 67 47 87 203
5380B03n66M54j26j18J81o1L0k00Q0L15j86n0j66J00R2r6K02O4k60M1R3Q4o1j24
$$ 203 -363 91 -35 -153 28 -33 -3 -203 -123 192 6 -44 -210 -110 -18 -114 88 152 -108 -67 26 110 49 -75
5404g5J8k53M39J07k76j07L65k75k02L73J5j8P4k69J24R5J30k46N4k03K65K7j18
$$ -75 -57 -310 129 236 -40 -147 218 -57 -259 114 129 111 185 -84 40 135 265 19 73 -130 135 162 44
5427D4j39j49J31J37j43K28o6k81K71m8L4l1k5j87J86J81l71N69l27j95K39o9
$$ 44 -95 -244 -113 24 -119 109 43 -238 33 -15 19 -12 -37 -224 -38 143 -228 341 14 -181 58 -11
5449a1L00j31n0k8j13k02K09J08k25K38p9J89k15J51m0k57j8j67K67L6m5j11j1
$$ -11 289 158 108 80 -33 -235 -26 82 -143 95 16 205 -10 141 101 -156 -174 -341 -74 -38 -83 -194 -205
5472b05M52m20K22Om7J22j70J3j40K01M9P5k10m2L09l51j8L52k17J9l5J15j30
$$ -205 247 -173 49 55 8 130 -40 -27 -167 34 83 158 -52 -94 215 -136 -154 198 -19 0 -35 80 -50
5495e0j55L98k62M97m17j82l7L10j06n6Q3l26M53L2j55M1k02K07k11k23J88o2
$$ -50 -205 193 -69 428 11 -171 -208 102 -4 -60 23 -303 150 182 27 68 -134 73 -138 -361 -173 -235
5517b35L51k70o1N28n18J98q5M6j3O0r2K99m8n1L8m44M64l20M13l65J43J42n4
$$ -235 116 -154 -215 313 -205 -7 -92 -46 -59 1 -91 208 160 109 147 -297 167 -153 260 -105 38 180 126
5540A26k21mL09k23r5K93J7L5j48K6j44J64j74r7L26l25L34j37r9l0J30j25K77
$$ 126 -95 -99 210 -13 -108 185 202 237 89 115 -29 135 -39 -136 190 -135 199 62 -37 -67 63 -62 215
5563B15k53k00NJ68J82k31K65k74K83o9k31M22l64K70k27l53N70m1k76K60J27
$$ 215 -38 -238 -233 -65 117 -114 151 -123 160 91 -140 282 -82 188 -39 -392 178 137 -139 121 248
5584B48m31M00j35j02K97j07l90K48l56K82K37k88L48j13r1J71j31k31N2O8p8
$$ 248 -183 217 82 -20 277 170 -220 28 -328 -46 191 -97 251 138 47 218 87 -144 -92 -24 -102
5605a02R6L4J86j09N7O1l90M39k16J01k23J19oJK4j27J52p0J10q3k32R8L79k68
$$ -102 -6 28 214 105 162 223 -167 272 56 157 -66 53 47 48 72 -55 97 27 137 54 -178 -80 299 31
5629C1k26K37o5m4K5K77l18l4j91M84j95L23l57q8L13Q9j94q7L1k14K79l5j23
$$ 31 -195 42 -23 -67 -42 235 -83 -117 -308 176 -19 304 -53 -141 172 261 67 -20 11 -203 76 41 -82
5652h2J1J60k61L82l70K60j34j05K34r1M21m39J70j88q9q7L82l72L15O0Kk83j89
$$ -82 -71 89 -172 210 -160 100 -34 -139 95 4 425 -14 156 -32 -121 -208 174 -198 117 177 179 -104 -293
5675b93J89j9L05k42q3K19j78J39J99k85K59r1k75N6K57j38L6r4j10J56q8J48
$$ -293 -104 -123 182 -60 -143 76 -102 37 236 -49 210 119 -156 -100 157 19 55 -39 -149 7 -81 67
5697F7J1m06M99j92J80j57Pj8mj25J26j66K13j11O4J25l30J51L25k15J00k97L33
$$ 67 78 -328 171 -21 159 2 9 -9 -13 -138 -12 -178 35 -76 -12 113 -217 -66 259 44 144 -153 180
5720A80k85K05q6k85N71l24J36j75L64j46l57L68k69J73j26j61J08j7L25j23J93
$$ 180 -105 100 14 -271 300 -24 112 -63 301 155 -202 166 -103 70 -56 -217 -109 -126 199 76 269
5741B69l50P1l74L39J4k67o4N37l58J71l04K71J43L6m76L78j04K03j25R5k64p
$$ 269 -81 -10 -384 -45 -31 -298 -362 175 -183 -12 -316 -45 98 134 -342 36 -68 135 10 105 -159 -166
5763a66K02j0l34L27K49l47j81P2R3J71J50m34J32J83j62M7J57m2l00j3J68K2
$$ -166 36 26 -308 19 268 -79 -260 -188 -95 76 226 -208 -76 107 -55 -8 149 107 -193 -206 -38 -16
5785a6k4R5M7L2k32J11J71j74J3l3M7j19k11L08J96l6l7J56l14j44N0K21N8j54
$$ -16 -40 55 102 134 -98 13 184 10 23 -10 37 -82 -293 15 211 175 138 294 -20 -164 -114 107 165 11
5809A1o0RJ24m2o8L77m34P0r0J71M1k13j30j3M65j97m6k65K67Kn9O1J27j75R3
$$ 11 -49 -40 84 42 -26 351 -83 -13 -103 68 109 -104 -234 -247 218 21 -25 -290 -23 -21 -80 -19 108 -67 26
5834B6K12l59P5q8K14p0L58j01k82l7q0L89o8k79O5K6q3J9R9N5K13k18l02L01
$$ 26 238 -121 -46 -134 80 10 368 267 -15 -52 -132 257 189 -90 -25 1 -82 -63 36 91 304 86 -216 85
5858H5q6J3K4j2m33L11K38j04l1n8n5M3Q8N0J8k94M38j46r2Q8j02m0l1J61r3J66
$$ 85 -1 12 36 24 -409 -98 140 36 5 -53 -108 -65 23 73 91 -203 235 89 -3 85 -17 -57 -88 73 -20 146
5884A46k47L64j04k35K30j44n9J73Pk79J78j2J37j35K48o12M70j2J53j82j71J29
$$ 146 -101 263 159 -76 154 10 -49 124 131 -148 30 18 155 20 268 -344 126 114 267 85 -86 43
5906D3J90k74K65k37m7K79k42j82L09L4k92L16j38J99l54K22L06m20m4J69l13
$$ 43 233 -41 224 -13 -60 219 -23 -205 104 138 -154 162 24 223 -131 91 397 -23 -67 102 -211
5927b11K72J14j5k7k34k8J11O5j3J95m71L98k83L37m11K16J08j01J82l26M14r3
$$ -211 61 175 160 133 -101 -129 -18 47 34 229 -242 156 -127 210 -201 15 123 22 204 -122 292 199
5949A99k6k49J91j59J14l21L0O36l31j22p8M6oJ34r8n7L89j93Qj58J22o8J21j99
$$ 199 173 -76 115 -44 70 -251 -221 415 84 -38 -116 -70 -76 58 -40 -97 292 99 107 -51 71 3 124 -75
5973g5jJ47J6j24j09K72J42k2m65L41K36m28J67l81J01J15P6j86O0K05K25l90
$$ -75 -76 71 87 -37 -146 126 268 246 -219 122 358 -70 97 -284 -183 -68 8 -178 -118 87 312 -78
5995g8J44N2k39M81m46k8J66R9k52m0nK86k2l06J37L83m12p1P8Q4J45j23n5j34
$$ -78 66 118 -121 360 -86 -114 52 151 -101 -141 -146 140 118 -188 -51 332 -80 -151 -73 11 156 33 -22 -156
6019a56j73M92j35j05j96J69k40M35j04l9J79j77l4J75m99Q3N24qk26M6J67q7
$$ -156 -329 163 28 -77 -273 -104 -344 91 -13 -52 127 -50 -84 91 -408 -325 199 191 -35 11 178 91
6041I1j38j3Q0J39j18K24l01J56m05L43K3m3k0J8O9k65J87k89J94Q7j0k26K54
$$ 91 -47 -60 20 159 41 265 -36 120 -285 58 81 38 18 36 105 -160 27 -262 -68 19 9 -217 37
6064C7j68K26J23o6J5j96j38N92n35J26L22l77J68k59PJ78J5kj1J02l06M7RR7
$$ 37 -131 95 218 152 167 -29 -167 425 -110 16 338 -39 129 -130 -123 55 70 68 57 159 -147 -100 -91 6
6088FK8J23l16J20j40Q2J94l80L71j58qo2L62j6k97j31M35k36j34J35k25N10l31
$$ 6 34 157 -159 -39 -179 -97 97 -283 88 -70 -78 -140 222 206 -91 -222 213 -23 -157 -22 -247 263 -68
6111f8m3Q1N5J76ol59j18L53p5j55K13o0QJ68k21o2J9J83K54m99O1K65k61J43
$$ -68 -111 -30 25 201 195 -164 -282 71 -4 -159 54 -6 2 170 -51 -113 -94 89 343 -156 -95 170 -91 52
6135E2K26n44L89j69j22K42j18K13k76j29L95k33J80J78j72l4o2J87m40K60J84
$$ 52 278 -266 123 -46 -168 74 -44 169 -107 -236 159 -74 106 284 112 78 16 203 -237 23 207
6156B07j43l1k49K37J3o0j00K6J37k53M63m1k46j7O0Oj45J04J32k98J95K9K61
$$ 207 64 33 -216 21 34 -26 -126 -100 37 -216 247 206 -40 -57 3 9 -136 -32 100 -198 -3 26 287
6179B87m76Q3L3P7J08J81l84K05q6J52m01J72K53Op6j25k16K96K3k56J13P0J6
$$ 287 -189 -106 -73 4 112 293 -91 114 28 180 -221 -49 204 210 134 9 -207 89 112 -144 -31 39 55
6202E5O3k90J53j9N1p7M3K06j63k2r9j00M5K73J66m09j1J60k1l63L74k20K20j71
$$ 55 118 -172 -19 -38 13 -64 -21 185 22 0 -99 -199 -154 119 285 -124 -135 25 4 -359 15 -205 15 -156
6226a56K82N6j08J0n1J65l87N39l86J30r2K19ml05J79k38O1L03k64J07q6MJ43
$$ -156 126 182 74 84 33 198 -189 350 -36 94 2 221 217 -88 91 -147 -86 217 -47 60 -26 -22 121
6249A21P7j72p3K50k00O3o6L4O6k26J40l26J53K56j71m2k4j22P5rN16l35M6m02
$$ 121 198 26 -47 203 3 66 0 34 100 -126 14 -312 -159 97 -74 -116 -140 -262 -187 -196 320 -15 31 -371
6273c71L75l3j55r3J6O7J02j1L2K22m8J66j57k10K84j99j26jJ24RJ73k63L86k5
$$ -371 4 -29 -184 -277 -261 -194 -92 -103 -71 151 103 269 112 -98 186 -13 -139 -140 -16 -7 166 -97 289 264
6297B64l07k39K62L08l82J91k04J57P0q4J9j12j81K81L6r3j63M1J02q9J48J37
$$ 264 -43 -282 -20 288 -94 97 -107 50 120 36 55 -57 -238 43 79 -14 -177 -136 -34 -123 25 162
$$ [...]
8191A07
##END NTUPLES=NMR FID
##END=
