##TITLE=1H_ART-H2SO4-good3-osn-f3
 200.13MHz, CDCl3,
 8 sc
 
 17.1.2025
##JCAMPDX= 6.0         $$ Bruker NMR JCAMP-DX V2.0
##DATA TYPE= NMR FID
##DATA CLASS= NTUPLES
##ORIGIN= UXNMR, Bruker Analytische Messtechnik GmbH
##OWNER= pz
$$ XWIN-NMR		Version 3.5
$$ Fri Jan 17 14:38:24 2025 Russian Standard Time (UT+4h)  she@DPX200
##.OBSERVE FREQUENCY= 200.1313
##.OBSERVE NUCLEUS= ^1H
##.DELAY= (6, 6)
##.ACQUISITION MODE= SIMULTANEOUS
##.ACQUISITION SCHEME= undefined
##.AVERAGES= 8
##.DIGITISER RES= 18
##SPECTROMETER/DATA SYSTEM= spect
##.PULSE SEQUENCE= zg30
##.SOLVENT NAME= DMSO
##.SHIFT REFERENCE= (INTERNAL, DMSO, 0, 14.3821)
##AUDIT TRAIL= $$ (NUMBER, WHEN, WHO, WHERE, WHAT)
$$ ##TITLE= Audit trail, XWIN-NMR		Version 3.5
$$ ##JCAMPDX= 5.01
$$ ##ORIGIN= Bruker BioSpin GmbH
$$ ##OWNER= she
$$ F:/spectra/data/she/nmr/H-C/1/audita.txt
$$ ##AUDIT TRAIL=  $$ (NUMBER, WHEN, WHO, WHERE, WHAT)
(   1,<2025-01-17 14:37:23.79 +0400>,<she>,<DPX200>,
      <created by zg, POWCHK disabled, PULCHK disabled
       configuration hash MD5:
       00 E9 B6 7A A2 85 ED C7 34 08 36 98 17 FE 4E 26
       data hash MD5: 16K
       B5 65 69 21 B3 1E C3 02 53 27 B3 84 7A 24 66 85>)
$$ ##END=
$$ 
$$ hash MD5
$$ CD 7F E2 37 D7 E4 84 0E 7A FB 03 11 BE B4 2C 16
##$RELAX= 
##$RELAX= 
##$RELAX= 
##$RELAX= 
##$RELAX= 
##$RELAX= 
$$ Bruker specific parameters
$$ --------------------------
##$DU= <F:/spectra>
##$EXPNO= 1
##$NAME= <H-C>
##$PROCNO= 1
##$TYPE= <nmr>
##$USER= <she>
##$AMP= (0..31)
100 100 100 100 100 100 100 100 100 100 100 100 100 100 100 100 100 100 
100 100 100 100 100 100 100 100 100 100 100 100 100 100 
##$AQSEQ= 0
##$AQ_mod= 1
##$AUNM= <au_zg>
##$AUTOPOS= <>
##$BF1= 200.13
##$BF2= 200.13
##$BF3= 200.13
##$BF4= 200.13
##$BF5= 200.13
##$BF6= 200.13
##$BF7= 200.13
##$BF8= 200.13
##$BYTORDA= 1
##$CFDGTYP= 0
##$CFRGTYP= 5
##$CHEMSTR= <none>
##$CNST= (0..31)
1 1 145 1 1 1 1 1 1 1 1 1 1 1 1 1 1 1 1 1 1 1 1 1 1 1 1 1 1 1 1 1 
##$CPDPRG= <>
##$CPDPRG1= <>
##$CPDPRG2= <>
##$CPDPRG3= <>
##$CPDPRG4= <mlev>
##$CPDPRG5= <mlev>
##$CPDPRG6= <mlev>
##$CPDPRG7= <mlev>
##$CPDPRG8= <mlev>
##$CPDPRGB= <>
##$CPDPRGT= <>
##$D= (0..31)
0 0.7 0 0 0 0 0 0 0 0 0 0.03 0 0 0 0 0 0 0 0 0 0 0 0 0 0 0 0 0 0 0 0 
##$DATE= 1737110243
##$DBL= (0..7)
120 120 120 120 120 120 120 120 
##$DBP= (0..7)
150 150 150 150 150 150 150 150 
##$DBP07= 0
##$DBPNAM0= <>
##$DBPNAM1= <>
##$DBPNAM2= <>
##$DBPNAM3= <>
##$DBPNAM4= <>
##$DBPNAM5= <>
##$DBPNAM6= <>
##$DBPNAM7= <>
##$DBPOAL= (0..7)
0.5 0.5 0.5 0.5 0.5 0.5 0.5 0.5 
##$DBPOFFS= (0..7)
0 0 0 0 0 0 0 0 
##$DE= 6
##$DECBNUC= <off>
##$DECIM= 32
##$DECNUC= <off>
##$DECSTAT= 4
##$DIGMOD= 1
##$DIGTYP= 9
##$DL= (0..7)
0 120 120 120 120 120 120 120 
##$DP= (0..7)
150 150 150 150 150 150 150 150 
##$DP07= 0
##$DPNAME0= <>
##$DPNAME1= <>
##$DPNAME2= <>
##$DPNAME3= <>
##$DPNAME4= <>
##$DPNAME5= <>
##$DPNAME6= <>
##$DPNAME7= <>
##$DPOAL= (0..7)
0.5 0.5 0.5 0.5 0.5 0.5 0.5 0.5 
##$DPOFFS= (0..7)
0 0 0 0 0 0 0 0 
##$DQDMODE= 0
##$DR= 18
##$DS= 0
$$ [...]
##$SUBNAM0= <"">
##$SUBNAM1= <"">
##$SUBNAM2= <"">
##$SUBNAM3= <"">
##$SUBNAM4= <"">
##$SUBNAM5= <"">
##$SUBNAM6= <"">
##$SUBNAM7= <"">
##$SUBNAM8= <"">
##$SUBNAM9= <"">
##$SW= 18.0517328524113
##$SWIBOX= (0..15)
0 0 2 0 0 0 0 0 0 0 0 0 0 0 0 0 
##$SW_h= 3612.71676300578
##$TD= 16384
##$TD0= 1
##$TE= 0
##$TE2= 300
##$TE3= 300
##$TEG= 300
##$TL= (0..7)
0 120 120 120 120 120 120 120 
##$TP= (0..7)
150 150 150 150 150 150 150 150 
##$TP07= 0
##$TPNAME0= <>
##$TPNAME1= <>
##$TPNAME2= <>
##$TPNAME3= <>
##$TPNAME4= <>
##$TPNAME5= <>
##$TPNAME6= <>
##$TPNAME7= <>
##$TPOAL= (0..7)
0.5 0.5 0.5 0.5 0.5 0.5 0.5 0.5 
##$TPOFFS= (0..7)
0 0 0 0 0 0 0 0 
##$TUNHIN= 0
##$TUNHOUT= 0
##$TUNXOUT= 0
##$USERA1= <user>
##$USERA2= <user>
##$USERA3= <user>
##$USERA4= <user>
##$USERA5= <user>
##$V9= 5
##$VALIST= <valist>
##$VCLIST= <CCCCCCCCCCCCCCC>
##$VD= 0
##$VDLIST= <DDDDDDDDDDDDDDD>
##$VPLIST= <PPPPPPPPPPPPPPP>
##$VTLIST= <TTTTTTTTTTTTTTT>
##$WBST= 1024
##$WBSW= 4
##$XGAIN= (0..3)
0 0 0 0 
##$XL= 0
##$YL= 0
##$YMAX_a= 239969
##$YMIN_a= -246631
##$ZGOPTNS= <>
##$ZL1= 120
##$ZL2= 120
##$ZL3= 120
##$ZL4= 120
##$ABSF1= 10
##$ABSF2= 0
##$ABSG= 5
##$ABSL= 3
##$ALPHA= 0
##$AQORDER= 0
##$ASSFAC= 0
##$ASSFACI= 0
##$ASSFACX= 0
##$ASSWID= 0
##$AUNMP= <proc_1d>
##$AZFE= 0.1
##$AZFW= 0.1
##$BCFW= 1
##$BC_mod= 2
##$BYTORDP= 1
##$COROFFS= 0
##$CY= -3
##$DATMOD= 1
##$DC= 2
##$DFILT= <>
##$DTYPP= 0
##$F1P= 0
##$F2P= 0
##$FCOR= 0.5
##$FTSIZE= 0
##$FT_mod= 4
##$GAMMA= 1
##$GB= 0.15
##$INTBC= 1
##$INTSCL= 1
##$ISEN= 128
##$LB= 0.25
##$LEV0= 0
##$LPBIN= 0
##$MAXI= 10000
##$MC2= 0
##$MEAN= 0
##$ME_mod= 0
##$MI= 1.114404
##$NCOEF= 0
##$NC_proc= 0
##$NLEV= 6
##$NOISF1= 3.799351
##$NOISF2= 2.8
##$NSP= 1
##$NTH_PI= 0
##$NZP= 0
##$OFFSET= 14.38212
##$PC= 1
##$PHC0= 248.571
##$PHC1= 16.3922
##$PH_mod= 1
##$PKNL= yes
##$PPARMOD= 0
##$PSCAL= 0
##$PSIGN= 0
##$REVERSE= no
##$SF= 200.129724274929
##$SI= 16384
##$SIGF1= 3
##$SIGF2= 2
##$SINO= 400
##$SIOLD= 16384
##$SREGLST= <1H.CDCl3>
##$SSB= 0
##$STSI= 0
##$STSR= 0
##$SW_p= 3205.1282051282
##$SYMM= 0
##$S_DEV= 0
##$TDeff= 0
##$TDoff= 0
##$TI= <>
##$TILT= no
##$TM1= 0
##$TM2= 0
##$TOPLEV= 0
##$USERP1= <user>
##$USERP2= <user>
##$USERP3= <user>
##$USERP4= <user>
##$USERP5= <user>
##$WDW= 1
##$XDIM= 8192
##$YMAX_p= 0
##$YMIN_p= 0
$$ End of Bruker specific parameters
$$ ---------------------------------
##NTUPLES= NMR FID
##VAR_NAME=  TIME,          FID/REAL,        FID/IMAG
##SYMBOL=    X,             R,               I
##VAR_TYPE=  INDEPENDENT,   DEPENDENT,       DEPENDENT
##VAR_FORM=  AFFN,          ASDF,            ASDF
##VAR_DIM=   8192,          8192,            8192
##UNITS=     SECONDS,       ARBITRARY UNITS, ARBITRARY UNITS
##FACTOR=    0.0002768,     1,               1
##FIRST=     0,             0,               0
##LAST=      2.2672688,     0,               0
##MIN=       0,             -246631,         0
##MAX=       2.2672688,     239969,          0
$$ Real data points
##PAGE= N=1
##DATA TABLE= (X++(R..R)), XYDATA
$$ [...]
1919A77j00n14N01j20l02L91k3m65J49M41j27j85P92J3q04L97L61m86%L54n55
1940a05j90K77J11p68O22K01p78j26J021k96n06O35M38j142P93O12m99n26Q23
1959E97l9r22O37R9j011K97M03m42l0N59j11q62M22Q10m92k19N12l34k59P86J80
1980E81m18K1L84o71m82J065l59l50j70K71k53j55N07L51q32L40N30j44J14J62
2000D92j60m37j24M97Q9k06l7J95n98O4M04n11n1K42o4m25N36Q52m90m50L29M31
2022E78l48j71N75l94n90O01j93l58M18M7p98J01O75j14q47P76N54p66k58R94
2042D82k35m64N74M4p89M43R64j155n66J211j28j082M41M52o94q4Q19k47p35J201
2062D52J49j222R6J125l59m07N75k88n84M83O59p84o79J006j66p50P28J72n34
$$ plain form
1919 177 77 -437 64 -56 -358 33 10 -455 -306 135 8 -177 615 628 -176 221 582 96 96 450 -105
1940 -105 -295 -18 93 -675 -53 148 -630 -756 265 -31 -537 98 536 -606 187 799 300 -226 597
1959 597 558 -364 273 372 -639 -342 61 -381 -411 148 37 -825 -403 407 -85 -304 208 -126 -385 401 581
1980 581 163 184 568 -103 -585 480 121 -229 -399 -128 -381 -536 -29 322 -510 -170 360 216 330 492
2000 492 332 -105 -229 268 357 151 114 309 -289 -225 179 -332 -383 -141 -205 -630 -94 758 268 -182 147 578
2022 578 230 59 634 240 -350 251 58 -300 118 165 -633 -532 143 29 -818 -42 512 -254 -512 482
2042 482 247 -217 357 401 -388 55 1019 -136 -702 509 381 -701 -260 192 -502 -586 233 -14 -749 452
2062 452 601 -621 -525 600 241 -166 409 121 -463 20 679 -105 -784 222 56 -694 34 206 -328
2081c28n03R99j16m69O38M00j071J37P86jn33M26k48n40N05M63n23q05O60J25
2101Bm56K37Q09p29m27R15j57q45O72O39n15m42Q32l6r10P07R4n96n52J069j73
2122A38o38L01L04o60J33P81K1n91M46K54p33J31Q23o27l51Q61q1q98N97L59m13
2143A57p06Q45k84m83K23L65m87l37J061j97l79L84K22m45l00J009j67p14K36
2162CM36j007N06L78j91p51N52O7o71J76Q22j90o83J222m6j117P57N42p82p0P86
2183G39k01p87J52P12j049j47J114o76p28Q43J93q12K50J279p18o87R18k7o04
2202b36K77N98p64k59J045o19o80O76M24j176J04J299o08n80O12K30q84N90O47
2221F96m75m32Q14k90p00N37O01n32o04M46j10l31L42L44r06L02K28R1k82J04
$$ plain form
2081 -328 -831 168 52 -417 221 621 -450 -313 473 472 -61 365 117 -423 82 545 22 -783 -123 2
2101 2 -454 -217 592 -137 -564 351 194 -651 21 660 145 -297 535 499 -411 296 390 -206 -758 311 138
2122 138 -500 -199 105 -555 -422 359 380 -211 235 489 -244 -113 710 83 -268 593 512 -386 211 570 157
2143 157 -549 296 12 -471 -248 117 -370 -707 354 157 -222 162 384 -61 -361 648 481 -233 3
2162 3 439 -568 -62 316 125 -626 -74 -7 -678 -502 320 130 -553 669 623 -494 263 805 23 -47 739
2183 739 538 -249 -97 615 -434 -581 533 -143 -871 -28 165 -647 -397 882 164 -523 395 368 -236
2202 -236 41 639 -125 -384 661 42 -638 38 462 -714 -610 689 81 -499 113 343 -541 49 696
2221 696 221 -211 603 313 -387 150 751 219 -385 61 -49 -380 -38 306 -600 -298 -70 21 -261 -157
2241a57L02l25p5N40j94J8L27j16o69K68L01Q5o48M25L34q88n0R75m25m00K28
2262a44N06n05o0O30j10m65J21M45o88R5R59q43p09J107J81r50J87M59n28J57
2282a55O04m35n09M28P02q61J19N25l46m64Q29J5o66K3N95o35J24L62k57o62O23
2303d1J50p77M00O58l72l68N19l3m48O74K88q08K24L94n05j00j5M96o86R7K95
2324D2j02N9J88k96n56M84N55j64l44O60m11l14N69r6J18m67K30k81K74l09J60
2345aj10P8l09L46k40K81K6J1j65j02K81MJ22L37j48m99R3M66n16j3J95k17l00
2368c80J70L54o04J70M2P3KM01k08j52J59K30n88M85K92l20r0L42k06k95J92J71
2390B40p19J8K71O5n54J038k9p27M99J74O1l18M52k68q8J08K3j14m86N88k85l83
$$ plain form
2241 -157 145 -180 -255 285 91 109 436 320 -349 -81 220 305 -343 82 416 -472 -522 453 28 -372 -144
2262 -144 362 -143 -203 427 317 -148 -27 418 -270 -175 784 -59 -768 339 520 -430 -243 216 -312 -155
2282 -155 449 14 -495 -67 635 -226 -107 418 72 -392 437 452 -214 -191 404 -231 -107 255 -2 -664 -41
2303 -41 109 -668 -268 390 18 -350 169 136 -312 362 650 -158 66 460 -45 -145 -160 336 -350 -253 42
2324 42 -60 -1 187 -109 -665 -181 374 210 -134 526 115 -199 370 274 392 -75 155 -126 148 -161 -1
2345 -1 -111 -33 -342 4 -236 45 71 82 -83 -185 96 100 222 559 411 -88 5 471 -45 -58 137 -80 -380
2368 -380 -210 144 -460 -290 -248 -175 -173 228 20 -132 27 257 -331 154 446 126 36 378 172 -123 69 240
2390 240 -479 -461 -190 -125 -679 359 330 -397 102 276 337 19 471 203 115 223 246 132 -354 234 -51 -434
2412d34M53m1l42J62M78m57K22R9l02K45L61km23J84K70n71j5Q14p87p9L96o0
2434A71m70M14j21k40m4L48k27j30P90m08q3n3N46o34K85N17q46k20O23m86L7
2455b31L56J52o08J69J18O3o1J36J73m06J70N00n52Q1M42m08l58O53K61o05p6
2476c1l8K12j82j9K2k42n0J40q0O3M18J60m25J45q1K77n1l4j52J07l57Q9N66o48
2500a91R8M7O4k98J76K74l38j68N09k49l4M35n0o31M62N17q40J50P97p60m06O05
2522A69J82o90j6K55k1l67P38k07n02L89K73m21pQ29l02o48N79J82p32O29O0m57
2544h5m69J008l54j90q9J56m51M8P90l03n16N26M22n85M2K58K4n46L73j50j49
2565b40K57O6l02j99M96M2l41K18R7m93L8N35j1l55Q42j10m66k55M47L7m96K68
$$ plain form
2412 -434 19 -22 -364 -202 276 -181 41 140 -162 83 444 442 19 203 473 -98 -113 701 -86 -165 231 171
2434 171 -299 115 -6 -246 -290 58 -169 -299 491 83 0 -53 493 -141 144 661 -185 -405 218 -268 -231
2455 -231 125 277 -331 -162 -44 19 -42 94 267 -139 31 531 -21 60 502 94 -264 389 650 45 -31
2476 -31 -69 143 -39 -58 -36 -278 -328 -188 -268 -205 213 373 -52 93 12 289 238 204 52 159 -198 -109 457 -191
2500 -191 -93 -46 18 -280 -104 170 -168 -336 173 -76 -110 325 275 -356 106 623 -217 -67 730 -30 -436 169
2522 169 351 -339 -355 -100 -121 -488 250 43 -459 -70 203 -218 -225 604 302 -346 233 415 -317 312 372 -85
2544 -85 -554 454 100 -90 -179 -23 -474 -426 364 61 -455 71 493 -92 -50 208 232 -314 59 -91 -240
2565 -240 17 83 -219 -418 78 120 -221 -3 94 -399 -361 174 163 -192 650 540 74 -181 266 303 -193 75
2587G5J17p34L15L86n6m37L94j84l15J79M26l1m16K68j03o3MN31j42n44L29M36
2609D35m13j52N63q00j85O41P8r21N63L62k80j9L90n7n32N62Q4n25K50O54m14
2630B84p62N38j9l26K42K93n47j49O25j56l75L11L75o50K02K80j26l62M81K43
2650D02n25K23N54m55n39O11k41n81K73L58l79k64N75j35l31M62K44l52J5K59
2670A74o8k82M00l5n36K60K23J71o07Q4K15m34L04M14m44k50J57L28l85K40L72
2691C01o5o33N47Ok92L09j6o2l20K20J91j96J24M2p85J90Q61r3p26N76n9k06j
2714h7M54m96j58O94k67m40L06K63k90n19N06L02l41m6K5k19m86R24jj09j09K19
2736A25l10Q8K32Q6j10K02Qk66l20M69k32j00p2O9p7j32M12j53m19M62M70n35
$$ plain form
2587 75 192 -542 -227 159 103 -334 60 -124 -439 -260 166 135 -281 -13 -116 -179 -175 356 214 -330 -1 435
2609 435 22 -130 433 -367 -552 89 167 -754 -191 171 -109 -128 262 205 -327 235 319 -206 44 698 284
2630 284 -478 60 41 -285 -43 250 -297 -446 179 23 -352 -41 334 -316 -114 166 40 -322 159 402
2650 402 -123 100 654 199 -340 271 30 -551 -278 80 -299 -563 12 -123 -454 8 252 -100 -85 174
2670 174 106 -176 224 189 -347 -87 136 307 -300 -216 -1 -435 -131 283 -161 -411 -254 74 -311 -71 301
2691 301 236 -397 150 156 -136 173 157 95 -225 -5 186 -10 114 156 -629 -439 422 329 -397 179 120 -86 -87
2714 -87 367 -129 -287 407 140 -300 6 269 -21 -540 -34 268 -73 -119 -94 -313 -799 125 124 15 -94 125
2736 125 -185 -97 135 221 111 313 321 55 -265 204 -28 -128 -200 -131 -208 -340 72 -81 -500 -38 432 -103
2758a03J37K09k07l19L33L94m86J67J82m28J29K60On34MJ06k76M23O63m71m34
2779b45L88P6m39M53P7l80j91M47J9l72P8K15m20K90J18K8m44L81L3n34L70M37
2801C85j8o44L83J6m19L04M54l4n83N67k71l89O30l24k58J59n1J71l73N28j56
2822G7k08J28n3K6l0M91l30n4k3J93j19k5j9k64J10q0J72m2j73J46LkK0J3K66
2847B23j87m0M76l46O5L6m3k75l0K24j17j6Q1l17M6M58J25o58p6K93m2q1L16j23
2871hj39J49J13j37R8J49l08l51M99J04m07J83L53m25k67O90l01p5K74j87q5J84
2893A06K33j43o1K53l68p8jM91n45K37q1k35j5J81P1o38N26k68M58r7m9pn3K83
2917B00j67j72L07n6J1J77k1m31j71L13m92M26O5Q8l83L27j76k83L69K95J42n36
$$ plain form
2758 -103 34 243 36 -283 50 444 -42 125 307 -121 8 268 274 -260 -256 -150 -426 -3 660 189 -245
2779 -245 143 219 -220 233 310 -70 -261 186 205 -167 -89 126 -294 -4 114 142 -302 79 112 -422 -52 385
2801 385 367 -277 106 122 -297 7 461 427 -156 411 140 -249 381 57 -201 -42 -93 78 -295 233 77
2822 77 -131 -3 -56 -30 -60 431 101 47 24 217 98 73 54 -210 -100 -180 -8 -50 -223 -77 -74 -76 -56 -43 223
2847 223 36 -4 472 126 191 227 184 -91 -121 103 -14 -30 51 -266 -220 238 363 -295 -371 -78 -120 -201 115 -8
2871 -8 -147 2 115 -22 76 225 -83 -434 65 169 -238 -55 298 -127 -394 296 -5 -80 194 7 -78 106
2893 106 339 196 135 388 20 -58 -59 432 -113 124 43 -192 -207 -26 45 -593 -67 -335 123 26 -23 -30 -83 200
2917 200 33 -139 168 112 123 300 279 -152 -323 -10 -502 -76 -11 77 -306 21 -155 -438 -69 226 368 -168
2939a68M65l9j22Q1Pl01n5M61n86R0L45n71K28j58M41k62r9J82k29k3N33O1k22
2962E9K12p8J1j09nO1k8k66l14J57J83J31l19K36j72L67k44K59L7l13L81Q9J46
2985D81k42l7Q2j34L8k24r7K13m0k96J84j02Q4J73J1k97o4L68j75K25J18j5m02
3008a48k9N64k65l75M32q4m36K58J66m10k5L30l59QO88k19n72M05L11j01l25N59
3030C73J8o13N63l86p1P6K64m51o8L84k04o4PK99l30mN19L4m33J35J65l95M08
3053B26L42m00MJ17k47k60J83K09K3k87l37M08q4J01K18l43J1J34K38k89j46L82
3075B03q4L8j62M43l02q3J55n57K42J86m9k67M2K04j36k34L41L30m52K2N67m68
3097b1L21K32m88k89N09m3l9m75M75m64N7K07M18o16M84j78J0l91L33Q0m82N03
$$ plain form
2939 -168 297 258 136 217 224 -77 -132 329 -257 -167 178 -393 -165 -323 118 -144 -243 -61 -290 -313 220 281 59
2962 59 271 193 204 95 90 151 123 -143 -457 -300 -117 14 -305 -69 -241 126 -118 141 178 -135 246 335 481
2985 481 239 202 284 150 188 -36 -133 80 40 -256 -72 -174 -90 83 94 -203 -267 101 -74 151 269 254 -148
3008 -148 -177 387 122 -253 179 95 -341 -83 83 -327 -352 -22 -381 -373 315 96 -476 -71 240 139 -186 373
3030 373 391 -222 341 -45 -116 -40 224 -227 -295 89 -115 -179 -172 127 -203 -207 312 346 -87 48 213 -182 226
3053 226 568 168 172 289 42 -218 -35 174 197 -90 -427 -19 -103 -2 216 -127 -116 18 256 -33 -179 203
3075 203 119 157 -5 438 136 53 208 -349 -107 79 30 -237 -195 9 -127 -361 -20 310 -142 -120 447 -21
3097 -21 300 532 44 -245 264 221 182 -293 182 -282 -225 -18 400 -216 268 90 100 -291 42 122 -360 143
3119A43K38j97l22L34k7k63L27P4m74K53j57k3m06L35Ll16J44J76j04J28L24O6
3141B56o56N08N3k66k9M88k98k52J48Q6j95J5J34l73J45M07N5n40L65J70Mk45
3163b0M09k78j67J93R8l21k23N79rm28j65L34k32J61J23j31k41K04K09n2K3N33
3185E99j31o10L65k10J79j0L25o59k51M64m0l73O8O94m72k43M64K2n10L69K42
3206B82k77k7R50q01k50O6L07l25K03J53l91l10M57K0k76K53J65l79O1K90R1p97
3228e35O67M56n80k91O88j63l69J25K55l84l6N75l85l44J4N04l12j9P7J20l78
3249c15M93J07n40L81K39m31j24M69l7l95M53L9n18j17P56o11k06P3K93qk23J37
3271h5N6k11J36M08k92OL14n30J60K61N0m05Q5l3N3k44K93L3l58J26R6k48K74
$$ plain form
3119 143 381 184 -138 196 169 -94 233 307 -167 86 -71 -94 -500 -165 -162 -478 -334 -158 -262 -134 190 256
3141 256 -400 108 161 -105 -134 354 56 -196 -48 38 -157 -142 -8 -381 -236 171 226 -314 51 221 225 -20
3163 -20 389 111 -56 137 235 -86 -309 270 261 -167 -332 2 -230 -69 54 -77 -318 -114 95 43 66 599
3185 599 468 -142 223 13 192 182 507 -152 -403 61 21 -352 -284 410 -62 -305 159 181 -329 40 282
3206 282 5 -22 928 127 -123 -57 250 -75 128 281 -110 -420 37 57 -219 34 199 -180 -119 171 262 -535
3228 -535 132 588 8 -283 405 242 -127 -2 253 -131 -167 408 23 -321 -307 197 -115 -134 -57 63 -315
3249 -315 178 285 -255 126 365 -66 -190 279 242 -153 300 339 -179 -296 460 -151 -357 -284 9 1 -222 -85
3271 -85 -29 -240 -104 304 12 18 332 -198 -38 223 273 -132 -47 -80 -27 -271 22 55 -303 -177 -81 -329 -55
3294e5N21o29nK65K48m30K87J18k09j98K82j03l09P5L54o10KN14M5k68q5nO0j5
3318a50L40j99k07K52K10j59n6K27j90p6j96K73j15L7k8j71j98M34J32r5l25M73
3340B13k47mJ69j48m0P1L33n35J59K01j83j26l13P55l91n7J85J02j51j68O5j76
3362b86L75O1l89J55L56rl52o2L34k45k26N66l85j83j50N20k21J70K01k98j8M6
3384d0q4P2J58j55j3p0K73j98K69k11O1l07K0J25k62L27q5k34L39k22K17q7J19
3407A2k79J55J69R5p4J59m56l9P4J47K32k79j51M0O1R2l4Q4K3Jj30k53L30J55
3431A34j46L26k29j52K25lk31K11R6l10M4K79k13k04K3K26Q7l3r5k14R8K12j30
3454AN9J47j51j0j11L0R1j06K45k3k44J65j40p2K1N9o8Q3k08L52o4jm6j09r3J24
$$ plain form
3294 -55 466 -163 -168 97 345 -85 202 320 111 -87 195 92 -217 -142 212 -398 -396 118 163 -105 -190 -195 -135 -150
3318 -150 190 -9 -216 36 246 87 31 258 68 -8 -204 69 -46 -9 -37 -208 -406 28 160 65 -260 213
3340 213 -34 -38 131 -17 -57 14 347 -188 -29 172 -11 -137 -450 305 -86 -143 42 144 -7 -175 -110 -286
3362 -286 89 150 -239 -84 272 263 -89 -151 183 -62 -288 278 -107 -290 -440 80 -141 29 230 -68 -86 -40
3384 -40 -124 -52 106 -49 -62 -132 141 -57 212 1 62 -245 -225 -100 -362 -35 -120 -354 -15 -237 -20 -107 12
3407 12 -267 -112 57 152 78 237 -219 -258 -184 -37 195 -84 -235 -195 -134 -42 -76 8 31 32 -98 -351 -21 134
3431 134 -12 314 85 -67 158 155 -76 135 231 -79 -35 244 31 -173 -150 76 163 130 35 -179 -81 131 1
3454 1 60 207 56 46 -65 -35 56 -50 195 172 -72 93 -47 -119 -98 -39 -107 -24 -232 120 56 55 9 -100 -193 -69
3480f9L30m94L28M13o47J34j17j09p5L35k40J67p3M6l65K86K40q2N7L47k19k35
3502d2K56j51q0j13L23k54j0J07P4j92j90O3j11L43j90l6J1J37K4J52j3mo6k3
3526A5K3O6k0P5j68k10J5L05j01lJ8k71J07Q0K89m8J34k39K9lo0q3R1l69Q6N9
3552a83L76k80j0n4j20J32K80j55k2J4Oj10K3N03n90J59K1J3k26M69p8oj60J8
3576B0j63K03P3lm33L08R6j60J00J57j8l88N65K2l17J26J35l91J8O9L46n09J44
3599@M5n8k77K48j9k29M31j53m35N33L01k46j91K39o7k06J56K92l02j28K2K81
3621B37k32p8j03K9J14j08J12M9k89N08l29K07K49m09p4K18J54m89O9M05k74j43
3643a77J37K92k62K3k91J1k0M19Jj47j09J00p9m1O46j13l89k36J89J60l52N23
$$ plain form
3480 -69 261 -233 95 508 -139 -5 -122 -231 -306 29 -211 -44 -117 -71 -436 -150 90 8 65 412 193 -42
3502 -42 214 63 -17 -130 193 -61 -71 36 110 -82 -272 -209 -320 23 -167 -203 -192 -55 -31 121 108 104 38 15
3526 15 38 104 84 159 -9 -219 -204 101 0 -3 15 -256 -149 -69 220 172 306 67 96 93 33 -50 41 -328 -242 -183
3552 -183 193 -87 -97 -151 -271 -139 141 -14 -36 -22 -16 -126 -103 400 -190 -31 -10 3 -223 246 168 162 2 20
3576 20 -143 60 133 130 -303 5 101 -59 41 198 180 -208 357 379 62 188 323 -68 -50 19 365 -144 0
3599 0 45 -13 -290 -42 -61 -290 141 -12 -447 86 387 141 -50 189 122 -84 72 364 62 -66 -44 237
3621 237 5 -73 -176 -147 -33 -141 -29 20 -269 239 -90 117 366 -43 -117 101 255 -234 -165 240 -34 -177
3643 -177 -40 252 -10 13 -278 -267 -287 132 133 -14 -123 -23 -102 -143 503 390 1 -235 -46 114 -238 285
3665B85k84j30J23J93l90k5r0M40k32M0L95k70m3J60o1o7L83J00n47k0J16k53
3687a77J90M8n9k62n2M94m97P8L12j5l26j02M19l62K44J29j55k20N45j81m01N46
3709A96Q4l42k87M43K6k92M09k27k78K19J98n7J79k33K89k62k06N61j28l06J68
3730A54n4n3k83K78j4k97J89o0q9K5L29k30L6K12r8q9J62l4k32L64J41l05k29
3753a77kP6O7Q0m7j96p1j9J93L8j1qJ23r2J08L11n88l5N51l66k7P7M17o11n8N35
3779B68n42J89K46m72m1K13K27l3L5J94j65l15K44J33k68L08K69l25j85K42k5
3800A97l50K27J57l47K1o9L77l12j40L91r8k37O16m14J15j29L96m94J45K46k00
3821I8l02J31K71j90q0j9j16j9K01Mm4L59j8k10j83N46p8l29k33N37j48j59J11
$$ plain form
3665 285 1 -129 -6 187 -203 -228 -318 122 -110 -70 325 55 12 172 111 44 427 527 -20 -40 76 -177
3687 -177 13 61 2 -260 -312 182 -315 -237 75 60 -266 -368 51 -311 -67 62 -93 -313 232 51 -350 196
3709 196 280 -62 -349 94 120 -172 237 10 -268 -49 149 92 271 38 327 65 -141 420 292 -14 154
3730 154 100 47 -236 42 28 -269 -80 -140 -229 -204 125 -105 -69 143 45 -44 118 84 -148 216 357 52 -177
3753 -177 -179 -103 -36 44 -3 -199 -270 -289 -96 -58 -69 -77 46 -46 62 373 -215 -250 301 -65 -92 -15 402 -209 -267 268
3779 268 -274 -85 161 -311 -352 -139 88 55 90 284 119 -196 48 181 -87 221 490 165 -20 222 197
3800 197 -153 74 231 -116 -95 -164 213 -99 -239 152 54 -183 433 19 134 5 401 -93 52 298 98
3821 98 -204 -73 198 8 -72 -91 -207 -226 -25 -21 -65 294 276 66 -117 429 351 22 -211 326 178 19 130
3844A30nj58o7QL1k00N38k87l03L80j49N5K29L1j55j19L17Rl42N3M92p92K50J05
3868E1K85m95NJ52k46J84L72n63j10M13J00k04j36M29k46J1l4J54k95L41j41L1
3890E8l66K35j29K28o9O5l31L41J2j9qq9J77L6K17j92k66m8L02k55L75l26J12
3913F0k55K7L2K20r0N3j84lN1K11N9j55k42N85j24k39j41O5J49k09L36k70N1K50
3937B37j54j45j14O1r1n3R7r1j69M38m4J91N4L8R7k74m5N8K8j39P9R6l16j00Q8
3962a73M8j0J92o7J63j94QQ7J20o20K74J46O1j80L71%j84m0r4Q2k06N30m81j19
3986b86O9L51j35k6j21J34k21L89J18m06M62j16k97rN0m7k01L61Ol39L6K36j61
4009a53L33l72L51j39m1J80R2k76O9N5j25R1k60P32n79J07j3J15l96q5J03p6J
$$ plain form
3844 130 125 -33 -100 -92 -61 -261 277 -10 -313 67 -82 -27 202 233 78 -41 276 285 -57 -4 488 -304 -54 51
3868 51 336 -159 -154 -2 -248 -64 308 -255 -365 48 148 -56 -192 237 -9 2 -32 122 -173 168 27 58
3890 58 -308 -73 -202 26 -43 22 -309 32 44 25 17 -72 105 141 358 166 -100 -148 154 -101 274 -52 60
3913 60 -195 -168 -136 84 -6 47 -137 -140 -89 122 181 26 -216 369 245 6 -135 -70 79 -130 206 -64 -13 237
3937 237 83 -62 -176 -115 -206 -259 -162 -253 -422 16 -28 163 217 255 352 78 33 91 119 -20 59 155 -161 -261 -173
3962 -173 -125 -135 57 -10 153 -41 -33 54 174 -446 -172 -26 35 -145 226 226 42 2 -92 -10 -216 314 -167 -286
3986 -286 -217 134 -1 -27 -148 -14 -235 154 272 -134 328 212 -85 -94 -44 -91 -292 69 75 -264 -228 8 -153
4009 -153 180 -192 159 20 -21 159 251 -25 44 99 -26 65 -195 537 -42 65 52 167 -229 -314 -211 -287 -286
4032b86M75j99K26r4m8j19K1K18m5k10K49k20rJ65j04o8K54m5n41J77K41o1K43
4055B20m45L48j79K2J12j0k05K11m8n2J38j0j61j91K05Mn7K42n5j77o3K76l50
4078b25R6M25m40K54L2j4j81L28n7k86o4L66j21k97K72o2N2k77K60k26j00K23
4100d2J22j21K67nq6l39K74j03K24k8n29M33k18L33k07Q3l65L97n3L10l64K63
4122B46k98J9k8J75j72j4J66j46K63K73k82r1j45K59l17J84o5JN6j54k08J11N
4145a62M25n27J05K23j11L09j45K81n25M55j76k21k03K49J30j20r8J55l42p4K97
4166g5L14n44J09K64j89p9M48j03l52K81L42o45k7M91l16J70Q9j12l80K51o9Q9
4188d3o6J80j41k05K31j59M49k52K55j84j44K63J01m71K25Q5k05L08k52J6n5R
$$ plain form
4032 -286 189 -10 216 122 74 -45 -24 194 149 -61 188 -32 -41 124 20 -48 206 161 -380 -203 38 -23 220
4055 220 -225 123 -56 -34 78 68 -137 74 26 -26 112 102 -59 -250 -45 -41 -98 144 89 -88 -151 125 -225
4078 -225 -129 296 -144 110 142 128 -53 275 218 -68 -132 234 113 -184 88 26 78 -199 61 -165 -265 -42
4100 -42 80 -41 226 221 135 -204 70 -33 191 163 -366 67 -151 182 -25 58 -307 90 37 347 -17 246
4122 246 -52 -33 -61 114 -58 -72 94 -52 211 484 202 111 -34 225 -92 92 27 28 84 -70 -278 -167 -162
4145 -162 263 -264 -159 64 -47 262 117 398 -127 328 152 -69 -272 -23 107 -13 -111 44 -298 -372 -75
4166 -75 239 -305 -196 68 -121 -200 248 145 -207 74 416 -229 -256 235 -81 89 178 66 -314 -63 -132 -43
4188 -43 -109 71 -70 -275 -44 -203 246 -6 249 65 -79 184 285 -186 39 124 -81 227 -25 -9 -64 -55
4210e5R5m8j27l6Q5O7n2J66j74J11rl3j18M1J13M9M6m2k60j00L62k32J49J6p2
4235e8j01K23J46j98n3j83M11k36j19L76J93m82Mk8R7j4l8o6J6k85L51P7j75L30
4259A88k69K04q9K95m06O8k1O4k5J65Q1j99r8O8k07J00K72l33k0Q4l2j55K25K26
4283A86q8k76K70K33j56j62K25l32M3Q2K32j06l87K44k2noj13n7J60j54M9lL40
4307A97k01J21j55K00k30M13m09K14Jk59K12l00L87r1k05M4j4Q4m0M01k97l3j19
4330g9K88M3l95J23J33q9q3K56k07k73L69qk50O6j01L09l26O0K00p3P6L40m11
4353c2o0L59J54m79j7K56k6j35L8J81m39m8J43k0J45K75m70k38M41J98m28J7L60
4376A75r4L6J53p3l68j0K63j31J11n4J0J95k44J22k23M31k64j79K51j45K02l29
$$ plain form
4210 -55 40 -8 -135 -171 -86 -19 -71 95 -79 32 23 -10 -128 -87 26 75 121 79 -181 -281 81 -151 -2 14 -58
4235 -58 -159 64 210 12 -41 -224 187 -49 -168 208 401 -81 -77 -105 -8 -22 -60 -126 -110 -395 -44 33 -142 188
4259 188 -81 123 34 329 -77 -9 -30 34 9 174 255 56 -42 26 -181 -81 191 -142 -162 -78 -110 -265 -40 186
4283 186 98 -178 92 325 169 7 232 -100 -57 25 257 151 -236 8 -14 -19 -25 -138 -195 -35 -189 -140 -143 197
4307 197 -4 117 -38 162 -68 345 -64 150 151 -108 104 -196 191 100 -105 -61 -75 9 -31 370 73 40 -79
4330 -79 209 252 -143 -20 113 24 -59 197 -10 -283 86 78 -172 -106 -207 102 -224 -164 36 -37 39 379 -32
4353 -32 -92 267 421 -58 -75 181 155 20 58 239 -200 -248 -105 -125 20 295 -175 -413 28 226 -202 -185 175
4376 175 81 117 270 197 -171 -181 82 -49 62 8 18 213 -31 91 -132 299 35 -144 107 -38 164 -165
4398a65K84M1k09N7q3J70k88N0L90k69o9j23J99l50K02K80j89mK31L7k67L8J66
4421A29l09J99J46o8J33j14j44O7j35J5M3j67K43j93L13j42P3k66Q0J36Mo0K52
4444B35J05l53j76K40q2Q5L5q6N0k32J58J54j53j67O6j54K19R7p4J69o3o3K05
4467B15j89J88j40p9j09L86m48Q6Q1j16j26L70p6k11J46r7Q3l5L19j33j97M91
4489D09m17rj31k6J53J96k83J56N7J6k45j68K17J96k69L04j94J04Q8j18J2J28
4511A76J75k64k25J26K40j50j89J95L0j89L5k01L56P0q6R9l91L58r8l7n2j05J44
4534A7L58k61K6j53j03J07K4J7k56M5j39K90j60K58k55K90k38L9o7L51L3k66o0
4557a03J8K76k8J44n79L61K49m02P9Ok42K70n2r2J1m4r7J91L13l32L01J5l34J45
$$ plain form
4398 -165 119 160 -49 8 -75 95 -193 -143 247 -22 -91 -214 -15 -365 -163 117 -72 -76 155 192 -75 -37 129
4421 129 -180 19 165 97 230 116 -28 39 -96 -81 -38 -205 38 -155 158 16 89 -177 -97 39 43 -17 235
4444 235 340 -13 -189 51 -31 54 89 3 53 -179 -21 133 -20 -187 -121 -275 -56 41 -33 136 73 10 215
4467 215 26 214 74 -5 -114 272 -176 -90 -9 -125 -251 119 43 -168 -22 -119 -36 -71 248 115 -82 409
4489 409 -8 -17 -148 -174 -21 175 -108 48 105 121 -124 -292 -75 121 -148 156 -38 66 154 36 48 176
4511 176 351 87 -138 -12 228 78 -111 84 114 -75 -40 -241 115 185 99 198 -193 165 67 30 -22 -127 17
4534 17 375 114 140 -13 -116 -9 15 32 -224 -179 -318 -28 -188 70 -185 105 -133 -94 -161 190 223 -43 -103
4557 -103 -85 191 163 307 -272 89 338 -64 15 21 -221 49 -3 -95 -84 -128 -225 -34 279 -53 248 263 -71 74
4581G4N7q9j15L43m18L71j88k14J54l48K48j14L71r4j8j94K7N5K58k7k42J84k04
4604a23K40l47J59P0O9k81J35j17K25q5J31o7j88M9J82j46J32j77J55q7K45k17
4626d3P2k49q4K99j60J78J84l04O7J34k57k3L41j48l4j16m8M42l13M17k8m13O9
4649a7J94N8j05q9r5k14L45l06K12K4J09k89PK13K51m21n2M75k9j81J74J16n09
4672a29K58J13l44J03K34m01Q4M3Lj94J7J29j6Q4q2J99J58j80J71r7j88M9R6o
4696A04J3r3j95K12j70N2l26O53j74k23J74m0j43L7M44k29k38R3K09m62K11L79
4718B88j97j13J40k99J03j11K48n25M09O1J4j52K87K11l49j36P5r1L45k31L32
4739C09K6n18J02J69J66o9n71L66K6j3L56l00j08r8J78J00P1Q1m75K96J47k14
$$ plain form
4581 74 131 42 -73 270 -148 223 35 -179 -25 -373 -125 -239 132 38 20 -174 -147 -92 166 139 -103 81 -123
4604 -123 117 -230 -71 -1 68 -213 -78 -195 30 -55 76 9 -179 -130 52 -94 38 -139 16 -71 174 -43
4626 -43 29 -220 -304 -5 -165 13 197 -107 -40 94 -163 -186 155 7 -27 -143 -191 251 -62 355 327 -86 -17
4649 -17 177 235 130 41 -54 -268 77 -229 -17 7 116 -173 -166 47 298 -123 -175 300 271 90 264 380 -129
4672 -129 129 242 -102 1 235 -166 -82 -39 -36 -230 -213 -84 -100 -16 -98 101 259 79 250 153 -35 14 110 104
4696 104 117 24 -171 41 -129 -77 -403 250 76 -147 27 -13 -156 -119 325 96 -142 -49 160 -302 -91 288
4718 288 91 -22 118 -181 -78 -189 59 -466 -57 4 18 -134 153 364 15 -121 -46 -137 208 -23 309
4739 309 335 -183 -81 88 254 185 -386 -20 6 -7 349 49 -59 -157 21 121 192 273 -202 94 241 27
4761B7Q6j99K60k82R6J53k21j71L91O7m05R5n2R7N4r0Q3NR5K26l77J74k29M8k7
4786i6K13Q7m33J82L25k94j53J32j4j03O3%j11j04J65K89j30m0l3J22k00J49j13
4809i7K09L6n06J68K25r3l2m2K25N0n48M47OK0J06K3l25m8K96J7l69J15L26j46
4833F3l45K30j1l68L68j9m38K20L89J55l64j64N66P7l65K79n2j20j26R5N9P6j67
4856C8k07L32l90L00l06j55J06L47j2j16L37m54K01K0j08l1J30K80l86j7N2j23
4878a62J78K66l76j05J1K79j77J6l1N9O2O8J86p2k65J46M3j63J82j83J96j55m62
4901d59K93Q5L40m65n9K57j35K31j07L12k26J25k90nJ43l6j09K57K2l24p1K91
4923G0j70jK20k39l1J56J2r1Km7K82j50K86k98K06j22Q5k80J17J62k32L5m1k6
$$ plain form
4761 27 113 -86 174 -108 -12 141 -80 -251 140 207 -198 -103 -155 -58 -4 -94 -11 -6 89 315 -62 112 -117 -69 -96
4786 -96 117 204 -229 -47 278 -16 -169 -37 -51 -154 -91 -91 -202 -306 -141 148 18 -22 -55 67 -133 16 -97
4809 -97 112 148 -358 -190 35 -58 -90 -132 93 143 -405 42 48 68 174 197 -128 -176 120 137 -232 -117 209 63
4833 63 -282 -52 -63 -431 -63 -82 -520 -300 89 244 -120 -284 282 359 -6 273 221 101 -25 70 129 205 38
4856 38 -169 163 -227 73 -233 -388 -282 65 53 -63 274 -180 21 41 -67 -98 32 312 -74 -91 -39 -162
4878 -162 16 282 -94 -199 -188 91 -86 -70 -101 -42 20 88 274 202 -63 83 126 -37 145 -38 158 3 -459
4901 -459 -166 -81 259 -206 -265 -8 -143 88 -19 293 67 192 -98 -103 40 4 -105 152 174 -150 -221 70
4923 70 -100 -101 119 -120 -151 5 17 -74 -72 -119 163 13 299 1 207 85 170 -110 7 169 -63 -28 -69 -95
4947i5OJ07p7M9q4q9J27J45m2k19J58K29J94l99N9l26J42K50k40J19q7M9K18l08
4971a14J08k08K42rJ2j91K57K10r1j1k74J00Q4M7k38J25M5l2k11J21O6j97K82
4994A23q4j09j9M6j71K67j68K91J90j06j19j25rJ46M5m56J60L6L6M6K9K15k42
5017B2k65L97q1k17J72J63r3j62L00p9k12M7J48j13K15J8m59K95m08R0N7R7Q0
5040A2J85l11p2N21k50oQ3k78O6J31j10J20k45L41j71j51J65o7Rp2K76k88j52
5063b64K97j62J52k19P6J16j87M96l50J95k16O4j44P4J47j56m9J32J61r6p4mQ6
5086G5n4L6J58n6k20l1K60j40j6K03j77Q7N7J5k71L68l75K76r3l44K38j18K88
5109A66k12J48m00M38k26p2L15n10L18j07J3j15K02j07K07j82r8L62m44L16kj13
$$ plain form
4947 -95 -89 18 -59 -10 -94 -183 -56 89 47 -172 -14 215 409 10 69 -257 -115 135 -105 14 -73 -24 194 -114
4971 -114 -6 -214 28 19 31 -160 97 307 216 205 -69 31 115 162 -76 49 94 62 -149 -28 38 -159 123
4994 123 39 -70 -89 -43 -214 53 -115 176 366 260 141 16 7 153 198 -258 -98 -62 -26 20 49 264 22
5017 22 -243 154 73 -144 28 191 98 -64 236 157 -55 -8 140 27 242 260 -199 96 -312 -222 -165 -68 12
5040 12 197 -114 -186 335 85 79 162 -116 -50 81 -29 91 -154 187 16 -135 30 -37 -28 -100 176 -112 -264
5063 -264 33 -129 23 -196 -120 -4 -191 305 -45 150 -66 -2 -146 -72 75 -81 -130 2 163 67 -7 -11 75
5086 75 21 57 215 159 -61 -92 168 28 12 215 38 125 182 197 -74 294 -81 195 102 -242 -4 -122 166
5109 166 -46 102 -298 140 -86 -158 157 -353 -35 -142 -129 -244 -42 -149 58 -124 -222 140 -304 12 10 -103
5131a03J6K2J23k6M0n5K06l33O2N6O3k80K05J06n3l6J11k74K10l85J75J05m6J13
5155B2LM18l18k86J68o8M9%J93j06k01K75j4jk5k84J49M6J47k20M7r8J82o1k68
5180b51J28J07m1oJ1J72p7M2K15n58K04j18M0j2j17J19L00m29K38j23J65qk00
5203a99j70K56J09P2k01J59J6l1K07J1l48J3M6k32J77r7K55j84R3K5M8Pj35N3
5227e0K60l21K48J25k59l2J97j86j05K32k6j64j8n7K6j0J44j25Q5n1K52l05K39
5250I9K26k65P5j17Q8j21J85l49r4L9RN6J37J14m3RK38j55m7rK82l79J18n7j01
5275f2J22p0j9n7J03Oj3l16Q1J31J27j64N87l72q7k03L71k05J52L3r0k7L0p7M06
5300C87n54L25k28j34M19p9j47K7k1Q0j17q2J21j66L89j80m6k3K88q3k21J67n7
$$ plain form
5131 -103 -87 -65 58 32 72 17 223 -110 -48 8 71 -209 -4 102 49 13 124 -150 60 -325 -150 -45 -91 22
5155 22 25 443 125 -161 7 -61 -12 -12 181 75 -126 149 135 134 109 -175 -26 20 167 -53 -6 -104 78 17 -251
5180 -251 -123 -16 -57 -63 -52 120 43 85 300 -258 -54 -172 -132 -144 -261 -142 158 -271 -33 -156 9 1 -199
5203 -199 -369 -113 -4 68 -133 26 42 11 218 229 -119 -106 -60 -292 -115 -212 43 -141 -48 -23 25 32 -103 -50
5227 -50 210 -111 137 262 3 -29 168 -18 -123 109 83 -81 -99 -156 -130 -140 4 -121 -36 -87 165 -140 99
5250 99 325 60 135 18 106 -15 170 -179 -273 -234 -225 -169 -32 82 39 48 286 131 84 75 357 -22 96 39 -62
5275 -62 60 -10 -29 -86 17 23 10 -306 -225 -94 33 -131 456 84 -3 -206 165 -40 112 145 55 28 58 -19 387
5300 387 -167 158 -70 -204 215 136 -11 16 -5 75 -42 -124 -3 -169 220 40 -6 -29 259 176 -45 122 65
5323F5k87J04n8K37j42r7K81m46QM58q3J0Q9j83j71j86M72J05m24L18Q8k15o1
5346a18J42l15L09j1J11l99R8J1O6N3J33M5J72n50L69p5J1q0J2M9Q8jPj72j60
5371b05n5K49j89J26P0q2j7L47l11j3R9k74K90l1K21K3j61j40K72k42L74j58q4
5394A09p9K5k03L41k67k1J7P5m7j12L00o6l2j40K27q7Q7m9k55Q9R9J44j97r0j
5419a33J60q5k22K89o0J46k19j82M30J2L0j96j75J64L26m14L11k14j68L45k27
5440h2J34k45J42p3j99K74J37j83P4P1j03J91k89K93j16M5j5J32m45N09l33j65
5462b46O3j4j24M85o3j46L0J71k55J05P1k58M68j69J59n4l42N9K50l83J00j89
5484b82J25J66k39j3J48K84j57K58o72O72m7l47K6J32J61k77n9J77k03K68k45
$$ plain form
5323 65 -222 -118 -176 61 -81 -178 103 -343 -335 123 40 50 139 -44 -215 -401 71 176 -248 70 158 -57 -118
5346 -118 24 -291 18 7 118 -281 -183 -172 -106 -53 80 125 297 -253 116 41 52 -28 -16 33 121 120 127 -45 -205
5371 -205 -260 -11 -200 -74 -4 -86 -103 244 -67 -80 19 -255 35 4 225 248 87 -53 219 -23 351 193 109
5394 109 30 55 -148 193 -74 -95 -78 -3 -50 -162 138 72 40 -100 127 40 127 78 -177 -88 11 155 -42 -132 -133
5419 -133 27 -58 -280 9 -51 95 -124 -306 124 136 166 -30 -205 -41 285 -129 182 -32 -200 145 -82
5440 -82 52 -193 -51 -124 -323 -49 88 -95 -21 50 -53 138 -151 142 26 71 56 188 -257 252 -81 -246
5462 -246 -183 -197 -321 164 101 -45 -15 156 -99 6 77 -181 287 118 277 223 -119 -60 190 -193 -93 -282
5484 -282 -157 9 -230 -243 -95 189 32 290 -382 290 243 -104 -78 54 215 -62 -121 56 -147 121 -124
5505a24k83K21K92j19J37l7m52K76J22J30kk04N0J19K34m31Qj14J22J62n3j15
5527f1o0J80j6l14J58K40k24K15l7j01K07l70K01j3J23l5Q3j7l60L60k84R0L38
5550C03l77K2L5P8m4k72K81K33k88j68J94k12M0K44k74M47m12M2L79Ql56K03k48
5573a42J54J6l14L88k07j18L0O5K89j06j22l7J92k04L54n6N4k51K44k09k8qj28
5596a44o8mK55j7k32L42j81J5l2L03l27P0J63j27J52l94M51j13k1Q2l88L38n1
5619G2j08M0k08j14L47k89J72K3M2r6j12K80j22m6M0J50rJ6j8j64j17K09J65k20
5643f7L5J32J7j70l1K26k05K34%l08P9J69J93l07J8Q0k67M8J39L8q0q5K41l03
5667a74j66J62J40P7K5L22m31j12R0J96k71M53k00m05O4K48j67j27J32Q1O5j62
$$ plain form
5505 -124 -407 -186 106 -13 124 87 -365 -89 33 163 161 -43 7 126 360 -71 -63 -177 -55 107 54 -61
5527 -61 -121 59 43 -271 -113 127 -97 118 81 -20 187 -183 18 5 128 93 176 159 -201 159 -125 -35 303
5550 303 -74 -52 -17 61 17 -255 26 259 -29 -197 -3 -215 -175 69 -205 242 -170 -128 251 259 -97 106 -142
5573 -142 12 28 -286 102 -105 -223 -193 -128 161 55 -67 -104 88 -116 238 182 236 -15 229 20 -8 -16 -144
5596 -144 -212 -216 39 22 -210 132 -49 -34 -66 237 -90 -20 143 16 168 -226 225 112 91 173 -215 123 72
5619 72 -36 4 -204 -318 29 -260 -88 -65 -23 -119 -231 49 -73 -119 -79 71 62 78 60 -104 -221 -12 153 -67
5643 -67 -32 100 117 -53 -84 142 -63 171 171 -137 -58 111 304 -3 15 95 -172 -124 15 53 -27 -112 129 -174
5667 -174 -340 -178 -38 39 64 386 -45 -157 -67 129 -142 311 111 -294 -230 18 -149 -276 -144 -63 2 -160
5689a60K13k26J12j10L94l01O6J77j43J67m01L60j43L1k82L78k23K68j64K3J19
5710A55j40j40K89M2k94oQ6R5k7N5k30K0qJ59k29J33m3K46m09K45n2P9l5j08k
5735a19j4M7J85k07Q2k28L68j20k26J68J85m2m80N21k50J08r8J76n97P50j8m10
5757b19K69l7j67J19Q9j07J35M5J03l07L59q0j11j83Q9M1k92M19m2Q2m86R0K09
5780A8j9o9Q8l13L65k06J07QJ24q6l1j02K99l48K01J67k07J73j4m3l31k74M95
5803BP7k31K82k66K22P2K3r8J08k78M6l8R5j14J91K1k40o7J77Q1j25j36LjK51
5828E7k59J16K31j84p1J10K00l09R5j49K08k16O9j46N9K67j35J7J2l6n6j95M56
5851A41k04J04o7l2K51j77j06M8j50J01K83k76J28m13M64k69M03m05K61j04j93
$$ plain form
5689 -160 53 -173 -61 -171 223 -78 -12 165 22 189 -212 148 5 36 -246 132 -91 177 13 36 155
5710 155 15 -125 164 206 -88 -94 -8 87 60 115 -115 -95 -103 56 -173 -40 -83 163 -246 -1 -53 26 -9 -117 -119
5735 -119 -133 -86 99 -108 -26 -254 114 -6 -232 -64 121 79 -401 120 -130 -22 -120 56 -541 209 191 -219
5757 -219 50 13 -154 -35 54 -53 82 127 230 -77 282 202 91 -92 -3 38 -254 165 123 205 -281 -191 18
5780 18 -1 -70 18 -295 70 -136 -29 -21 103 17 -14 -116 183 -165 36 203 -4 169 155 112 -219 -493 2
5803 2 79 -152 130 -136 86 158 181 83 191 -87 -41 -79 16 -98 93 114 -126 -193 -16 65 -60 -196 -193 -194 57
5828 57 -202 -86 145 -39 -110 0 200 -109 -14 -163 45 -171 -102 -248 -189 78 -57 -40 -28 -64 -120 -315 141
5851 141 -63 41 -26 -58 193 16 -90 -42 -192 -91 192 -84 44 -369 95 -174 229 -176 85 -19 -212
5872b12l4L71k68J52j9Nj59O23o17K4n8J93k47M7J55J24k60q3N61l13R9p1j9J05
5896I9r4K38k53J17J8M2ql23J38R8j69J51m23L34L11n19L47k97K63J42k60M4L7
5919C3p7J18K72l14J81k10M3j57j72J96K2l9m7L20k29Q2J64l61K69m0j24J09j3
5942B6J06O2l27J90j87K26j87J05j25K0K95j59P9j94j40J12q5K12J0J3j99J67
5964B0L8L8o9k32L45l83K26M6l7R8J08j11J0j06N2j65J5L7K4L3Q4n2L0Q5p5J55
5990B14M2j66O7q8K51n36N72l61k35R0L69k56J36q5k73J55P8J61p5L5k68J81J42
6013A50o5N3j20j32J93M6j96J03O9j59j62K64j50m7J30j86RP2L81j59J31o6l75
6036b16M40k89L01l35K82j53M8R3m22K70J38k76k4r4N58k49JO2j4K4m62L38rM1
$$ plain form
5872 -212 -246 125 -143 9 -10 -5 -164 459 -158 -134 -192 1 -246 -199 -44 80 -180 -263 298 -15 84 13 -6 99
5896 99 5 243 -10 107 125 167 159 -164 -26 72 -97 54 -369 -35 276 -243 104 -193 70 212 -48 -4 33
5919 33 -44 74 346 32 213 3 46 -111 -283 -87 -65 -104 -151 169 -60 22 186 -175 94 54 -70 39 26
5942 26 132 194 -133 57 -130 96 -91 14 -111 -91 204 45 124 -70 -210 -98 -183 29 39 52 -147 20
5964 20 58 96 27 -205 140 -243 -17 29 -8 90 198 87 97 -9 43 -122 -107 -70 -46 -13 71 19 49 134 59 214
5990 214 256 90 157 69 320 -216 356 -5 -240 -150 219 -37 99 14 -259 -104 -26 135 60 95 -173 8 150
6013 150 85 138 18 -114 79 125 -71 32 101 -58 -220 44 -106 -153 -23 -209 -200 -128 253 94 225 159 -216
6036 -216 224 -65 236 -99 183 30 78 171 -251 19 157 -119 -143 -237 321 72 73 135 121 145 -317 21 12 53
6060E3k78K13P6K5p9P7Jl86L05k14J22J95k39j65M4K08P9p6N9J37M6j62k15K00
6084B6K18l18Qj6O7KJ40k60J68J05K26m58Q5k76K97k28M16k83J77q7j31J47k50
6107b25L59l70K96J5k07K12J30l30N4J14j29L1oj0j46N63l82jK2l6J85j08j68
6130a37k02oM07j42j07k79O07n0m01N46k90K25q0J76k99M9N1m4J71j46j79M79
6152C49l90k91K42J30j47k50J74L60k06J16j70j10J92k79L16MK43o2j97J44k24
6173e6k48L83k06J37P4k72K21LN4j50P7m1j14J48M0J6M8p9K59R6k18J44j61m16
6197b61J65n7J1O7Q5J03k66K54j50N8J61k34M3J7M9k12M24m3k42J40m7k36j7L81
6221A93k55j5K66j4m53J72L20k04P4j65J64Mj48k5P4L11l29LQ0j4j54M1n3K58
$$ plain form
6060 53 -225 -12 64 89 10 87 88 -298 7 -207 -85 110 -129 -294 -250 -42 37 -39 20 157 203 41 -174 26
6084 26 244 -74 -66 -82 -15 -13 127 -133 35 140 366 -92 -7 -283 14 -214 202 -81 96 9 -122 25 -225
6107 -225 134 -236 60 75 -132 80 210 -120 -66 48 -81 -50 -56 -66 -212 351 -31 -32 -10 -46 139 31 -137
6130 -137 -339 -345 62 -80 -187 -466 141 91 -310 236 -54 171 91 267 -32 17 68 24 195 49 -130 349
6152 349 -41 -332 -90 40 -107 -357 -183 177 -29 87 -83 -193 -1 -280 36 40 283 221 24 168 -56
6173 -56 -304 79 -127 10 84 -188 33 36 90 -60 17 -24 -138 10 50 66 114 35 294 390 172 316 155 -261
6197 -261 -96 -153 -142 -75 10 113 -153 101 -49 9 170 -64 -21 -4 45 -167 257 214 -28 112 65 -171 -188 193
6221 193 -62 -77 189 175 -278 -106 214 10 84 -81 83 87 -61 -86 -12 299 -30 -27 53 39 -115 -74 -127 131
6245A31q1j76j40L16j02Q2j30J11k9o7K64l1J07p3n2k28R3oJ27J3j05J40j62Q0
6269H2J76l43J9K32j92K09l80K71j20J19j4J30M4k08J25l0j39M7r6K05p7m9k50
6292b39J05M6J97K7j68j23J36k2K55l54J35K11k65J1J8K4L21n19K62R5k64q1K70
6315G8l58J36J96q7j98K57Q9k68J54L33l63J34J54q1M1k50j36K29j81%O0J7j5
6338e9N1J33j65k8l1J73n5K00m3k6k34J88Q3O5m50J13J94mm39K47K3j13K25k11
6362a63m0M30n06J56j51QN81k25j11M1K21l25K06j90O9l26M49p1k76K87k29J54
6384a1q1q5N1J34K48k34K23j08j86M93k55j06j13J57Mj20j20r6k4N59m67k0L79
6407B22n1l1j37j59J83j73J17p4N6J52l10N67m92J80K3K67k84k7n34M66J14k09
$$ plain form
6245 131 50 -126 -266 50 -52 30 -100 11 -18 -85 179 148 255 182 130 -98 -5 -11 116 129 24 164 2 82
6269 82 258 -85 -66 166 -26 183 -197 74 -46 73 59 189 233 25 150 120 -19 28 -68 137 60 11 -239
6292 -239 -134 -88 109 136 -32 -155 -19 -41 214 -140 -5 206 -59 -48 -30 -6 315 -204 58 153 -111 -192 78
6315 78 -280 -144 52 -35 -233 24 113 -155 -1 332 -31 103 257 176 217 -33 -169 60 -121 -121 -61 -44 -59
6338 -59 -8 125 -40 -68 -99 74 19 219 176 150 -84 104 187 252 -198 -85 109 105 -334 -87 -64 -177 48 -163
6362 -163 -203 227 -279 -123 -274 -266 315 90 -21 20 241 -84 122 -68 1 -325 124 53 -223 64 -165 -11
6384 -11 -92 -177 -126 8 256 22 245 137 -49 444 189 83 -30 127 131 11 -109 -205 -229 330 -137 -157 222
6407 222 171 140 3 -156 27 -146 -29 -103 -47 105 -205 362 -130 50 73 340 56 29 -505 -39 75 -134
6429a34K9L64m50K50J21p4N5l24J47J47k54L75l28j6N5k43K70k57K42l7J71j76
6451f7J40P0k90K28j03J13O9k6j01No8j13K87k02K54l67K44l79O0O95n18P4m3
6474c8j0O7l43K44N1j56p9L27J34k05J18q1o4R7j37K02j88J20j27J20p5K60m45
6497b08J57K31n97L57M6l1J99K00j55j26j20K01oj0l01K77l57M31l05kl8J2J30
6520a5k24PK24jJ76j04L6j96OK05J28l74J22J52k96J96j27K03n7j99K09k98M85
6543B58m26K49K1QJ10j82Q6j15J84k50m3k0J49J8J24k18l5r5L09j09l34J00J62
6566d9l52N50pj57r2L3L11n77K95K37j05j70p9L22k00j95mN9L66j17k21J84N0
6589H2l36N50k36J80j79K1J46K6j50j75L25k86K98r2j81k57L49j60K1l8K78q6
$$ plain form
6429 -134 -105 259 -191 59 180 106 161 -163 -16 131 -123 252 -76 -92 -37 -280 -10 -267 -25 -62 109 -67
6451 -67 73 143 -147 81 -22 91 160 134 33 38 -30 -143 144 -58 196 -171 73 -306 -246 449 -69 5 -38
6474 -38 -48 19 -324 -80 -29 -185 -264 63 197 -8 110 29 -35 62 -75 127 -61 59 -68 52 -23 237 -208
6497 -208 -51 180 -417 -60 -14 -45 154 354 199 73 -47 154 148 138 -163 114 -243 188 -117 -119 -157 -145 -15
6520 -15 -239 -232 -8 -9 167 63 99 -97 -91 114 242 -132 -10 142 -154 42 -85 118 61 -138 71 -227 258
6543 258 -168 81 102 110 220 38 124 9 193 -57 -100 -120 29 47 171 -47 -82 -177 132 23 -311 -211 -49
6566 -49 -401 149 142 -15 -107 -74 237 -340 -45 192 87 -83 -162 160 -40 -235 -239 -180 186 69 -152 32 82
6589 82 -254 296 60 240 61 82 228 254 104 -71 254 -32 266 174 -7 -264 85 -75 -54 -92 186 100
6611A00m7K4r4L15j06j44M4Pq8J6j11N9O9q4j62m2N2N09m49J97k68L90k74J02
6635A5N2j29q5L0N25n97K00j61L27j77L21m00j12M20m78J05L35l37K63q1j37J63
6657F2NJj07j54L65l51J09J2Q1j12pQ4j35J30q5j9K42J45k91j7r4J24J71j50q
6682AQk95M44j71m8J08J89k60L46k95j75k1J61l5L0q8m3Q9k0L15m44R8K71J99
6706C64m13J96k64lL76q3l75P4K80k05k43L79r5L0j74l7J49j60L47l66M86j91
6728G2k20J12K02O3k08J71l34K02j04n0J12j71K2K83j43j66K31j0P6%O0l41R4
6751d7L5m9K91l8j82J93l44K12k20Q8j81J0j85L05k24J67J54n7qJ7j42M32J4r0
6775A51j4k42J32j38N9j9p7J28l6j2K14m0l16QL41Q5n28K02L26k28j37L1Q2j27
$$ plain form
6611 100 53 77 -17 298 192 48 92 99 11 27 -84 -25 44 -40 -202 -244 -192 317 -132 65 -203 187 -87 15
6635 15 67 -62 -147 -117 408 -189 11 -150 177 0 321 -79 -191 229 -249 -144 191 -146 117 36 -101 62
6657 62 67 68 -39 -193 172 -179 -70 -58 23 -89 -96 -12 -147 -17 -102 -121 121 266 -25 -42 -136 -12 159 9 1
6682 1 9 -286 158 -13 -61 47 236 -24 322 27 -148 -169 -8 -43 -13 -101 -144 -55 -75 240 -204 -106 165 364
6706 364 -49 147 -117 -120 256 173 -202 -128 152 -53 -296 83 -12 18 -156 -193 -44 -204 143 -223 263 72
6728 72 -148 -36 166 229 21 192 -142 60 -44 -94 18 -153 -131 152 9 -157 74 64 140 140 200 -141 -47
6751 -47 -12 -61 230 192 10 203 -141 71 -149 -61 -242 -232 -417 -112 -336 -169 -15 -72 -80 -63 -205 227 241 151
6775 151 137 -105 27 -111 -52 -71 -148 -20 -56 -68 146 106 -210 -202 139 224 -304 -102 224 -4 -141 -110 -28 -155
6799a55J90J15j28J20O6j76PpJ69r0j92K43m06K24J58j1j26N2J58l21J16r3j01
6822a88J08M6j7O7j60j9J89j02K08j63J74j7l2J1J05k90LK62j61j06K65n65N08
6845A26r2j84J4L2L17l78R4J08K05m35K59m04N07j46j82L29k93L45l47j10J37
6866i8O6Q1J13k26k4K09m0k14k2J69J06k52L89k01M5j78M13l0j58m3K7l93O2K98
6890I9k54K77j27j14J53M5k23L19l19j72J69J10q5L3R1ol0K84k08o2q3L0J85l6
6914G6K5k8j77j03p4P6pK92J39j47p7J99k78Q0J91j60L5j82J25k89L08L0j39k87
6938c72K13Q0R6J15n4m15K28K92m91K54K34j34j26J17J04jK0Rk20j43R4l0J47
6961A7j6o8J07j54K8J19pLj39K8K25j5k44J37J75m23J9O2Q3J52Q6j04Lj37K30
$$ plain form
6799 -155 35 150 22 142 208 32 39 32 201 111 -81 162 -244 -20 138 127 1 53 211 -110 6 -87 -188
6822 -188 -80 -34 -51 16 -144 -163 26 -76 132 -31 143 126 94 105 210 -80 -77 185 24 -82 183 -382 126
6845 126 34 -150 -136 -104 213 -165 -71 37 242 -193 66 -338 169 23 -159 170 -123 222 -125 -235 -98
6866 -98 -32 49 162 -64 -88 121 81 -133 -155 14 120 -132 257 56 101 -77 336 306 148 105 132 -261 -199 99
6890 99 -155 122 -5 -119 34 79 -144 175 -144 -316 -147 -37 -122 -89 2 -4 -34 250 42 -20 -103 -73 112 76
6914 76 101 73 -104 -207 -281 -205 -212 80 219 72 -5 194 -84 -4 187 27 62 -120 5 -284 24 54 -85 -372
6938 -372 -159 -79 17 132 78 -337 -109 183 -308 -54 180 46 -80 37 141 140 160 169 -51 -194 -100 -130 17
6961 17 1 -67 40 -114 -86 33 26 29 -110 -82 143 128 -116 21 196 -227 -208 -146 -63 89 175 71 74 -63 167
6986A67l17K13L5J75k06O8m58N82j84j56N53l74l0M0q6j2r8n6L0j53J91K6K0J62
7010A32n34N99j9p2K3n0R7k7J10l45J28q1R8kp7K02l3j49j93K63Q5m97M25m0N2
7035I5k3K2j88J1J74j49J52K85k89J04l29N4K62r1R6l41j63N84J6l13Q1J35k56
7058g1N8k05L13P6j44J2K1j54Q3l8Q9J31j18m6j11O2K38m33K86k66P8K79q5K6
7082H1j12l8r0L73k84K35l84K14k13K73J71j19%l95N61k25l29J16J56J10l91M19
7104A29rk70L30r9j8k97M60j2k45Q0k03%J32J06j7l1R9O2j28J70j79j70L24j58
7128E6j17K84k47J47k29K51j59j74K55j36J16j63O5m1Q6J5l77N46l79J43q6L8
7150a06J88k11k00K80J93M4j06J03k40K79j36k11K12j33k06L60l95K84M6M6l66
$$ plain form
6986 167 -150 63 98 273 67 135 -323 259 75 -81 472 98 68 108 22 10 -88 -144 -114 -267 -76 -50 -30 132
7010 132 -402 197 178 106 129 79 176 149 259 -86 42 -39 59 57 -20 182 149 0 -193 70 155 -342 83 43 95
7035 95 72 94 -94 -83 91 -58 94 379 90 194 -135 -81 181 90 186 -155 -318 266 282 -31 50 185 -71
7058 -71 -13 -218 95 171 27 39 60 -94 -11 -49 40 171 53 7 -104 -42 196 -237 49 -217 -139 140 55 81
7082 81 -31 -69 -159 214 -70 165 -219 -5 -218 55 226 107 107 -288 273 48 -281 -165 -9 101 -290 129
7104 129 120 -150 180 81 63 -234 226 214 -31 49 -154 -154 -22 84 67 36 135 197 69 239 60 -110 214 56
7128 56 -61 223 -24 123 -106 145 -14 -188 67 -69 47 -116 -51 -92 -6 9 -368 178 -201 -58 -144 -106
7150 -106 82 -129 -329 -49 144 188 82 185 -55 224 88 -123 89 -44 -250 110 -285 -1 45 91 -275
7171b75M95l16J52R9%r5p1Q6O8Om79K40m8o0M75k43j47P4n2L5j54k26N14l5qj90
7197a55K41J04j48j90J19K7j97M12m34L02m3J4p2J29l7j06K11j95j12K12o5N9
7219G6K19k16j49K19j87J35k74O3K47k71j68M40l71K74k26O8J71j18j83N1J26
7240g4K24j19k57P3M10k97m5L36k93n2J53M8r4K48m00J70k39J11J49M9j02p5K20
7263A44k70K38K21j31k78K2j92K5K07J1J14j94J3o3J79P7l15J58j24L11k16jK3
7286d1J13j16J88L5k46J90k2J4j92k04M61n25L52Q2r6M0M2k80J98K37k51J7P6
7309G2J30l8N8j73J37j96L57k05j00j17L23n9l30l0J79M1n75N67j69O5M2J98k82
7332a05O0K45K1m46J07M9M9%j49K29J03k67L0k7J29k45L17j3k84K27j07J45k89
$$ plain form
7171 -275 220 -96 56 155 155 60 -11 75 143 149 -330 -90 -138 -198 277 34 -113 -39 -91 -56 -210 -436 78 43 35 -155
7197 -155 86 190 42 -148 -29 -2 -199 213 -221 81 38 52 -20 109 72 -34 177 -18 -130 82 17 76
7219 76 295 79 -70 149 -38 97 -177 -114 133 -138 -306 134 -237 37 -189 -121 50 -68 -251 -200 -74
7240 -74 150 31 -226 -153 257 -40 -85 251 -42 -94 59 107 13 261 -139 31 -208 -97 52 101 -1 -76 144
7263 144 -126 112 333 202 -76 -54 -246 -221 -14 -3 111 -83 -70 -133 46 123 -192 -34 -158 153 -63 -64 -41
7286 -41 72 -44 144 179 -67 123 101 115 -77 -281 180 -345 7 89 -7 33 75 -205 -7 230 -21 -4 72
7309 72 202 164 222 49 186 -10 347 142 42 -75 248 189 -141 -171 8 49 -526 41 -128 -63 -21 177 -105
7332 -105 -45 200 221 -225 -118 -69 -20 -20 -169 60 163 -104 -74 -101 28 -217 100 87 -197 30 -77 68 -221
7355b21K67P6j91Mj60J66J81m22PK82l9l3L64k98l50L38J25j23Q5K5J11l12L09
7378A91k64K77Mk49j3m3M27m43K52J06l48J52j27r3K03R8J6j01O5p3m7L7n3K48
7402B22l20J07K16k53q2M5l17O09l58J28k8j32J93j00J94j37k26J84pM28m94q0
7424b08M09k09N3m9J32l60K97l8m32N25k70P7J25k08J48J22m8j49K5N9L50k98
7446E3N7nK3j86RP4j48lj34K57N0r7PL05k16j87M92l37J41q5N3p3K70k02j57J75
7472A36J1l09R4k8n7J87j11n4K94l93M70k11P6m9j61J67J14P5M5k84J46j12K7
7495G3J33k84J14J28k82k06L39j13L10k77J27k94K32K64k45J69j27r9mJ5jO2j51
7518a17J11J40j09K15m28J95k21L06m23K18j04K23l61N61j64Q2j33k7k1J99K01
$$ plain form
7355 -221 46 122 -69 -65 -225 -59 122 -300 -293 -11 -50 -83 281 -17 -367 -29 96 -27 58 83 194 -118 191
7378 191 -73 204 208 -41 -54 -97 330 -113 139 245 -103 49 -78 -171 32 130 146 45 110 37 -10 27 -26 222
7402 222 -98 9 225 -28 -110 -65 -382 227 -131 -3 -31 -163 30 -70 124 -13 -239 -55 -62 366 -128 -208
7424 -208 201 -8 45 -4 128 -232 65 27 -405 120 -150 -73 52 -156 -8 114 66 -83 -58 1 351 53
7446 53 110 105 128 -58 -49 25 -123 -126 -260 -3 47 -50 -43 262 46 -141 351 14 155 70 123 50 320 118 -39 136
7472 136 147 -162 -68 -96 -153 34 -77 -131 163 -230 240 29 105 56 -105 62 176 251 296 12 158 46 73
7495 73 206 -78 36 164 -118 -324 15 -98 212 -65 62 -232 0 264 19 188 61 -38 -42 -27 -28 34 -117
7518 -117 -6 134 25 240 -188 7 -214 92 -331 -113 -217 6 -355 206 42 124 -9 -36 -57 142 343
7539C43n59L33p5l1k9K6k1k11K34k20L80k69J16j09J00o4r4P1L29k57p3K79m61
7562b62M24J46l04l8N5q7m8J31j22O1L1P5nj79j2M55l73J33l29M46p7l17J08j0
7586i8J26J16j06k40J06Q0J16j01q4J50o9r5m3K83K31l91j43Q3k4R6j34K48N6
7609A63j29Nj46j31J77K6K74k23K05k96j04NJ17L13k12J00j1k07qJ0N3o3L21l26
7633h7J35k07j36K85j94J65l1P3o8K40m0k67K49j31J97o4j47K21l78J70l26L18
7655b3R4j50J27j04j83K53Q0o1j16j71L01m4K04k63J42k06N7P9o0rlQ9j47O1m0
7680i3L86m64J90j27l0K22p0K30j68o2K43m63M22k39o6L8L72m79K56j38j38J68
7702a0r7J40o6l6J2j5J81k42K95r3R9J31l12q5L2L07j52k47L39l19N4L97l44k82
$$ plain form
7539 343 -216 117 42 11 -18 8 -13 -224 10 -210 170 -99 17 -92 8 -56 -150 -79 250 -7 -80 199 -262
7562 -262 162 308 4 -34 21 -66 -114 17 -105 -44 -13 62 57 -122 -134 321 -52 81 -248 198 121 -196 -88 -98
7586 -98 28 144 38 -202 -96 -16 100 -1 -85 65 -4 -99 -142 141 372 -19 -162 -79 -103 -7 -141 107 163
7609 163 34 39 -107 -238 -61 -35 239 16 221 -75 -179 -174 -57 256 44 144 133 -74 -82 -72 -19 -82 239 -87
7633 -87 48 -159 -295 -10 -204 -39 -70 3 -65 175 135 -132 117 -14 183 119 -28 193 -185 -15 -341 -23
7655 -23 71 -79 48 -56 -239 14 94 33 -83 -254 47 3 207 -56 86 -120 -63 16 -44 -53 -56 33 -114 -53 -93
7680 -93 293 -171 19 -108 -138 84 14 244 76 14 257 -206 216 -23 -89 -51 321 -158 98 -40 -178 -10
7702 -10 -107 33 -33 -69 -57 -72 109 -133 162 69 168 299 -13 -98 -66 241 89 -158 181 -138 -84 313 -31 -313
7726c13M57k46mK37j36j7P8Pm2K4J97k42j20k8l8J37J22J10k80o9K3K04j72L87
7750B76l64J9M8k30J88J83R8m25L82m6J27p1j54K58l4j93J18j85n8J3J2R5j48
7773i1k0k13M00R4m6j45j97K97l31N2J83K13j55j04j65K69J1j16J79k36J44n9
7795c6J90O8j45n1j30O6j17J9Q7k35L80k97M39j5m64J99m3M9jo0J7J65k10M4O5
7820a6k1R4J04q1Q5j08k41N2n2R8K17o0k29K39j9P7J77l07r7J74j28N8%k00J88
7845Dj20J18r9k9J11J72l10L8K48L84n81j30K24J83l09J71k8J77j24R7k46R1k1
7868B1j2j62M22M7k46O5l24J70j38K33p3M1J74k60K60k41K97k85j69M47j01q8
7890G8l7R4J37l73K36n51O61l17j32K76J00l95J69J2P1j45P8M1N7J5K43j43k61
$$ plain form
7726 -313 144 -102 -106 131 -5 -22 56 63 21 45 242 0 -120 -148 -186 -49 73 183 -97 -166 -143 61 -111 276
7750 276 -88 -69 -21 -251 -63 120 218 -207 175 129 256 185 31 289 255 62 180 -5 -63 -50 -38 57 -91
7773 -91 -111 -324 76 170 124 -21 -218 79 -252 -200 -17 196 41 -63 -228 41 52 -64 115 -121 23 -36
7795 -36 154 222 77 26 -104 -38 -155 -136 -49 -284 96 -201 238 223 -241 -42 -85 -36 -37 -97 -80 85 -125 -81 -16
7820 -16 -37 57 161 80 165 57 -184 -132 -184 -86 131 71 -158 81 62 139 316 9 -88 86 -42 16 16 -184 4
7845 4 -116 2 -97 -126 -15 157 -153 -115 133 517 -64 -194 30 213 -96 75 47 224 100 197 -49 42 21
7868 21 9 -153 269 316 70 135 -189 -19 -157 76 3 44 218 -42 218 -23 274 -11 -180 267 166 78
7890 78 41 135 272 -101 135 -416 245 -72 -204 72 172 -223 -54 -42 29 -116 -38 3 60 75 318 175 -86
7913h6Q4m2J67Jk77M3J60Q5J5o2j06J18j43lr0L7R4J43n5j38K42j41jK31k81l7
7939d2O6J49n04L48N3n4j07M9J11K29l81R8J37l8l98K59j81M16q2j35O8j09NN9
7963A6J32j79N9p3n0qJ43k7j02o8J25P6n4j02K5J47j32J57J59m2l28J39O0k06
7987a33N0jK05k81J62j07O3J1kj74J18jR7K8k26R2K16n8j41J86K1J13k76J5K37
8012B14m67K20J39l59L38j08O4j60P0O6R5j14oJ0k3k09Q7K72n4j45K3Ol2j78J91
8037f0Q5N2j3J60l21o4L01p8m2J7k9J00p0K48k83M7J77r5k54j56K52k4J53k00
8061i7M1j3M49k42k81J97j8M5o4j75L95k46q8M3j68q6J43J73j30j63J41K8k61
8084c77J66L11j78m3R3r1J3n9M98k38l1p3J58k55J81J39l9J77m23k48M80k08R3
$$ plain form
7913 -86 -2 -44 123 124 -153 -110 50 135 150 88 -18 100 -43 -46 -136 -99 -5 138 83 -55 187 46 45 276 -5 -42
7939 -42 24 173 -331 17 70 16 -91 -42 69 298 -83 15 152 114 -284 -25 -206 210 128 -7 61 -48 -43 16
7963 16 148 -31 28 -45 -95 -103 40 13 -89 -157 -32 44 -10 -112 -87 60 -72 85 244 202 -126 13 73 -133
7987 -133 -83 -84 121 -160 2 -105 -42 -31 -33 -207 -89 -90 7 35 -191 -99 117 59 -82 104 125 238 -38 -23 214
8012 214 -253 -33 106 -253 85 -23 41 -119 -49 17 112 -2 -8 2 -21 -230 -143 129 75 -70 -47 -41 -73 -251 -60
8037 -60 25 77 64 224 -97 -161 140 62 20 37 8 108 38 286 3 50 227 132 -122 -278 -26 -50 103 -97
8061 -97 -56 -69 380 138 -143 54 36 81 17 -158 237 -9 -97 -54 -222 -308 -165 8 -122 -285 -144 -116 -377
8084 -377 -211 100 -78 -121 -28 -119 -106 -165 333 95 64 -9 149 -106 75 214 175 352 -71 -319 161 -47 46
8107D6q4K35k56l6k1J35L2k69L47K8j7j37j32K9J0J39k86K20R7j23j28J27m9J10
8131A7r5J49j24L82l48N1P4J25m18O0K0N6m1M4q5Q8J32l73J23L60l28L17J0k92
8155i6J9o2QL11mm68L35k51K78j98K04J10j70j69K84m84L82n4l2J67l41L22o1
8178C0p9qK37j74l7j12K21K12j77j73R4J54m19
$$ plain form
8107 46 -38 197 -59 -95 -116 19 51 -218 129 157 140 3 -129 -100 -90 49 -237 -17 80 -43 -171 -44 -93 17
8131 17 -78 71 -53 329 -19 32 106 231 -187 -127 -107 -51 -92 -48 -133 -45 87 -286 -163 197 -131 186 196 -96
8155 -96 -77 -139 -131 180 176 -292 43 -208 70 -128 76 186 16 -153 131 -353 29 -25 -57 110 -231 91 30
8178 30 -49 -57 180 6 -31 -143 78 290 113 -60 34 188 -231
8191b31
$$ Imaginary data points
##PAGE= N=2
##DATA TABLE= (X++(I..I)), XYDATA
0@%%%%%%%%%%%qJ6j6J6j8K6l2M0m8N6p2Q8j04J20j36J60j87K13k45K82l22L65
33A94m15M71n31N97o69P48q35R29j033J149j274J410j558J720j898K092k305K538
51A330k797L083l399L753m152M602n115N711o407P235q242R491j1090J3227j6241
66i011K0838k8774M6198j54373J19863K45228l16734q3023K21937L1346j64171
77g0676N7022N5499n4082J4239M8623p8691j217P9418l1335o0865N9041l26o0509
90d3859M1051M5160p3702n269O9818l5077m8866P7576J9817q9719Q878Q8361k7073
103B7096o5104L2295M2626k5816k4832M472J1311J0807o608k2523Q93J6923Q02
116B342m261k118q921P008J9432q188j6526J0975J0608m021j492p969k501K5209
$$ plain form
0 0 0 0 0 0 0 0 0 0 0 0 0 -8 8 -8 8 -10 16 -16 24 -24 32 -40 48 -56 64 -72 88 -99 114 -131 151 -171 194
33 194 -221 250 -281 316 -353 395 -440 489 -544 605 -669 741 -817 903 -995 1097 -1208 1330
51 1330 -1467 1616 -1783 1970 -2182 2420 -2695 3016 -3391 3844 -4398 5093 -5997 7230 -9011
66 -9011 11827 -16947 29251 -125122 -5259 239969 -76765 -159788 62149 93495 -70676
77 -70676 -13654 41845 -12237 2002 50625 -28066 -29283 50135 18800 -42065 16976 16650 -43859
90 -43859 -2808 42352 -31350 -36619 33199 -1878 -50744 26832 46649 -43070 -34192 54169 27096
103 27096 -38008 -5713 36913 11097 -13735 -9263 2048 12855 6247 -16276 -15383 1540 2342
116 2342 -1919 -4037 -12958 -5950 13482 5294 -11232 -257 10351 6330 4838 -3131 -5632 19577
130A9577m712m3868J7336N1061l8551m8208N4084L0445o2796n784N7801j5883
142A0502l5677L0072M942k6773L0284J1950n2440J2413N6429l9155l9951N8378
154B0974P497o7198K4851N5433n0572k9250O0761m894n4156L3121L4719m3728
166a2442l213L8628k5493j9112M3897m241m2035K5682K0124m0179Q196M1173l6243
179e258k8275M9220K964n0581K5046L9557m1406k0179M4326j468k9980K3164J1596
192A8726l3941O862L1097j9989j9034K5221K423k5296N764J4674p593j249L475
205A140j3033K915K1211n888j7939J0184J1929j0262m122R489L383n656o683p82
219d114R790J842j4859J87J4189p571j3598J0832R120r344j88L488q475Q878J6796
$$ plain form
130 19577 14865 -29003 -11667 39394 843 -47365 6719 37164 -25632 -31416 26385 10502
142 10502 -25175 4897 9839 -16934 13350 25300 -27140 -14727 41702 2547 -37404 20974
154 20974 28471 -38727 -13876 41557 -9015 -38265 22496 17602 -36554 -3433 31286 -12442
166 -12442 -15655 22973 -2520 -21632 22265 18024 -24011 1671 21795 -18384 -10188 30985 -5258
179 -5258 -33533 15687 18651 -31930 -6884 32673 -8733 -28912 15414 13946 -16034 7130 18726
192 18726 -15215 -8353 22744 2755 -16279 8942 11365 -13931 -8167 6507 -1086 -2335 1140
205 1140 -11893 -8978 12233 6345 -11594 -1410 10519 257 -3865 5624 9007 3351 -3332 -4114
219 -4114 5676 7518 -7341 -7154 7035 -536 -14134 -3302 5818 -3526 -3714 -226 -8701 177 16973
234A6973j5442j6436K1086J1618j9518j981J1369q504n62J1281j5241j1293K4437
247G787L741k9651M107K5064j1235j0848J6303l924j2787J9507P875k4547L673
260d935K2665j5467j3721K4055N97k8623P915K1795j5658j2038J4759j267j0362
273a0285J1211J882j4787R494J7968j5039j4185J5937J1545o975n180m849r82
286d245J2988L524j8785l648J5898k233j2669M603O037n028J776L737r150R46
300f249J5095k11j3600J547R469j969l161L001K60m714l355J281O967R41j1374
315f072m801J2462M674j1511l223J1180K998p257l011K188O068O429o482j1859
329h217M561J3053k943j0447J169L346j389L71K83l084J419L953m630k700O981
$$ plain form
234 16973 1531 -14905 6181 17799 -1719 -3700 7669 -835 -1397 9884 -5357 -16650 7787
247 7787 11528 -18123 -14016 11048 -187 -11035 5268 1344 -11443 8064 15939 -8608 -4935
260 -4935 17730 2263 -11458 12597 13194 -15429 -7514 14281 -1377 -13415 1344 77 -10285
273 -10285 926 2808 -11979 -2485 15483 444 -13741 2196 13741 6766 1586 -3263 -4245
286 -4245 8743 12267 -6518 -10166 5732 3499 -9170 -4567 1470 -3558 -1782 1955 -7195 -6249
300 -6249 8846 8635 -4965 -3418 6051 4082 921 3922 4182 -532 -3887 -2606 4361 5302 -6072
315 -6072 -10873 1589 6263 -5248 -8471 2709 5707 -1550 -4561 -2373 3695 10124 3642 -8217
329 -8217 -3656 9397 6454 -3993 -2824 522 -867 -496 -213 -3297 -1878 2075 -2555 -5255 1726
344A726K312o702J807O668n944n817J0514O174j2091p549J0957N995r619l575
358e144N735M02n107K310M195l312k360L322J451k088J330J322j216P83P24k394
374d7p1M212j710n204M9K949P04p88k204l565K970O241k965n830M704N399n032
391a88k986O419K537m927j453J668l38N59J207k709l494J859J895j802K18J215
407c20k030j610L794J253j719J482L353l545l904O217M578n480l534L022p18l891
423c052M444K489q852j795Q217j934o702O877N011r198o87R655k351n124Q891
438E889J355j2087K820J0574o311m993Q121m873j0964J1115Q131j4742m247J4010
452C798l386q340R041L260j0386O685R237j3842l218J8573r53j7733M791J0101
$$ plain form
344 1726 4038 -2664 -857 5811 -133 -5950 4564 10738 -1353 -8902 2055 8050 -1569 -5144
358 -5144 591 993 -4114 -1804 2391 -921 -3281 41 1492 -596 734 2056 840 1623 2347 -47
374 -47 -118 4094 2384 -2820 -2771 178 882 94 -2110 -5675 -2705 3536 571 -5259 -555 4844 -188
391 -188 -3174 3245 5782 855 -598 1070 732 1291 2498 -211 -3705 -1846 49 -1753 -1535 -320
407 -320 -2350 -3960 -166 1087 -632 850 4203 658 -3246 2971 7549 2069 -1465 1557 839 -3052
423 -3052 1392 3881 -4971 -6766 1451 -483 -7185 -308 4703 -4495 -5182 4473 2122 -3002 5889
438 5889 7244 -4843 -2023 8551 2240 -2753 5368 495 -10469 646 8777 -5965 -10212 3798
452 3798 412 -7928 1113 4373 -6013 672 9909 -3933 -7151 11422 10469 -7264 -2473 7628
466G628q293j110P941r418o715J4061P02j5372O297J1310j0500n211J4399j022
480D697j1574P770Q284j0415k214Q931j971m671M372k213p229O225P161r158p339
495i344P334N603m007k483R1J039K867K305k928l045L225M934k468o335K072P095
511E955k514o552Q01K336j863K330K254p867k089J0750L75r617M741O629r179
526c510r76J2754m386j0202R108N149j3390J772J2226r570o394J3351l756j5654
540a3478J3016J3990j8619o756J7339j845j0583J1632L017j6750O669J5240j4094
553a222q051J8638k272j8254J0142J0570j5868j14J6366j0197j3919J5939P309
566I067j5466L298J1080j1717l630J6688k751j4394Q698P303j1640K22J0955p646
$$ plain form
466 7628 -665 -1775 6166 -3252 -9967 4094 4796 -10576 -4279 7031 -3469 -8680 5719 4697
480 4697 -6877 893 9177 -1238 -3452 5479 3508 -1163 3209 996 -6233 -8 7153 -2005 -9344
495 -9344 -2010 3593 -414 -2897 -2806 -1767 1100 3405 477 -2568 657 5591 3123 -3212 -1140 5955
511 5955 3441 -3111 -2310 26 -1837 493 2747 -5120 -7209 3541 3916 -5701 -960 5669 -3510
526 -3510 -4486 8268 3882 -6320 2788 7937 -5453 -3681 8545 -1025 -7419 5932 2176 -13478
540 -13478 -462 13528 -5091 -11847 5492 3647 -6936 4696 7713 -9037 -2368 12872 -1222
553 -1222 -9273 9365 7093 -11161 -1019 9551 -6317 -6431 9935 -262 -14181 1758 9067
566 9067 -6399 -3101 7979 -3738 -7368 9320 6569 -7825 873 8176 -3464 -3242 7713 67
580F7p488J0906P1j1639M735R594p309n244O414P32k362M519L12o862K092P318
596E856j718n972Q70L595K32l698j558K097J401k024j476k23j14L694J674o303
612c667j458R424O44r159L766O903o583k646Q648k635q289O811L205j0918K556
627c398J0200q820o877J1989q06j1958R870R678j5043l734J7637l338j2394J0792
641C798M707j4868M644J3160j3195p865J7503j686j8327P474J3480j0933m943
654g051J0531n968n302J3908Q97j5329O397J1990j1488l620J3886m258j2685R925
668A833O193j4494P55J4168p014j1723Q796M717p466K749O463q309k915J0312
682D065J286p280J808L125k571q7K349k766j066L781j397n437J881M165r46l635
$$ plain form
580 67 -7421 3485 3556 -8083 -3348 6246 -1063 -6307 107 839 -1523 2996 3308 -3554 -1462 5856
596 5856 4138 -1834 -964 2631 2863 -835 -2393 -296 1105 -919 -2395 -2618 -2732 962 2636 -3667
612 -3667 -5125 4299 4943 -4216 -450 6453 -130 -2776 5872 3237 -5052 1759 4964 -5954 -3398
627 -3398 6802 -2018 -8895 3094 2288 -9670 200 9878 -5165 -8899 8738 5400 -6994 3798
641 3798 8505 -6363 -1719 11441 -1754 -9619 7884 6198 -12129 -4655 8825 -2108 -7051
654 -7051 3480 -2488 -7790 6118 7015 -8314 -1917 10073 -1415 -5035 8851 4593 -8092 1833
668 1833 8026 -6468 -5713 8455 1441 -10282 -1486 3231 -4235 -1486 4977 -3332 -6247 4065
682 4065 5351 -1929 -121 3004 433 346 2695 -71 -1137 2644 1247 -4190 -2309 1856 910 -2725
698b725PK171l1m43J867J526l671j424N775J167m987N04K987l282k77M568l389
715C43o046O716L976r827j504J0025j385o364L733R21l838N780L411j0371k52
730d682J2412m006r633P619M405j0497J348R607o987o617R125R83r037M502N936
745D478q205O27R178o404o831J1084L418j0936Q14P241m315j527O713m847p867
760g379Q228N371j0136j133Q012k947m744N107J293m552L872L170o227j084O916
775C767rm011Q36n0k085K715J650m061p16K037j680o79K852M4l442J580K220j654
793f86J29J721J049o67j979r15K630K847k964l149J625L67j024J464l54l138P67
810b277L041k235j013M409o02l565K109K558k572Q47K835k591k839L166J139k832
$$ plain form
698 -2725 -2718 -547 -578 -1021 846 2372 -1299 -2723 3052 4219 -768 -264 2723 -559 -836 3732 343
715 343 -5703 1013 4989 -4838 -6342 3683 2298 -4066 -333 588 -3250 2530 5941 -4430 -4682
730 -4682 7730 3724 -5909 1710 6115 -4382 -3034 6573 -414 -7031 2094 3077 -5960 -1458 4478
745 4478 -3727 -3100 6078 -326 -7157 3927 7345 -3591 -2777 4464 149 -1378 5335 488 -7379
760 -7379 849 6220 -3916 -5049 2963 16 -4728 379 1672 -2880 992 4162 -2065 -3149 3767
775 3767 3758 -253 583 533 -1552 1163 2813 -1248 -1964 73 -1607 -2286 566 610 -2832 -1252 968 -686
793 -686 -557 1164 2213 1546 -433 -1348 1282 4129 1165 -1984 -359 8 -1016 448 94 -3044 -2277
810 -2277 764 -1471 -2484 1925 1323 -2242 -133 2425 -147 700 3535 944 -1895 1271 2410 -422
826d22N25L31l257J172L159k901k171L995L1l824K199M462l094j691K971N3j977
843d39J986R29k804L53J405k139r5J930k089k301K943M65k088R27J711j800j41
860a247K729r44m53J912j003k381K251K070k279j278Q01p85o9J606j497j868J811
877f24K87j987J666K554k609o17K780o40k125L168J592l900r33K736p70o87K105
894A996k442l391L189K997l873j153L495j088k028J916J816j581O08J893k839
909d85j154L639Q63k849l17Q15k113O82L436j811l710R83K806j097j075J343j04
926a48r37J725O87k471J409K903j893l195J641K453j142j340O15j887p39L039
942G20M48l576J05K934r23j474K342L63k067K023J680l143q75M480k35m887J319
$$ plain form
826 -422 103 434 -2823 -1651 1508 -1393 -3564 431 462 -3362 -1163 3299 205 -1486 1485 1538 -439
843 -439 1547 2476 -328 25 1430 -709 -804 1126 -963 -3264 -321 144 -1944 -1017 694 -1106 -1247
860 -1247 1482 538 85 1997 994 -1387 864 2934 655 -623 178 -607 -676 930 -567 -2435 -624
877 -624 -337 -2324 -658 1896 -713 -1330 1450 810 -1315 1853 3445 -455 -1388 1348 578 -109 1996
894 1996 -446 -3837 -648 2349 -1524 -2677 818 -270 -2298 -382 1434 -147 461 2354 -485
909 -485 -1639 2000 2863 14 -303 512 -1601 -919 2517 706 -3004 -2021 785 -312 -1387 -44 -148
926 -148 -1085 640 1327 -1144 265 3168 1275 -1920 -279 2174 1032 -308 307 -1580 -2319 720
942 720 1168 -2408 -2303 631 -292 -1766 576 939 -1128 895 2575 -568 -1443 3037 2802 -2085 -766
959g66K734k327o45K551k384k942L951K482m191j586L645j70j232J947J64k707
975a476J952L054l238j890M029J18m145O97K424k196o29K758j651l585K538L554
991B314k547j891K383K99j899K409J752l188n10L275j070k459K522J051l848j98
1007a605K726k111j665L927j10n106J950M376k431k182M448p58m516K703N327
1022D973m518k459M526q01m390L084L056n491l47M149k720l942N809J902n793
1037b962M90N203l129j817N525p91n594L293M175m909j157N117k181n252M098
1052A09K692n306o8M762k844l452M439J533l831J549K607l355qM653j935m047
1068b502K985K761m409o97M509j802l769J686K389k160m84K206j340j302K133
$$ plain form
959 -766 1968 -359 -1004 1547 -837 -3779 172 2654 -1537 -3123 522 352 -880 1067 1231 -1476
975 -1476 476 3530 292 -1598 2431 2549 -1596 -899 1525 -671 -1300 1458 -193 -3778 -1240 2314
991 2314 -233 -2124 259 558 -1341 1068 2820 -368 -878 2397 1327 -1132 1390 2441 -1407 -1605
1007 -1605 1121 -990 -2655 1272 1162 -3944 -1994 2382 -49 -2231 2217 1459 -3057 -354 4973
1022 4973 455 -2004 2522 1721 -2669 415 3471 -2020 -2367 1782 -938 -4880 929 2831 -2962
1037 -2962 -2472 2731 -398 -2215 3310 2519 -3075 218 4393 -516 -1673 3444 1263 -3989 109
1052 109 2801 -2505 -2573 2189 -655 -4107 332 1865 -1966 -417 2190 -1165 -1173 3480 1545 -2502
1068 -2502 483 3244 -1165 -1862 2647 845 -2924 -1238 1151 -1009 -1493 713 -627 -1929 204
1083B04J440k558J48K778j158j898J916J734l010o29K577r27k630K234J654l585
1099a710o48K970n77k055K676O35l868J215N158k591l752L737J371m075J402L529
1115C417l625j971M553j567m965L861L956n665j875N188p22l217M302N78n762
1130c514K217N294l548k613M983k95o080L931L749n782j176N443j825m812L739
1145b89K349l871P70K902m086l72O080j047n788K825L809l525r02L825j670l215
1161b205K668J521l678M83K750j672k131J619M73j126J717P10j929j203K987J202
1177B186j396j546R86O68J58k75o74n81J33Q75j245j463J373K100j965j345J595
1194d16J098j317J098J021k833K90L916o61m006K018K082l564K30L199k308l124
$$ plain form
1083 204 1644 -914 -766 2012 854 -1044 872 2606 -404 -1033 1544 617 -2013 221 1875 -1710
1099 -1710 -2358 612 35 -2020 656 1291 -2577 -1362 3796 1205 -2547 1190 2561 -1514 -112 3417
1115 3417 -208 -2179 2374 807 -4158 -297 3659 -2006 -3881 1307 585 -2632 1670 2248 -3514
1130 -3514 -1297 3997 449 -2164 2819 2524 -3556 375 4124 -1658 -2834 2609 784 -4028 -289
1145 -289 2060 -1811 -1041 1861 -2225 -2597 3483 2436 -3352 -527 3282 -243 -1145 2680 1010 -2205
1161 -2205 463 1984 -1694 -1211 1539 -133 -2264 -645 -172 -1298 419 1129 -800 -2003 984 2186
1177 2186 790 -756 230 898 1056 781 107 -474 -341 534 -711 -2174 -801 1299 -666 -2011 -416
1194 -416 682 -635 463 1484 -1349 -1059 2857 2196 -1810 208 2290 -1274 -1044 2155 -153 -3277
1210c277M054R22m751J247M249k955j885L685o40k281L155J572n439J013N185
1225C854k936l072L964l3m791K427L714m485j828M260o89l254K991J569l467R89
1241g87K943k224j312L774j02l958J544K489k865l47K568j875k415K548P06k086
1257a399O22J456k034m66K979m48j445J481M73j502O3J504j66q68l99l89O76N73
1275G11j225L8K46o98o97J681K46j029L65N83m66K69J289r19l46J159r08j294
1293i95K152P62k961M1J980j425j107K382n80j694J251Q38k023Q84K621k179k056
1310b109L512M55k932J313K144k710j077K953l72k606J136J165k401Q47J586j861
1326i57l92K547j057k195K249J802k759J79K040j352m57K002q82k064J476J167
$$ plain form
1210 -3277 777 1699 -3052 -1805 2444 -511 -2396 1289 649 -1632 1523 3095 -2344 -1331 3854
1225 3854 918 -2154 1810 1777 -3014 -587 3127 -1358 -3186 1074 385 -2869 122 1691 -1776 -787
1241 -787 2156 -68 -1380 2394 2292 -1666 -122 2367 -498 -845 1723 -152 -2567 -19 687 -1399
1257 -1399 -777 679 -1355 -1821 1158 710 -735 746 1219 -283 -220 1284 1118 250 -149 -538 138 711
1275 711 -514 -476 -230 -928 -1625 56 302 -727 -362 221 -245 24 1313 394 48 1207 299 -995
1293 -995 1157 1919 -1042 -1001 979 -446 -1553 829 249 -1445 -194 644 -1379 -495 2126 -53 -2109
1310 -2109 1403 1858 -1074 239 2383 -327 -1404 1549 1177 -1429 -293 872 -1529 -682 904 -957
1326 -957 -1349 1198 141 -2054 195 1997 -762 -583 1457 105 -352 1650 768 -1296 180 1347
1342A347j921oJ236j493n14J763m13j502J632L11j000J41J397o96j93J160r24
1359C25j066J666M11j629o6L88j170O98J618j683j306J440R42j265L98Q79r42
1376c62M31R81j412p0K341l45k645O12J741j418j83J081j275j048J124J243j349
1393e53j9N84q44N93J503j212p32J625J49j831M97J788r22q80O39j058l83J365
1411C09K81j114l21J53K72j06Q35k96n14Q00K34m41K48M35j73m93J79m68K81O27
1431G28q27p04L72J42j16Q17p63p55P32R28p02l2R33l03r02J386j4j518P28J146
1451A276j459o54J541m29j278Q51Q7j622J066J822j681j347K286K55j461J459
1467G12R95k161r0K012k61k078J180J141k345Q6J783j178j008J663l70j885J272
$$ plain form
1342 1347 -574 -580 656 -837 -1351 412 -1 -1503 129 440 -560 -419 978 282 89 1249 325
1359 325 -741 925 1336 -293 -359 29 -1141 -443 1175 -508 -1814 -374 568 -697 -299 580 -362
1376 -362 69 1050 -362 -432 1909 1564 -1081 -469 1272 -146 -329 752 -523 -1571 -447 796 -553
1393 -553 -572 12 -832 -239 1264 52 -680 945 1094 -737 -240 1548 626 -254 385 -673 -1056 309
1411 309 590 -524 -845 -692 -420 -526 309 13 -501 299 533 92 340 775 602 109 288 -180 101 728
1431 728 -99 -803 -431 -289 -405 412 -351 -1106 -374 554 -148 -180 753 450 -452 934 920 -598 130 1276
1451 1276 -183 -837 704 275 -1003 -152 -65 -1687 -621 1201 -480 -1827 459 714 -747 712
1467 712 1707 -454 -544 1468 1207 -871 309 1450 -895 -809 974 -204 -1212 451 81 -1804 -532
1484e32J971j477j202J950k70j042J545O95j880l60J928q26j686J830L68j838
1500h26q75J941l14q08J184J25j684L45K069r55r04J539j5j577P17J770j332r62
1518e62J221k8j819R06J459j511j033J394j40r20J309Q42k184J45J916m45j540
1535i90J515J249j946l90J471n33j051J601l36k306J400J780j926r37J769K72
1551F42k169J361J436j950j61K063l96j619J226J113j901j46J178m29j216J339
1567C71M87k245N75J662q65j423J489K69j625J343J612j904p75J854P38k241O35
1584d3J680j905q82K029k89k026J290R22j797n25K148m15j776K028L99k014N44
1601f32K352j085j499J471O49k159J188J622k555j130K870m31k894K076J545k343
$$ plain form
1484 -532 1439 -38 -1240 710 440 -602 943 1638 -242 -602 1326 500 -1186 644 1012 -826
1500 -826 -1701 240 -74 -882 302 427 -1257 -912 1157 202 -702 837 822 -755 -38 1732 400 -562
1518 -562 659 631 -1188 -282 1177 -334 -1367 27 -113 -1033 276 1118 -1066 -921 995 550 -990
1535 -990 525 1774 -172 -562 909 376 -675 926 590 -1716 -316 1464 -462 -1399 370 642
1551 642 -1527 -166 1270 -680 -841 1222 826 -793 433 1546 -355 -501 677 248 -968 371
1567 371 858 -1387 -812 850 -15 -1438 51 320 -1305 38 1650 -254 -1029 825 1563 -678 -43
1584 -43 1637 -268 -1150 879 590 -1436 -146 776 -1021 -1546 602 187 -1589 439 838 -1176 -632
1601 -632 1720 635 -864 607 1256 -903 285 1907 -648 -1778 1092 661 -2233 -157 1388 -955
1617i55q04K497o59j270J979Q46l057Q02K709j396j413J683j06k181J320J636
1633A631k249r35K348l58k342J509J563k142M5J872j052j164K332M31k269L40
1649d40J398m60j033J274j11j762M60J688j343p64J283J55j711O00J362o89l21
1666d14Q83q4j079P99J383j447p17J265J39j499Q18J060j609j170K208O9j846
1683a241O28J463j339q00J887j16j370J189P28j527k1K309j293j726J577Q31k373
1700a194O63K433k408j459K323L80k019R80J420j752l98K392j070j417J998N76
1716A448k489LK981j634j562J829k45j642J006J606j993m16J787p08j343J903
1732E31N04k008L38J844j183o54J726k77j649O33J326j102n30Q80m37r86R07N59
$$ plain form
1617 -955 -1759 738 79 -1191 788 1634 -1423 -621 2088 692 -721 962 856 -1325 -5 1631
1633 1631 -618 -1553 795 437 -1905 -396 1167 -975 -930 942 -110 -1274 1058 1489 -780 -440
1649 -440 958 498 -535 739 628 -1134 -674 1014 -329 -1093 190 345 -1366 -766 596 -93 -414
1666 -414 469 385 -694 105 1488 41 -676 589 728 -771 47 1107 -502 -1672 536 605 -1241
1683 -1241 -613 850 -489 -1289 598 482 -888 301 1029 -498 -519 1790 497 -1229 348 1179 -1194
1700 -1194 -531 1902 -506 -1965 358 738 -1281 -301 1119 -633 -1031 1361 291 -1126 872 1448
1716 1448 -1041 -1038 1943 309 -1253 576 331 -1311 -305 1301 -692 -1108 679 -29 -1372 531
1732 531 1035 -973 -635 1209 26 -628 1098 821 -828 -195 1131 29 -501 379 -58 -1044 -137 422
1750D22r05k86J029o07n07R09O66j05q57M75J8j20M52q8m99j35K01R8m35O6K84
1771G6l75n42L95O59m99J60M79p56j73J245K27j111M06O57q42j15J113m75j811
1790a282J246O18r32n30J246o09o87Q05L54j150J027J315j767n47J834N9j358
1807c58Q34L45j360K33J237j046j101J539j87j001N87J005j286k9J287m36q13
1824e50J170L25j474O62R70j142j76J270o87j403R06O95p10l28M77n93j54J280
1842E38n69r05J011J75p01N17O39k60l66K64j85l66N61J11j007P0L48n65M99K25
1862C4l47k75N72K52m57L74L32p23L99M26o67Q6R27m66p67J97J78l38L41L18j438
1883a042o3J257j7m25L19J50p09J50J368j044P0P98p12m95Q34l9n46M76L1o80
$$ plain form
1750 422 -483 -769 260 -347 -854 55 721 616 -241 234 252 132 584 496 -3 -138 63 161 -274 -208 76
1771 76 -299 -841 -446 213 -286 -126 353 -403 -576 669 896 -215 191 848 6 -109 1004 529 -1282
1790 -1282 -36 582 -350 -880 366 -243 -930 -125 229 -921 106 1421 -346 -893 941 1000 -358
1807 -358 476 821 -539 -306 931 -115 -1216 323 136 -865 -278 727 -559 -588 699 263 -550
1824 -550 620 945 -529 133 1103 -39 -215 1055 368 -1035 -129 566 -144 -472 5 -588 -742 538
1842 538 -31 -936 75 250 -451 66 705 445 79 343 158 -208 353 464 -543 -473 -125 -690 -191 34
1862 34 -313 -588 -16 236 -221 153 485 -238 161 587 -80 6 933 467 -300 -103 75 -263 78 396 -1042
1883 -1042 -1105 152 135 -290 29 179 -530 -380 988 -56 14 812 100 -395 439 400 -146 330 361 -319
1903c19k2L36m5l88L73Mk37M47L41o42j63P23k4m19L90J05m77L1J33k26L94j97
1925A18j60l56M73l94k27M77j46k65R6Q88l18m16O24k17k42M35K10q50L82L80
1945D92q95j6P56l39p33N83j05m82M76R78r59q43J281L44q67M70N74j055k75J197
1965E82j11p50L75M3o18N0O88l09r33J023m51j84N73O05p09j66J134p65j21M85
1985D41N06j119l2L15k66M5J19l95lk14O04m9J66L0k12j86N0M51J9l29L21J05
2007C67j62j61J70J69j43k67j37l36K58P47m84p10M77N40n16n2N97J68p86P60
2027D99J47o78j5O25k64q39P77J68p75J56P34q74j90P77K44j203M82O62q40M17
2047A0Q31p67o03J070N25r91k40P99m08n42Q31m74o95M48O58j021k76J171j07
$$ plain form
1903 -319 -341 -5 -50 -438 -65 -61 -298 149 490 -152 -315 408 384 -35 355 460 -17 14 147 -79 315 118
1925 118 -42 -398 75 -319 -546 -69 -215 -480 -384 504 186 -230 394 177 -65 370 580 -270 112 492
1945 492 -403 -419 337 -2 -735 -152 -257 -739 -263 715 -244 -1087 194 538 -329 141 715 -340 -615 582
1965 582 471 -279 96 139 -479 -429 259 -50 -983 40 -411 -595 -22 583 -126 -292 842 77 -44 441
1985 441 947 -172 -204 111 -155 -110 9 -386 -389 -603 1 -48 118 148 -64 -250 -200 251 270 -59 262 367
2007 367 205 44 214 383 240 -27 -164 -500 -242 505 21 -689 -212 328 -188 -240 357 525 -261 499
2027 499 646 -32 -47 578 314 -525 252 420 -355 -199 535 -339 -529 248 492 -711 -229 433 -407 10
2047 10 841 74 -529 541 1066 75 -165 634 226 -316 515 41 -654 -206 452 -569 -845 326 219
2066B19j059J176j47k66M6N60k85n72P38L21p34j56Q41p84n36J113n7j102P22
2085C8J48m70m54Q31K74o92J59N84n89K33N17K10j139L03M29p16K47M71k29p67
2105f12Q41J79p79J65N46o33m74Q19M07o44Q5O96q22j36Q18P2p47L85J76o91J08
2126b41N34n5q99O49Q8p73M78O35o97l3P41J90r13L63P42n37p09R94J3q57J93
2147i4M00k77n08R76l42r01L01N23k68j05M16J06n22M60M93o84j23N56R2q98O51
2168B52K05p46K8O67o43m60R19L56j305M02P30p58j71P93K74p11K36O03p00j24
2188a53R31m76n60K46M00q51L0P39m89p43J010L46r28L77P84q40n81J477o8q06
2208a55L21O08j037OP15k55q20L04N30p72L84O28o16o46N63P09q63M16O25o28
$$ plain form
2066 219 -840 336 189 -77 -31 529 244 -328 410 731 -3 -159 682 -102 -638 475 418 -684 38
2085 38 186 -284 -738 93 367 -325 -166 418 -171 62 579 789 -350 -47 382 -334 -87 384 155 -612
2105 -612 229 408 -371 -206 340 -293 -767 52 459 -185 -100 596 -226 -362 456 528 -219 166 342 -349 -241
2126 -241 293 238 -661 -12 76 -697 -219 416 -281 -314 427 617 -296 67 809 272 -437 557 570 -287 -94
2147 -94 306 29 -479 497 155 -746 -445 78 -190 -295 121 227 -295 165 658 -26 -149 407 499 -399 252
2168 252 457 -289 -261 406 -237 -697 222 578 -727 -325 405 -353 -524 269 543 -168 68 671 -29 -153
2188 -153 778 302 -258 -12 388 -463 -433 306 -183 -926 84 430 -498 -121 663 -177 -758 719 651 -155
2208 -155 166 774 -263 -257 458 203 -617 -313 217 -555 -171 457 -159 -805 -242 467 -396 20 645 17
2228A7j77J94J65k43J62J22o84Q4N32N7o69K85N19q42nP16k22N2k76J87kl68Q77
2251D81l6n30JK64M0k06M42k10r07L42Q68p98k31N90j9q39Q49K17m46J91M63o09
2273h3m34Q62K26p11oK99m51q6Q18m76p86N78K42k41j02O12k85o74R54K66q12
2294b90N25L6k46n48J008j0o70O31J5r19O9Q27n04k85J48N69q76M60M75n83j12
2315b80O14N4n45L40K29l68MM87k26o41L74o6m39K22L01j85k41K11P2JJ36J28
2337A82k31N7J10k7K40q9j54J92p9j84J08m3K0j27O3k91k93O12j73n9r3R4j82
2360c47L94L49l49j69L50j69j52J56J52k71k24K95l79J69K88k66k05J23M77m65
2380b43K43N01m37k04O63kl52jL95m95o3J48O5k35J09J37m75k08Q38o24k81L00
$$ plain form
2228 17 -160 34 199 -44 118 240 -444 -360 172 229 -440 -155 364 -478 -483 233 11 63 -213 -26 -28 -396 481
2251 481 445 -85 -84 180 220 14 456 246 -661 -319 549 -249 -480 110 91 -748 101 318 -128 63 526 -83
2273 -83 -517 345 571 -140 -146 153 -298 -384 434 -42 -828 -250 -8 -249 -351 261 -24 -698 256 522 -290
2294 -290 235 271 25 -523 485 475 -195 436 451 -468 -399 428 -76 -361 -213 356 -520 -60 415 -168 -280
2315 -280 334 388 -157 183 412 44 48 535 309 -332 42 -24 -463 -241 60 -125 -366 -155 -83 -82 54 182
2337 182 -49 8 118 91 331 242 88 280 201 17 125 82 102 -25 38 -253 -546 66 -107 -166 -259 -165 -347
2360 -347 47 396 47 -122 228 59 -93 63 215 -56 -280 15 -364 -195 93 -173 -378 -255 222 -243
2380 -243 0 501 64 -140 523 521 169 168 563 68 5 153 218 -17 92 229 -246 -454 384 -240 -521 -221
2402b21M9qK77L58m26J6L86l38l05O52k76l44L18J12k72j07J42l87P7R8J45O5
2424A1L7m3l04M89M93m46m99N58m7k98J61M04o01k62L32m68j78O64j20k15L96
2445F4J01j60J08L23o90p3O58k80RN36m64n41M79M06m00q0J64r6m28N33k29k03
2467b63J05m2k1j4N62R2m92n0M10o9j14J09N6k08m1k00J42J80k34K09k25J04m1
2490d5J50j79K4j92J75R3l9K60k66l86P76m03J8j60N60o28J23J52j60r6K74R9
2512A50m72P8O69n88l84R47m40l76M27M46p57L44K00m25K53L17m53l86J38L42
2532C0k33k59Q25m86m05M36J13k19n0O44n30j42Q12j68l43N4J84n58kN12k77k83
2554c45O6K23m61L27L00j67k54M17M7k26QO60n43o1J75J05l15j74O02m71m55O60
$$ plain form
2402 -221 -172 -180 97 455 29 45 431 93 -212 440 164 -180 138 250 -22 -129 13 -374 -297 -199 -54 11
2424 11 48 5 -299 190 683 237 -262 296 249 -49 112 516 -85 -347 -15 -483 -661 3 -117 -332 64
2445 64 165 5 113 436 -254 -327 331 51 60 596 132 -409 70 476 76 -4 160 64 -364 169 -60 -263
2467 -263 -158 -200 -221 -235 327 419 -73 -123 287 218 104 213 269 61 20 -180 -38 142 -92 117 -108 -4 -45
2490 -45 105 -74 -50 -242 -67 26 -13 247 -19 -405 371 -32 -14 -174 386 -242 -119 33 -127 -223 51 150
2512 150 -322 -244 425 -163 -547 400 -40 -416 11 457 -300 44 244 -181 72 389 -64 -450 -312 30
2532 30 -203 -462 363 -123 -528 -92 21 -198 -248 396 -134 -276 536 368 25 79 263 -295 -297 215 -62 -345
2554 -345 -279 -56 -517 -190 110 -57 -311 106 153 -73 -65 595 52 -9 166 271 -44 -218 384 -87 -542 118
2576A18N4l49R2J30n95L17K96j79p6N5N69l95k04O62j41n04J68K37l47k41N57
2597B24j38o86M10J86m53J78M74l03J52n1M16l90j11L29k27j19N24J71q10J8M47
2618B41l31l66Q79m24q44O93M10m63j99Q00m99k9R2N22m87K9L33m07p9M07J14
2639C92o63M8M40m63l25P72j6o86L23O76o14J46K40j4m48L31J31n35N15K62n84
2660g2k57M24rl83oJ59jJ1J05L1k97J47L67m39n1N74j17k34K51K01m58J24N2q8
2684C4k85J86L51l16k20L15l88J67K86M67r21K23N46o31K24J57J58l10k66M82
2704B59j0l56K94J85n89n6K11m41L00L15k48l48M59K45k52j51O89l04n69N08J02
2725B43l73K60J59k36m63N95J77q31K16K72p8l48M79m0j65j6N09l55l97Q24j6
$$ plain form
2576 118 172 -177 -85 45 -550 -233 63 -116 -192 -137 432 37 -167 495 354 -150 18 255 -92 -333 224
2597 224 86 -600 -190 -4 -457 -279 195 -108 44 -7 409 19 -92 237 10 -109 415 586 -224 -206 241
2618 241 -90 -456 423 -1 -845 -152 258 -205 -404 396 -103 -132 -40 482 -5 24 357 -50 -129 278 392
2639 392 -271 -223 217 -246 -571 201 185 -501 -178 498 -116 30 270 256 -192 139 270 -265 250 512 -72
2660 -72 -329 95 86 -297 -303 -144 -145 -134 -29 2 -295 -148 219 -220 -271 303 186 -48 203 404 -54 70 122 34
2684 34 -251 -65 286 -30 -250 65 -323 -156 130 597 -324 -101 445 -186 38 195 353 43 -223 259
2704 259 249 -107 187 372 -217 -273 -62 -503 -203 112 -136 -484 -25 220 -32 -183 506 202 -367 141 243
2725 243 -130 130 289 53 -410 185 362 -469 -253 19 -59 -407 72 32 -133 -149 360 5 -392 432 416
2746D16m37M4J64j02j14K96l01k99J89K91n33J4M60J63m63k4M25l12L0M87m08
2767a4j78N21j50l19q2N48n70R9J62L1m72M18L60k28k62J00J8j76M73J31n10M8
2789e2K99j33j82O41p51j47K65K41n02N8N35l64m90M42K52m51K73J36j61M2L79
2810C30J0j86j61QJ69k49L78j00k03o0j06J86j65K02N6k31JK26j44p9N11j54k85
2833d6kM00k17J05N7m43J72l05K63nQn6j60l30P83L0k84q9K98J28m26J22J73k10
2857c4k90N73k16k59K22J07k99KJ11j60k21L53Q7j03L98m40r4o0N67k31j02M53
2879C64J88o92J30K91k15l95N80R5n84K03o1m5K37J89k97m56L42K84Mkj1j89L75
2902C35j4l92K35M6k12j44J61j20k82K70n9J36n37P38j10m09L71k36J28L83L30
$$ plain form
2746 416 -21 23 187 85 -29 267 -34 -333 -144 147 -386 -372 88 251 -212 -236 189 -123 -93 394 -14
2767 -14 -192 329 179 -140 -222 326 -244 -145 17 48 -424 -6 354 126 -136 -36 -18 -194 279 410 -100 -52
2789 -52 247 114 -68 573 -178 -325 -60 181 -321 -263 272 -92 -582 -140 112 -339 -66 70 -91 -49 330
2810 330 340 154 -7 1 170 -79 299 199 -4 -64 -170 16 -149 53 109 -122 -121 105 -39 -118 393 239 -46
2833 -46 -48 352 135 240 297 -146 26 -279 -16 -21 -13 -69 -229 -559 224 254 -30 -119 179 307 -119 3 176 -34
2857 -34 -324 249 33 -226 -4 103 -196 -194 -83 -243 -464 -111 -24 -127 271 -169 -263 -323 244 13 -89 364
2879 364 552 -140 -10 281 66 -329 251 346 -238 -35 -96 -141 96 285 -12 -468 -126 158 162 160 149 -40 335
2902 335 321 -71 164 210 -2 -146 15 -105 -387 -117 -176 -40 -577 161 51 -358 13 -223 -95 288 618
2923F18o51p3L55k83J15L2L9j18m6j30k3L2P6Jk99P6K00K80J0j93J07k98K75o8
2947C4k6L79j41l50J40k62J97p6N7l83K15J26L23m29j19M79k20k08K40K84k97
2968c7K56k07J40J35k01Q3j60j78J44J49l65J18k03K53o7J70o7j22N0J20R9R5
2990B05j20K54m73M5K85j55L7l15K56l67R5J50l9k36L26Q8m40K56K12kk49M09
3012B22k15R7J48k3r1k76O33m35k75N37l66k52K13R9L7j86K36k06k62L64K32l36
3034a05K05L79o10n7L80K50n33J77mk19J90Kj29m53L53j14K00J56L41n3o50J22
3056a72M06k77L04J05n53K22j43P6p6J4J22k82m5J84R6k08L00o1j34k62L02N51
3078D69n93J95n4J11P3R3L7o54K65L99n31p2K97J72n39K69P2K4l61K81K02l77
$$ plain form
2923 618 -33 -106 249 -34 81 113 152 34 -12 -142 -165 -133 -57 -56 -355 -279 -79 201 211 18 125 -173 102 34
2947 34 8 387 246 -104 36 -226 -29 -105 -48 -431 -216 -90 233 -196 -315 164 -56 -264 -24 260 -37
2968 -37 219 12 152 287 86 169 9 -169 -25 124 -241 -123 -326 -73 -140 30 -37 -159 -109 11 110 205
2990 205 85 339 -134 -89 196 41 78 -237 19 -348 -253 -103 -142 -378 -52 36 -404 -148 64 62 -187 222
3012 222 7 104 252 229 138 -138 495 60 -215 322 -44 -296 -83 16 53 -133 103 -103 -365 -1 231 -105
3034 -105 100 479 -131 -188 192 442 -91 86 82 -137 53 55 -74 -527 -174 -288 -88 68 409 356 -294 -172
3056 -172 234 -43 261 366 -187 35 -108 -32 -108 -94 28 -254 -299 -115 -19 -227 73 12 -122 -384 -82 469
3078 469 -124 71 17 128 201 294 331 -323 -58 341 -190 -262 35 207 -332 -63 9 33 -328 -47 155 -222
3100b22K74O5J93q9R1l02M6K31j26m35j6O78l96l74M40k89j11L59p2L5m6J81k86
3123a71j74M69K60j98m35L92j07j56M58l1o40L21j38K1k89N12l1l47J77L92j86
3144I9l55L89r0m86N01N29m44j44J38l67j27N59l57noL35l91q4J96Jj08N3N40
3167C76k57l58M62J3k00q5M76k84J9k50Mm15Q8Q88o73k35M77N2m81L77J07k19
3189a18J18L01j88l60N61l4l42L6M32m59p1K32K1j56K2Jj03j92O65lr30O40J57
3212B30m98K82L07l21j65L23J16l12j14K67k21m05P36Jn79K69J9k37J45Q6K67
3233A96l30J69L15k87k44K56J71m33K49o3k81K32J54j81l04K17N62n87l9L06j70
3254i2r1L66k09L4n3J40L1k89K89k54j17K96K93n60K35j8p7k28P45m9m27j55J28
$$ plain form
3100 -222 52 117 310 221 312 10 56 287 161 -274 -290 388 -8 -382 58 -231 -342 17 -55 -20 -66 115 -171
3123 -171 -345 124 384 186 -249 143 36 -120 338 307 -333 -12 -150 -129 -418 94 63 -284 -107 285 99
3144 99 -256 133 43 -443 58 587 143 -1 137 -230 -357 202 -155 -160 -166 169 -222 -306 -110 -109 -217 -164 376
3167 376 119 -239 223 236 36 -49 427 143 162 -88 -84 -499 -411 477 -196 -431 46 98 -383 -6 101 -118
3189 -118 0 301 113 -247 314 280 -62 -26 406 -53 -124 108 129 -27 -5 -4 -107 -299 366 363 -567 73 230
3212 230 -268 14 321 0 -165 158 274 -38 -152 115 -106 -511 225 226 -353 -84 -65 -302 -157 -71 196
3233 196 -134 35 350 63 -181 75 246 -187 62 -1 -282 -50 104 -77 -381 -164 398 -189 -228 78 -92
3254 -92 -183 183 -26 8 -45 95 126 -163 126 -128 -245 51 344 -216 19 1 -76 -304 441 392 -35 -190 -62
3277f2r1q0M68J54n76L38K37k22o8J2m2jj81l5n1k16N52p9l76mM52M0q4Lq5j96
3303a93M07J37m01N0l4j06J86L00k01k73Q1J65r4l56M85r2l13K7K74L6N5k79L73
3326B34m38K11K86K9k18Nq2j25K34P4n84L39J51j69j47M37l16J89m5P5n9j80K19
3349A20K55o22K31J54p8m29N29j54k68J31n7j5M3J98p7m01J02O90p79N86N5o8
3371A46k18J59j55p7J5L00l29P3K67k15l6o5K7j58K97L6q1k44N45m52L98l20L12
3394B25j60R5J42k45r5k4J52k16K1J98j95l0J49k07L11l1j17l02K27L78n67L80
3416H9K31Kl11j39J71R8q5j93Q9j50R7r3K25j56j06J85o4J66p6L76k26l50K87
3439F7L6p1m5MP6p9K02k3k15M7k03J97L0J7k1n5j8K6K5m2M11l14P5q7k12J0M02
$$ plain form
3277 -62 -153 -233 235 389 -187 151 388 166 98 110 68 67 -114 -149 -200 -416 136 57 -319 -323 129 169 85 88 3 -193
3303 -193 214 351 -50 0 -34 -140 46 346 145 -128 -47 118 24 -332 153 61 -252 -225 49 85 140 -139 234
3326 234 -204 7 293 322 104 109 27 -98 136 210 -374 -35 116 -53 -200 237 -79 110 65 140 81 -99 120
3349 120 375 -247 -16 138 60 -369 160 6 -262 -131 -188 -203 -160 38 -39 -440 -338 352 -427 159 214 146
3371 146 -72 87 -68 -145 -130 170 -159 -86 181 -34 -70 -135 -108 -266 31 67 -14 -258 287 -165 233 -87 225
3394 225 65 160 302 57 -38 -62 90 -126 -105 93 -102 -132 17 -190 121 90 -27 -329 -102 276 -291 89
3416 89 320 322 11 -128 43 141 56 -137 -48 -198 -101 -194 31 -125 -231 -46 -110 56 -20 356 130 -220 67
3439 67 103 32 -13 -9 67 -12 190 167 -48 -1 -204 -7 23 40 19 -36 -54 -28 -3 -45 366 52 127 40 -172 -162 240
3466B40j50j66K0K11N2m20L22k0J42k38l9j11M9L60m59K71J85j67J64L13o67K5
3488h3K18Qk33k12J69o8K27k77J40j11N5K00Q3k77L7J45P7K80m23rp2P7j47K46
3512E0L6q1k5L4k06k54M64J1j00q1L87l56R4J52Q0k32J66N4Q4m47M07k2k97L50
3536B68m64n5j34N91m31J17m12O10k74O1nK37m15N37k9j62L23k46M3l01J43r2
3558i0N8j17l7J08k24J20R7n6j63J71J2R7J64M3r7m6p3L42k40j9J25j55m47N00
3582G3j56K22Nj23k36J21K57j06j9n3O7J2K06N2m43K07K14k57r9K66l22l30M89
3605D7Q3k35k00K59j34m5J52R6k25J11M2M5k52N30j88k56K18J20q3k01J77r8l26
3628c63M81j99Rk50K87O8l67K17o9J65J58l0o7n6K27L9Q9l99P0m8lk97L24k96
$$ plain form
3466 240 90 -76 -56 155 207 -213 109 89 231 -7 -46 -157 -108 252 -207 64 249 82 246 559 -108 -83
3488 -83 135 143 -90 -302 -133 -201 26 -251 -111 -222 -167 33 116 -161 -124 21 98 378 -45 -54 -126 -49 -196 50
3512 50 86 5 -20 14 -192 -446 18 29 -71 -152 235 -121 -27 125 205 -27 139 193 277 -170 237 215 -82 268
3536 268 -196 -251 -385 206 -225 -108 -520 90 -184 -123 -128 109 -306 231 202 40 363 117 160 -141 2 -90
3558 -90 -32 -149 -186 -78 -302 -182 -85 -141 -304 -133 -121 -24 140 183 86 40 -33 309 69 50 175 20 -427 73
3582 73 -83 139 144 21 -215 -94 163 57 38 -15 52 64 270 322 -121 86 300 43 -56 210 -112 -442 47
3605 47 130 -105 -305 -46 -180 -225 -73 23 -202 -91 -49 -4 -256 274 86 -170 48 168 85 -116 61 -37 -363
3628 -363 118 -81 -72 -322 -35 33 -334 -117 -186 -21 137 107 40 -16 211 250 339 -60 10 -38 -41 -338 -14 -310
3652c10qM51k05l05N16N7j78q0J75j85K09nJ08l93J61K68j38m51N13m61K2R7K85
3675A43k9l14O6J33j40j2P2J93r8K20j06k03J17K11l46k2M62k10k01Q0M23q14
3697c75K13L55l71l37P72j63l70N65L1l57J8K60o8j08K3J00j96p4L81m24q6R2
3719a19L26n16J01J43j57j85L92k1k36K57J32q0l6Q9k4j98J95k55J44r2J84P1
3741A15k65N5K65m43K52P5J29m19J13J86QNO1p2k01M33m0m84M07K3j65J82l61
3764a41J03l04O40l80P9k90M48r0o71N98K72j55j56L29r3k66K22J87n63J90K46
3785B05l60O4J51j89k82O77j37l41L21R1j35ML26k15k77M0L08m37J29R5J75n44
3807c31j06P11l28p1L39r2l61K49j79k47J56J48K27k16K35J40j02l27L69M6k81
$$ plain form
3652 -310 -318 133 -72 -377 139 196 18 -62 113 -72 137 132 240 -153 8 276 138 -313 200 -261 -239 -142 143
3675 143 114 -200 -134 -1 -141 -153 -81 112 14 234 128 -75 42 253 -93 -115 347 137 -64 16 439 -375
3697 -375 -162 193 -178 -515 257 94 -276 289 320 -37 -19 241 173 65 88 188 -8 -82 299 -125 -211 -119
3719 -119 207 -309 -208 -65 -222 -407 -15 -36 -272 -15 117 37 1 90 66 -132 63 -192 -48 -140 44 115
3741 115 -150 -95 170 -273 -21 54 183 -236 -123 63 71 76 137 65 -136 297 257 -227 180 203 38 220 -141
3764 -141 -38 -342 298 -82 -3 -293 155 65 -606 -8 264 109 -47 282 189 -77 145 332 -231 -41 205
3785 205 -155 -91 60 -129 -411 266 129 -212 109 200 65 69 395 180 -97 -57 251 -186 -57 38 213 -331
3807 -331 -437 274 -54 -125 214 122 -239 10 -169 -416 -260 -112 115 -101 134 274 172 -155 214 260 -21
3828b1k08L32j79j43M54k87j61K68L3k92j87M49k63J66J73j92J85k37R4Jk71M94
3850B08k10o0J91or6k08M31j65n50L61N21n23l1N73q0k48j53J24j16n6L25Ll92
3873a57J04M7l70M41K2p5k35K32j8q5K35j37k42j82J94J17K06k56K44j51N3M3
3895C0O2j56K53k83k13K8O0L90j58L5j43O2J24m0R0K5K58l84Q0r2J84k07j97K28
3919C6l6j19j05j41K11Q4N8k25q8M02K81l95L05K49n12n6o6M59l57j84L4J73k71
3942b63J75N0n0l2L09r8j59l5j0M0L55J7k24p9r2M11k26K37j17k15J56k29J43
3965F4J75j66j82J97pJ05m41M48j22N5j6N5n2j39l9o2J12j9J60j69l8Q7j24j1
3989a29K58m02K64j78j53M04j39QP4J22J2p1J86j65k49L39m61M42k13K01k56j27
$$ plain form
3828 -21 -229 103 -76 -219 235 -52 -213 55 88 -204 -391 58 -205 -39 134 -58 127 -110 -16 -15 -286 208
3850 208 -2 -62 129 123 27 -181 250 85 -465 -104 417 -106 -137 436 356 108 -45 79 -37 -93 232 235 -157
3873 -157 -53 -6 -376 65 87 12 -223 9 -9 -94 141 4 -238 -420 -226 -109 97 -159 85 -66 -13 30
3895 30 92 -64 189 -94 -307 -279 -219 171 13 48 -95 -33 91 51 141 166 424 40 120 28 212 5 -192 36
3919 36 0 -119 -224 -365 -154 -70 -12 -237 -325 77 358 -37 268 517 5 -51 -117 342 -15 -199 -165 8 -263
3942 -263 -88 -38 -88 -120 189 91 -68 -103 -113 -73 282 299 75 -4 -96 315 89 326 209 -6 150 -79 64
3965 64 239 73 -109 88 81 186 -255 193 71 126 110 165 113 -26 -65 -127 -15 -34 126 -43 -81 6 -118 -129
3989 -129 129 -273 -9 -187 -340 64 -75 -67 7 129 141 70 256 91 -158 181 -280 162 -51 150 -106 -233
4011b33L57N2r7k82l3K39l99L54PK68j47K9JJ05l2J91r1m01J40J64k08q6L84l73
4035i1R6k50L62K2r8l86M21l8r8L56k68P8j62J46l44L22o0K08m09j5J93k78L72
4058G9K11k92j42QK11JJ6l7j0l8J09N6l0K79k96k05R1o8p7K66j18j28j1j95L98
4083G8o1j91J94l7K84p7P0K6m01K11R6jj72k18K23l31M56l9k34J23j87j94K49
4106a33J81j65J44J50k54K19J23K56n01j40J61k34L60k22J80j85J02M2p9%Q9k9
4128F5q9M2J70j70K07l26L73k63L8K53p5j96J9q5J86j39j82j1o1J56l7m8K44j27
4152e6j2m11N14M1J36o9k11oM1L45l22mJ18q9J72j25J28k67j55L44J23k22J39
4175A52K39j13n9j96J17Q8p2m5j24j20J63l5jJ21j43l4K57r6k81n5J93pk06J60
$$ plain form
4011 -233 124 176 79 -203 -236 3 -396 -42 -35 233 86 115 116 221 189 380 289 -112 28 192 -16 -102 282 -91
4035 -91 5 -245 117 139 41 -345 76 38 -60 296 28 106 -56 90 -254 68 8 216 -193 -208 -15 -293 79
4058 79 290 -2 -144 -136 75 76 92 55 45 7 116 172 142 421 125 -80 11 -57 -134 132 14 -114 -125 -320 78
4083 78 17 -174 20 -17 267 190 260 286 -115 96 192 191 19 -199 24 -307 149 110 -124 -1 -188 -382 -133
4106 -133 48 -117 27 177 -77 142 265 521 20 -120 41 -193 167 -55 125 -60 42 84 5 5 94 65
4128 65 -24 18 188 18 225 -101 272 9 47 300 225 29 48 -37 149 10 -172 -183 -244 -88 -125 -173 71 -56
4152 -56 -68 -479 35 76 212 143 -68 -74 -33 312 -10 -14 104 15 187 62 190 -77 -232 112 235 13 152
4175 152 391 278 219 23 140 228 156 111 -13 -133 30 -5 -6 115 -28 -62 195 99 -182 -237 -44 -51 -257 -97
4199i7j33L31k9M4k37J1L19L1l31q8K96n00M22l6po6p4J20j30K65O8k97j65N64
4223B81J39m42q8M00j44r9k4j63RO5Q9R2J18p1k20j07j76K07J50l49L36J54k73
4246a16J96j10J4l4K83j63J0j05K28J0m00J33k04K79J60J0k70j13J69k51K38J43
4268A07j28L48j27k19j27j06J92o8j41L90j80p0o8K88k14p4K2O5n9j84L32J31
4290A10j91M37j47m98L45J38l42J21J15l5k00J46K05k70N9n3K0j75L83j85j4m3
4312g4K68k11J01r3K03Q3k08K7p3j94M9J1L46J05k85j41K28l12K40j05J09O1K07
4335C42k11P6j44K03o77O71j84m37L54l79N12j83K84l64O5J52j68J46J36j99M0
4356C5N4m7O7j5J25j32k50L89o7k90J9J01m6l20N51k4m20J22P6K13l62M12k7p6
$$ plain form
4199 -97 -230 101 72 116 -121 -110 209 240 -91 -179 117 -383 39 3 -4 -70 -144 -24 -154 111 179 -118 -283 281
4223 281 420 -22 -110 290 146 47 23 -140 -131 -66 23 115 233 162 -58 -165 -341 -134 16 -333 3 157 -116
4246 -116 80 -30 -16 -50 233 70 80 -25 203 213 -187 -54 -258 21 181 191 -79 -192 -23 -274 -36 107
4268 107 -21 327 200 -19 -146 -252 -60 -128 -269 121 -59 -129 -197 91 -123 -197 -175 -110 -169 -353 -21 110
4290 110 -81 356 209 -289 56 194 -148 -27 88 53 -147 -1 204 -66 -7 -60 -40 -215 168 -17 -31 -74
4312 -74 194 -17 84 -9 194 277 69 96 23 -171 -122 -111 235 340 55 -86 142 -170 70 -35 74 135 342
4335 342 131 207 63 266 -411 260 76 -361 -7 -386 126 -57 227 -137 -72 80 -88 58 194 -5 35
4356 35 89 42 109 94 219 87 -163 226 159 -131 -112 -11 -57 -377 174 150 -270 -148 -72 141 -221 191 164 88
4380H8j3R9k14m4N7L0jO3j15j0J12r3Kn6R0J03k14J29k3P5j16K51j87j2OO8J96
4407B71N4m6j90j69J41Mn8j85L48j67k51L15K7j26j01J68j65M7K92o1l72K87o9
4430fj27L69j01j49K35l89J59j46L47m90K16m7n8K01K8j05o5K04k42L62l89L05
4452A12k85L2M46n18K37Q4r4l6O0j84J71l8Q6k20o4L7n0O60k32j26M8j43L1J20
4476A34k09J86k12j58K07j57L96j43k64J62NJ14J31j62pNP8k3J17k93K2j3J42
4499E8j22N9j03n8J44M6o2M8r6J93k06j04j8K3L18k28p7L21k30N54m41N6r2R9
4523H2J51oj22p0k71J97m5J40m08N26J4r7J19k92J55l23K98k8J29j10j58J80p0
4546ij8j97J8J17K2j5N1K3J50l33J92J00M7Q3j77J59j69K16k07q5K13q9k68J41
$$ plain form
4380 88 75 174 -40 -84 -27 3 2 65 -50 -60 52 -41 -39 -95 -5 98 -116 13 -10 65 -51 200 13 1 7 75 271
4407 271 325 279 89 -80 61 65 7 -178 170 3 -248 67 94 -32 -133 35 -130 -83 209 148 -224 63 -6
4430 -6 -133 236 135 -14 221 -168 -9 -155 192 -298 -82 -129 -187 14 42 -63 -128 76 -166 196 -193 112
4452 112 -173 -141 305 -213 24 108 14 -22 38 -146 25 -13 73 -147 -211 -174 -224 436 204 78 126 -17 14 134
4476 134 -75 111 -101 -259 -52 -209 187 44 -220 -58 -53 61 192 30 23 28 106 83 200 -93 -71 -84 58
4499 58 -64 -5 -108 -166 -22 24 -38 10 -86 107 -99 -203 -221 -198 120 -108 -185 136 -94 460 19 75 -17 82
4523 82 233 227 105 35 -236 -39 -84 56 -352 174 188 91 210 -82 73 -250 48 20 149 39 -119 61 -9
4546 -9 -27 -224 -206 -89 -67 -82 -31 -8 142 -191 1 101 148 231 54 213 44 260 53 -32 181 92 -176 -35
4570c5q5j0J65j62J39l17N33k5l26M23m19K28j48L43l85K96j3l50J14J44o0l09
4592b59J82N0K22l77K79L0j67J55j29j35J64J25r2kK80k01j71J93m11K54k48L45
4614H7p9J50k5j82o8O8J67l27J49L21k54l3q4L11k95RK17L3j75m8J43m1k08j02
4638b66M85m37r9J10K46j30j7J49l78L0L95k7l03O13k60j25L3q1lo3J15L08k06
4661H9j67J55k25R1J4n5j94J67K47k50K00R4k02Q5M6nok89K74j67j14J40j22K
4685a92K9J50l37O8M21Nk45K22r2K52Q4m20J33J84k71J34k65M27k54j21k3R7j26
4708a40JQ6L22q1m41J07J08k2J90p5j2J17o8j57J34Q9k96n4p1K48O6K5ln8q8m1
4734a14J00k91L19j23K72n2j87R4p5R9R8L0k79L12r6L9r4J5Jl14L34K47o67M74
$$ plain form
4570 -35 -120 -130 35 -127 12 -305 228 203 -123 300 -119 109 -39 304 -81 215 202 -148 -34 110 50 -259
4592 -259 -77 -27 195 -182 97 127 -40 115 -14 -149 15 140 48 46 326 125 -46 147 -264 -10 -258 87
4614 87 8 158 133 -49 -117 -49 118 -209 -60 261 7 -26 -110 201 -94 -85 132 165 -10 -58 85 44 -164 -266
4638 -266 219 -218 -317 -207 39 -91 -108 41 -337 -307 88 61 -242 371 111 -14 19 -62 -65 -128 -13 295 89
4661 89 -78 77 -148 -57 -43 -98 -292 -125 122 -128 72 166 -36 49 95 90 84 -205 69 -98 -212 -72 -194 -192
4685 -192 -163 -13 -350 -282 139 144 -101 121 29 281 365 -55 78 262 -9 125 -140 287 33 -88 -111 -14 -140
4708 -140 -139 -53 269 188 -253 -146 -38 -60 130 55 43 160 92 -65 69 158 -138 -192 -263 -15 51 76 73 15 -73 -114
4734 -114 -14 -305 14 -109 163 111 -76 18 -57 42 140 170 -109 203 107 146 52 67 68 -246 88 335 -332 142
4758A42l90N25k65Q2j34j5J75J04k97k8L29j30k95J74j39K78p7%P8l2k03p0L31
4781A43l20K31j11M3N9N7m5k05L70l70j47K92Q5k79r7J67o6K18N2n06N48j69J84
4804A34l1J57k35j8K23k01K35p9j80J48o0l26K97q3j77K5K52j76q6j15k3M68l59
4827b10M36r4m07M74j15j40J23K52m15K74j39k79O6J90L47n43K46j2m04J55J21
4848g4J67N6J53rl92J53P3J22n82M31J68j88r7J76m70J92o8N5j45J41K85j93p6
4871a22K51L8l17J60k9L46l93J11K35n22J28K98l64L55l76K14k09L20m1m19L28
4892hj16K50r8k70L44J14p8J86m85J66M05k54j60r7Q8j15J07M2R4p5KM3J03j05
4916H3r1q6J35L18k53J7k89J29q7j64K89J61n44K17L46k32n1J23M4J01j59Q3j47
$$ plain form
4758 142 -248 277 12 94 -40 -55 120 224 -73 -101 228 98 -197 -23 -162 116 39 39 117 85 -118 -188 143
4781 143 -177 54 -57 -14 45 102 57 -148 222 -148 -295 -3 82 -197 -294 -127 -193 25 77 -429 119 -50 134
4804 134 103 260 25 7 230 29 264 185 5 153 93 -233 64 -19 -196 -171 81 -95 -181 -296 -319 149 -210
4827 -210 226 132 -275 199 84 -56 67 319 -96 178 39 -240 -174 16 363 -180 66 54 -350 -195 -74
4848 -74 93 149 302 293 -99 54 127 249 -333 98 266 78 -19 157 -313 -121 -189 -134 -279 -138 147 -46 -122
4871 -122 129 167 -150 10 -19 327 -66 45 280 -242 -114 184 -180 175 -201 13 -196 124 83 -336 -8
4892 -8 -124 126 28 -242 102 216 138 324 -161 5 410 156 -4 -101 -13 -128 -21 21 115 40 42 85 188 83
4916 83 -8 -94 41 359 106 123 -166 -37 -124 -288 1 162 -382 -165 181 -51 -102 21 65 166 7 90 -57
4939e7L6J52K39k55k72K76k43M9K04l04k3K32LQ8r7k19J31p7M1K2j61J89rL59
4963C04k18J42j23j71O0j72M22m56J86j63J84O4k05K19j92J33q9M33j94k03m0
4984g9o0L34l56j85P63l85o6J41o0o7n1j26R1r7R1J45M8L7k97K2J27Lk0K69n6
5009A66j65n2N0L6J6K0r5m9J14l56O7M7j5J29J17n2k36K30K3J42j46R8J7j75k48
5034c17L65k7K4pr4M6j85J21J53j47L51l08j34J14J3k2JL98m34J95j72q1K53j59
5058e3J40j54K09j90R7mn07J33J63J11J68l08L87l8jj09J82pp1j75J18J27k51
5081c3j05K00J18k62k49J27J80p4P5j60J29Q0K55l9m50O3J72l94L80J70k06j25
5103a48L31j20j6j90K11J09l18K67q1j19J55o0J59l18J03P1kp2J00Q9k59n0J26
$$ plain form
4939 -57 -21 131 370 115 -157 119 -124 -75 129 -175 -198 34 37 125 28 -191 -60 -137 -96 -74 -235 -46 -55 304
4963 304 86 228 105 -66 -6 -178 244 -212 -26 -189 -5 59 -146 73 -119 14 -75 358 164 -39 -79
4984 -79 -139 195 -161 -346 417 32 -34 107 47 -20 -71 -197 -106 -203 -112 33 81 118 -179 -157 -30 -27 -47 222 166
5009 166 1 -51 -1 35 51 71 -24 -73 41 -315 -248 -201 -216 -87 30 -22 -258 -28 -5 137 -9 89 106 -69 -317
5034 -317 48 21 45 38 -56 -10 -195 -74 79 -68 283 -25 -159 -45 -32 -54 -53 345 -89 106 -66 -147 106 -53
5058 -53 87 -67 142 -48 49 45 -462 -329 -166 -55 113 -195 192 154 153 44 226 219 148 -27 91 218 -33
5081 -33 -138 62 180 -82 -331 -204 -24 -98 -23 -183 -54 26 281 242 -208 -145 27 -367 13 183 -23 -148
5103 -148 183 63 47 -143 68 177 -141 126 45 -74 81 21 180 -138 -35 36 34 -38 62 151 -108 -158 -32
5126c2j06mJ02O2K6M9k97J08p2L16j24k18L99m5k59J38K38n29L44o7Q7j80k25
5149b89L10m9nK22l10K54j00n1J13j52k26K06j15L98k12r4l1K02J29O9j33l18
5171a82R5J57r2P5q0jn0l5J13j7J03j64J89K06r1j19o2Q8j49R0k4J52l35K33n7
5196D3j81M23m82Q1rj19N9K83j06J56j69j24L00K1j85J61J15j79J08k1J49l98
5218g4l5L8J76n8J6j94M3J68l58J91Q6J27l65J56R7K1k2P0j61J08q7j53J09j77
5242b78R0J26j24O6J75j48J56j18q7K7L04o8L8p2j23m8k16L82J26k58K13k46N3
5265c0j48K72p5j80L36k17j7j84M57q9K4k36Q0n4J54J70m2j36K05k95L9k6P4m09
5289c27K38J13j32K50k19K15R2l58L7k5J47J38l33K95j38l6j74K08J84n5l72L22
$$ plain form
5126 -32 -138 -142 -40 22 48 97 -200 -92 -164 152 28 -190 209 164 -95 43 281 -248 96 29 116 -64 -289
5149 -289 21 -28 -33 189 -121 133 33 -18 95 -57 -283 -77 -192 206 -6 -100 -131 71 200 269 136 -182
5171 -182 -87 70 -22 53 -27 -28 -78 -113 0 -17 86 -78 111 317 226 107 45 133 -16 74 50 202 -133 100 43
5196 43 -138 285 -197 -116 -125 -244 -185 98 -8 148 -21 -145 155 176 -9 152 267 88 196 175 324 -74
5218 -74 -109 -71 105 47 63 -131 -88 80 -278 -87 -1 126 -239 -83 14 35 13 83 -78 30 -57 -210 -101 -278
5242 -278 -188 -62 -186 -120 55 -93 63 -55 -142 -115 189 121 159 87 -36 -84 -300 82 208 -50 163 -83 -30
5265 -30 -178 94 19 -161 175 -42 -59 -243 214 125 149 -87 -7 -61 93 263 221 85 290 -5 34 8 82 -327
5289 -327 -89 24 -108 142 -77 138 230 -128 -91 -116 31 169 -164 131 -7 -43 -217 -9 175 120 -252 70
5311G0j43Q0M7J95O7l21pO5n8j29M61l67R5k24K89k98M2L45l93m9KK09J4m0j1
5336e9Q5l89L27K7L79k58J46j81k13J54J2J32k1K51n19j56M13k85j7K31l34K39
5358c6K28l39m6R0R9pK49j85J9j85K01P0K73k06j37j92K16k63M61m78J98k03O0
5381a13j76K85j14L58j42p4J90l86L38P5k43m0J21J3K25p4m12J73N5l67K12J85
5403H9j29K74j15j70O8p9r9K81L5k07J42pJ06k84K28k35k36J13K72j33O6K29j61
5426D8j32Rr3j86O43l46L47k14L76m52K19k25J99m1j28N9q0m1j20r0L6J30m6J28
5450@R7j05j15K00k37R7K15l3O8j09j56J25R1l29J31O7k24J01K8K59q7k82K08
5473A0P4J77j01l1j58j73M35p5l13kN9J85j10O4j4j76K51M5j68j40L63k86K74
$$ plain form
5311 70 -73 7 54 249 316 -5 -12 53 -5 -134 327 -40 55 -169 120 -178 -136 209 -184 -233 -231 -22 -8 -48 -59
5336 -59 26 -363 -36 -9 370 112 258 77 -136 18 30 162 141 392 -127 -283 130 -155 -172 59 -275 -36
5358 -36 192 -147 -193 -103 -4 -11 238 53 72 -113 88 158 431 225 88 -104 112 -151 310 -168 30 -173 -113
5381 -113 -289 -4 -118 240 98 24 214 -172 166 241 -2 -42 79 92 317 243 -169 4 59 -308 -96 89
5403 89 -40 234 119 -51 17 -62 -161 120 155 -52 90 83 189 -95 133 -102 -338 -225 47 -86 -20 209 48
5426 48 -84 -75 -168 -354 289 -57 290 76 452 0 219 -6 193 152 24 83 3 -38 -158 -248 -212 -82 -128 0
5450 0 97 -8 -123 77 -160 -63 152 119 187 78 -78 47 138 -191 -60 7 -217 -116 -88 171 84 -198 10
5473 10 84 261 160 129 -29 -202 233 158 -155 -157 -98 87 -23 41 27 -149 102 147 -21 -161 202 -84 190
5496A90k89J45Q0k01J89J5n3l35J81J08J61Q2l92J69l76J73J72J15j90O0nQk5
5519a8q5L26l28K75o9J0q3l01J95K73M8j07p4m08L34L4o5l6R0J35m24J78P1J04
5543G5k9N0k91J41N3K0J51k42M7j5p6L8K15j06J23j92p9J21k12L11l14K43j27
5566i5K3N0j08K43J0k0k7k36K37R6j85K59k18n5j73J40K11k43q2R9n2J07q1N0
5590e0O6O2J80l95L6mJ28j88M4J19k78M62p7k89K32qj5O6j11K10k71J67j24J58
5614A20j17j35J94j27J87k17K47l96K49J97k10r8O9j17J39K0l6K16k70K71j70
5635A6J55j7j22L8Ro2J40qk44l8J12o7j9LN6r1K31k00J39j15K17p2J8P6j9j77
5661d1j43L28j06k15K92j28n1M2j36J11K48j79R2k11r0K4K16J8j00K68k11j23
$$ plain form
5496 190 -99 46 126 -75 114 129 76 -259 -78 30 191 273 -119 50 -326 -153 19 134 -56 4 -1 7 -18
5519 -18 -103 223 -105 170 101 111 28 -273 -78 195 243 136 62 -346 -12 22 -43 -79 11 146 -278 -100 -29 75
5543 75 46 96 -195 -54 -1 19 170 -72 -25 -40 -116 -78 137 31 154 -38 -117 4 -208 103 -211 32 -95
5566 -95 -72 -22 -130 113 123 103 76 -160 77 173 -12 247 29 -26 -199 -59 152 -91 -173 -74 -126 -19 -100 -50
5590 -50 16 78 258 -137 -101 -105 23 -165 -121 -2 -280 182 105 -184 48 40 25 91 -20 190 -81 86 -38 120
5614 120 3 -132 62 -65 122 -95 152 -244 5 202 -8 -106 -37 -154 -15 5 -31 185 -85 186 16
5635 16 171 154 32 70 79 17 157 149 -95 -133 -21 -88 -107 -104 -48 -139 92 -108 31 -84 133 61 79 155 136 -41
5661 -41 -184 144 38 -177 115 -13 -64 -22 -158 -47 201 22 114 -97 -187 -163 53 71 -29 239 28 -95
5683i5J78P8L5j44J81K2l31L4j38R0l0oO7K96j66J78l02N9J19Ok10J99l7j77R6
$$ plain form
5683 -95 83 161 196 52 233 255 -76 -42 -180 -90 -120 -126 -59 237 71 249 -53 6 125 131 -79 120 83 -94 2
$$ [...]
8191A34
##END NTUPLES=NMR FID
##END=
