##TITLE=1H_ART-AcOHH2SO4-f6
 200.13MHz, CDCl3,
 8 sc
 
 17.1.2025
##JCAMPDX= 6.0         $$ Bruker NMR JCAMP-DX V2.0
##DATA TYPE= NMR FID
##DATA CLASS= NTUPLES
##ORIGIN= UXNMR, Bruker Analytische Messtechnik GmbH
##OWNER= pz
$$ XWIN-NMR		Version 3.5
$$ Fri Jan 17 14:33:31 2025 Russian Standard Time (UT+4h)  she@DPX200
##.OBSERVE FREQUENCY= 200.1313
##.OBSERVE NUCLEUS= ^1H
##.DELAY= (6, 6)
##.ACQUISITION MODE= SIMULTANEOUS
##.ACQUISITION SCHEME= undefined
##.AVERAGES= 8
##.DIGITISER RES= 18
##SPECTROMETER/DATA SYSTEM= spect
##.PULSE SEQUENCE= zg30
##.SOLVENT NAME= DMSO
##.SHIFT REFERENCE= (INTERNAL, DMSO, 0, 14.3821)
##AUDIT TRAIL= $$ (NUMBER, WHEN, WHO, WHERE, WHAT)
$$ ##TITLE= Audit trail, XWIN-NMR		Version 3.5
$$ ##JCAMPDX= 5.01
$$ ##ORIGIN= Bruker BioSpin GmbH
$$ ##OWNER= she
$$ F:/spectra/data/she/nmr/H-C/1/audita.txt
$$ ##AUDIT TRAIL=  $$ (NUMBER, WHEN, WHO, WHERE, WHAT)
(   1,<2025-01-17 14:32:37.71 +0400>,<she>,<DPX200>,
      <created by zg, POWCHK disabled, PULCHK disabled
       configuration hash MD5:
       00 E9 B6 7A A2 85 ED C7 34 08 36 98 17 FE 4E 26
       data hash MD5: 16K
       6F 2D 4E AF 5D F2 BE 5F F8 C7 CD 05 9B 34 40 07>)
$$ ##END=
$$ 
$$ hash MD5
$$ 36 AE 86 B3 30 AA 7E A8 80 B8 BC 01 4F 45 A4 14
##$RELAX= 
##$RELAX= 
##$RELAX= 
##$RELAX= 
##$RELAX= 
##$RELAX= 
$$ Bruker specific parameters
$$ --------------------------
##$DU= <F:/spectra>
##$EXPNO= 1
##$NAME= <H-C>
##$PROCNO= 1
##$TYPE= <nmr>
##$USER= <she>
##$AMP= (0..31)
100 100 100 100 100 100 100 100 100 100 100 100 100 100 100 100 100 100 
100 100 100 100 100 100 100 100 100 100 100 100 100 100 
##$AQSEQ= 0
##$AQ_mod= 1
##$AUNM= <au_zg>
##$AUTOPOS= <>
##$BF1= 200.13
##$BF2= 200.13
##$BF3= 200.13
##$BF4= 200.13
##$BF5= 200.13
##$BF6= 200.13
##$BF7= 200.13
##$BF8= 200.13
##$BYTORDA= 1
##$CFDGTYP= 0
##$CFRGTYP= 5
##$CHEMSTR= <none>
##$CNST= (0..31)
1 1 145 1 1 1 1 1 1 1 1 1 1 1 1 1 1 1 1 1 1 1 1 1 1 1 1 1 1 1 1 1 
##$CPDPRG= <>
##$CPDPRG1= <>
##$CPDPRG2= <>
##$CPDPRG3= <>
##$CPDPRG4= <mlev>
##$CPDPRG5= <mlev>
##$CPDPRG6= <mlev>
##$CPDPRG7= <mlev>
##$CPDPRG8= <mlev>
##$CPDPRGB= <>
##$CPDPRGT= <>
##$D= (0..31)
0 0.7 0 0 0 0 0 0 0 0 0 0.03 0 0 0 0 0 0 0 0 0 0 0 0 0 0 0 0 0 0 0 0 
##$DATE= 1737109957
##$DBL= (0..7)
120 120 120 120 120 120 120 120 
##$DBP= (0..7)
150 150 150 150 150 150 150 150 
##$DBP07= 0
##$DBPNAM0= <>
##$DBPNAM1= <>
##$DBPNAM2= <>
##$DBPNAM3= <>
##$DBPNAM4= <>
##$DBPNAM5= <>
##$DBPNAM6= <>
##$DBPNAM7= <>
##$DBPOAL= (0..7)
0.5 0.5 0.5 0.5 0.5 0.5 0.5 0.5 
##$DBPOFFS= (0..7)
0 0 0 0 0 0 0 0 
##$DE= 6
##$DECBNUC= <off>
##$DECIM= 32
##$DECNUC= <off>
##$DECSTAT= 4
##$DIGMOD= 1
##$DIGTYP= 9
##$DL= (0..7)
0 120 120 120 120 120 120 120 
##$DP= (0..7)
150 150 150 150 150 150 150 150 
##$DP07= 0
##$DPNAME0= <>
##$DPNAME1= <>
##$DPNAME2= <>
##$DPNAME3= <>
##$DPNAME4= <>
##$DPNAME5= <>
##$DPNAME6= <>
##$DPNAME7= <>
##$DPOAL= (0..7)
0.5 0.5 0.5 0.5 0.5 0.5 0.5 0.5 
##$DPOFFS= (0..7)
0 0 0 0 0 0 0 0 
##$DQDMODE= 0
##$DR= 18
##$DS= 0
##$DSLIST= <SSSSSSSSSSSSSSS>
$$ [...]
##$SUBNAM0= <"">
##$SUBNAM1= <"">
##$SUBNAM2= <"">
##$SUBNAM3= <"">
##$SUBNAM4= <"">
##$SUBNAM5= <"">
##$SUBNAM6= <"">
##$SUBNAM7= <"">
##$SUBNAM8= <"">
##$SUBNAM9= <"">
##$SW= 18.0517328524113
##$SWIBOX= (0..15)
0 0 2 0 0 0 0 0 0 0 0 0 0 0 0 0 
##$SW_h= 3612.71676300578
##$TD= 16384
##$TD0= 1
##$TE= 0
##$TE2= 300
##$TE3= 300
##$TEG= 300
##$TL= (0..7)
0 120 120 120 120 120 120 120 
##$TP= (0..7)
150 150 150 150 150 150 150 150 
##$TP07= 0
##$TPNAME0= <>
##$TPNAME1= <>
##$TPNAME2= <>
##$TPNAME3= <>
##$TPNAME4= <>
##$TPNAME5= <>
##$TPNAME6= <>
##$TPNAME7= <>
##$TPOAL= (0..7)
0.5 0.5 0.5 0.5 0.5 0.5 0.5 0.5 
##$TPOFFS= (0..7)
0 0 0 0 0 0 0 0 
##$TUNHIN= 0
##$TUNHOUT= 0
##$TUNXOUT= 0
##$USERA1= <user>
##$USERA2= <user>
##$USERA3= <user>
##$USERA4= <user>
##$USERA5= <user>
##$V9= 5
##$VALIST= <valist>
##$VCLIST= <CCCCCCCCCCCCCCC>
##$VD= 0
##$VDLIST= <DDDDDDDDDDDDDDD>
##$VPLIST= <PPPPPPPPPPPPPPP>
##$VTLIST= <TTTTTTTTTTTTTTT>
##$WBST= 1024
##$WBSW= 4
##$XGAIN= (0..3)
0 0 0 0 
##$XL= 0
##$YL= 0
##$YMAX_a= 90416
##$YMIN_a= -100040
##$ZGOPTNS= <>
##$ZL1= 120
##$ZL2= 120
##$ZL3= 120
##$ZL4= 120
##$ABSF1= 10
##$ABSF2= 0
##$ABSG= 5
##$ABSL= 3
##$ALPHA= 0
##$AQORDER= 0
##$ASSFAC= 0
##$ASSFACI= 0
##$ASSFACX= 0
##$ASSWID= 0
##$AUNMP= <proc_1d>
##$AZFE= 0.1
##$AZFW= 0.1
##$BCFW= 1
##$BC_mod= 2
##$BYTORDP= 1
##$COROFFS= 0
##$CY= -3
##$DATMOD= 1
##$DC= 2
##$DFILT= <>
##$DTYPP= 0
##$F1P= 0
##$F2P= 0
##$FCOR= 0.5
##$FTSIZE= 0
##$FT_mod= 4
##$GAMMA= 1
##$GB= 0.15
##$INTBC= 1
##$INTSCL= 1
##$ISEN= 128
##$LB= 0.25
##$LEV0= 0
##$LPBIN= 0
##$MAXI= 10000
##$MC2= 0
##$MEAN= 0
##$ME_mod= 0
##$MI= 1.114404
##$NCOEF= 0
##$NC_proc= 0
##$NLEV= 6
##$NOISF1= 3.799351
##$NOISF2= 2.8
##$NSP= 1
##$NTH_PI= 0
##$NZP= 0
##$OFFSET= 14.38212
##$PC= 1
##$PHC0= 247.5195
##$PHC1= 17.3922
##$PH_mod= 1
##$PKNL= yes
##$PPARMOD= 0
##$PSCAL= 0
##$PSIGN= 0
##$REVERSE= no
##$SF= 200.129724274929
##$SI= 16384
##$SIGF1= 3
##$SIGF2= 2
##$SINO= 400
##$SIOLD= 16384
##$SREGLST= <1H.CDCl3>
##$SSB= 0
##$STSI= 0
##$STSR= 0
##$SW_p= 3205.1282051282
##$SYMM= 0
##$S_DEV= 0
##$TDeff= 0
##$TDoff= 0
##$TI= <>
##$TILT= no
##$TM1= 0
##$TM2= 0
##$TOPLEV= 0
##$USERP1= <user>
##$USERP2= <user>
##$USERP3= <user>
##$USERP4= <user>
##$USERP5= <user>
##$WDW= 1
##$XDIM= 8192
##$YMAX_p= 0
##$YMIN_p= 0
$$ End of Bruker specific parameters
$$ ---------------------------------
##NTUPLES= NMR FID
##VAR_NAME=  TIME,          FID/REAL,        FID/IMAG
##SYMBOL=    X,             R,               I
##VAR_TYPE=  INDEPENDENT,   DEPENDENT,       DEPENDENT
##VAR_FORM=  AFFN,          ASDF,            ASDF
##VAR_DIM=   8192,          8192,            8192
##UNITS=     SECONDS,       ARBITRARY UNITS, ARBITRARY UNITS
##FACTOR=    0.0002768,     1,               1
##FIRST=     0,             0,               0
##LAST=      2.2672688,     0,               0
##MIN=       0,             -100040,         0
##MAX=       2.2672688,     90416,           0
$$ Real data points
##PAGE= N=1
##DATA TABLE= (X++(R..R)), XYDATA
$$ [...]
1834A71r26J9N06j1m76N63M71m24Q0N41r2l95L20M35l58m15OK44n40p2L51l48
1856c50j77J43J12L02l41J71P14j43o60N14kk90P9N48l40o22O99M4p57j72N65
1877C7n8p17M20O73p67P3M54M13p84N02M75l12o73Q13N01r71k62P89n69q10N28
1898b45P01j384J2P86K23j144M79R69p91O1J079j23p58O67L88o05k68P69k06q01
1918a91M78n8o75k25N59k19j55J31j41L67o6K8M6K98k0l0N6L01j50j08J25k95
1940E6l18N02J5p91J68N69m11m57J125k20p00J85P71m80l90Q60J88o94n2P02m92
1961A36m77N83Ko02K79K80k95p02N77O53p43j27Q31j46o03P53L15m44n63R64N5
1982G26r80L2J104j204k56N95j54m98L86L92q44m5R17q9o87N24M73l44R6M76j65
$$ y = [171, -755, -736, -230, -241, -717, -154, 317, -107, -27, 514, 422, 27, 347, 782, 424, 9, 15, 259, -281, -353, -2, -350, -527, -384, -272, 30, -311, -140, 574, 431, -229, 285, 283, -7, 72, 620, 280, -342, 357, 401, -356, -528, 37, -21, -738, -318, 355, -412, -339, 115, 528, -256, 246, 721, 409, -264, 549, 1050, 79, -183, 606, 37, -773, -245, 456, -928, -916, -130, 93, -1051, -572, 397, -394, -333, 746, 623, -135, 532, 920, 315, 47, 816, 610, -191, 287, 229, -446, -671, -112, -331, -486, -355, -496, -129, -195, -167, -121, 177, 157, 127, 183, 484, 334, 226, 351, 56, -262, 240, 255, -536, -368, 201, -210, -667, 458, 238, -462, -277, 494, 14, -376, 484, 672, -22, -74, 628, 136, -341, 242, 244, -358, -79, 201, -94, -796, -219, 434, -309, -436, 395, 249, -354, 399, 714, 270, -293, 671, 726, -254, -222, 882, -322, -578, 17, -137, -635, -249, 143, -701, -746, 171, 82, -605, -81, 392, 48, 144, 620, 455]
2003D55l47M60j85l11L32J58j070J32N36o31K51K53m80m9O44l6p29Q63M5m91r
2024b09R93l49m10K20K70o46k70Q64k44j230O73P21q05k91J078j29q19N04Q64
2043G85q45k41R22r6n99K46O14n89n53J181m23j007N9O84n96m36Q44J31p72K44
2063d47R52l45m84Q11J66o81K33N32m36o49O90J46q72M29L8m59M2K90k08K4J10
2084a18j27O9O3O2J75L39J47j75k82L13j25m95N30P9q93Q5N83j64q49O12L95n03
2106b79o2P28o82l47Q71M48p27J45N52m00o57Q44J78j039J90O76p26j42N43r8
2126A6p36K70O95l95m99J046rm87R4P36n35k84P9N88m27m53N27n40k22J04N27
2147I5o48l2N69N1m48N16J38k40p3N22N2l15q4J29K36m12J42k2Om42k13K52O5
$$ y = [455, 108, 568, 383, 72, 404, 562, -508, -376, 160, -471, -220, 33, -447, -496, 148, 112, -617, 246, 291, -200, -209, 784, 435, 25, 245, 515, -131, -401, 463, 219, -1011, -338, 383, -422, -713, 365, 236, -583, -79, 785, -60, -301, 621, 525, -74, 172, 786, 197, -356, 825, 402, -605, -546, 138, -458, -894, -50, 81, -691, -447, 505, 160, -324, 487, 653, -28, 205, 737, 301, -348, 342, 488, -384, 45, 83, -376, -334, -44, -252, -228, -118, -245, -176, -113, -51, 124, 463, 610, 435, 153, 466, 341, -154, 376, 455, -438, -353, 230, 66, -783, -171, 224, -279, -341, 387, -295, -642, 229, 677, -50, 95, 647, 247, -410, 434, 612, -427, -237, 439, -287, -429, 114, 16, -720, -450, 245, -150, -649, 397, 388, -99, -5, 731, 196, -88, -9, 579, 152, -301, 226, -314, -536, -432, 95, -553, -585, -16, 35, -413, 103, 241, 1, -72, 450, 502, 187, 103, 232, 468, 56, 198, 176, 182, -260, -473, -221, -156]
2170a56l36P1M70o5l78L38M97q37M30P51o20j72N64K03r05K87K84o23k65P40j42
2191A36n35o3M82k00j78K37K65n30P2R16m89l54L48M51n02J10j48K38l16N0J38
2212A28j85k22M25o3m32O4O84j86n51N14m2l52K50L13K5j76R8J32m34r4J46l9
2234Cm49K51k47j75J77R7N12j70j60K20M07m24j99M45L91l59j0J39k00m83K36
2255BO3l32J87J0n4l46M29K17l83o9M77k79J76K10R9l69MM81j78m09J22N39m70
2278A27l40J66J6j17N6j6j91j61M90P5k39n3N05m13R4K93k6j63k85L29O4k34j26
2301a49L29m19p5J78J26m40Q3K96M04l51J73J21p8j68J27K88p54M9O71l49r2j18
2323a48L50n29p7K59j3k12P9L43m02K11K64K62k51OJ68k46r8N18p1m80K67K9j8
$$ y = [-156, -492, -421, 49, -16, -394, -56, 441, -396, 34, 785, 165, -7, 557, 760, -145, 142, 426, -197, -462, 278, 136, -399, -462, 20, -180, -358, -121, 144, -386, -314, 602, 113, -241, 107, 558, 56, 166, 18, 256, -60, -10, 128, -57, -279, 146, 83, -349, -285, 399, 213, -338, 176, 134, -218, 32, 345, 370, 194, 292, 424, -10, -104, 42, 3, -446, -195, -442, -617, -440, -343, 169, -1, -161, 59, 466, 42, -157, 288, 679, 320, 310, 449, 249, -234, 2, 65, -267, -80, -70, -124, -470, -41, 176, -207, -276, 201, -78, 98, 308, 407, 38, 42, 523, 345, -64, 58, 597, 127, -213, -47, -31, -148, -92, -108, -299, -460, 30, 105, -134, -187, 318, -95, -1, 292, 266, 103, -182, 147, 211, -23, -149, 180, -239, -314, -136, -10, -450, -367, -71, 333, -18, 155, 276, 198, 30, 157, 445, -309, -260, 411, 62, -30, -148, 202, -327, -404, -145, -158, -370, -291, 52, -350, -139, 125, 387, 136, 142, 310, 64, -34, 484, 413, -67, 200, 229, 211]
2346B11m79K82j17J32n43L41j0j87P8L49p3J23j64K26Q8k10L01J16m18j99L88
2367B35k51j02k87M79l65k5J5L93p26O20J12J21l42K02N08m85Q6K51m88L2K28
2388B11J15m99K6K05k47l43L24K82m58j52N92L93l17J26Q0l13j74P53m66j70P8
2409D6K76o7o76N2L50k84J83j02J34j79n2N1J65j84L14J9J11J03n0K76l82l9J37
2432B02J05j31k63M7l33J57J8K06l09l30N53j95K3M18L46o98j40P75j23k56L14
2453C86k32n56L71J97p5n82M82N9o27M46L53l8p53N43J99j11l39N51r9l00K92
2474A67J08k25M6J15j78l52N20j58m56K15R7nm86L08N13n18L8N84k97l8K22L00
2496E20j61l13K32j14k42P7l2j98J11O9o80O75k18J57K71j98k55L08M16k92k99
$$ y = [211, -268, 14, -103, 29, -514, -173, -183, -370, -292, 57, -16, 107, -57, 169, 257, 47, 348, 464, 46, -153, 235, -16, -118, -405, 74, -291, -316, -301, 92, -634, -14, 98, 219, -123, 79, 587, 102, 188, 439, -49, -17, 211, 326, -173, -147, 58, -189, -532, -208, 74, -384, -536, 56, 449, 132, 258, 338, 25, -149, 604, 138, -32, 46, 322, 255, -421, -369, -19, -303, -120, -222, -88, -267, -319, -268, -103, -287, 27, 46, 157, 260, 210, 486, 104, 65, 202, 307, 176, -87, -40, -373, -216, -198, 8, -301, -631, -78, -273, -250, 168, 514, -184, -324, 451, 328, 72, 386, 154, -402, -31, 166, 91, -491, -9, 50, -577, -131, 222, 184, -569, -26, 173, 62, -277, 274, 175, -125, 167, 275, 50, 96, 211, 33, -319, 201, 43, -413, -198, -101, -106, -592, -284, 229, -289, -251, 333, 36, -2, 220, 520, 359, 46, 278, 164, -78, -1, -33, -231, -120, -51, -731, -56, -274, -117, 154, -44, -299, 9, 425, 133, -166]
2517a66L76K93k42O9j38J9m14j7N81n85m4N21o06j71L28M62l97N1K68j51j42J32
2539B7L06k47j8L49r7n42K37L31o15l31Q04k90m15J98L37n34K33O26k46k49J23
2560a3K22k44O0K6K03l23L26N0k26n34M64l03K47k12K88o1k03K27j29M08m19J96
2582E0M33j87q3O8l45M30m80K47Jk17r6J12r5J20n9J54l23J1P2K28M8k90P70m41
2606A28k05L68j34j97K32j9k24j47K41J16m01j14N88k82m15N69ql18J71O23o52
2627h0j79M70q3k31J17L55j81l43L91k01k47R5J84n1k66K34k43r4J46K81J52k76
2649e0L85n0j74j08K33j87Q4k27J65k24j54K40j74J56L4n1k2l9MO9J64J59k63
2672c0L38P9k87J91m5j63J41j15r3j29O3O5q5k72L83m7l16M5P7Q0k62M87K8k05
$$ y = [-166, 210, 503, 261, 330, 192, 211, -203, -220, 361, -224, -268, 253, -353, -524, -196, 266, -131, -80, 188, 37, -105, 27, 333, 86, 68, 417, 320, -222, 15, 346, -269, -600, 204, -86, -501, -303, 34, -500, -267, 359, 113, -136, -13, 209, -35, 25, 51, 254, -69, 257, 307, 81, -453, 11, -292, -45, -257, 31, -30, -233, -6, -135, 273, -146, 50, 483, 296, 213, 281, -64, 366, -114, 133, 134, -83, -179, -67, -162, -42, -101, 53, -270, -259, -187, 41, 89, -201, 569, 128, -77, 291, 157, -40, 192, 173, -51, -198, 43, 159, -242, -356, 232, -50, -465, 104, 96, -222, -51, 572, -80, -259, 211, 128, -103, 14, 369, 188, -155, 236, 35, -212, -117, 67, 16, -250, -16, -259, -353, -207, 74, 226, -50, 335, 285, 111, 3, 236, 49, 133, -94, 71, -153, -307, -67, -241, -85, -51, -102, -124, -163, -159, -90, 74, 233, -30, 308, 387, 100, 291, 246, 83, 224, 109, 16, -113, -50, 15, -70, -342, 41, -6, -322, -277, -200, -120, -382, 105, 133, -72]
2696g2l4L51J25q46N63J25k39j4J23k91m5K94L15o67k9J98L56k61M1L1m4o1L69
2719B88J01m63N4J63J90k39j64J99j95r5Rk4K8K18N0k00M7J16j44L00Kj98J70
2742B13j28M1K4Kk40J12J76l42k3n4J35k28K59p2M8j48K51M47o32R1O00m31k12
2765a11L85l0l18k2J94Q2m25M9J80j07k65K66q9J71J0M4J65j68L99j82k42K02
2787A88J68k19q1N5q4j2j1K9l7l56K29L53nm76K2K98j58Q6L51m24J69J40K6o7
2811A84j96j96K60l13J83Q2k29j78L25J58n41K44J43j21J53N5lmk10L63J53j36
2833A76Q1m6r6p7o6q7J6J29j23l01L09q0Q7j57K12J09P3n4K01K6j71j1M2J18l20
2858a0q5k52N89m70n1K95k8l76J06K40Q5l31K19J84q3r2K18j31Q3J98j11j51J47
$$ y = [-72, -106, 245, 370, -476, 87, 212, -27, -41, 82, -209, -254, 40, 355, -312, -341, -143, 213, -48, -7, 24, -20, -81, 288, 389, -74, -20, 143, 333, 94, -70, 129, -66, -161, -152, -176, -148, 70, 120, -80, -33, 83, -61, 239, 241, 43, 213, 85, 126, 150, 152, -88, 24, 200, -142, -165, -219, -84, -312, -53, -125, -77, -225, 26, 473, -159, -68, 532, 101, -111, 274, 244, -74, -96, 98, 180, -245, -196, -16, -123, -388, -122, -211, -40, -30, 14, 179, 11, 410, 228, -14, 188, 356, 137, 56, 111, 27, 15, 4, 33, -4, -360, -131, 222, 217, -259, -237, 61, -97, -11, 340, -84, 85, 225, 251, 184, -12, -208, 52, -261, -78, 4, -225, -403, -78, 80, -461, -217, -74, -195, -42, 13, 10, 6, -204, 159, 312, 176, 257, 211, 115, 38, -28, -115, -99, 30, -93, -394, -85, -165, -78, -235, -23, 86, 159, 105, 306, 332, 161, 150, 192, 310, -10, -95, -347, 242, -228, -279, 16, -12, -388, -282, -42, 43, -288, -69, 115, 32, -60, 158, 27, 110, 308, 197, 46, 193]
2881A93J97o31K31o0N6j87O3J22p4qL67j26k35R1K43N0N7j56K8k12K4R2J08l12
2905g9L47l49j82P0j15p5L72l30L93Q0o40O23j99m1K45K18j98j93M70n69K22P0
2927A40J0k23k83P3k5R4K08L1k42LQ2j07M33k27K33p3K65j43l1o8j01j20J71q
2951I2m40L8L33j46p4K54j26k05J97K77r2K9J14J34k74J67q8j66J06k99K50k40
2973a59j9K20j87k6J50J82k22Qn2N5j90M23jRj73N8MK3R2m02L78k39j56K23k80
2998b81P6K26k4j8j03p9M08k00n7j93M38jj82J92j73R9l49L39j37K3J00k87m1
3021b24J22K53k20k80L12L7kK9O8K9l23L44j35j07o9K68j48j16L57j66r0O8j58
3044a51J58l81M43J61l47J52K43m08L4M3O41o80J96K18m2m39P7L39k08n9m45L54
$$ y = [193, 390, -241, -10, -70, -14, -201, -138, -16, -90, -98, 269, 143, -92, -1, 242, 292, 349, 193, 221, 9, 33, 125, 233, -79, 268, -81, -263, -193, -308, -383, -11, -341, 52, 132, -508, 115, -84, -125, 120, 338, 140, -53, 417, -152, 70, 140, 150, -73, -356, -283, -308, -214, -6, 25, -217, -214, -132, -239, 194, -33, 200, 127, 392, 249, 218, 150, 49, -71, 100, 92, -348, -310, 23, -123, -197, 57, -69, -274, -77, 200, 108, 137, 251, 385, 111, 278, 190, 24, 130, -169, 81, -159, -178, 42, -145, -171, -21, 161, -61, -53, -105, -50, -240, 183, 182, 191, 18, 76, 80, 103, 195, -207, 171, -68, -224, -1, -281, -205, 21, -3, -21, -124, -203, 205, 5, -52, -245, 193, 192, 10, 202, 29, 128, -221, 118, -19, 4, 104, -183, -224, -102, 151, -69, -349, -37, 0, -2, 27, 95, 124, -199, 145, 10, -97, -166, 102, -46, -162, 195, 29, -61, 7, -151, 7, -374, 69, 230, -117, 35, 278, -130, -96, -53, 588, -92, 104, 322, 280, -159, -82, 257, 49, -10, -455, -101]
3066a01J63Rr8j5J08j86J76o2K48k36L06kj33n9J25o6m6m3j8q5O3j80K06q4J7
3091GJ68m77K95J64Ol90J37L95k84o2L54M1n01M58j03k45J52Kj53l15N62j31m5
3114C5k27L51ll91K94j03j47L12K13j47J81j63j58Q1k34O1K2Q1J07k15r7J10j21
3137a58K04l4q9K19m2m2J13l72J90K10n02M58R5k92m4o0J97Qp6p4K66m35L48p2
3161A6J07j56J39K1l53L56j15L94m78j8j26lL12j88m32O67j56O6j04O0j31K8m4
3184a38K3J69j48J37j79J82r7J57k18L0J13J77n38M74J23m97K64k85J60j59L8
3205b12L05p6l04M01l4j67R7P9p8Q4j1l8K18k19J18ok20J94k2j9j48K01l51j9
3229b27L41L8k33M1J57J39k48P1K0r7L61m63K1n1k98K76k39O3J35J97M52m42J90
$$ y = [-101, 62, 71, -27, -42, 66, -120, 56, -6, 242, 6, 312, 310, 177, 118, 243, 177, 131, 88, 70, -15, 48, -132, 74, -10, 7, 175, -302, -7, 157, 163, -227, -90, 305, 21, -41, 313, 354, -147, 311, 208, -37, 115, 117, -36, -351, 211, 80, 35, -192, 159, 156, -235, 59, -44, -191, 121, 334, 187, 368, 205, 47, 128, -106, -45, -23, 58, 165, -50, -147, -37, -158, 46, 12, -77, 142, 100, 58, 171, -201, -11, 199, -303, 155, 250, -42, -86, -146, 51, 59, -17, -91, 175, -260, 88, 16, 123, -33, 106, 127, -226, 130, 15, 409, -69, -87, -213, -216, 96, -92, -524, 143, -13, 53, -51, 9, -122, -94, -138, -115, 54, -94, 43, -136, 46, -51, 106, -112, -82, 31, 208, -330, 144, 267, -230, 34, -251, -91, -250, -212, 93, 17, -287, 114, 80, -87, 10, 89, 11, 95, 84, 46, 264, 45, 163, 157, -63, 131, 109, 90, -58, 143, -208, -227, 114, 152, -81, -40, 117, 256, 8, 79, 99, 2, 363, -100, -79, -130, -428, -152, -391, -328, -193, 4, 456, 14, 204]
3252B04L3N7n6p7N6m31R7J43P3qK55o22L08q1j7K81k85K95j76oj9j4j4P9J41k81
3278f5J63k58L08J1j44l8N4j33r7K1P6K71l64L77l41Q4Mj38J58J60P2k07k22L43
3302I5J41j56k5j27R7j62M5J08p7P5r5J57r6M8j38K14k64R5J95n1k14J90J12j56
3326A1j8L47j33l04J30j8J12k99L0J15J03m13K70k69L9M08J10J81k34J12K01l63
3348A18n2q8L73m90l4J88r9j43J16L3J65k07M7L47l58J02K64m46L25j35j03K90
3370B13l11J27P0l6l22K62k22R5M0MR0j97Q1K51l79J82Q6J3N1Jj29L2l0J43M9
3395A64k28l1R1O4P3l24J95j05N8J10Ok08K66Nj76J60j35L7K09m3k41k5K87n90
3419c81N13J00l91K98k48M41m49Q3j25l72N05J89j04p3K73l30L6M34j6l38m8L85
$$ y = [204, 237, 294, 238, 161, 217, -214, -117, 26, 99, 91, 346, -276, 32, -49, -66, 215, -70, 225, 49, 43, 24, 10, -4, 75, 216, -65, 98, -160, 148, 159, 15, -23, 31, -102, -199, -178, -102, 169, -195, 182, -159, -75, -71, -209, -51, 109, 181, -26, -248, 95, 236, 80, 55, -72, 25, -137, -92, 16, -61, 14, -81, 76, -20, 28, -110, 104, -160, -65, 130, 79, -135, 55, 167, 11, -7, 340, 207, -97, 33, 15, 127, -172, -142, -27, 76, -337, -67, -336, -297, 111, 221, 402, 168, 280, 481, 118, 66, -22, 351, -139, -173, 15, -84, -227, -111, -78, 87, -120, -73, 274, -84, 18, 282, -164, 161, 26, -77, 213, -98, 29, 99, 63, -259, 3, -219, -124, -84, -80, 10, -187, -106, 145, -234, -52, 34, 47, 98, 99, -30, 2, -28, 115, 164, -64, -95, -4, 60, 133, -191, 4, -101, -43, 67, 73, -135, 131, 136, -40, 120, -15, 22, 231, 188, -53, -78, 209, -381, 132, 232, -159, 139, -109, 332, -117, -34, -159, -531, -26, 163, 59, -14, 259, -71, -35, 399, 383, 45, -3, 382]
3441C82l51M6j05O3j44J01Mk51K23k1J66j66N4J23P9J2j09N2r9J56k08J05K0j14
3465A8j8k54L22j7l3k46L00n7j2J7l7k30L01J45n8J81j76O6k11J9K27p1l7j4k28
3490a03N7J57j05j56J35O3J3m2k3R5k83J87J25m9k38J74J54o0k93J36J44j29n3
3513i4j51L36k45J50p1K63j25J62l64J36j82L87j06%j4J99j4k48O0r7n0Q0j04
3536i2O7jL54l85J04J11j66L9p3K01m8K40l46K53l50L72l09j39K55j73K58km87
3559c17L8L01k74O3J4N14m20L09R8m09L15J81l33K57j31l82nJ38P5j20J91j66
3581f3J07p7J72k58Qr5M74k33O8k29M7O1J00L07l30j07J49k25oK99k11PL17l44
3605f2J27k06Q7o0K28k5j51K72l12J11kK14j32j74J63j68K13k49K63R2n77L84
$$ y = [382, 31, 77, -28, 35, -109, -8, -4, -255, -32, -53, 113, -53, 1, 124, 203, 215, 106, 158, 59, 215, 7, 112, 132, 18, 0, -254, 68, 51, 18, -228, 72, 15, 3, 20, -17, -247, 54, 199, 141, 322, 146, 212, 1, 20, 247, 176, 139, 125, -103, -46, 111, 6, -150, -15, 48, 61, 19, -4, 91, -192, -5, 120, 71, -167, 7, 161, 101, -192, -56, 88, -41, -94, -245, 91, -154, -4, -75, 188, 63, 225, -139, -3, -185, 202, 96, 96, 82, 281, 267, 19, 79, -18, -68, 12, -92, -25, -26, 328, -57, 47, 158, -8, 31, -42, 159, 111, 351, 5, 258, -92, 280, -29, -168, 87, -86, 172, 170, -317, -279, 22, -252, -189, -175, 339, -81, 228, 326, -83, 232, 413, 80, 337, 206, -176, -181, -43, 32, -88, 103, -63, 44, -33, 139, -119, -111, -206, 268, 35, 103, -126, -79, -18, 82, 389, 59, -48, 101, -124, -130, 169, -42, -35, 282, -62, 65, -141, -54, -114, 114, 89, -62, 210, -102, 9, 7, 221, 89, -85, 78, -90, 123, -126, 137, 229, -348, 36]
3627C6rp9J81k72M0K83l85M52n02O62l60l17M35q0k06k3Q9R3N5l71J63J57k06
3650a64J38oq0K73j07j89p6L32k16P2K33j39j37J97n0K83n04K3j42L02N3k29k76
3673d09K69M05j76j32J37k9K0M6J25l95K76m8J0MK09q9m16J28l0J89l18J30m4
3696a38qN2J9K18j14j25L49k18J2j96j32L95j49lL8m0Kpl2J58o6j76K7j21K15
3721d0Q5q3J64k17K86o9j06J9J20j13R0j55J15m5m5P0j32P4J26m40L52J37l44
3744a51P1m5j14K52N3K68J32m80L09k04r6J74k49n5p9J28J5L8k46J31n0K7Q4o3
3768a50K99k6K06j18l48J2P6n9L5j4N4l17J83J97q0k5j31J75m4P9j55oL58j32
3792F9ol8O6j02J3K60n51K04K84p9q1J91j24jk76Q3Q4L5J07P8l58K62J94o21K31
$$ y = [36, 27, -52, 129, -143, -103, 180, -205, 247, -255, 407, 47, -270, 165, 85, -121, -144, -55, 38, 93, -278, -115, 42, -164, -26, -32, -112, 161, 54, -135, -211, 121, -95, -23, 210, 71, -66, 131, 81, 364, -140, -117, -259, 43, 96, -133, -409, -140, 265, 89, -43, 94, 65, 85, 131, 256, -139, 137, 89, 99, 103, 312, 223, -193, -65, -95, 94, -224, -94, -138, -146, -94, -75, 143, 29, -96, 253, 35, 47, -149, -281, 114, -35, -38, 0, -40, -38, -45, -77, 81, 15, -161, -134, -255, -40, 45, -38, 126, -91, 195, 126, 20, 39, 159, 46, 136, -19, 96, 51, 6, 76, -56, 18, 144, -296, 56, 193, -151, -80, -125, -239, 13, 66, 334, 466, -14, 295, 91, -5, 169, -80, -135, -214, -86, -71, -33, -279, -148, -198, -171, -87, -150, 149, 123, 329, 211, -137, -125, -49, -108, -73, -87, -33, -350, -167, 30, -50, -75, -206, -31, -75, 4, -151, -157, 201, 69, 63, 25, 91, -11, 2, 262, -289, -85, 199, 120, 39, 230, 106, 105, -171, -88, -4, 31, 138, 216, -142, 120, 314, -307, -76]
3817g6J49J16o4k5J6j38J20k30J3O3o8K55p4k41J80o4j7M6pJ74k03r9L30j60J63
3842A59o4j64p5K48j82J25lm21O26n70M34l9k48L85j63j0k13M99l01M0J32Ql28
3865a25J28q4J01k6K65l99K66n2o4o4j7J16k88N13k11l81L99K17k91J0M0K14L3
3888C00k86l8k58K87jj34K79J10m35j03K95j32K69K3k61P2J9k33K13K3K36m88
3910b43K92%K12m67K18o1J8L38l17j93K51r2K44l77L32k46O1J75j04j92N12n21
3932a60J24K63p5k37p4K19l05K03l11K01R7l4M9j36k9J84J04r7K97k26j76Q8m6
3955g7k4L5p6J30P4j1J74l65j01J60j55K43j83Q7J20j28K5L51r5j93J82j82k3
3978c2K38k13J4j63K95k32M4J41k05J48o8n0n3O84p51M00l12J47L57m09O8j30
$$ y = [-76, 73, 189, 125, 100, 116, -22, 98, -132, -119, -56, -124, 131, 57, -184, -4, -68, -85, -39, -46, 128, -75, -174, 156, -4, 159, 95, -69, -144, 104, -78, 47, 44, -377, 249, -321, 113, 74, -174, 211, 48, 38, -175, 324, 23, 63, 195, 203, -125, 3, -81, 20, -6, 259, -140, 126, 74, 10, -54, -71, 45, -243, 270, 59, -322, 77, 294, 3, 13, 53, 267, 300, 14, -24, -282, 5, 4, -130, 149, 259, -176, -279, 16, -116, 153, 176, -85, -13, 6, -227, -14, 9, 245, -243, 49, 49, 261, -206, 12, -49, -31, 307, -10, -203, 48, -44, 200, -177, 155, -91, -30, 145, 41, -151, 361, -160, -36, 227, 152, -85, -159, 60, -245, -42, -353, -152, -55, -89, -40, -176, -205, -21, 83, -14, 283, 57, -119, -31, -77, -101, -66, -142, -12, 62, 51, 225, -140, -241, -81, -236, 7, -176, -89, 31, -97, -72, 279, 184, -9, 173, -9, -32, 206, -7, 7, -156, 139, -93, -49, 92, -113, 35, -33, -83, -136, 548, -203, 197, -115, 32, 389, -20, 48, -82]
4000h2Q0k00J51l46J52J10j96P6N6M46k65k5J44p5l50K03L64k79K85m29J86R9
4022A05r0P0j97j93J73l0J0K9m4l5Q4Q8J64k2m20O41l10K34J2l26M8P1l57N47
4046B52m9j31j43J14J05l62K49l33M20m04O9K46o0Q3j3J84k92j19J27n0J1J76
4068H0l36J83n6Q9R2j71L44j23m99M25k88J34M9J56r6J62k36j8J28Q6R8q3n2K37
4092C05l19kj17J3J15o3k9lj44P0K35k53L9J01R4k84O9J04J23N2k8Q3l39M0K30
4117I2K6j46P9m3n1J80l67L42P8l72K47j33Qr8mJ66%j08Q4k3j68l0K75j12j44
4142b22L59k60L4j0J69j15K66l3l65L93k50L7O9r6O8K23k39M8k0j69n0K69k75
4165a69j22L84k96K27j55K61j53r1Q5K25l03J92M3K1L2k77J29l2J18n1o9Q2l8
$$ y = [-82, -2, -202, -51, -397, -245, -135, -331, -255, -199, 247, -18, -43, 101, 26, -324, -121, 243, -36, 249, -180, 6, 105, 15, 85, -112, -305, -132, -162, -152, -123, -167, -202, -118, -30, 134, 112, -308, 333, 23, 257, 269, -57, -9, 62, -295, 252, 203, 72, -71, 43, 148, -214, 35, -298, 122, -282, -213, 33, -27, 56, 43, 227, -65, -184, -57, -107, -96, 80, -256, -73, -129, -40, 52, -119, 225, 102, -397, 28, -260, -126, -77, 79, -17, 145, -91, -109, 19, 105, 203, 120, 68, 305, -14, -16, -133, -120, -5, -68, -97, -100, -244, -174, 61, -192, -153, -52, 42, -242, -173, -69, 54, 106, 78, 161, -178, -138, 92, 118, -28, 51, 8, -43, 137, -230, 112, 190, -182, 65, -68, -60, -158, -162, 4, 4, -104, -20, -43, -211, -241, 34, -78, -222, 137, -123, -89, -99, 70, -45, 221, 188, -177, 216, -34, 3, 72, -24, 44, 267, 28, 76, 56, -113, -163, 106, -169, -291, 93, -203, 24, -131, 130, -23, -114, -29, 196, -107, 85, 128, 149, 181, -96, 33, 1, 119, 68, -1, 81, 43]
4188D3j53N0J38p4r4k89K57K1m4NL53J49l10j11l2j8K09K5l88L90j35J06r7K7
4212B8M7l46M13m4j6J13j58j48k34L82M7n1n2l1j20N5M9J12j5K48l58O3P0J18
4236A72j88r3j61J64L89k25R3p5k6P5J9j40p6R5j27p5K74j30MQKm4o5K10L27n14
4262a07K04J82l12R0p9l3O1j64J80R0j60L54m97K75Rj02R0l87K49PR2l05L32N3
4286A22j75J47j25j87L98p5J79m14P9m6j75J62K92n0l1k37N0O4k91J54J95m0J64
4309A60o7j23q9L6J69j66O8K45j15l97J28Q4p1L06k96K01k54N8J06lL72r7k31
4332B4j58J2J29N8j50j05K25p0r1M8k5n9Q8k14J60J84m1n6J70rj77R9P2q9n7M
4358b8R6j41J23J4k44m6K71j02r0K54j88L29q4l92K24k14M96j50m12L81j85MJ00
$$ y = [43, -110, -60, 78, 4, -90, -379, -122, -101, -145, -140, 213, 362, 52, -59, -91, -109, 100, 125, -263, 127, -8, 98, 1, 28, 75, -271, 142, 98, 82, 195, 37, -111, -345, 37, 84, 33, -19, -50, -170, -115, -66, 46, 31, 279, -79, -16, 54, 172, -16, -109, -270, -106, 283, 58, 151, 76, 50, 125, 144, 4, -72, 23, -104, -179, 95, -35, -31, -23, -21, -65, -130, 80, 407, -107, 97, 279, -33, 57, -22, -55, 6, -158, 22, 112, -48, 306, -191, 84, 93, -9, 81, -306, -57, -50, 42, -263, 69, 122, -53, 94, -31, -218, 180, 105, 284, -130, -51, -97, -272, -110, 182, 132, 101, -136, -86, -22, -313, -159, 36, -4, 160, 93, -30, -119, -83, 86, -80, -12, 233, 118, -279, -151, -67, -138, 168, -128, 73, -181, -123, -17, -20, 352, 255, 24, -134, -122, 7, 65, -85, -190, 35, -35, -126, -78, -103, -162, -74, -288, -128, 56, 15, -41, 129, 120, -57, 42, 114, 25, -32, -28, 68, -73, 50, 64, -180, -226, 45, -57, -147, 107, -81, 248, 164, -228, -4, -218, 278, 128, -284, 97, -88, -84, 16]
4381A6j56J41J00j30k2N0o1k5K36l27J90J16j23j01N9k3J9R8Q6j11l60K32L1k5
4405i0n9m4K5M11j62J50k86j03K49oj66lM0J28j73J68k18K80R3k09j19O1o8K40
4429A39k78L45j66o0J41j41JK54k63K0LQ0R2j36K35k04nj0P6J10m60K57l21J73
4453a18q4J62J11j65Q8j9J6Q2l8k30l3O9M2K39l25M9L3J3K14j24j32J92k22M73
4477B93l89j53K21m9J21Nk01J72K45k78m1J10j97J68P4k1r4N0o0j10J88m6j26
4500a18K74m70N60j52j40n7K86l47K83k66K9P5j8K88n15K16j03J31K90l46j65
4521b65M2L6L96l02jJ75n1q1j14K41m2M0j57JpR3O6k12K53j89J17j25N1O3J50
4546A78j48k6n2j25K11J33q7j73J28k11J83R0k20L1K26l8O0j99N7n5k5K0j21J21
$$ y = [16, -140, 1, 101, -29, -51, -1, -62, -87, 149, -178, 12, 128, 5, -96, -37, -60, -41, 57, 143, 32, -328, -96, -65, -90, -149, -193, -168, 243, 81, 231, -55, -158, 91, 85, -81, -84, -44, 84, -89, 79, -139, 141, 234, 25, -94, -33, -101, 139, -139, 206, 40, -20, 121, -20, -19, 235, -28, -8, -5, 75, 167, 31, 266, 62, 57, 47, 123, 233, -227, 30, -291, -118, -202, -40, 71, -94, -6, -25, -9, 73, 35, -195, -228, -159, -117, 122, -203, -154, -121, -108, 106, -18, -150, 42, -180, 293, -96, -249, -28, -77, 44, 49, -152, 20, 265, -13, -54, 56, -141, 27, 101, 80, -14, 36, -24, -134, 54, 8, -118, 156, -314, 246, 94, -46, -103, 183, -164, 119, -147, -118, -43, -61, 227, -288, -72, -175, -44, 246, -100, -265, -223, -187, 209, -93, -94, 81, 30, -51, -165, 76, 34, 74, -83, -82, -89, 4, 70, -142, 111, -78, 39, -86, -35, 28, 178, 30, 4, -48, -173, 38, 171, 84, -89, 39, -172, 11, 101, -119, -88, 138, 100, 160, -39, 18, -37, -62, -42, -163, -42]
4570d2K61l97K21k0J07M0k33J18r4M6j89r8L36J18m8k98K96l60M60j89k84J58
4592i1K25k18K63j12o4Q1j37k19N17l45K30j52j6K33k08j69J50j38J79j33K34
4613A10k19m4K41n8k80M46q1k76M46k1P4l99L0K45j59k65M26m12K07P1n5l47L90
4636G0M0j72R4j13L0J50j15J06k4j88j09L87l05J72J62k10L6j45lm9J35r6l1J86
4660Hj33M7Q7r7M50m07L48l40J27p3p7j59K38J02l2j9j62K78m27J82n0Q2p3M6
4684e4P2r2k69L39K6o9K4J11l7J01o3k65R2J84j50j38K70K8J51k44m4o8J85P7
4708A67m4N3j84o3J4pJ68L9k14P8m3j43R6j59j43L13Q9k98J75O1J29k20M5O6M5
4733B0K08j24j51l1l09O51l61M66k12K9j45j44J11r2k9K00K84k55m5k19Q6j06
$$ y = [-42, 219, -178, 43, 23, 130, 170, -63, 55, -39, 7, -182, -280, 56, 174, 126, -172, 124, -236, 224, 35, -249, -91, 134, -84, 179, 67, 3, 84, -53, -272, 245, -100, 130, -22, -38, 195, -13, -182, -32, -170, 9, -124, 110, -109, -153, 88, 30, -250, 196, 115, -161, 285, 264, 338, -61, -31, 214, 55, -210, 216, -196, 11, 82, 27, -320, 70, 110, -62, 32, -81, -51, 99, -16, 90, 66, -122, -231, 156, -149, 23, 185, -25, 11, -134, -137, -186, -51, -147, -178, 8, -125, -78, 9, -88, 362, -45, 303, -37, 90, 17, -60, -219, 19, 121, 89, 70, -92, 186, -241, -59, -109, -27, -100, -54, 18, -74, -343, -4, 22, -47, -23, 88, 51, 152, 89, -176, -84, 100, -50, -188, 82, 110, 261, 17, -27, -95, 90, 167, 123, 176, -8, -71, -57, -64, 104, 143, -71, 7, -36, -179, -83, -242, -385, -72, 17, -281, -106, -45, 84, -136, -91, -25, 20, 228, 104, -47, -78, -387, 264, -97, 369, 157, 186, 41, -103, 8, -84, -113, 87, 371, 116, 71, -148, -62, -168]
4755a68K82j24J92k33k82M14k6p7L6L14k93l81M5J50K89k48j3J45j43k9j7J85
4777A8j24J30K42l50k74L11L5rJ78j68n7O8j77k9L59l90L55Q3j28L6j86K13j04
4800C2j95K08p2k33L41k5l2j5K2j90J29M7l3J12r1N6r8k9O2k33R5J01j38J52l2
4825e9O5k0j20Q6R5Rm0K38j17k3k25R3M27n12n6J22j32K26j00L58k06M5r6k20
4849a62K63j58J2J54k29k09L52l6OL0k46J25k9K42k05J25m8j76K13J2o0J35Ro
4873A14k62J09M4o4L9j61L08k92J66o4j42K18j64K16Ok3N6J69j41o4l09L48j14
4896gJ9j7k75L73j81J50P9p1n8k1M3J97j16j5l0m7o7k40K70K94m27K58j06j09
4920a04N6k2k39M09J22j33N6l9j46J4r4L68j61j5J38j02k21r0N23l78K9K79o8
$$ y = [-168, 114, -10, 182, -51, -333, 81, 55, -22, 14, 328, 35, -346, -301, -151, 138, -110, -123, 22, -121, -150, -167, 18, -106, 24, 266, -84, -358, -47, -12, -21, 157, -11, -68, 0, -177, -206, 153, -237, 118, 201, 73, 109, -77, 136, 32, -163, 45, -27, -260, 81, 56, 24, 9, 31, -159, -30, 17, -16, 96, 5, 61, -37, -66, -4, -237, -142, -41, -179, -27, -59, 6, -14, -134, -48, 47, 56, 16, 254, 137, 114, -111, -18, 409, -103, -159, -37, -169, 57, -43, 315, 109, 154, 58, -162, 101, -57, -45, 109, -120, -329, 23, -13, -7, 23, -223, -98, -127, 115, -90, 35, -13, -189, 24, 36, -24, 111, 120, 114, -148, -39, 5, -59, -20, -181, 127, -165, 1, -63, -205, 13, -151, 65, 71, 48, 104, 273, 132, 68, -241, 107, -7, 12, -5, -280, 93, -88, 62, 141, 70, 12, -9, 34, 231, 115, 100, 70, 23, -44, -284, -14, 280, -147, 111, 5, -104, -48, -70, -309, 100, 222, 89, 145, 106, -40, -26, -120, 248, 87, 72, 210, 108, -113, -203, 320, -58, -29, 250, 182]
4943A82%k51q1L4k8J9K00q6k71L20K9j71k3j2J10M5J25j68Q1j5Lm2Oj01n9J75
4969B1j78M15j96k09L62j5j54j01P5J47Mj02j0j0M5k91K91O0j11j95L6J96j01
4992b1j8o6k88L46L06j87j49N4O0N7R2j66J90j94Pn3p5n0%J30l45L65r1P8K28
5017B10j79p6J74k88R5RL1l6J90l71K56j12o4L30l43N0M35m61K4K0J80m1Pj00
5041f0j91K65r1M9M64m55P7k00n6J27jR5k74J45Q4m0L42n5k62J66j37L18l51P8
5065C7J38j01J00r4K8k16R8J47j9K3j31q1J67J53k8l7l34K92j46K61l80J95j40
5088f8R2l7J16k58J60K7k02L55q7j12J51j73j07J25j83J3R2j7RK82K6k54nK4j57
5113a88J44RL6J66l16Q2J61k14K31k09r2K07p6j42K94J00j36Q0L13l02j09j4P1
$$ y = [182, 182, -69, -150, -116, -144, -125, 75, -11, -282, 38, 67, -104, -127, -139, -29, 16, 141, -27, 54, 39, 42, 0, 6, -95, -154, 21, -157, 258, 62, -147, 215, 200, 46, -55, 20, 167, 171, 69, 59, 49, 94, -197, 94, 154, 43, -152, -116, 80, -21, -39, -105, -393, -47, 259, 72, -77, -23, 37, 94, 186, 20, 210, 16, 23, -30, -105, -155, -155, -25, -370, -5, -96, -18, 210, 31, -45, 129, -159, -64, -55, -24, -60, 130, -241, 15, -97, -161, 169, -174, -124, 311, -150, -126, -106, 74, 33, 40, -60, -251, 14, -77, -28, 436, -19, 58, -142, -198, -71, -72, 23, -251, -106, -22, -62, 280, 225, -37, 129, -8, 310, -41, 37, 175, 74, 174, 80, 108, -108, -10, 137, 118, 141, 10, -71, 96, 249, 221, 184, -150, 142, -4, 257, -123, 72, -68, 24, -13, 103, -155, 5, 32, -170, 185, 98, -14, 137, -36, -143, -18, -201, -188, -96, -113, -104, 178, 204, -50, -55, -31, -188, -44, -35, 1, 167, -149, -67, 94, -120, 111, -98, -190, 17, -59, -201, 93, 193, 57, 137, 450, 148, 39, 25, 96]
5136I6o2k21J87p5j16P3K47j66J60k5O5j83m72N65J21k31R2J92l62J84l6J58l90
5159a99K13Oj58L01k81J70j9n1m84L21L8R0J19l56J44J3J68j68K68m2n1k85K55
5182A2J83j54p9J17L07m26J01k53M88k17Lk94J48k3L3l5N4k58J27J10J86L0l49
5205a89L44m08J03J74J55j35Q3q6j18j25K88j84J23K3j24K90l20k1P2K0O2K19
5227B46l71K25j45j3K5K19l30J33K4j61K80j37J06j71r0M60m26L08j51N6l85J34
5249a64J62J2j05J22mJ7j93J57j85L24j30j53K49k98L28k3j14j08J84K28k77J
5271C0Ml0j44L69j40j36L3L02j33l7l17K03mJ99k2l32K79J25j25m50K76M18l63
5294Eo4Q0o9m6Qj87J32j50K73n2J20j51K65j88m5J86k21L90k28j91K22n7Rj72
$$ y = [96, 34, -187, 0, -75, -191, -118, 129, -37, 123, 98, 163, -20, -492, 73, 194, -37, 55, 247, -115, 69, 33, 191, -199, 14, 20, -138, 163, -118, 52, 33, -18, -502, -181, -143, -53, 66, -290, -146, -133, 35, -133, 135, 93, 42, -243, 12, 195, 41, -38, 79, 386, -40, 61, -192, 296, 79, 82, -212, -64, -87, -54, -89, -35, -293, -166, -56, 130, 160, -189, 155, -253, -150, 24, 179, 44, 127, 41, -77, -202, 86, -98, 25, 48, -76, 214, -106, -127, -55, -35, 27, 246, -125, 100, -45, -58, -33, 186, -144, -11, 13, -148, 132, -5, 101, -70, -160, 300, -126, 182, 31, 87, -298, -164, -2, 10, -95, 27, 23, 40, -153, 4, -181, 143, 13, -140, 109, -189, 139, 116, 2, -106, 78, 306, 29, 30, 34, 4, -140, 229, 89, -47, -14, 288, 155, 118, -199, 4, 0, 199, 177, -155, 124, 249, 124, -326, -50, 368, 5, -59, 21, -48, -94, -86, -273, -141, -291, -18, -70, 50, -101, 164, -24, -69, 117, -104, 286, 58, -133, 89, 32, 41, -131]
5318a31K8r1K26k2l7j23L4J50K43l70M6J00k85K48P5J47k96L32k42L42m56K12
5340A30r9p3P6j2j68l3K91k13K36j11P3M8k0m8j40j84K98j33J20k33L60l09J20
5363b4k0R4q5J2N0Q7l10K02p3J35k74K44n9K37r6j79j2K49j04R7j29l13L15Q6
5387A30j87R5k18J50K4R3k88N8k8m8M01j65k02N1j06L86j79r1L5J43nJ81j04j03
5411B3j05M2Q0NJ89k36n4J88o1j02j95J55QJ38J19k29J86Jj91P4k34R0n9K94k00
5436g4K36k26rJ28j16K2o1j42K21j26R4J69q5N2j59M3K08n28M56J43n16L75q9
5459A6p6R7l0K3P8O3j30j72K55k17P6m2Q5o8J52l22L10k46j54J31K31K0O7k68
5483a21P7J19j88K67k02L15k54j27L05j14j32K69k23l2R6K25j98j8j32J25J37
$$ y = [-131, -103, -194, 32, 10, -27, -150, -116, 34, 277, -93, -47, 53, -232, 16, 91, 238, -58, 274, 32, 374, -82, 130, 31, -42, 34, 22, -146, -179, 112, -101, 135, 24, 97, 145, 125, 77, -63, -247, 51, -82, 38, -195, 165, -144, -24, -44, 50, -35, -23, 27, 114, -196, 6, -67, 68, -206, 38, -21, 216, 120, -59, -71, 178, 74, 171, 42, -271, 44, 130, -57, 38, -180, -30, -6, 87, -201, -143, -171, -219, 182, 17, -185, -134, -240, 146, -33, -124, -89, 54, 49, 230, 126, 23, -82, -40, 40, 45, 234, -2, -56, 132, 71, -31, -226, -71, -63, 75, 194, -35, 151, 152, -39, 35, -199, -109, -168, 126, -74, 162, -64, -73, 55, -61, -39, -100, -242, -21, -147, -53, 116, 31, 83, -76, -33, 175, -353, 103, 246, -270, 105, 16, -60, 37, 7, 30, 108, 171, 41, -131, 124, -93, -17, -59, 26, -42, 110, -212, 98, -148, -302, -171, 60, 80, 147, -121, -44, 75, -113, 154, -48, 267, 13, -114, 191, 77, -55, 214, -9, -41, 55, 280, 82, 64, -68, 57, 194]
5504A94l11K37k01p2Q4K1j18K97j11J92J6j64J45q2m13K84j5K0%j24J32M0K19
5527B70m13L43m9l4k83k0j14L04R0j15J38k78K12J8p5k39L53j00J2J22l97J88
5549f7j24O3J85j3j51K35r5j01K21l11J44J64J06l33K70n85M12J9j12J51k49K85
5571A14R1k01m5P8K22q6n4j73n8K86%j1p9r0k1M2j58J7J79J53o08N96l20L5R3
5596BJ82l04L4R6j56J09K83k61Q2q8L9K6j03J7P2q2K66k32J21k95J22p1L7J87
5620H3j56J72j67p9J19J66j84J85j28J23M7Pk16K49l51L0L7L3J3J69j9Qj63K78
5644B56P4j95M7k47J25k68L08j32k03J84l3J45j68K27j8k95L92j84p1K22j49r3
5666g6l3M2K04j45R4K9N8j62l0l27M52J65n71M51K4n0l80J53L02m18L61J9l67
$$ y = [194, -117, 120, -81, -153, -69, -48, -166, 131, 20, 212, 228, 64, 209, 127, -286, -2, -17, 3, 3, -121, 11, 51, 270, -143, 200, 151, 117, -166, -186, -300, 4, 94, -21, 117, -161, 51, 69, -6, -245, 108, 8, 20, 142, -255, -67, -191, -128, 57, 44, -107, 128, 33, -68, 153, -158, -14, 150, 256, -77, 193, -392, 20, 39, -73, 78, -171, 114, 205, 4, -41, 37, 259, 173, 119, -54, -112, 174, 174, 163, 84, -6, -27, 15, -143, -126, 53, 206, -402, 194, -126, -91, 2, 184, -120, -86, 10, -146, -37, 246, -15, 67, -21, 18, 44, -59, -42, 30, -52, 214, -18, 103, -192, -70, -141, -104, 83, -73, 99, -68, -147, -28, 138, -46, 139, 11, 134, 181, 188, -28, 221, -130, -100, -63, -30, -17, 152, 133, 141, -22, 256, 330, 135, 182, -65, 60, -208, 100, -32, -235, -51, -84, 61, -107, 120, 102, -193, 199, 15, -56, 166, 17, -76, -109, -67, 137, -8, 86, 115, 173, 11, -19, -346, 106, 271, -300, 151, 175, 125, -255, -102, 200, -218, 143, 162, -205]
5689b05RK90r2P0m5M2P7j88k20M82j32q0J01J07j03k51M6K9k9J39j94J45j13M02
5713B87m03j35J90R1j27J57j5Nj15P0l09M96m49j6M25j30k4n1N0K04j69J25m56
5736b99J84K12j9j91j01L90r4K27k69j26P4p6kK67l19M35j42k8J77M4m36l8K5
5759a05J3K81mj82pj05M5JL0K27m44P3L21q8j44J2J49J12m90K34J05q0L95j92
5783A57q7jj38J40j72J45j08J10j21K10j94J67j62j4m2j68J54J81k56J64J10M
5805G9q1O6j91K11j33MK6Q4kp2R6k01R0N9l14J72J15J7J80j54l38K74k66N73l84
5830i0KK33r1J72j66k50J74J06nJ2j74R6J01P8j49j85K76J27m86L40R9l38K49
5853A31J51o10L47l77K55K46j65J42j78p3J48n1Kk34J05J43jL4j68Q7j1j8J62
$$ y = [-205, -196, 94, 2, 72, 27, 69, 146, -42, -262, 220, 88, 8, 109, 216, 113, -138, -92, -63, -92, 47, -147, -2, -115, 287, -116, -251, -61, 30, -97, 60, 45, 50, -65, 5, -304, 192, -257, -273, 152, 22, -2, -53, -3, 201, 32, 157, -299, -115, 97, 78, -113, -214, 176, 82, 309, 40, -86, -12, -88, -90, 177, -142, 293, 151, 123, 300, 344, -92, -130, -105, -92, 189, 185, 3, -4, -109, -64, -63, -33, 194, -250, -177, 144, 56, -88, -76, 73, 185, -305, -71, 34, -46, 349, 157, 70, 69, -69, 71, -101, 44, -64, 46, -75, 135, -59, 108, -54, -68, -110, -278, -124, 57, -199, -35, 75, 79, -2, 64, -127, 84, -49, -45, -19, 65, 63, -9, 87, -114, -24, 35, -279, -107, 8, 25, 205, 51, -287, -13, -279, 294, -90, -88, 145, 54, 226, 60, -190, -16, 90, 85, 97, -77, 19, 120, 198, 49, -136, 140, 267, -219, 121, 220, -118, 131, 282, -328, 19, -358, -103, 143, -22, 120, -58, -131, 17, -34, -32, -266, -161, -18, -19, 15, -153, -66, -77, -95, 67]
5876F7K6j37j61K80J53q6r6%j06j36K15p2J66K21l13j53K20j27OL84m00j16M6
5899a19P6P5j03j16J85K30k63O5O2l1j54OJ03P8j84J12j03L3K33J48k85j3Q6k37
5923a16K4J77j18L2j78J67J30k01O9j10K31j02p5q1J39J6J19J87l61J07o0j2j59
5946a75K68j57K07k98P4R7J04lk22L74k1k40o7O7l5K69k61K93m87K90M5l2rJ03
5970A84j31J95j82l2k0k26J99n3l6J21n6Jn1J48M3L5j94Q1P9P9j31j4l9n6k41
5995b97J43J54o6K11l32M05j74l8m7K04j94K66j34j22K80k57k74P4L63j86J38
6016A17J61l05N4R0r2O3j85J16o0l9L01j47l94K02K39o5o0o1q9L31o4p8j23K66
6040A78j37NJ00K0q3K2j5l27K90j8r0N5M1j19J87j89J18J91l12Q7J17k85Q7K33
$$ y = [67, 93, -44, -205, 75, 228, 142, 46, 46, -60, -196, 19, -53, 113, 334, 21, -132, 88, -39, -33, 351, -49, -165, -119, -43, 32, -71, -187, -2, 228, -35, 30, 92, 61, -93, -87, 16, 94, -90, 22, -81, -48, 185, 333, 48, 35, 121, -116, -92, 85, -33, -1, -179, -12, 118, -83, -14, -124, 107, 5, -70, -151, -12, 4, 123, 310, -51, 56, -4, -16, -175, 93, -64, 143, -155, -81, 16, 120, 117, -105, 269, 248, 8, -59, 8, -27, 242, -19, 274, -213, 77, 122, 90, 81, 184, 53, 248, 66, 34, 14, -212, -13, -66, -102, 19, -37, -36, -87, 61, 104, 139, -55, 26, 105, 184, 53, 39, 0, -56, -297, -154, 0, -66, 145, -187, 218, 44, 6, -41, 163, -31, 235, 101, -21, 259, 2, -272, -198, 165, -21, 117, 278, -27, 27, 117, 25, 88, -97, 19, -41, -80, 221, 74, -320, -118, 121, 56, -4, -65, -154, 177, 113, 35, -88, 178, 41, 46, 146, 166, 83, 105, 90, -237, 53, 35, -55, 0, 41, -78, 109, -80, 38, 229, -83, 4, 121, -164, -77, 156]
6064A56o9j63M08l14J32j69k41O6J94j50j90J52O6k5K88O3O1m58J09M4j38L5J63
6087B0l3J63n5k5J19j90O5J73k66j20K59j37K83l31J04L97j0l22j96J72kq9M5
6110B4O8l25K07J23j96MM12j67qK9j25K09j36l0q6K68q6j62K18j43k24K52k07
6133h1q2K36j27n0N1r6N27l32J64j02j33J71k93L16j38O9j61l9Q4j2Rj60J55J39
6157A15k73J03J34J23k5k99j27K67o0J1j87J27K94j33O1k59Q6l07K90N2j39mK67
6180A17k62R9n6M10k98j55J92R0l35Q4K50k37j1n2J29K1J33j04R3N2j39k98K3
6203b54J44J11N5k83R7K27j44J41j7q5J2K74k15k2rJ22j09r7j15J86J72k17R4
6226F8MO6q7j54K77j61j6m5L15k68Q9j39Q3m50J66M10J12l08P7l7p1mR0K32k08
$$ y = [156, 87, -76, 332, 18, 150, -19, -260, -194, 0, -150, -340, -188, -122, -147, 141, 204, 265, -193, -84, -40, -178, -143, 20, -13, 150, 95, 70, 189, -1, 64, 237, -29, -149, 110, -27, 256, -75, 29, 426, 416, 94, -102, 70, 68, -21, 24, 92, -233, -26, 97, -99, -95, 317, 150, 142, 171, 46, 255, 119, 89, 3, 271, 185, 23, 241, 98, -126, 126, -81, -163, 73, -54, -104, -53, -149, 378, 46, 210, 108, -25, 146, -147, 169, 31, 100, -61, -100, -16, -28, -19, -179, -24, 115, -158, -55, 79, 202, 177, -122, -249, 18, -42, -31, -218, -91, 203, 70, 131, -128, -42, -349, -59, -7, -146, -150, 117, -145, -46, -102, 308, 10, -145, 47, 137, -198, -114, 136, -101, -112, -164, -35, -14, 119, 15, 108, 160, 21, -277, -254, -110, 1, 56, -227, -130, 97, -47, 94, 77, -8, 4, 278, 63, 41, 32, 154, 45, -52, -167, 19, 191, -26, 68, 72, 138, 51, -103, 174, 13, -3, -48, 267, -1, 88, -51, 32, -418, -252, 158, 270, -38, 39, 2, -69, -73, 17, 249, 41]
6251D1j03K82Qn8k28j81J76Q8L0j74K61k67J11J81m57N8P5J93o8l1j05J09m1j28
6275b28J06J44O5Oo0J67m95K02L4o4n0k3L31J18q8l27O01l44m2P7P7l38L65k58
6299b4J5J9P3N5P2p5k68p2L72k93K69J92m55J61k27J50j28m8J34J62K8m4o9K66
6323B65j75q7k7m5K2K66p7j54J91k26N4j16Nj00M36J59l99oj43J64k10M8N4K9
6347g2L3J76o2j69N1J45j14K8k74L25%j97m3P0L4L3%N4K56j64o5j37J19j11M0
6372d4O9k5L8j46j12L08k94K65r7n9O1K67k08j18J0K31k99J81k06J07m9J78J07
6395A65k38j98K41J68p1J2p7o6J62l00L93l58K48N9j92l41L06L5K00l03L76k75
6417e4J40k21m4K91o0q9j13j2L2Q2L9k0P9j76J08j2J08k3r8K25p6Q4k84r9J70
$$ y = [41, -62, 220, 228, 170, -58, -239, -63, 25, 55, -119, 142, -125, -14, 167, -290, -232, -157, 36, -32, -63, -168, -59, -100, -228, -122, 22, 87, 93, 33, 200, -295, -93, -59, -123, -173, -196, 135, 253, 165, -162, 439, 95, 53, 130, 207, -131, 234, -24, -9, 10, 83, 138, 210, 135, -133, -205, 167, -126, 143, 335, -120, 41, -186, -36, -164, -212, -78, 84, 112, 68, -1, 265, 90, 3, -24, -69, -47, 219, 142, -12, 179, -47, 7, -109, -104, -204, 232, 391, -8, -14, -157, 7, -203, -155, -101, -72, -39, 137, 75, -94, -43, 102, -12, 16, -258, 67, 67, -130, -173, -103, -69, -36, -36, 18, 274, 110, 45, -92, 27, -84, -44, 25, 0, 38, -108, -220, 88, -206, 59, -38, -97, -36, 231, 23, -95, -85, 146, -153, 28, -178, -71, -120, 58, 165, -73, -271, -30, 138, 67, 79, 2, -64, 98, -202, 191, -167, 81, 140, -52, -393, -87, -52, 148, -155, 221, -54, 86, -135, -179, 112, 52, -37, -150, -162, -130, -48, -9, -29, 50, -126, -18, -30, 78, 55, -43, 182, 106, 190, -94, -193, -23]
6442b3k17J70K02j82%j3m2j19P4M45n35L66o5j4r9%J7j87J51j90K45r1L7k3N5
6467c8k79M16P8k36L5n6M40m57J13m5J04J0o5p9j2k6P7K19r1j32l1L09l67Q0j41
6492a74K94k14m5K73l0l7j10K16j26r4J2L8lQ0p1k3J1k35J65l4M5K79j1k54J11
6517F3p5r8M63j98l52L92l08J51pj4j38L22O4k24k3k8J70L7lk70q5J28O3j78K04
6542E6j26j01K73J8J6K4j29m6n6K15j27L3q6j59K58L4j15j6K22J99p21L26K40
6565B32j12J5j39j0K61%o85O32k07j02K88k35J44j49J10l5J83j00k84J83K21n7
6587A54k72M9j00R7j31K84j3o3o2P4m8P3n7J18o7O3l1j82L90m37R6J66j95L16
6611B22l39K29j7j19L40k36j09j28L06k4m31K07J2k03K43k00L16j01J98p7j07
$$ y = [-23, -240, -70, 132, -50, -50, -63, -105, -224, -150, 295, -240, 126, 61, 47, -52, -52, -35, -222, -71, -261, -16, -107, -70, -93, -38, -317, 99, 177, -59, -24, -80, 360, -97, 16, -29, 75, 85, 20, -59, -71, -97, -20, 199, 108, -24, -55, 254, -113, -33, -174, 120, -94, -139, 134, 104, 67, -43, 173, 47, -47, -35, 3, 0, 80, 9, -14, -3, -238, -73, -107, -62, 217, 206, -48, 63, -12, -110, 353, 155, -197, 195, -113, 38, 31, 17, -121, 201, 265, 41, 18, -10, 160, 197, 194, -76, -161, -33, 30, -148, 56, -70, -171, 102, 120, 136, 160, 31, -15, -71, 144, 17, 50, -36, -195, 63, 97, -18, -34, 188, 387, -334, -8, 232, 120, 135, -4, -14, 247, 247, -438, 194, -13, -115, 173, -62, 82, -67, 43, 8, 191, 91, -193, -10, 211, 154, -118, -69, -169, -72, -203, 81, 68, 5, -57, 17, -31, 42, -15, 103, 36, 99, 68, -114, 276, -161, -65, 101, -94, 222, -117, 112, 95, -24, 316, 80, -29, -157, 149, 125, -306, -99, -87, -290, -47, -247, 69, -32, 166, 89, -18]
6632a8p1K14k24J52Jj49J68k39L21j17J5k00PM05k74O3k03R1J14k4k66M22k4Q9
6656B53n09K82K8Mn1Q1q6j14j55K07K90o22O70k94j51J86K1k00J90n6j5J07L74
6679D40m24J83j92N4j98K47p5j16O0j6K46k63J2J67k58R1J42Rk15K20l1l24K76
6702C5L3P7k01L4P2k38N2Q9j74M96k21k34K6j34O13l15K74J0l54O8J95j93j48
6725a38L86j41J70k56k48L08l55J59OJ39J24k09P9k16L38j43j15j92NN39j12j61
6747c3J14k34L20j38r3L2N0J26m84O36k99Q9P4l05q1L82k96L03j83J72l4n7j61
6770a00J51L0J9l73J92L28k50j32K18k07k38Q4K34j29J46j40J95J32n9l52K92
6791D1k59L47r1R1K1l19K32o8j97m8L53j04J25k22K27P4j79Q7J67j35l45J19L6
$$ y = [-18, -89, 125, -99, 53, 54, -95, 73, -166, 155, 38, 53, -147, -140, 265, -9, 54, -149, -58, 56, 32, -234, 188, 164, 253, -256, 26, 54, 58, 7, 88, 2, -112, -267, -60, 230, -392, 278, -16, -167, 19, 40, -160, 30, -26, -41, 66, 440, 16, 199, 7, 61, -137, 110, 35, -81, -21, -37, 209, -54, -42, 125, -133, -42, 100, 109, -106, 114, 83, -241, 35, 68, 145, -56, -22, 50, -188, -136, -47, -221, 275, 54, -180, -154, -288, 325, 10, 284, 294, -60, 8, 203, 10, -138, 248, 107, 277, 21, -227, 81, -274, -115, -109, 30, 154, -55, 24, -192, 146, 3, -112, -304, -299, 240, 128, -33, 81, -153, 167, 29, -64, -32, 18, 144, -340, 296, -3, 86, 160, -145, -226, 156, -140, 163, -20, 152, 118, 61, -100, 51, 81, 100, -273, -81, 247, -3, -135, 83, -124, -362, -278, -44, -173, -27, -167, 28, 160, 101, -251, 41, -218, 129, 38, 129, 150, -169, 63, -5, -202, -250, 103, -1, 124, -98, 129, 203, 24, 111, 278, 143, -202, -83, -47]
6814d7L30l56p8L15q8O2jl80M7J73K74k21j46O8J69l76L45k17m5j77L23q2J77
6837F9o5j95K85k71J61J53j62J63j2n6j37n2K99k21l6J88j17Q5q0K2O7j32L76
6860C32j26j68K8j38J83m15O19j16j62j12L52k21j10J73j41j97K14O3j01K97k77
6881b3K3J20j3K2k00R9j91K49J97l74M8M3n7K81n6p1P4K0k25JJ49k17K23j0j82
6906g0r0R8K30j86joJ13k89OK87k14JM49p78N89r0j23P6j24p9J32j83M05l23R8
6931g2n8L05l07J0K30m9J66k35j19l5L37l1l32J67k0q4L3J98K18l57n5M2K35J1
6955A98l12J73q1J34o2P5j09k5J53j89k37K50l1KQ6O2j57J4k56M35P0o9l30J13
6979i3l1J89L9k2j32J22J12j20q5k3L4r3q5L45l8l12J57k9j00j37K46P7k5L1o
$$ y = [-47, 283, -73, -151, 164, 76, 138, 137, -243, -196, -23, 251, 30, -116, -48, 121, -255, 90, -127, -172, -349, -26, -108, 69, 4, -191, 94, -177, -16, 137, -25, 138, 126, 70, -67, -119, 180, -41, -77, 111, -6, 79, -1, 21, 88, -44, 332, 206, 38, 66, -72, 111, -304, 315, 199, 37, -75, 277, 56, -54, 119, -22, -219, -5, 58, -43, 254, -23, 0, 120, 107, 129, -71, 28, -163, 86, 283, -91, -43, 0, -57, 224, 168, 97, 171, 191, -34, -33, 116, -101, 122, 112, -70, -160, -62, 168, -18, -19, -25, 88, -201, -195, 92, -122, -121, 328, -450, 139, 49, -74, 2, -122, -201, -69, -252, 153, -170, -72, -130, 175, -132, -122, 108, 59, 225, -10, -129, -164, 173, 142, -190, -23, -43, -127, -94, 104, 322, -35, -90, -48, 187, 198, -114, 59, -22, 112, 50, 125, 16, -9, 144, -45, -282, -32, -63, -61, 25, 87, -70, -56, -312, 123, 193, 124, -206, -93, -124, 65, 104, 82, -50, 72, 184, 64, -21, -44, -10, -103, -188, 157, 119, -193, -36, -65, -165, -302, -56, 21, -4, 27, 21]
7004B1R1L8j68o3r7L74j96J4J00l27J46K23J27l07j43K68j85L49j26O7n29K98
7026b5M31o08J67m4p3n8L62p1j56j04K87n9J55l89K55j40%L03n24L13k73K77K80
7049C06k35nN2O4j3l29K1j12K44j65M25k41n2J84k06J11j11K56p2j26R4jj04j3
7073b8O5j91J11j42K67k65L52p8j2j4Q8o3m2J55l31K30O4l01J09O1J6K64k49m23
7097c57M19l8k62J87K43k50J11M3J2J29j18M8l21J30j27J58rQK0j82K68j03k94
7120b85K65K32l33J69k90M57l62JL55k81J09R8k56L7j69K58l9K79k65J12j59N1
7142a6Rl14M78J93l22K85l82k29M08K3n1N2j13j20Q2K9K02l33K84mj81q0M9qk4
7167h3J64K7k52K56j68P0j62p2K43J48k37j3L37m7o5K8k6j84j09L05k15k33J03
$$ y = [21, 112, 150, -18, -81, -178, 196, 0, 14, 114, -213, -67, 156, 283, -24, -167, 101, -84, 265, 139, 206, -323, -25, 406, -202, -35, -79, -152, -210, 152, 81, -75, -179, 108, 49, 204, -185, 70, -70, -70, 233, -291, 22, -251, 26, 306, 71, 66, 118, 182, 169, -160, -139, -251, -7, -172, 253, 12, -40, 144, -62, 49, -62, 194, 122, -4, 90, 89, -15, -28, 37, -154, -43, -185, 82, -183, 169, 91, 79, 65, 153, 90, 48, 203, -128, 102, 166, -135, -26, 35, 51, 315, 66, -357, 62, 24, -238, -51, 192, -58, 53, 96, 108, 237, 119, 167, -154, -24, -151, 7, -2, 6, 26, -156, 112, 9, -285, -20, 212, -121, 48, -242, 215, -147, -146, 209, -72, 37, 135, -121, -84, -253, 5, -34, 245, -20, 92, -67, -16, -7, -321, 157, 350, 28, 313, -69, -298, 110, 133, 82, 134, 21, -99, -17, 12, 214, -119, 165, 161, -20, -100, -51, -59, -83, 81, 108, -144, 112, -56, 14, -148, -220, 23, 171, -66, -79, 258, 211, 146, 174, 148, -36, -145, 160, -55, -288, -185]
7190a85L44j04Q2k90O1J67n2k38L57m40K99j68L11k25L45m34K82q0J0k51J76k21
7212b54K80K06m04p2K39J40k08P3J1J04J33J3k05M4K7r5o3J8PO9M1l00K36J81
7236B21K4k08j77J68K9j37K61p6k60j0J98nk8q7J09J39r7j89j19J64p9M7O4K43
7260A95k16K14k15J20M2j22k20K30j99J20k2j43J70o1P3K02q6k26K22k17L34j78
7282A7k76L43k31J36o8L13l96J14q8K2k41M20j65k21M09j81L90n94K45J26k54
7303a80j40L18L3L9o2PK10l46J72j8q0%L3j19J61pO6J9o4r4J08J42j53J1k28k8
7329b00J00K5L77j86l79L39J02n37L12J04m5O2m05L26l2K4o8q5K27n2J64k39l1
7352i7R6k39L29J17o1j27j84L47L21l77lJ79n10L4K22Q0j07j08K71k79LL37l68
$$ y = [-185, 159, 55, 137, -153, -92, 75, 23, -215, 142, -298, 1, -167, 144, -81, 264, -170, 112, 32, 42, -209, -33, -254, 26, 232, -172, -244, -5, 135, -73, 0, 11, 115, 248, 261, 56, 100, 127, 32, -31, -13, -6, 63, 104, -196, 40, 221, 245, 37, -140, 28, 57, -80, 181, 105, -155, -165, 33, 28, 0, -87, 22, 161, 64, -125, -244, -80, -159, -112, -48, 195, -21, 193, -22, 98, 140, 18, -202, 28, -171, -51, -73, -216, -46, -107, -34, 168, 82, -144, 78, -139, 195, 17, -259, 84, -147, -11, -79, 234, -162, -48, -136, -114, -355, 65, -100, -321, 88, -93, 297, -297, -52, 74, -180, -320, -2, 31, 70, 8, 15, 225, -121, 51, 33, -47, -47, -14, -133, 28, 21, 87, 106, 42, -52, 56, 198, 45, 56, -172, -200, -100, -75, 302, 116, -263, 76, 178, -359, -47, 57, 12, 74, -331, -5, -37, -13, -81, -166, 61, 9, 173, -66, -97, -1, -240, 89, 206, 145, 18, -166, 181, 502, 125, 122, 301, -209, -175, 47, 127, 20, -88, 183, -96, -93, 244, -124]
7375a24K74j26J00k34l3p5J64K25j87K54n14L9N86m09l9P3P3q7JL4J84q9J16k84
7399g8j15L9J2L26j69j37N5J57j04R0l7J53J05m45M41l15M6O3p5j95J38J25KP5
7423A57m19K93j41P9J04o1j32J96m7j25j41L44j11j04R5Q6l38M5L55j97K19L24
7445D81m80k10J16J3J03J62k66K62k49J66j37J22O4j04R1j00q7J14J98n33K60
7466a4l20L57l19R5J92J57j26q3K93j70j32J04J79k21j1M4J35l03J45o6J80J30
7488B46n23L41L9k75J43j7K94l22mm9R7J05m2J7J74k77L0P9j12p1K96k21J42J4
7512A04j41k5L7J26L1K6m0n7m2MJ51k0k22J86N1j32k72L23j45Q6Jk32K1J00m7
7537a28M32l69J1qJ5j67K41R4j14k08J74o3m3O9R5j74L04l14N3K05k14Q5kq4M4
$$ y = [-124, 150, 24, 124, -110, -143, -218, -54, 171, -16, 238, -276, -237, 349, -60, -99, -26, 47, -40, -39, -5, 179, 90, 206, -78, -193, -154, -142, 184, 15, -122, -67, 90, -14, 76, 39, 192, 297, -148, 293, -22, 24, 87, 12, -183, -45, 80, 82, 157, -262, 31, -110, -31, 73, 12, -120, 76, 29, -96, -237, 107, -4, -108, -13, 73, -265, -220, 135, -62, 157, 481, 1, -209, -93, -80, 23, 185, -81, 181, -68, 98, -39, 83, 147, 43, 134, 34, -53, 61, 259, -274, -14, -334, 23, -296, -201, -9, 148, 22, -61, 232, 62, -70, 34, 213, -8, -19, 25, 160, -143, 2, -64, 116, 246, -277, 64, 103, -172, -29, -46, 248, -74, -78, -127, -30, 75, 33, 50, 224, -53, -23, 56, -56, -127, 169, -52, 90, 104, -37, -62, -25, 101, 132, 158, 118, 61, 19, 23, 174, 154, -68, 118, 169, 37, -235, 88, -57, 29, 30, -202, -181, -81, -128, 304, -65, -54, -62, -47, -214, 27, 121, 7, -201, -27, -90, -133, -64, 31, -143, 161, -153, -100, 105, -109, -24, -26, -110, -66]
7562f6n2J46J61j24k01L25L69o71N5J45q8J95l37o5K08l5Nm6j94L53j24K9J58
7585A46j14O0j03J79o5L5M1M2n67K59R6M5J87j15j62K94k59J91k5j37J28r6J05
7608A65j10j26J32J35M2j70K28k29j25n9J23o3l8j53L13K29n01K12J42n2j25k8
7630e8p6K04M8j64j6n0j19K23K9J72j27M4j49k44L81O4l7L6k1j41j09j8J86J22
7654A80k83L9J46p9j40oL79j14p6r2j9M1j33L44j38P3j12o1J45j17j0K12j56k10
7678a87K70k17J67J95k29J40m71M26j84J68L2J8R9Kj72j06J74k89n7L15K09q9
7700B14j91j66J7P0j75K16p9n8K09R6l53rN5L24k06L01m14J94j66K2Q0J73l54
7723b00K8j17L68o1L7K8k7p2m7K20m7p3J04n5o1j10N6J54k33R0j11K05r4JK30
$$ y = [-66, -118, 28, 189, 65, -136, 189, 558, -113, -58, 87, -1, 194, -143, -208, 0, -35, -30, -76, -270, 83, -41, -12, 146, 32, 92, -11, 168, 103, 138, 179, 221, -346, -87, 9, 54, 241, 126, -36, 258, -1, 190, 165, 28, 156, 60, 165, 55, -71, 61, 196, 238, 68, 296, 67, -58, -117, 6, -57, -95, -248, 65, 294, -207, 5, 147, 95, -30, -58, -134, 70, 118, -46, -62, -112, -231, -8, 21, 193, 66, 110, -39, -283, 98, 162, 125, 161, 140, -1, -110, -128, 58, 180, -103, -64, 82, 3, -137, -143, 236, 122, 46, -46, -65, -24, -157, 187, 49, 122, 10, -51, 94, -23, -33, 179, 23, -187, 83, -134, 33, 228, -1, 139, -332, 94, -90, 78, 110, 128, 227, 229, 57, -49, 125, -164, -221, 94, 303, 214, 23, -143, -126, -56, -231, -15, -94, -152, 57, 153, -200, -209, -154, 170, -36, 265, -149, 45, -121, -99, -19, 154, -200, -172, -289, 79, 18, 55, 83, 56, -16, -63, 157, 110, 37, 141, 86, 25, -85, -29, 125, -108, -18, -129, 76, -18, -17, 213]
7748B13l42J5K30j33K87n34M26l40J55L45k06l48J39K74n6k51q6J30K06j35k37
7769b48J30P3J16j57o3J49K49m24J58J56L7j84P5K85n03RJ41J04j30J92k13J75
7791A27l7n22L40L17k62p1k08K10j17L78m00L81O9l21P1J92j04k41L25o2j42K9
7813d8j02L0N5QJ0p9P5%j82O4K49j22M7k00J74k85L49qR9r0k04p0K10kK0PO9l57
7841b83P0M54Ml84J73p3K9O8oJ14j55j07p8J69k17K10J09k33J67K01l59Q9J79
7864A41k12n8N2j18L31o5R4l20L07J04m16L59k17l16N62k84K91l48J7M6L0K07
7886A87l19J64j36M6j36J77j93K07J55l19M8J87q9k23L84l34K82J0N9j55J33K50
7908C85k81o5k0J99k03l1L4k42J01M8l0J63k68K54k00J49j66L08n8l4n2o9l17
$$ y = [213, -129, -114, 116, -17, 270, -264, 162, -178, -23, 322, 116, -232, -93, 181, 125, -126, -212, -82, 124, -11, -248, -118, -45, 71, -86, -149, 0, 249, -175, -17, 139, 176, -8, 67, 352, -151, -142, -1, 103, -27, 165, -48, 127, 90, -432, -92, 225, -37, -108, -316, -106, -223, 155, -245, 136, 205, -116, -45, 147, 43, -198, 127, 65, -77, -48, -150, -120, -65, -57, -47, -126, -51, -51, -233, -169, 80, -42, 5, -195, -21, -306, 43, 35, 134, 44, -160, -230, -20, -22, -2, 5, 74, -283, -213, 241, 245, -139, 34, -39, -10, 58, 52, 166, 11, -96, -174, -5, -222, -12, 97, -136, 31, 232, -127, -38, 141, -71, -129, -77, -195, 136, 71, 165, -155, 152, 256, -160, 199, -18, -334, 228, -56, 235, -113, -96, -50, -20, 187, -132, 32, -104, -58, -194, -17, -210, -3, 152, -167, -119, 68, -21, -244, 140, -194, 88, 98, 157, 2, 135, 385, 104, 39, 19, 218, 15, -16, 18, -224, -123, -75, -105, 58, -210, 44, -156, -7, -173, 135, 77, 43, -9, -78, -395]
7931c95M55J29l89L21P8k10J26O1l16J48J05k2M9r4j18K30J52k25l9j17K18j09
7953C8n4J59j0k21l0J79J86n44J51J37p3J2n8L8J48j06L05m82L19l5p8rK13P9
7977B64l94K37j35j54K31j4Lk65J11K60k36L36l53R6J70o2l03L82j99o0m8J04
7999b9N4m5q4K66j65J7j39k3j62M19j46J0R6J16L6n16J22L10q1kQ8l04K24LoK44
8025C03k06m02J46K72k01L4l4%k9K24J13p5J97m53L7n7J85J65j41o0n1J07j79
8048a05J19J25K7m55K99j16N7k8K21k00J16m2L07m09K3P1n0j01K04q7q7J37Q1
8071A07j90k1J1J27L8n5o6j29K58Q9j3k43K55l06L09l7j09O2J21j40j53K21R3
8094B29m20J42K03k19K14l99K21R5l02m8K69j55j22L35l1K7o0Q2n6J06k85J56
$$ y = [-395, 60, 189, -200, 121, 199, -11, 115, 176, -140, 8, 113, 91, 140, 46, -72, 158, 310, 85, 46, -71, 147, 38, -16, 143, 133, -88, -118, 61, 247, -297, -146, -9, -82, -70, -128, -90, 58, -48, 257, -225, 94, 59, -19, -28, 185, 264, -130, 107, -28, -182, 49, 35, 38, -227, -116, 144, -92, 244, -109, -13, 157, 95, -208, 174, -25, -85, -133, -29, 25, -20, -104, 162, -3, 14, -125, -148, -310, 109, -37, -27, 69, 185, 221, -295, -173, 137, 56, 54, 142, -162, 62, 65, 59, 303, 97, -305, -159, 113, -88, -54, -88, -88, -117, 107, 220, 145, 342, -111, -74, -131, 54, 219, 78, 18, -33, 74, -105, 14, 139, 166, -289, 10, -106, -49, -77, 144, -56, 60, 18, 325, -84, -61, 10, -40, -141, 63, -24, -111, 26, 107, -83, -104, -93, 34, 72, 17, -49, -178, 80, 169, 156, -87, 168, -138, 171, 134, 25, 87, 208, 68, -85, 136, 229, -191, -49, 154, -65, 149, -250, -29, 66, -236, -284, -15, -170, -292, 43, 12, 39, -21, 61, 5, 111, -174, -18]
8116a8r9p6K34j11K15q0j24J0N2pj07J57k08J42K67j60N0o7j9j38j01K88k88K40
8140E2J44j70J34l73K59l7n7j85K26lK48m89P9J50L8J1j52Q8K26j05j98J76j52
8163i0K17l54k7K74n2Ll2J65j85P7K4j1j51K31K25j66k17J70k57J50P1L1j62J28
8187F2j08p5j16M03
$$ y = [-18, -117, -193, 41, -70, 145, 65, -59, -49, 3, -4, -111, 46, -162, -20, 247, 87, 137, 70, 51, -87, -188, 100, -188, 52, 196, 26, 160, -213, 46, 9, -48, -233, -7, -10, 238, -251, -172, -22, 16, 27, -125, -37, 189, 84, -114, 62, -90, 127, -227, -254, 20, -32, -29, -61, 104, -81, -4, 20, 9, -142, 89, 314, 148, -69, 101, -156, -6, 65, 96, -66, 62, -46, -121, -237, 166]
8191A66
$$ Imaginary data points
##PAGE= N=2
##DATA TABLE= (X++(I..I)), XYDATA
0@%%%%%%%%%%%%%%Qj6J6j6J6k4L2l2M0m8N6o4P2q8J04j20J36j52J71j95K22k50
36a32K81l16L52l93M38m87N41o00O64p33Q09q93R86j085J195j317J452j603J769
55I28j956K167k408K689l018L405l874M462n214O216p627R779j3497K1682p6459
70f2725N7723R5418j45019n893J10985k3411q7647O8403M2384o0211p474M9483
82C2016k6426j5965L4289o485l6957K0766J2536k2813K277J6457k0911p679K0183
95A288J512j1511M507O84l01Q000m471m248J7348m256k4868J5091K6549k4536
109G88j9016K5787K734k4335J2546J6686k3472o104K5324m890j9060J6672J2894
122A6554k2009p049K2943N318j9408o724J3758M776j4740l862J5567j790k1798
$$ y = [0, 0, 0, 0, 0, 0, 0, 0, 0, 0, 0, 0, 0, 0, 0, 8, -8, 8, -8, 8, -16, 16, -16, 24, -24, 32, -32, 40, -48, 56, -64, 72, -80, 91, -104, 118, -132, 149, -167, 185, -208, 230, -257, 284, -316, 348, -385, 424, -469, 517, -568, 627, -690, 762, -841, 928, -1028, 1139, -1269, 1420, -1598, 1807, -2067, 2395, -2819, 3397, -4230, 5549, -7948, 13734, -62725, -5002, 90416, -54603, -60496, 50489, 27078, -60569, 7834, 50218, -9993, -17467, 32016, 5590, -10375, 23914, 17429, -19528, 1238, 13774, -9039, -6762, 9695, -11216, -18895, 1288, 2800, -8711, -4204, -3520, -3821, 4179, -292, -4540, 12808, 8552, -16316, -1225, 25324, 788, -18228, 7559, 10293, -14042, -1496, 15190, -8282, -14386, 10938, 6048, -13012, 3660, 16554, -5455, -12504, 10439, 15757, -3651, -10375, 3383, 8159, -6581, -10443, 5124, 3334, -18464]
135a8464P691K2653j4480j5573K3069N380k4530J1627K6401k1991j4886K9887
147A6784k88k7796J7270J8169l3165o518L4754j2581l2083K4917J6395l5934k121
160b2197L6663j1842k7696K2353J6475k3494Q79K3800q407j5179J4328Q419j2784
173A318j412Q844l982o581J847K868r16n833l235O511K370r169J217J0589n879
188a443q679J1958O906j3482q01J3714m945r611R350N063j2287j382J0573k558
202B376q386M442N169m708l772O021M737n485l900P423L391p991r58R428m382
217C405j0251Q167O169j4162j414J3632p892j2255J4890O537j9523L677K0227
230A1207j1007j3178K0188O688k0447M121J9154j0986j2070J4174K662j5210L878
$$ y = [-18464, -10773, 11880, -2600, -18173, 4896, 10276, -14254, -2627, 23774, 1783, -13103, 16784, 16496, -11300, 5970, 24139, -9026, -15544, 19210, 6629, -25454, -537, 15858, -20076, -22197, 14466, 2624, -25072, -2719, 13756, -9738, -8859, 14941, 6534, -8645, 5683, 14102, 1318, -94, 8750, 4768, -1813, 34, 2902, 1986, -3847, -7082, -571, 1799, -7370, -6153, 4436, -1443, -10122, 1836, 8742, -4740, -5541, 8173, 3228, -6383, 2967, 8030, -4257, -5639, 4934, 2376, -6010, -1568, 3601, -1107, -4879, 1142, 5879, 394, -3506, 3917, 7308, -683, -1641, 7787, 3405, -6846, 1321, 7490, -6672, -8086, 5546, -2346, -14601, 289, 6826, -12697, -9020, 11207, 200, -12978, 7210, 13898, -6549, -2428, 16726, 5740, -6330, 7844, 10506, -4704, -826]
243h26Q391j0212m751Q283k601p082M746L119n136J266L993j336R43K130r56K288
259B259K574m156J455N501n053m934Q568k27j1533L746Q735r386o650J1606Q49
274C354j1574M415Q515o943l165R063j044p065N538M621p228k191P352r40o863
289d155J136M934r93m973O90N274l39n039K561O138l828l784P346J281q600K842
305D91Q009p895o447R627J382j2727J907J0090p953p159J0325K508j0913L567
319e188J0552n996n704R700M406p966m80Q296p24o205N88M078j646m546M29J716
335A310k486l099K364L10m640J659N537m110m467Q935L719r548J219J1153l483
350D373r137P581O177r810j663Q777l473q131O062M120q791q97P779j934o473
$$ y = [-826, 7565, -2647, -7398, 885, -1716, -8798, -4052, -933, -6069, -4803, -810, -2146, -1203, 927, -29, 2259, 4833, 677, 2132, 7633, 2580, -2354, 6214, 5987, -5546, -1800, 6935, -2451, -9101, 2505, 3354, -8220, -3805, 4710, -2233, -5398, 3665, 2621, -4444, 1094, 5715, -1513, -3704, 3648, 2708, -4155, -3019, 1915, 922, -4051, -3361, 1913, 1574, -3465, -904, 5234, 1406, -2378, 4968, 6249, -2351, 491, 8500, 605, -5842, 3785, 5167, -7560, -5653, 4437, -3516, -10675, -350, 2158, -8755, -5188, 5364, -632, -6336, 3364, 7770, -196, -676, 7620, 6896, 691, 1279, 5357, 3711, -835, -406, 1310, -1176, -4275, -1911, -1601, -6241, -4582, 955, -3155, -7622, 1313, 5032, -4516, -3297, 7856, 4373, -4764, 2817, 8994, -816, -2479, 6298, 2825, -5306, 756, 4876, -3915, -4812, 2967, 1033, -5440]
365e440M473M275m758j313M877j01l162J157K363j736k642J506K124k034l805
380d216K881L506m464k962O224K620o994R22Q231k387o367N822M540p705l44P514
396F821m231p363O526L198r855j185R206m046r021P506N953j0005j236J1847j503
411B612r864P790Q605q901m007J1339P20j1132L707Q208p462o785Q238J404r810
426e338Q28P360n164n232O412K697o684N33P223j962m444M774L388m148j041M354
442C556l63l635P63K674k109k854J418J720k059j853K523J485k555p03M055j17
458A946m122J694M469k834m189M419K367o467j034O911k368p361M304N773p499
473c991k427R774m01r005N236Q874p399n236J1063J121j1332L303R863q007p501
$$ y = [-5440, -967, 3308, -1450, -2763, 2114, 2013, -1149, 8, 2371, 635, -2007, -501, 1623, -411, -4216, -1335, 2171, -2293, -5255, 969, 3589, -3405, -2483, 5748, 3361, -3006, 2816, 7356, -349, -693, 6821, 2590, -4773, 1753, 4951, -4904, -6089, 3117, -929, -9950, -2444, 3509, -6496, -7732, 4115, 2612, -7252, 538, 9143, 242, -3765, 7574, 8294, -2838, 869, 9077, 1615, -5170, 3068, 4472, -5338, -4510, 2850, -2314, -7546, -1134, 1563, -5121, -4588, 2635, 673, -3771, 1003, 4391, 243, -798, 3556, 3193, -442, 321, 2995, 886, -1968, -550, 1170, -889, -2742, -219, 1266, -1289, -1992, 2063, 1946, -2176, -482, 3987, 1153, -3036, 1383, 3750, -2717, -3751, 3160, 792, -6569, -2265, 3508, -3991, -6418, 3356, 2955, -6050, -814, 8060, 661, -4575, 6488, 7609, -3723, -420, 9443, 1436, -6065]
488f065R660J338j1580K114Q965p327o769R558K586r846K955Q997n997m385R712
503C916J904q389K845P485m988m374N946J290o898p6M269k242l535J280O17j751
519b701o9J296R9m80L04O44J523r7o76J473N43k068L22K978j311l690J838K283
537B211k984j529L725m47m253J905M305k924k567N082O28n681J887O520m158o359
553d639N873L254p743o24P545m260p637P394M697q989j55R784l892p766R281O401
569H524j0628j315J1406k942q844O808M735r853j671R528m448p536O246K405q614
584f199N47Q070l518n449N080K975m175J824M045k349j195K690P72j611J283j95
600B595j950L73R7j379O52k03k975K99L280j588k634L224M62l359J962M227l286
$$ y = [-6065, 3595, 4933, -6647, -4533, 4432, -2895, -9664, -106, 2480, -7366, -4411, 4586, -1411, -5796, 3916, 5820, -2569, 276, 7761, 2773, -1601, 4345, 5635, -1263, -1339, 2930, 688, -2847, -1567, -950, -2701, -2770, -1474, -1375, -1855, -1551, -907, 616, 519, -157, 1316, 1859, -209, 113, 3091, 1780, -1910, -72, 2211, -773, -2302, 1423, 976, -3277, -1372, 2933, 9, -2558, 2524, 3152, -2529, -642, 5878, 1720, -4639, 1234, 4488, -3255, -3879, 3666, -594, -8231, -837, 3860, -5129, -5284, 4500, 608, -7158, 2123, 8524, -2104, -3419, 7987, 5045, -3799, 3009, 7744, -2109, -3780, 5748, 1300, -6236, 10, 2415, -6199, -5652, 2418, -1100, -6549, -1469, 1506, -2669, -845, 3200, 851, -344, 2346, 3118, 1507, 2790, 2595, 645, 1018, 1115, -264, 388, 185, -2790, -2491, 789, -799, -3433, -209, 253, -3106, -1144, 3083, -203]
617b03k435M949K11m483K172L996m333m009N262K145n738p27N437j839m321M409
633D93L623n301j808O142p9n151K636M751n573l678O973Q37q381K059O141n937
649b253m190P566M47p760L106O645n299j995P383k84o446M380N163n600j384N343
665D822j895m775L499J802n130n09K715k005k048K887m75k511J577J084j143K177
681G2P91j782J513K399k857L35L702k220l947M102K332o285l15N308l329m392
697d573M770K162o028N00N622k545l615M550K264m667l9M692j545l823K196K265
713B186l070j248L122J78l869J037L407k380j725L417J571m456O64N106j654m673
729b387L976L398n450j814N389j392n918K957L578m872j914M829o55m110K836
$$ y = [-203, -2638, 2311, 2522, -1961, 211, 4207, -126, -4135, 1127, 3272, -2466, -3193, 2244, 405, -3916, 493, 4116, -1185, -2993, 3149, 3070, -2081, 555, 5306, -267, -3945, 3028, 3865, -4516, -2457, 3684, -2253, -6443, 1123, 1570, -6190, -3084, 3561, -1738, -3733, 3650, 3366, -3080, 1300, 6463, 863, -521, 4822, 2927, -1848, 1651, 3453, -1677, -2186, 529, -1476, -3524, -637, -1112, -3623, -2046, -962, -2105, 72, 863, -919, 594, 2993, 136, 471, 4173, 1953, -1994, 2108, 4440, -1845, -2160, 3148, -181, -4573, 197, 2359, -3669, -3169, 2453, -92, -3707, 843, 3107, -1560, -1599, 3093, 1548, -2275, -79, 2186, -884, -2132, 990, 1168, -2701, -1664, 1743, -637, -2362, 1055, 2626, -1830, -1166, 3940, 2286, -2387, 1589, 4987, -463, -2277, 3112, 1720, -4198, -1241, 2337, -2535, -4449, 380, -275, -4385, -1549]
744a549L104l070l86L513j33j685J916J242q71q17P39j5l77j257l80J005j369
761c90k152J331J572l320j012M103j93l913K775L688l513j028M782o7m455L046
777A254K861m007j001L764j277l913K575J793l790r06L738p99k934J554K529j759
793c18j209K032J168j804p26K169Nj854m98K381j184k689K062J709l084q33L975
810A302r39l218K845K887l490o86M557j065l721L149K401m360j392M071n79m689
826b927J595K387k423k203K393N65j736O01J646M0j170J404J428j055l53K209
842B401N75k709K87K877j660l365J904K400m022j736L440l73l456J439K838k600
858a760j115L823j98k671J865K180j695r93K560n27j520M94J029j390q94Q95L85
$$ y = [-1549, 1555, -1515, -1901, 1612, 1479, -206, 1710, 2952, 2081, 1264, 2003, 1988, 1611, 354, -26, 979, -390, -2542, -1211, 361, -2959, -3971, 132, -61, -3974, -1199, 2489, -1024, -2052, 2730, 2663, -1792, 1254, 4115, 108, -893, 2871, 1594, -2319, 256, 2049, -1741, -2647, 1091, 292, -2642, -1088, 1441, -318, -1527, 505, 1673, -131, -857, 1312, 1317, -537, -1035, 1346, 162, -2527, -465, 1244, -1840, -2673, 1302, 363, -2855, -10, 2877, -613, -1299, 3258, 2193, -1528, 1621, 4022, -338, -1730, 2341, 1762, -2927, -1332, 1055, -1368, -3571, -1178, -613, -2349, -1748, -102, -62, -1232, 172, 1600, 545, 192, 2401, 2976, 267, 554, 3431, 1771, -1594, 310, 2710, -1312, -3048, 392, 19, -3437, -1998, 840, -1760, -2875, 948, 750, -1921, -56, 2124, 429, -564, 1996, 1469, -51, 443, 1472, 82, -812, 83, 468]
875D68j066l39P48Q55j855j13K380N91l158Q16L665k117l191L297K282n052l09
892b098M253j591m174L534K281n063l44N162j762l638M039K333m071J54M383j410
908A988k716K467J477l258m63L063k110l191J886J469k632r71K569l95k286J233
924a870K603j178j251K193J375j849M65J915k49j908R73J404j878j378J861l19
940I09k283PJ220n38j263O23P69k34l01M50Q84J46n81O62J343j455l66J406l05
959A093j865J169J363k596j313L212k13l407J386L293l114j364M020O10m104J721
975a09L534l390k540M853j62n356K117M071l984k700M647L63n097J795M213l012
991g57k376M371R80l833J711L818k785k273L078R60l297J99K240j905j984J685
$$ y = [468, -598, -937, -189, 666, -1189, -1302, 1078, 1669, -1489, -673, 2992, 875, -2316, 981, 3263, -1789, -2098, 2155, 564, -3610, -76, 2205, -2858, -3202, 1960, 198, -3440, 599, 2932, -1139, -985, 3398, 1988, -728, 1739, 3216, -42, -505, 2558, 448, -2743, -857, 612, -2020, -2991, -422, -817, -3103, -1870, 733, -445, -1696, 497, 1872, 23, 488, 2403, 2154, 246, 1219, 2623, 745, -633, 1228, 909, -1374, -1367, -147, -685, -1948, -1325, -556, -790, -1091, -641, 243, 389, -192, 470, 1813, 358, -8, 1398, 1093, -772, 397, 1760, -836, -2149, 1063, 850, -2557, -1171, 2122, -992, -2356, 1664, 2274, -1830, -109, 3425, 35, -2505, 2348, 2186, -3170, -1053, 3018, -966, -3666, 981, 1344, -3753, -1958, 2255, -757, -3133, 1238, 2218, -1615, 96, 3914, 1129, -1144, 1934, 2894, -403, -204, 2036, 131, -1853, -168]
1007a68P04k697K50J406p19p20J102L25l85M96O52N67J16j55j55O65M37j129J32
1026G24Q79j101j555J708Q1k381L26K018k020j236K603R15l377J432L145k042
1042A19k143L624O98l890J104L179k408k865M018K26m001P11M045k432k772L067
1058B80J742l970Q25L774j761k882L304J254l546J72L349j456l378K501J637l848
1074b003o62L500j034k819K394J859k634k39K939l94j744J693J155j434j10J419
1090A886n98r69R34n58r99K28L6r14l49L54j88L2L02o58Q3J600j58j125J997J165
1110B101k532K16L059j502k181K096J152k949o85L565j998l438L278J388l990
1125b420J58L813j297l057K717K170k906o97L898j352k999K445J696k527j380
$$ y = [-168, 536, -2161, -1911, -505, -1224, -1944, -842, -517, -902, -406, 246, 813, 929, 774, 619, 1284, 1721, 592, 724, 1603, 502, -1053, 655, 736, -1645, -1319, 699, -1321, -2557, 46, 961, -2416, -984, 2161, 119, -2024, 1600, 2298, -1592, -488, 2691, 283, -2582, 1436, 1662, -2339, -1628, 2417, -15, -2787, 280, 2022, -1948, -1123, 2651, 890, -1992, 1312, 2566, -980, -808, 2541, 1085, -2293, 208, 1845, -2003, -2665, 835, -199, -3018, -624, 1235, -1399, -1638, 1301, 907, -837, 856, 2011, 577, 467, 1886, 1288, 319, 1253, 695, -304, -76, -40, -954, -1303, -949, -1137, -1105, -803, -1461, -1378, 222, 64, -1061, 936, 2101, -431, -215, 2844, 1342, -839, 1257, 2409, -540, -1225, 2340, 342, -3096, 182, 1570, -2420, -2262, 1551, 254, -2803, -86, 2084, -822, -1519, 2379, 1027, -1972, 473, 2169, -358, -1738]
1140a738L160n64l035J274K318k314j034K822n2k291J251K269j771j250K567M95
1156B107k780O10K025j349k196J677Q52k373j69J558m80j283M97J132m96mO05
1173f7L42M64k82L06P14J64j143K09Q56q41j168J382m15j992P88J223j998j017
1191b475K832n09k463K145J787k543k35L532o39k880K569J560k861o37L141j057
1207A267k901J883J431k880o56K782o49k245J082K209j675r14J863P10j666m0
1223c99J748o16j485R00R96j486p30J332Q8j737M04J538p78j451K077Q51j973
1240g21K69K192p91j456J398J223j813n97J456p08j274N09M33j058l24Q44k17
1257f35n74l0O87L65m03O6J222Q9o14M79J131j091o38J736j66k182N42J701k124
$$ y = [-1738, 1422, 858, -2177, -903, 1415, -899, -1933, 889, 837, -1454, -203, 2066, 295, -955, 1612, 2107, -673, -63, 1962, 613, -1583, 94, 946, -1427, -1596, -38, -518, -1801, -1304, -172, -668, -672, -67, 275, 739, 457, 763, 1477, 1641, 498, 707, 1563, 722, -446, 936, 521, -1471, -683, 540, -1458, -2475, 357, -152, -2615, -470, 1317, -1226, -1461, 2071, 1432, -1448, 1121, 2681, -180, -817, 2324, 1267, -1634, 249, 1680, -1200, -1856, 926, 277, -1968, -886, 1323, -352, -1266, 597, 1307, -359, -399, 1349, 733, -752, 148, 1144, -342, -1072, 260, 348, -1389, -985, 553, -225, -1676, 401, 1252, -721, -452, 1740, 949, -507, 891, 2114, 301, -296, 1160, 452, -822, -313, 120, -938, -1262, -418, -635, -1209, -1239, -552, -187, -590, -524, 698, 787, 173, 652, 1783, 692, 54, 1790, 1624, -558, -16, 1685, -439]
1276d39j340K118Q8k567Q38J984j688j178K524L09j816N51K173j182q40J723L12
1293A570j626K23R46o76o88L48M27j092p52J141N2o85J55J110j06j097N56J519
1311A325r49j156J884K05k002J43J626j026j679K049K08k210M21J809j279q07
1327a438J729Q68j837M65J755m74j266J111M97j094j63Q67m82j703Q56P31r40
1344e18p87N59L15p71n8J177K98j315L49J872n96o08J099N56j105j94J485p25
1362A033j280O29N66j630l86J263m32j174M98Q59r07j45J481M0j070L07R69J91
1380H12q29L29Q39o62r20N52J024j644m72J675m26j712J248J475k221n55K749
1397A262l85k296J664J695k331m72K477k50k860J518J367k128j165K704p04k079
$$ y = [-439, -1779, 339, 427, -2140, -1302, 682, -1006, -2184, 340, 649, -1167, -616, 1557, 375, -465, 1258, 1570, -56, 167, 1113, 437, -251, 97, 524, -568, -1320, -179, -127, -812, -657, 453, 347, -750, -194, 1325, 376, -780, 1104, 1309, -693, -550, 1076, 50, -1629, 420, 628, -1582, -1161, 648, -631, -1438, 291, 1159, -678, -213, 1542, 1068, -198, 913, 1410, 316, 153, 1020, 538, -1165, -309, 422, -518, -1305, -746, -431, -1202, -1260, -83, 215, -1100, -751, 1121, 525, -83, 1016, 1572, 467, 273, 1758, 1033, -247, 382, 948, -682, -1068, 195, -237, -1411, -913, -54, -961, -1106, 375, 415, -655, -348, 621, 812, -17, 312, 1151, 489, -431, 121, 1145, -499, -971, 704, 278, -1434, -186, 1289, -932, -1487, 1262, 877, -1419, 245, 1940, -391, -863, 1614, 1364, -1496, 22, 1389, -739, -1904, 800, 96, -1983]
1413a983J137J392j655j49J864Jj168O59J134p30n02O95L25q66L01K83l66o71
1431b99J8J67m61k97J1M58m91M6M75M10o48K49R92K46q98M21P12m76k07M24k04
1452F48o78j83Q39l85j206O95M51r46o05J777k75j250K88J646q69n16J504L47
1470A282j886J99J973j484q91J898k38k154P99J739j520j679K269M33k266J095
1486d31J724j231j166K155M42j873M10J442j573q39J670kj563K32N34q13j63P52
1504b93l0m88L13Q01l93K57K24K16K3o3j81L55L74j054L5M34j22j498L41Q81j087
1525i55n23J456rj384N43J279n71n50J887k38j629P32J843j104j517J783L8j762
1543f81L13J680r93j748J287Q56k123K96J983j204j469K214P26j806k2K003r09
$$ y = [-1983, -846, 546, -1109, -1258, 606, 607, -561, 98, 1232, 502, 0, 695, 1020, 154, 455, 738, 372, -299, -281, -114, -575, -872, -861, -403, -894, -848, -373, 37, -611, -362, 630, 876, -22, 399, 1111, 635, 428, 852, 648, -30, -213, 626, 241, -965, -270, 181, -765, -1370, 407, 132, -1118, -830, 816, -53, -569, 935, 1282, -604, -405, 1568, 84, -807, 1091, 853, -1301, -502, 1237, -283, -1962, 307, 740, -1526, -431, 1293, 62, -1104, 1051, 1493, -380, 30, 1472, -101, -940, 730, 728, -835, -603, -69, -882, -1045, -293, -323, -811, -498, 303, -90, 167, 391, 607, 630, 567, 386, 741, 1115, 61, 96, 530, 408, -1090, -749, 132, -955, -1478, -22, -31, -1415, -872, 407, -164, -714, 1173, 935, -694, 38, 1881, 777, -740, 1043, 1081, -681, -368, 1312, 319, -1429, -142, 714, -1409, -1113, 870, -334, -1803, 411, 1137, -669, -691, 1312, 403]
1560D03j673K086N10j912k67J694q92j410J589M55j726K33J481l53j102J077L41
1577E34o82J50J001q9r73K75M35p22j07O17q23j85K34l84K94j5j4l08K98J41j21
1598d44O24N70m32j32R45m07o31O60L02j324Q5J351p48j837J353M55j802M85J404
1617D77o40j575J637Q71j488PK040j028j055J414Q13j562m06J540k90j646O82
1634b09J352j762m20J547n12j252Q37R83j330m9J640k24r76N24Q05p37o29J192
1652G80k34j038o8P80l68o69M60M15n40m08Q68m1l89M97J15L00l83L07L37k38
1672D83l13R9L26n55m34M54j23p48J94M28k48p04N53J022p10j32Q00k72o00O62
1692A82R38p62n02J515m07j606R31O74j488l70J820o48j643Q29J013j074n58J498
$$ y = [403, -1270, 816, 1326, -586, -853, 841, -51, -1461, 128, 583, -1143, -910, 571, 218, -884, 193, 534, -148, 2, 1003, 914, -59, 216, 651, -71, -178, 439, -384, -569, -335, -719, -425, -440, -454, -762, -464, -323, -444, 180, 750, 318, 186, 1131, 724, 93, 753, 1055, -269, -184, 1167, 419, -1418, -65, 390, -1412, -927, 477, -163, -1738, -101, 770, -718, -711, 1329, 301, -754, 660, 1473, -89, -495, 1045, 755, -891, -209, 1143, -619, -1039, 508, -4, -1256, -419, 564, -766, -815, 825, 601, -375, 149, 954, 217, -412, 780, 546, -492, -560, 220, -148, -817, -357, 58, -482, -890, -22, -63, -452, 45, 160, 460, 77, 384, 721, 483, 170, 269, 595, 40, -394, 60, -63, -811, -617, -189, -437, -1141, -588, 434, -276, -408, 392, 120, -480, 182, 1120, 358, -144, 1371, 964, -642, 289, 963, -525, -895, 925, 277, -1366, -537, 476, -598, -1156, 342]
1710C42k0j519J260R18r35m28J483l8j224J92P44k98j058O12M26q26O6L28k68
1729b43n09O99j0l89l2N10L85l97k26N59K29p13J28Q21m99p86L29K05o01k65P34
1750g1k2m02M59L36o42j06J110k28o13N16M21l92k29J77L03r41l3N70m00q91M01
1771f77M91n11l04R35L61q16J22Q54k79n97J242no79K68O65p85l85M21J82j137
1791f34k08J178o32l77K83L99n04j54M91J60j13r4N18j55k46O60qn41o8M12j26
1812B41m11j7N77o26o19R46K05o74l59J251j37r88P56O58o08l83P10Q5j228O95
1832G4O52j110l16P58N1r47M73L16m85m0P40k21k46L56J60j61J78n7L78L7m18
1853A72J39k8m02%K5O7n76o9P65k98p85O69L15n19O0R90m64r7L84M11n28J62L15
$$ y = [342, 322, -1197, 63, 981, 46, -382, 1101, 1063, -161, 31, 775, 477, -581, 31, 457, -369, -303, 25, -243, -752, -53, -63, -452, -484, 26, 411, 14, -212, 347, 576, -137, -9, 812, 313, -473, -144, 61, -540, -805, -71, -93, -495, -36, 300, -342, -448, 662, 434, -179, 337, 758, 366, 137, 314, 617, -324, -357, 213, -187, -1078, -677, -186, -697, -1001, -66, 295, -521, -399, 455, 176, -421, 821, 816, 137, 405, 1070, 285, -100, 321, 503, -634, -842, 336, -296, -673, -390, 9, -495, -649, -158, 2, -111, -205, 313, 158, -88, 572, 564, 23, -45, 367, 241, -170, -187, 390, -236, -855, 91, 296, -378, -737, 514, 377, -611, 145, 803, 195, -188, 522, 607, -621, 74, 726, -384, -700, 58, 109, -838, -365, -49, -534, -574, 166, -55, -301, 55, 215, 54, 232, 175, 553, 590, 172, 311, 283, -119, -119, -94, -27, -603, -672, 93, -205, -990, -321, -6, -525, -465, 525, 61, -36, 348, 759, 231, 393, 708]
1876G08k61m86Q8N84q49m44N19J26q69L37M38m67Q7J17P49k43n95J311n50o39
1896c39L51Q38q72k75N19M93j384M35Q25q49l27N95j02q33Q01M99m50k98Q84k21
1916B90m91L74P31q61j89P14n03k49J52J73o54K69J16j58J00J42p3J1M34j81k23
1937g6Q06l66l15P42l4q39L08L40k33r02O34K7q18j06Q75k76p35P23K45k83MP96
1959E17k07o55N55P78q31j44P96k50j016M05N97q16m33P82kr53J90Q64n21m78
1979h22R14N28r17K35J032j212j3O94K15q45j37P01m27m66Q55q4j141P89L9k9
1999i1k85L83J42n25M54Q3J22M0k26j11K0K48n8l03O9k81k65M23K09n10K3M26
2021a3p14J23O83M24p95N27L71m80k92O95J37r96N04N64n65q19P06K55j303L22
$$ y = [708, 447, -39, 49, 633, -216, -660, -141, -15, -884, -547, -109, -576, -489, -372, 377, 134, -461, 850, 300, -339, 12, 850, -22, -297, 222, 715, -669, -234, 591, -258, -585, 10, -92, -925, -124, 375, -75, -373, 511, 290, -201, 173, 904, 43, -146, 568, 65, -184, -32, 141, -513, -244, -128, -286, -186, -44, -117, -106, 328, 147, -76, 730, 364, 49, 791, 757, -82, 226, 566, 333, -569, 65, 92, -726, -832, 43, -233, -968, -245, 0, -283, -279, 517, 310, -345, 210, 988, 157, 13, 809, 559, -457, -52, 545, -271, -704, 78, 76, -877, -687, 177, -344, -822, 92, 620, -297, -62, 970, -242, -255, 439, 654, -191, -328, 373, -54, -520, 335, 251, -890, -101, -62, -91, -376, 7, 149, -376, 78, 161, 283, 323, 97, -14, 6, 254, 196, -107, -38, -319, -584, -161, 48, -462, -439, -13, -727, -604, 79, 503, -292, 235, 606, 126, -166, 529, 666, -330, 174, 738, 173, -646, 60, 315, -988, -666]
2041f66J008p64o31J052K60r05K98Q52m36o72R35O63r10k85P89j22j031J009o8
2060C76j057K12P52n17n85N31M28p23J36N70j70K7N03P9m49K93j01k6l15Q7J20
2081A71k44J93K54q33l3L89j65K33k70J68N3M59k13k99K89M86o86n8O25k71m58
2102b10J96M19q43P6P32m96p50P93L19q67K32R36k91n40O80K03n49K01N29m39
2122C31m23M20M7r44K08R19n76q38O21L04o61j6R77o29k21M43L48l40J22M70j99
2143C63n61L42M31m20k9j00J08l19%n8l2j51K07k0M9J75K56j16Q9J59N1m5K7m63
2167e7L70k14M0k32K62n0n06L95l48QJ04N28l35l36L71N97j029L65M97K5n60K97
2189A92K32n04o9P97m68p58K31K45l59j36O49j71n01M92P31p94j30P93J56n80
$$ y = [-666, 342, -422, -1053, -1, 259, -646, -348, 504, 68, -604, 331, 994, 84, -201, 588, 466, -565, 444, 376, -681, -469, 283, -234, -819, -288, 140, -583, -447, 123, -47, -20, 483, 562, 113, 406, 305, 279, -36, 51, 171, -73, 120, 374, -459, -492, -103, -268, -35, -305, -137, -84, 375, 162, -137, 152, 638, -48, -106, 519, 248, -210, -14, 405, -438, -362, 370, -126, -876, -83, 236, -631, -399, 537, 246, -294, 386, 589, 40, 241, 770, 331, -92, 328, 375, -569, -361, 558, -18, -856, -235, 69, -592, -608, 369, -260, -481, -38, 310, -30, 92, 562, 363, -198, 144, 575, 155, 126, 26, 134, -185, -185, -243, -275, -426, -219, -239, -190, -15, 241, 125, 214, 373, 424, 379, 406, -57, 313, 99, 139, -93, 169, 119, -387, 8, -340, -332, -228, 300, -35, -371, 0, 597, -432, -67, 430, 455, -105, 192, 424, -80, -149, 648, 180, -578, -347, -102, -461, -597, 52, -119, -620, -128, 603, -191, -321, 472, 628, 48]
2209D8n3O24k52m27M89j10k61k20M37n10l79L05J38j84J9L34pj55K90J10m4L3
2231B25L8j68M11k67M5n10J98J56k98J12j00R9p4k36M4N83l63m3J74L18k03j27
2253A4L62q5l14r1M16k00k52L66Jm87r6J62L7m06L17L07m54J9Q41j37l65L60l2
2276B83Q8j92J56j54J06l72J72k38k42J63K10k13l76O42l06o0n0N38k07j60M69
2297B57M68o54J6K76K32n68j34K64l61j68L16o3m55K55L29q0m40N42k10J06k26
2318b98M39J04k72L11N6j1m86K18J59l18j2M31n32k39P9K83m89L55N01k30l08
2339b59L74Q6j19K1K66j26k03J68M3o9l56K84m22O6j82L47n3n56L93J23r2J08
2361a58J38K40k51p8O63k76k50K30J93k86l15L12k97k1k00L86l80j06J45L63j18
$$ y = [48, -5, 619, 367, -60, 429, 319, 58, -162, 275, -235, -614, -309, -171, -355, -336, -2, -9, -164, 126, 236, 192, 225, 263, 95, 506, 239, 284, -226, -28, 128, -170, -58, -158, -59, -133, -369, -325, 258, -105, -148, 26, 344, 141, 14, 376, 291, -23, -114, 302, 102, -150, 216, 217, -270, -366, -204, -167, -573, -256, 51, -403, -384, 457, 320, -45, 315, 283, 371, 179, 335, 181, 287, -85, 87, -151, -393, -230, -20, -233, -609, 33, -273, -333, -383, 155, -52, -212, 257, 725, 71, 87, 363, 595, 27, -107, 157, -204, -372, -56, -119, -574, -319, 10, -70, -510, 32, -178, -72, -298, 141, 245, -27, 284, 340, 329, -157, 61, 220, -98, -110, 321, -211, -450, -371, -88, -577, -222, 279, 49, -259, 115, 201, 82, 103, 369, 243, 40, 208, 251, 182, -174, 110, -312, -246, -428, -81, -134, -690, -297, -174, -266, -158, -20, 220, -31, -109, 554, 278, 28, 258, 451, 165, -150, 162, -135, -156, -356, 30, -350, -456, -311, 52, -66]
2382f6j86P88m94k38P63l34j96J83J78J37o45L93K4m16m0K8J08l65M67j27j35
2403a73j23K51K46m75K06J46J59k52K47Pl10M2L26l05J39k40Q2j85jj24P4N44
2425B81m81J96k60J83J4Q4N1K5O2K15M5n56K59J03n37j18N75k13m49N9O04l29
2447a87j02L30O0p9P9K76l65k39P36l99k87Q6Q08p55q4J80qn20K15N40p00J25
2469b90K50q4m15L98L80k81j16L90M9k70J70K17m10J36o1J34k20Pl4j09k37J60
2491b36J33l12M17j88J86j59J55J11j4J92p1j30N6J52j28j17j6M9k51r8K49k76
2513b96M40O9m52j3M44m9j51M08j09m96M04L73n42k43M96j29l78J99L40n88k67
2534e40P94j81p0j86K45M9j97M20J73p14J96N28j77l94N31k17k07k98N71l68k17
$$ y = [-66, -252, 536, 42, -196, 567, 233, 37, 220, 398, 535, -110, 283, 307, -109, -149, -121, -13, -378, 89, -38, -173, -296, -45, 201, -274, -68, 78, 237, -15, 232, 239, -71, -29, 297, -8, 131, -109, -27, -212, -213, -337, -263, 281, -200, -4, -264, -81, -67, 17, 68, 93, 155, 370, 415, -141, 118, 221, -316, -434, 141, -72, -521, -462, 142, -187, -289, 41, 101, 22, 101, 377, 12, -227, 509, 110, -177, -91, 717, -38, -122, 58, 50, -470, -255, 285, -415, -290, -40, -124, -539, -141, 239, -42, -158, 232, 281, 11, 181, 398, -12, 124, 63, 197, -23, -16, -50, -159, -396, -236, -103, -415, 2, -186, 0, -159, -4, 107, 93, 285, 214, 84, 140, 292, 164, 47, 31, 80, -171, -269, -20, -296, 144, 213, -239, -252, 192, 143, -8, 400, 291, -205, 199, 572, 30, -213, 283, 154, -224, -25, 315, -273, -540, 254, 73, 3, -183, 62, 111, -86, 334, 507, -207, -11, 517, 340, -54, 477, 260, 53, -245, 326, -42, -259]
2555b59j43K15j62J61L78n1l90J57L56k92j8L19l81L1J45L57k09l57L92p3k92
2576a16l7MK39k47P6K0J77m29J76L4J79k60J35K35q3O5n9K9O9K4j91j44k05L68
2600E9J91n41P8K60j34m19O28J64l00n7N95m31l37M16L05o04R7M44l66m52L52
2621e2m9m49M12K47M3o19O08K4l26m1L79R0k11J56m0m26K78L80k45l11R0K36k52
2644g8j17K01l00q7K05J27j2J33Q3k05j77M65k14J25j14N2j5N5m0l14L68j79j81
2667b19P5J1l4j85L83kj47j51M62k0j60L82k5k63l00M49J07m24NJ79k81m51N66
2690d3O2l93J42O91m51j39L64om33N2M80l32N8J47J67k18j66J92k15R6k86j8j04
2713c53K20J80r1k59O1N47m20oJ76j35J20O5M37l75o3j21L11k69k54M35l82J10
$$ y = [-259, -402, -187, -349, -188, 190, 139, -251, -94, 262, -30, -48, 271, -110, -79, 66, 423, 214, -143, 249, 176, -116, -153, -149, 90, -157, -81, -61, 116, -313, -137, -103, 76, -184, -49, 186, 103, 168, 109, 138, 207, 231, 40, -104, -309, 59, 250, -291, -213, 47, -87, -506, 122, 286, -14, -71, 524, 93, -244, 172, 477, -127, -30, 414, 48, -404, -52, -101, -550, -138, 109, 152, -467, 141, 165, -161, -202, 177, 267, 56, 212, 172, -254, 24, 404, 159, -152, -62, 174, -78, -195, 6, -294, -381, -176, -49, -61, 72, 155, -50, -227, 238, 24, 149, 35, 87, 72, 127, 87, -227, 141, -38, -219, -144, -133, -167, -352, 31, 29, -118, -269, 193, 173, 13, 395, 370, 107, -193, 256, 363, -61, -56, 123, -158, -609, -43, 19, -374, -232, 459, 8, -131, 233, 227, -206, -154, 326, -6, 52, 199, 366, 148, -18, 174, -41, 55, -231, -249, -353, -133, 47, -44, -303, -242, 305, -115, -121, 55, -80, 40, 105, 542, 167, 104, -17, 294, 25, -229, 206, -176, -66]
2735f6j2K78n11L5M00j76j76K37K73q5m46K17J78K60m85K69q9mj53K46l08m40
2757e58M87J12p9j27J96J02l82L38j8P0j70N20m06N6j4P2k77j5L7K58m49R2Q3
2780g2J44n25K26k19J36M16n8N6j28J26m2J28j67K86J53m60k39M26k48NR5l0p6
2803f7k85O08l00j98J95M04k24k79M50M7r1q6q4k27K75K73R6n79PqJ75l61P0L99
2827B10n06J0L75l92K39J0j04M24k36J15l6q2r1M54m13M7%j50N0J82m9K42l75
2850g6j84L51K8j8k19K54n56N36j41K57rm14L12J87n54L44Q6j72l48K15Q4l13
2872c50J73K0J03K33l45J68j47J97L41j0o16M07J91l48K58j15l55M3M8k2r3kN5
2895a66n0M3k9L56k48k71L72N2j79J01R7j29j34K41K0J44k73K1O4j40k00q4J98
$$ y = [-66, -78, 200, -311, -276, 124, -52, -228, 9, 282, 197, -249, -32, 146, 406, -79, 190, 101, 97, -56, 190, -118, -558, -71, 41, -38, -165, 31, 133, -249, 89, 71, 141, -29, 491, 85, 141, 127, 199, -78, -93, -56, 202, -247, -155, -72, 72, -453, -227, -446, -310, 106, 48, 104, -24, 102, 60, 188, 21, 307, 460, 0, -239, 187, -61, -56, 39, 9, -67, -352, 256, -44, -242, -47, 357, 133, -146, 304, 351, 260, 174, 90, -137, 138, 411, 507, -72, -65, -73, 102, -259, -189, 210, -296, -286, 89, -303, -64, -54, -158, 266, 30, 145, 109, 27, -64, 390, -23, 24, 24, -126, -76, 106, 57, 299, -76, -260, 91, 119, 101, -118, 136, -420, 116, -25, 232, 223, -191, 121, 308, -246, 98, 184, 12, -336, -121, -37, -350, -177, -157, -54, 179, -166, 2, -145, 52, 393, 383, -233, 174, 365, 17, 275, 160, -195, -152, -104, -126, -219, -221, -166, -216, -173, -202, 154, -94, -365, 7, 59, -120, -19, 78, -51, -185, 56, 76, 220, -53, -32, 32, -108, -308, -392, -194]
2918a94l4J71L7M4J9j21J72J17J4Q9k10Nk5M2j75k64k3M34n21K66j58J23k7K43
2942B4k60J74j61N35l98O7r8N19k28l79L88K3l50K2N76o74j56M13k72pQ8L21L3
2965B00m70M28k75j16J70J99l09K78J90q5j94m7J72l32K85j54J8r0%J13k09j52
2987c80L85R9q5M0K19K6r3j22j89J45R9K5j93O0j26j51J57k1Q4k1K01j09r7J86
3011A39R5o3q0J8j33P7j6j43K02k50M42l48o4MP5k31j38L9L28k00K15L32m69K75
3035A06R1P3m87L39j09K7j33K72m43K31Q6j10l11k1N45k57m5K58jk25l3L12l59
3058a94J16L21j49j57k3K44j19r3M4K77m59j08L12n6j07J78N0m7L05m66j43K30
3080d4K73l85L15Q4k43R5l6r6J4n1L31l96r5K45k16J15K63j23k46j66N43m1Q4
$$ y = [-194, -228, -57, -20, 24, 43, -78, 94, 211, 225, 314, 104, 109, 84, 126, -49, -313, -336, 98, -423, -157, -315, -192, -219, 24, -236, -62, -223, 312, -86, -19, -117, 402, 174, -205, 183, 206, -144, -122, 454, -220, -376, 37, -235, -242, -154, 167, 200, -270, 158, -117, -233, -63, 136, -173, 105, 295, 210, 16, -31, 141, -191, 94, -60, -42, -132, -132, -19, -228, -380, 5, 104, 19, 59, 278, 304, 211, 89, -100, 45, 144, 169, -24, 36, -90, -241, -84, -105, -21, -42, 159, 50, -47, 139, 234, 171, 91, 109, -24, 53, 37, -106, 96, -154, 288, -60, -124, -120, -45, -276, -414, -375, -47, -247, -32, 300, -169, 106, 197, 270, -217, 122, 13, 40, -93, 179, -264, -33, 53, -57, -368, -389, 156, -101, -146, 112, 111, -114, -147, 165, -194, -78, 243, 94, -63, -86, 158, 39, -54, -10, 267, -192, -300, 12, -44, -151, 27, 77, 30, 335, -131, -274, -44, 229, -156, 159, 243, 0, 95, 59, -37, -23, -74, 257, -139, -234, 11, -205, -90, 173, 50, -196, -362, 181, 140, 224]
3103B24l9k70M78m43J39J16l42L3n7K73J6J85l04m1J09l2k81J32J27k85L00N7
3125I5J10Nl74L48N7l31J53j2k0p0n5Q9r2r0K78j44l1J11Lj74qN6j3R4J88r7J01
3152A77m5k52N9O6j12j09J60J62j15j23J47Q3q0K5q4K50n3k70k72L42J38J5Q0
3175A89j78M08n70L06j19M6l39L93k1l4j42N4k65K05J54k51L23l07K12J7M0oO5
3198A80j47P2j05Mo3j71M03l15j85L73lm29N29k88K38k5R3M8j49J26k38J92j7
3221A23K02l88J12R5j97n9L07l39O6j36L98o00M43P6M6k38K66l50M82k27J98n6
3243B24k31N2l6j02%L03k45j4J43J78k71p6j98K36J61j28L64m90L9K53j90N0j00
3266g8J25o7L05k39j08j79P3p7j33O31l00K28k29J56p9L07n79M01j28J00l4k91
$$ y = [224, 185, -85, 393, -50, 89, 205, -137, -104, -161, 112, 128, 313, 9, -32, 77, 45, -236, -104, 23, -262, 38, 95, 205, 210, -164, 184, 241, -90, 63, 51, 31, -39, -94, -5, -97, -187, 91, -53, -84, 27, 30, -144, -152, -96, -109, -15, 173, 76, 177, 132, -120, -61, 5, -107, -216, -56, 106, -9, -132, 15, 98, 18, 43, -41, 209, 156, -114, -386, -44, 94, 109, 189, 11, 419, -151, 155, 36, 82, -257, 136, 115, 81, -61, -7, -272, -67, 87, -164, 159, -148, 64, 81, 121, 115, 180, 33, 105, 0, 4, -59, -230, 173, -142, -327, 46, 43, -386, 143, -145, 93, 68, 161, 209, 60, 186, -52, 140, 123, 325, -63, 49, 144, -53, -112, 195, -144, -78, -214, 184, -416, 27, 103, 149, -89, 177, -173, 309, 82, 280, 224, -7, 45, 9, -93, -93, 210, -35, -49, 94, 272, 1, -75, -273, -37, 124, -4, 360, -130, -91, 162, -28, 22, -78, 47, -20, 285, 46, -62, -241, -168, -245, -378, 253, -47, 181, -48, 108, 29, 336, -243, 158, 30, 130, 96, -195]
3288a95K80r5P8J95j27l00j20L31m17K94K91m22L34N5m8K09l82J07j00j29M32
3309B71m90Q4j1J04O2m97N69l0q7jJ75Kk96J87NJ6ol10L09l3J44J12m26K21Q9
3334A63j04O7j72J27j96j3l6n5k3M43j21N5o5p8M69l78o8j68L39m22L32o02M15
3357i1k2J77l13K11J23l07L91j80M0P8j8k05K6m6L37k85N76k63n15L97j14J1J6
3380B4k5k7J9j38j15J75N1oR6r7p1J06J49J00k89J4J37j85J82l6O2j1k10J93j73
3405g5K04n05L07k06K34j89k7K58J01j79J18j16K05l23K51J09J07k84K82k48J07
3426A31o9k48K53q3k22J39K21k72J88j39L2l3J58rJ74p2j64K22k35M6j45L9l5
3449a23l3K57o42O63j25m1j89K20j19N9J97J21j73l31K91l2l5J1qJ98j19J7n3
$$ y = [-195, 85, -10, 68, 263, 136, -164, -284, 47, -370, -76, 215, -207, 127, 182, 134, 343, -39, 68, -32, -161, 271, -219, -135, -146, -42, 20, -477, 92, 62, -25, -26, 149, 151, -145, 42, 47, 63, 57, -253, 56, 23, 167, 279, -147, 74, 163, 59, 126, -46, 81, -115, -128, -164, -219, -242, 201, 80, 135, 70, -8, 461, 83, 15, -153, 186, -236, 96, -506, -91, -113, 64, -249, -38, 85, -222, 169, -11, 29, 107, 89, -116, -90, -136, 201, -84, 492, 229, -286, 111, -3, 8, 24, -1, -28, -9, -147, -262, -87, -36, -42, 54, -43, -114, -8, 141, 241, -48, -34, 103, -82, 100, 64, 126, 115, -95, 98, -75, 129, -376, -69, -275, -41, -230, -257, 1, 102, -77, 41, -75, 130, -193, 58, 167, 274, -10, 272, 24, 131, 62, -186, 67, -16, -238, -99, 122, -150, 38, -101, -69, -102, 56, 47, 221, 149, -15, 207, -28, 18, -127, -88, -123, -156, 101, -541, 122, -3, -44, -233, -13, -132, -73, 124, 245, 72, -259, 32, 0, -35, -24, -32, 166, 47, 64, 11]
3472A1R0j42Op3K78k54J18j30J62j8m5J03k4M3K25q2l75J28K26l48j00J57J71
3495A27j62L3o0Q6J47r4j17J13j8J02j76J73q0K29n10J62K56l18J42K3R7m72J73
3518a44L23j22m17J77J20J01J06j03m30M31J47R2l46k92K53L07j93l48L26j49
3538a61q9M37j43J23j51j98N2k2N5J45j57J71j43q7J86K74l44k10L07r2k3P6k5
3561a9J28k26N2n6J70k12L27k42j51L91J4L5j49L5o0L49J9k42P3j38j5R1k65J32
3585D1k35L62l58j76M39k67K01j64R5Rk12L05L60k98l27K17N4O3m48N4L01K9m91
3608d46J19M40k63J92N5k89J56J2Q8k82M15r5j41J46j55o2J76J95lj15j09J74
3630B08r0j25j05j15J24J22M3k8j40K67r9R5N6l53M07q2N2m01K15r6M3k08L46
$$ y = [11, 101, -41, -35, -108, 170, -84, 34, -96, 66, 48, 3, 106, 82, 125, 350, 268, -107, 21, 247, -101, -201, -44, 127, -35, -2, -62, 24, 171, 77, -40, 73, 55, 157, -19, 154, 74, 303, -207, -45, 211, -107, 35, 58, 155, -317, -144, 179, 57, -360, -183, -63, 38, 144, 41, -389, 42, 189, 281, -65, -357, -104, 203, 10, -338, -12, -161, -250, 187, 44, 167, 16, -182, -130, -152, -97, 48, -109, 62, -81, -168, 18, 292, -52, -262, 45, -47, -70, 6, -19, 109, -117, -65, -121, 49, -163, 164, -78, -229, 162, 176, 211, 62, 97, 37, 386, 405, 163, 236, 98, 83, 174, -91, 41, -194, 168, -190, -366, 73, -194, 7, -157, -62, -53, -265, 40, 400, 102, -225, -8, 46, 109, -339, -285, 16, 45, -446, -327, 113, -150, 42, 97, -192, -36, -24, 64, -218, 197, 102, -39, 107, -48, -110, 66, 261, 258, 143, 34, 208, 118, -7, -112, -227, -103, 19, 62, 34, -106, 161, 62, 157, 213, -140, 267, 185, 237, -164, 51, -45, -2, -210, 136]
3653A36l68J96K21j81q9L89k38j27J62l80K77J43j39L65j66k59J47J42k5j71n3
3674a8k48N18l71L93j72k32N1J78j67j4J44j56N3M9Q5k0r3J26j15M5N8j24l6j9
3698h5J18j24k85M22P9j64R0J29r0j33L02n5j1K4j00r5K57m66K22J6j62M6L69
3721C04l95m8L4J35L3k45K59O0Ql03M69j79j56j05J64J10k95Q0j18N4K29k24j72
3744c01K88j76K47k69K68p7j79M2K55r3j2m4j20K57j79K9m6Q4J42pr5j78L4l9
3768a69L06k03K83l5r9M9l16j60L57P4o2p4L27l81j57J07L20r4j29J71O0j22r1
3791c8j19J52l33K09p3K11k7J3J92k48K83j08L18k84j09k73Q6J24J42m51J20J75
3813c8oL7J26k3q2K4j5k42L88k63J06J02K09l28j43K64k1j11j78K75j65R2p5J27
$$ y = [136, -232, -36, 185, 4, -85, 304, 66, -61, 101, -279, -2, 141, 2, 367, 201, -58, 89, 231, 206, 35, -18, -266, 252, -119, 274, 102, -130, -79, 99, -68, -82, 62, -94, -41, 8, 93, 73, -20, 106, -9, 36, 94, -30, -66, -85, 33, -91, -376, 46, 125, -39, 51, 180, 90, -43, 259, 204, 193, 217, 117, 22, 279, -187, 35, 51, -111, -65, 304, -91, -139, -105, 30, 63, -182, 77, 137, 145, -158, 311, 132, -24, -129, 35, 145, -150, -70, -188, -134, 95, -129, -301, -13, -189, 58, -211, 57, -20, -199, -157, 98, 5, -7, -51, -171, 86, -93, -64, -110, -26, 116, 109, 14, -164, -130, -169, 137, -66, 217, 182, 83, 132, -184, -344, 13, 87, 25, -49, 278, -103, -260, -153, 167, 73, -56, 115, 175, 53, -38, -157, -5, -338, -129, -202, 9, -18, -5, 187, -61, 222, 114, 432, 148, 39, -234, -148, -24, 118, -333, -213, -38, -44, -7, 119, 96, 14, 38, 23, -219, 169, -94, 12, 114, 323, -5, -148, 116, 95, -16, -194, 81, -84, 8, -67, 60]
3837F0o5K96m34j92M6K74Q0n7J88R9l73r4P6l0N9l9j35L15o2j33K28j09K88l46
3861f0q7K95K6k73M89k65n1J13m00J09J18J46j27J76j77O9k20J01k9o1J03K44
3883B39k73O2l66M17j76J54M9o9j78J70%j6j04r0K48k68J61p4K24j85J42r8N8
3906B7l72M30j42N9j18M02k48P9q1j88l7L1J01j84J80j90J09p7J25K43p8k07J60
3929B4j76K92j77j41L4N36m16O4m3q2K53l40K97r6J57k06M9R4j37K08k73K7Nj05
3953a52K50O2l0l38rK85j77N6K4k93J62K16k23K70l30K06L8P4O4p4N0p2M2J21
3977B22j22L5k57K51P8k79k74L21M8l5l9K03k70O5J00j29L59k9m49M77l23n6m0
4000a43K01J8j91j37N17l51Q5J40m15L24O1Pk04j87J34K38J88m82l9K53j88L1
$$ y = [60, -5, 291, -143, -335, -289, -15, 65, 8, 196, 295, -78, -172, -96, -126, -67, -106, -241, 74, 12, -121, 107, -2, 286, -60, -147, 148, 174, -99, 390, 125, 74, 187, -213, -104, 14, 160, 33, 209, 32, 101, -119, -18, -47, -108, -5, 239, -34, 28, -338, 79, -97, 57, 106, 37, -141, 29, 29, 13, -91, -181, 67, -201, -40, -114, 110, -75, 67, -31, 27, -345, 85, -57, 2, -116, 286, 38, 117, 36, -152, -189, -158, -57, -241, -61, -251, -142, -219, -94, 149, 71, -136, 24, -152, 140, -37, -178, -144, 392, -24, 40, -3, -85, 168, -172, 125, 29, 186, -20, 29, 123, -14, 194, -79, -52, -47, -152, 98, 160, 130, -208, -217, 68, -109, -53, -29, -322, -160, 56, -167, 103, -227, -21, 17, 91, 155, 81, 131, 59, 101, 222, 100, 135, -122, 129, 207, -72, -346, -25, 23, -12, -51, 152, -118, -53, 47, -82, 277, 248, -201, 276, -47, -103, -143, 58, 76, -115, -252, 265, -86, -1, 139, -276, 48, 109, 116, -88, -275, -141, 97, 285, -197, -236, 17, -171, -140]
4022a40L25r0q4j2n9L41n23K02j4N5j20K8r3j5K25O0j12j78K36k40M8N7L60j86
4046G1l11Q7J16n5K70j65M9k8k8qL3r9J58k81J87J07j60J12m10M05j03R8j99R8
4070e6K93k98N0k39J37L7K8k11L4K03M0M4N0k08J52j35q7J42k62K35j76M50l22
4093i9K76q8L2k02j52L41j71J95k92J58m6P8j61R9Q7j38L13m01k09M38Q8j40K34
4116B40j37j04j45J39j59J93K15j39k78J46M4l6J69j05p6J67R7j44r4o1K3k96
4138c41M32Lk32K99j98k15J75o9J27K02j16j16J69l28j3J41m2K75k8j50j5k38
4160b78M82j35j26L7O9k06P7J32k33J88j43L62j53k98J13m8J59p1O2j66M50k58
4182A6m4L2k13J05n7K24j13k6J85q9j54J67j12J42j85j30k1M45j43N7Q5j43Q4
$$ y = [-140, 185, 95, 11, -1, -60, 281, -242, -40, -54, 1, -119, -91, -184, -199, 26, 86, -26, -204, 32, -208, -160, -103, 257, 71, -240, -153, -37, -92, 178, 13, 62, 34, 6, -2, 31, -68, 90, -191, -4, 103, -57, 55, -355, 50, -53, 45, -154, -56, 237, -61, -11, -250, -113, -76, -48, -259, -225, -22, 18, 62, 112, -96, 56, -79, -166, -24, -286, -51, -227, 223, -99, 177, 89, 121, -81, -233, 108, -63, 132, -160, -2, -48, 30, -131, -32, 55, -83, 230, -171, -380, 58, 146, 6, 240, 103, -1, -146, -7, -166, 27, 242, 103, -175, -29, 15, -21, 148, 43, -33, 134, 231, 87, -7, -68, -45, -341, 91, 94, -138, 161, -37, -252, -77, -146, -19, 183, 67, -49, 120, -208, -221, -80, -122, 153, 125, -25, -40, -278, 204, 69, -57, -20, 49, -157, -80, 52, -181, 7, -136, 226, 73, -225, -112, -160, -1, -72, -10, -176, 274, 16, -28, 4, -209, -104, -161, 63, -50, -76, 109, 20, -134, 33, -79, 63, -122, -252, -273, 172, 29, 86, 171, 28, 112]
4205A12k47p7J25K9L0m3NQ5j6k42M56l07m40N01M2j70j09M29j15K16m41K06K85
4228C14m34M62n27J03M40n62K03o7J54n1j27Q0L6j11K80r1j63J72k14n9O0P9o9
4251i2J65k65M17k50l82K79P4j48Q7J5L17p2j64j09K83Mn6k7k36J69J71k44J18
4274E4J41o0k12o8K67k73L30k59L70j47k10j69j4J29R6K61l63K12k68K57lm8J52
4297A75k7j01l23K97l34K52Q6k34R2M3K51j71R0k06r4M16j22m5k84J18J45k18
4319a94O0J69r8K94m31N9L13l06M7K38n1j06pJ61r3k21N3K23k5j29J08Qj25l15
4343c68K12K31k30N8K13l17K57k1R9k74J01K10j90k1L7j5K36j84J03j29m5O0K76
4366B99k45m4k21L9N1J25n5J39l32L91N0m18J55L4K7J38jo3O4j27k63J13L75n35
$$ y = [112, -135, -212, -87, -58, -28, -71, -66, 19, 3, -239, 217, -90, -530, -29, 13, -157, -266, 163, 48, 264, -177, 29, 314, -120, 342, -185, -82, 358, -204, -1, -68, 86, 35, -92, -12, 24, -87, 193, 102, -61, 111, -103, -162, -102, -23, -92, 73, -192, 225, -25, -407, -128, -54, -202, -115, -100, 217, 145, -19, -128, 155, 159, 103, 76, -160, 9, 180, -64, 54, 195, 135, -77, -145, 122, -151, 179, -80, 290, 143, -67, -236, -250, -121, -25, 236, -127, 85, -183, 74, 71, 23, 175, 148, 47, -276, 21, -313, -61, 25, -209, -117, -74, 177, 6, 96, -110, -204, 212, 90, 45, -239, -121, 24, -194, -134, 35, -63, 231, -200, -141, 172, -134, -87, 151, 100, -6, -13, 148, 55, -166, -113, 110, 85, -44, 64, 72, -53, -368, -156, 75, -155, -97, 116, -201, 56, 35, 134, -140, -39, 171, -19, -40, -3, -18, 218, 34, 137, 8, -37, 23, 299, 54, 10, -211, -172, -121, 4, -51, 88, -244, 147, 197, -221, -66, -32, -5, 133, 132, 69, 133, 6, -257, -144, 231, -304]
4390c04M87l62J70J09m39K08J64m9J22k07K78l01K89r3k14q8M88k16m2p9j44K37
4412A4m62L78R4o6m9J65m1j30q5n0M65k80LJ34J14o3l13J73l19K52lK39l42N7
4436a15J80j35j78L9J82J83k50P0J87M4o6p0j34J20j65M04j22J25k35L5j56k9
4458h6L43m10K31j23J38j1j26J26ln7Q7j71n7p6L18N3j28K9J18q3k82p7R5J12
4482d0J40ql72L18N9k0j84j2J74j65K85j0n1Q6k31M6K24k95K5j79K63nj03j0K0
4507d5K59k41J03j5L5L2l54L07j00N4l9j68MQ0JK70l65l7m4K93r3j31L93q7p5
4532C7j05J23Q9R4m17K45J13o7m6Q8J76n26J04L06j49k97J59J37j77K67n13K67
4554i2J59J95l25J43L52n11M39k25N1j30j76K13n9J44j43j49J92J03l18K7K49
$$ y = [-304, 183, -179, -9, 100, -339, -131, 33, -16, 106, -101, 177, -124, 165, 72, -142, -230, 258, 42, 0, -79, -223, 14, -448, -70, 24, -42, -91, 74, 33, -97, -182, -232, 233, -47, -44, 90, 204, 141, -172, 1, -318, -66, -69, 170, -172, -115, 65, -70, -248, -209, -27, 156, -94, -24, 163, 207, 141, 71, -63, 57, -108, 296, 174, 299, 64, 99, -57, -86, 257, -153, 78, -45, 93, 82, -44, 82, 79, 22, 109, -62, -119, -195, 123, 176, 48, 77, 195, 112, -170, -247, -152, -40, 100, 92, -280, 38, 97, 77, -107, -119, 55, -110, 175, 165, 114, 200, -31, 15, 239, -56, -31, -210, 53, 48, -55, -65, -45, 214, -27, 76, 61, 96, 128, -226, 81, -19, 35, -4, -172, -168, -88, -87, 183, -182, -219, -263, 30, -63, -194, 199, 112, 37, -68, 55, 144, 238, -179, 66, 179, 112, 66, 154, 330, -196, -92, 214, 65, -232, -73, 64, -113, 154, -359, -92, 67, 262, -63, 80, 432, -79, 360, 135, 186, 56, -120, 93, 34, 178, 35, -114, 78, 181, -137, -110, 139]
4575A39k80q2M87l39p2L91k87k1K3k7R4o3K7l22L68j33N9K06l95J95K35l49l0
4598a76J32R9R1j83L44m23L8J17j02j36J0M59j35k46M5L00l1j46j84n3J00J04
4620B4K0m5P4q0R6k83L25k76K39j46J88N2l35%L63k00l57M27j25O9k66L45j75
4643f6J26l36M28J88j75k7k04K3j73J48K70k44J21l42N44k46k26Q1l5K1O4J42
4665H2R0j31j42J53j4K00p6l23KJ35J76j10j20M6m16L91J26m40O45n5l34J5pK14
4689A07Po0Jj90Q4J55k7j47K7o7J44R8j5j96N6J39l10M11j28k22J34j34J84M0
4713I1j80J06r1K9j45J15p9K57J8l90L40n4j08M82o00q9P1L90j19O1k1N4J02j97
4737D3q6J19j03k36K44L69k79l60K87q9K35j10l4j64O4J46j75J10J28j70P4j58
$$ y = [139, -141, -223, 264, -75, -147, 244, -43, -64, -41, -68, 26, -37, -10, -332, 36, -97, -38, 168, -227, -32, 203, -146, -176, -44, 55, 146, -37, 307, -116, -78, 39, -63, -199, -189, 270, 135, -111, -66, 234, 203, 57, -127, -180, -80, 24, 44, -1, 73, -7, 89, -194, 131, -145, 94, -52, 136, 188, -147, -147, 216, 16, -341, 86, -39, 30, -236, 109, -66, 60, -276, 152, 340, 165, 138, -66, -43, -216, -68, 202, -42, 79, -263, 281, 35, -191, -110, -145, -124, -60, 82, 172, 41, -101, 52, 38, 238, 162, -161, -159, -24, 152, 42, -78, -32, -448, -57, 69, -371, 274, 219, -115, -100, -107, 107, 114, 54, 55, -135, -51, 104, 77, -70, -43, -110, 34, 132, 117, -79, -23, 116, -194, 217, 89, -133, 1, -133, 51, 91, -89, 17, -74, -45, -190, -75, -154, 103, 121, -269, 71, 17, -91, 391, -209, -298, -227, 163, 44, 105, 84, 138, 240, 43, -43, 76, -27, -263, -19, 350, 71, -289, -2, -91, 144, 34, 0, -164, -100, 46, -129, -19, 109, -61, 13, -145]
4759a45L16j28J1l8J4m0j21P5J65q5j9J2j05J62j34J12j03K18l11l7O1m7J60k07
4783b14K99Np2O2K0k56J44q3Q1j79o4J77j55L53k44K97j77J36k25o8J44j2P0j41
4807a02Q6J07q9N1mk59K87k43J88J28j27k5m3K73o55M13J19q8J21r7oj05J60R
4831I9j7q1j13K76j48Np5j08j13K93j60K46N4o0k2j26k03L82J72k62K5m7J42J2
4855A71l46l1K03j3L0j25L04k06J3r8K1K81l33K47J8k7j27n3K11j59l6K22q1m68
4879c82K91j01k4M28k97K42j75L06k98j41J42j36J69j65K36l0j95K83q5J83j5
4900B36o1k61J92k28P0j25Q7R5P9j39N5j96k2L42k4K20k99K23j83j7Q1j50l5R4
4924C4K8kj64L3k0j10J62j61K02j14L54l46L28l08J99j24K6J81k31J2j10K18m1
$$ y = [-145, 171, 43, 54, 16, 30, -10, -131, -56, 109, 24, 5, 17, -88, 74, -60, 52, -51, 167, -144, -181, -120, -167, -7, -214, 85, 90, 18, 80, 100, -156, -12, -95, -14, -193, -257, -80, -235, 118, -126, 171, -6, 130, -95, -163, -19, -31, 39, -102, -16, 91, 2, 53, 49, -210, 77, -166, 22, 150, 23, -2, -45, 228, -427, -14, 105, 17, 138, 41, 35, -70, 90, 99, 82, 1, -112, 164, 16, 21, -54, -162, -275, 18, -142, 104, 158, 98, 76, -50, -253, 129, 301, 39, 64, 17, 159, 171, -175, -206, -3, -16, 14, -111, 193, -13, 0, -98, -77, 204, -129, 118, 136, 109, -18, -71, 140, -19, -55, 167, 86, -382, -91, -192, -216, 212, -85, 157, -18, 288, -10, -151, -9, -145, 24, -141, 95, 65, -130, 153, 68, 251, 236, 175, -86, 106, -122, -52, -177, -90, 5, 84, -55, 0, -196, -218, 124, 100, 320, 21, 244, 61, 44, 125, -25, -60, 34, 62, 60, -104, -71, -91, -201, -39, -200, 2, -112, 242, -104, 224, -84, 115, -9, 17, 198, -33, -21, -131, 87, 46]
4947D6J87m48M39j23k22K31k87K35j48j41K58p3K4K9L0Q1k92P9K23kk1k56Q4Q9
4971B2o0n8p5l9K13J62j47j05K83j54J55l9j34O8J4J04k92j6J3K47J14k49J03
4994A30p6p3O5R7n6Jk1R1k00K6M4p4p1j52L67o3n2J95l2j31l06M98l97L54l71
5019b07K17j96K10K3M8Pn3j31j08K12K63l15J57K1k7m99J66L66j78J56j19JJ04
5042A18j00K4rr8j6K48j41J58l86J95p0m6J14q6l23L58Q3j78J86j56K40l70L37
5065H2m10K79m4ml5j5N1L04k88J65l06l3J07N3L26j99L5k6j79J26j25J76j30j38
5089b28N38n80K72k0K12k15R4k6q2j47K71j09JLr4P2l7q8l9K30n4J59j06J53j98
5114a8J23o3K6p4j24K41n6j26L00k97J24l4J33j36l3j36N3Ml05L20M5m9n0j32
$$ y = [46, 233, -215, 224, 101, -121, 110, -177, 58, -90, -231, 27, -46, -22, 7, 37, 118, -174, -95, 128, 126, 105, -151, -67, 22, -38, -96, -171, -210, 3, 165, 18, -87, 196, 42, 197, 158, 24, 92, 106, 210, -82, -98, -85, 162, 276, 27, 130, 54, -19, 46, 143, 87, 88, 67, 158, -42, -16, 28, -46, -117, -269, 98, 35, -17, 178, 146, 15, -291, 207, -190, 164, -207, 10, -186, 24, 47, 95, 102, 49, -82, -190, 22, 285, -30, 127, 148, 121, -378, -212, 154, -24, 132, 13, 14, 118, 18, 42, 33, -65, -81, 167, 26, 184, -202, -7, -77, -123, -9, -95, -418, -60, 23, -155, 31, -125, 115, -255, 82, -328, -49, -93, -97, -132, -147, -96, 208, -80, 85, -221, -254, -147, -94, 232, 33, 68, 42, -137, -11, -136, 40, -90, -228, 310, -270, 2, -18, 194, -21, 73, 47, -35, -182, 89, -20, -19, -16, -110, -38, -75, -163, -202, 28, -26, 133, 27, 180, -18, 105, 42, 68, -6, -130, 111, 55, -71, 229, -68, 56, 22, 155, 19, -14, -150, -97, -93, -398, -78, -33, -82, -132, -264]
5138b64M09j30l9j14J7o5K39L6o9no7J88r8k1R2p5L5J4l04K76j17N7p3P5j65R7
5164g1R9j11L3J87k30J94n4M4j50j59r0K62J44j72pk4r8J40J20q4p3M4n5K2J40
5189E1N1k74J27j8J92j53J18J27k20L7k69N2J8J56J34j94R5q8P8j29J90M4k09
5212h4k7P9k2m4J13j48N9n8P9j29J44L2n6l3k2L5K21r2n1P7N1K36l76k93M18k01
5238i2n0R3L2J17j87J78p7k11K48J6k34K04O5k72K40p0j76J87j67j23J09N3l9
5261a56Q3K0P5k2r8J22J08j15J24j14j5m2l0j04Q9N7O6K72k92k26L08k59J88J49
5285A88o9J9J7l91K01k94M05J2j96J70J2j81k7J61L01r7j00n4j30O8J48rm12J71
5309h7K4q2J91j29K73r2L17n20J28k0K53Q5k53J89k51J64l00J79k25j31K87J49
$$ y = [-264, 145, 15, -24, -138, -121, -186, 53, 89, 20, 15, -52, 136, 38, 17, 109, 34, 69, 83, -221, 55, -62, -5, -78, -3, -168, -71, 28, -83, -50, 137, -93, 101, 47, 91, -59, -218, -308, -46, 98, -74, -81, -105, -203, -63, 57, -27, -100, -56, -111, -89, 51, 102, -172, -45, -63, 129, -24, 94, 221, 1, 38, -231, -179, -161, -5, 129, -65, 30, -58, 20, -109, 81, 125, -84, -111, -32, -54, -98, 15, -133, -74, -132, -53, -182, -38, -6, -62, -95, -117, -82, 139, 47, -4, 73, 124, 360, -16, -309, 109, -92, -142, -49, -17, 100, -87, 91, 14, -197, 51, 67, -167, 37, 102, -170, 70, 0, -176, 11, -156, -279, -170, -117, -156, -73, -53, 22, 0, -98, 24, 132, 17, 141, 27, 12, -30, -60, -164, -75, -18, 48, 320, 28, -198, 110, -149, 39, 188, 119, 138, 155, -236, -35, -329, 76, 88, -108, 62, 74, -107, -134, 27, 328, 231, 131, 77, -53, 15, 163, 154, -258, -87, -63, -145, 46, -83, 190, 98, 415, -105, 23, 3, 256, 341, 88, 277, 26, 190, -110, 69, -156, -287, 0, 149]
5331A49j31k4O8K2r3j21K62m2K18k50P7j02p6m8J15j45K00j71R1Mr0J43J69j9
5355B06l99J79L78m89j44K61m2j3j50j1J57m6O0jK68j22j20J01j91j14K8L44j62
5378b2J23k30J88P1j41L73m80K56J3m55O33l32J5J76l37K18J1q4M9Q2q4Q7j98
5401f8j31L77j32r8k31M57j45j90J94k0J67j32n5n6J03J8j73j69L51j96K97j08
5423F0j6n9k14K70r3K70k47L22j77L3J35j58j0j44P8l3j70K26o1K3j06K01j49
5446a9j4L6j09J45m6r4J81k14K1J63l94M75J47l62n0J29o7n0p0k9K25k59P0l4
5470b19L3PK98j88L83n59K14j74K68Q9N0k7l56L04KK16l09j61k39N57k34J40j48
5493e3M1l6K63q4Q3k11j7L6K4j68M14j57r7J87m01J25K45k70N9j18J34j13P4J8
$$ y = [149, 18, -6, 62, 84, -9, -130, 132, 90, 308, 58, 135, 33, -43, -91, 24, -121, 79, -92, -1, 3, -87, 56, 225, 206, -193, -14, 364, -125, -269, -8, -50, -63, -213, -224, -67, -113, -53, -54, 214, 92, -28, 73, -118, -232, -204, 140, -22, 101, -129, 59, 130, -11, 362, -118, 138, 151, -304, 329, -3, 12, 188, -149, 69, 80, -4, 45, 127, 43, 130, -68, -199, 178, 46, -52, -283, 174, 29, -161, 33, 13, 180, 48, -7, -63, 40, 58, -115, -284, 67, -129, 168, 60, 44, -15, -229, 41, -52, 218, -29, 293, 116, 149, 284, 126, 116, -28, 50, 17, -153, 73, 12, 35, -71, 130, -19, -33, 3, -106, 39, -7, -101, 80, -134, -113, 50, -344, 131, 278, -84, -134, -5, -72, -122, -192, -221, 4, -255, -185, -219, -186, -179, 119, -69, 314, -245, -31, -205, 63, 152, 202, 175, -181, 123, 125, 341, 32, -129, -368, 189, -45, 95, -53, -12, -48, 215, 131, 214, 3, -14, 22, 46, -122, 292, 135, 38, 225, -176, -51, 194, -76, -17, -135, -1, -114, -40, -22]
5517b2K3M14n65J11J56q2p3l8K91l15K63j93j68K58R3j93kl22K72J44K0p3J4J66
5541A79m12L03R6j30J27m86N29P0k19P3l88K59j12K01J05J25k80K00j97N9J29
5562B31r8r1j00J08k43L33j01j65Q4J8k07J37j22L55n0k63J0J56O3k2j6j32k33
5585c48K82J66k40K19n9k21pK07J02o9k47J7K24J31j44J05k94J86n0J1J3J91n3
5608A22l33J29J08R5k28J76l48N56j72m9m9J67n14L47o3J69k48O7j0j41K36Qj25
5631a00J26k6p5M8o7J34l07K86j59K31J3l8r3Q6r8j88lM5J94p6J84k79J12N7j45
5656a38J70n6R3n1o0n9j53J43P5j55M64k69k77M25k99oj58M44Q1j86K72k42j60
5679a02J00J31n8m30L91j58l0J84M19p26R0P9K72l80L59j22q9L35k11%m05L15
$$ y = [-22, 1, 415, -150, -39, 117, 35, -38, -76, 215, -100, 163, -30, -198, 60, 153, -40, -42, -364, -92, 52, 72, -1, 13, 179, -233, 70, 166, 36, 163, -323, 206, 276, 57, 130, -258, 1, -111, 90, 195, 320, 40, 240, 43, 102, 231, 133, 42, -58, 50, -193, 140, 39, -126, -42, -24, -231, -94, -216, 139, 89, -174, -164, -8, 55, 33, 17, -115, -348, -66, 100, -140, 79, 20, -201, -208, -1, 101, 32, -215, -198, 26, 157, 13, 118, -176, 10, -40, -29, -16, 175, 122, -211, -82, 26, 121, -107, 69, -279, 277, 105, 56, 7, 174, -340, 7, -56, 113, -135, -68, -78, -219, 17, 25, -100, 26, 0, -75, -27, -94, 40, -267, 19, -140, 91, 104, 66, -27, 59, -39, -227, -230, -185, 9, -67, 117, -162, -50, 7, -138, 32, -24, 69, 18, -42, -101, -254, -111, -36, -191, 273, 4, -273, 152, -147, -153, -311, 133, 214, 28, 300, 58, -102, -2, 129, 71, -359, 32, -126, -156, 28, 447, -279, -189, -110, 162, -218, 141, 19, -70, 265, 54, 54, -351, -36]
5701c6J25k32l7J64J50l89J29J58K7jP7m3k33k4Q8R7oJ6O2M1j85K3j52K30k8q8
5727f7J21n6j40r0L61l64J40j02J88N8l65L91j55K7J40k06j85L43J61j68J86J11
5749C29l32n6K22k39m7K03l62N34k88j32K90k03m4o1O4J23j22P6J69j57M1k11
5771b03M12k24J00pl14J22J36j49JJ16J50l60J62R0j47R5l6N8j33J34o3K24n89
5794d25L65k74K31J07K48l49mr0J06k2J39l7j18L2L0k89M45N1j13j15J92P8l30
5817a42M28l71J51o9J17KL10k73j74j7k9k1L7J37l4j08j08J69o3N2k08L51k33
5840i6j50L60j07K49j22j05K05j47m9Pk28L92l78L79k34N9k23L56k75k10N13k81
$$ y = [-36, 89, -143, -180, -16, 134, -255, -126, 32, 59, 58, 135, 92, -141, -165, -77, 20, 14, 30, 92, 133, -52, -29, -181, 49, 21, -67, 54, -2, -142, -232, 129, -235, -95, -197, -9, 49, -316, 75, -80, -53, 87, -119, -304, 39, 200, 32, 218, 329, -3, -59, 163, -76, -123, 80, -282, 252, -36, -168, 122, -81, -125, -186, -122, 1, -121, -45, 124, -33, 8, -203, 209, -15, 85, 78, -236, -114, 22, -127, -126, -10, 140, -220, -58, 32, -115, -20, -56, 2, -131, 3, -60, 164, -425, -60, -334, -103, 4, 252, -97, -101, -191, -85, -107, 32, -5, -123, -91, -61, -350, 95, 146, 33, -82, 110, 188, -142, 286, -85, 66, -3, 114, 116, 426, 153, -21, -38, -67, -88, -51, 86, 52, -56, -164, 5, -58, -6, -214, 137, -96, -246, 114, 7, 256, 134, 29, 234, 87, 38, 45, -183, 209, -169, 210, -24, 35, -188, 168, -107, -317, 196, -85]
$$ [...]
8191E
##END NTUPLES=NMR FID
##END=
