##TITLE=1H_ART-AcOHH2SO4-f12
 200.13MHz, CDCl3,
 8 sc
 
 17.1.2025
##JCAMPDX= 6.0         $$ Bruker NMR JCAMP-DX V2.0
##DATA TYPE= NMR FID
##DATA CLASS= NTUPLES
##ORIGIN= UXNMR, Bruker Analytische Messtechnik GmbH
##OWNER= pz
$$ XWIN-NMR		Version 3.5
$$ Fri Jan 17 14:28:28 2025 Russian Standard Time (UT+4h)  she@DPX200
##.OBSERVE FREQUENCY= 200.1313
##.OBSERVE NUCLEUS= ^1H
##.DELAY= (6, 6)
##.ACQUISITION MODE= SIMULTANEOUS
##.ACQUISITION SCHEME= undefined
##.AVERAGES= 8
##.DIGITISER RES= 18
##SPECTROMETER/DATA SYSTEM= spect
##.PULSE SEQUENCE= zg30
##.SOLVENT NAME= DMSO
##.SHIFT REFERENCE= (INTERNAL, DMSO, 0, 14.3821)
##AUDIT TRAIL= $$ (NUMBER, WHEN, WHO, WHERE, WHAT)
$$ ##TITLE= Audit trail, XWIN-NMR		Version 3.5
$$ ##JCAMPDX= 5.01
$$ ##ORIGIN= Bruker BioSpin GmbH
$$ ##OWNER= she
$$ F:/spectra/data/she/nmr/H-C/1/audita.txt
$$ ##AUDIT TRAIL=  $$ (NUMBER, WHEN, WHO, WHERE, WHAT)
(   1,<2025-01-17 14:27:27.92 +0400>,<she>,<DPX200>,
      <created by zg, POWCHK disabled, PULCHK disabled
       configuration hash MD5:
       00 E9 B6 7A A2 85 ED C7 34 08 36 98 17 FE 4E 26
       data hash MD5: 16K
       A9 F9 B1 0D 59 C5 46 2C 68 6C 75 DC 76 02 D1 53>)
$$ ##END=
$$ 
$$ hash MD5
$$ EE 3D 4D DE EE FA CC 36 46 30 6D 69 97 CE 2D AA
##$RELAX= 
##$RELAX= 
##$RELAX= 
##$RELAX= 
##$RELAX= 
##$RELAX= 
$$ Bruker specific parameters
$$ --------------------------
##$DU= <F:/spectra>
##$EXPNO= 1
##$NAME= <H-C>
##$PROCNO= 1
##$TYPE= <nmr>
##$USER= <she>
##$AMP= (0..31)
100 100 100 100 100 100 100 100 100 100 100 100 100 100 100 100 100 100 
100 100 100 100 100 100 100 100 100 100 100 100 100 100 
##$AQSEQ= 0
##$AQ_mod= 1
##$AUNM= <au_zg>
##$AUTOPOS= <>
##$BF1= 200.13
##$BF2= 200.13
##$BF3= 200.13
##$BF4= 200.13
##$BF5= 200.13
##$BF6= 200.13
##$BF7= 200.13
##$BF8= 200.13
##$BYTORDA= 1
##$CFDGTYP= 0
##$CFRGTYP= 5
##$CHEMSTR= <none>
##$CNST= (0..31)
1 1 145 1 1 1 1 1 1 1 1 1 1 1 1 1 1 1 1 1 1 1 1 1 1 1 1 1 1 1 1 1 
##$CPDPRG= <>
##$CPDPRG1= <>
##$CPDPRG2= <>
##$CPDPRG3= <>
##$CPDPRG4= <mlev>
##$CPDPRG5= <mlev>
##$CPDPRG6= <mlev>
##$CPDPRG7= <mlev>
##$CPDPRG8= <mlev>
##$CPDPRGB= <>
##$CPDPRGT= <>
##$D= (0..31)
0 0.7 0 0 0 0 0 0 0 0 0 0.03 0 0 0 0 0 0 0 0 0 0 0 0 0 0 0 0 0 0 0 0 
##$DATE= 1737109647
##$DBL= (0..7)
120 120 120 120 120 120 120 120 
##$DBP= (0..7)
150 150 150 150 150 150 150 150 
##$DBP07= 0
##$DBPNAM0= <>
##$DBPNAM1= <>
##$DBPNAM2= <>
##$DBPNAM3= <>
##$DBPNAM4= <>
##$DBPNAM5= <>
##$DBPNAM6= <>
##$DBPNAM7= <>
##$DBPOAL= (0..7)
0.5 0.5 0.5 0.5 0.5 0.5 0.5 0.5 
##$DBPOFFS= (0..7)
0 0 0 0 0 0 0 0 
##$DE= 6
##$DECBNUC= <off>
##$DECIM= 32
##$DECNUC= <off>
##$DECSTAT= 4
##$DIGMOD= 1
##$DIGTYP= 9
##$DL= (0..7)
0 120 120 120 120 120 120 120 
##$DP= (0..7)
150 150 150 150 150 150 150 150 
##$DP07= 0
##$DPNAME0= <>
##$DPNAME1= <>
##$DPNAME2= <>
##$DPNAME3= <>
##$DPNAME4= <>
##$DPNAME5= <>
##$DPNAME6= <>
##$DPNAME7= <>
##$DPOAL= (0..7)
0.5 0.5 0.5 0.5 0.5 0.5 0.5 0.5 
##$DPOFFS= (0..7)
0 0 0 0 0 0 0 0 
##$DQDMODE= 0
##$DR= 18
##$DS= 0
##$DSLIST= <SSSSSSSSSSSSSSS>
$$ [...]
##$SUBNAM0= <"">
##$SUBNAM1= <"">
##$SUBNAM2= <"">
##$SUBNAM3= <"">
##$SUBNAM4= <"">
##$SUBNAM5= <"">
##$SUBNAM6= <"">
##$SUBNAM7= <"">
##$SUBNAM8= <"">
##$SUBNAM9= <"">
##$SW= 18.0517328524113
##$SWIBOX= (0..15)
0 0 2 0 0 0 0 0 0 0 0 0 0 0 0 0 
##$SW_h= 3612.71676300578
##$TD= 16384
##$TD0= 1
##$TE= 0
##$TE2= 300
##$TE3= 300
##$TEG= 300
##$TL= (0..7)
0 120 120 120 120 120 120 120 
##$TP= (0..7)
150 150 150 150 150 150 150 150 
##$TP07= 0
##$TPNAME0= <>
##$TPNAME1= <>
##$TPNAME2= <>
##$TPNAME3= <>
##$TPNAME4= <>
##$TPNAME5= <>
##$TPNAME6= <>
##$TPNAME7= <>
##$TPOAL= (0..7)
0.5 0.5 0.5 0.5 0.5 0.5 0.5 0.5 
##$TPOFFS= (0..7)
0 0 0 0 0 0 0 0 
##$TUNHIN= 0
##$TUNHOUT= 0
##$TUNXOUT= 0
##$USERA1= <user>
##$USERA2= <user>
##$USERA3= <user>
##$USERA4= <user>
##$USERA5= <user>
##$V9= 5
##$VALIST= <valist>
##$VCLIST= <CCCCCCCCCCCCCCC>
##$VD= 0
##$VDLIST= <DDDDDDDDDDDDDDD>
##$VPLIST= <PPPPPPPPPPPPPPP>
##$VTLIST= <TTTTTTTTTTTTTTT>
##$WBST= 1024
##$WBSW= 4
##$XGAIN= (0..3)
0 0 0 0 
##$XL= 0
##$YL= 0
##$YMAX_a= 401833
##$YMIN_a= -417662
##$ZGOPTNS= <>
##$ZL1= 120
##$ZL2= 120
##$ZL3= 120
##$ZL4= 120
##$ABSF1= 10
##$ABSF2= 0
##$ABSG= 5
##$ABSL= 3
##$ALPHA= 0
##$AQORDER= 0
##$ASSFAC= 0
##$ASSFACI= 0
##$ASSFACX= 0
##$ASSWID= 0
##$AUNMP= <proc_1d>
##$AZFE= 0.1
##$AZFW= 0.1
##$BCFW= 1
##$BC_mod= 2
##$BYTORDP= 1
##$COROFFS= 0
##$CY= -3
##$DATMOD= 1
##$DC= 2
##$DFILT= <>
##$DTYPP= 0
##$F1P= 0
##$F2P= 0
##$FCOR= 0.5
##$FTSIZE= 0
##$FT_mod= 4
##$GAMMA= 1
##$GB= 0.15
##$INTBC= 1
##$INTSCL= 1
##$ISEN= 128
##$LB= 0.25
##$LEV0= 0
##$LPBIN= 0
##$MAXI= 10000
##$MC2= 0
##$MEAN= 0
##$ME_mod= 0
##$MI= 1.114404
##$NCOEF= 0
##$NC_proc= 0
##$NLEV= 6
##$NOISF1= 3.799351
##$NOISF2= 2.8
##$NSP= 1
##$NTH_PI= 0
##$NZP= 0
##$OFFSET= 14.38212
##$PC= 1
##$PHC0= 250.8238
##$PHC1= 13.5922
##$PH_mod= 1
##$PKNL= yes
##$PPARMOD= 0
##$PSCAL= 0
##$PSIGN= 0
##$REVERSE= no
##$SF= 200.129724274929
##$SI= 16384
##$SIGF1= 3
##$SIGF2= 2
##$SINO= 400
##$SIOLD= 16384
##$SREGLST= <1H.CDCl3>
##$SSB= 0
##$STSI= 0
##$STSR= 0
##$SW_p= 3205.1282051282
##$SYMM= 0
##$S_DEV= 0
##$TDeff= 0
##$TDoff= 0
##$TI= <>
##$TILT= no
##$TM1= 0
##$TM2= 0
##$TOPLEV= 0
##$USERP1= <user>
##$USERP2= <user>
##$USERP3= <user>
##$USERP4= <user>
##$USERP5= <user>
##$WDW= 1
##$XDIM= 8192
##$YMAX_p= 0
##$YMIN_p= 0
$$ End of Bruker specific parameters
$$ ---------------------------------
##NTUPLES= NMR FID
##VAR_NAME=  TIME,          FID/REAL,        FID/IMAG
##SYMBOL=    X,             R,               I
##VAR_TYPE=  INDEPENDENT,   DEPENDENT,       DEPENDENT
##VAR_FORM=  AFFN,          ASDF,            ASDF
##VAR_DIM=   8192,          8192,            8192
##UNITS=     SECONDS,       ARBITRARY UNITS, ARBITRARY UNITS
##FACTOR=    0.0002768,     1,               1
##FIRST=     0,             0,               0
##LAST=      2.2672688,     0,               0
##MIN=       0,             -417662,         0
##MAX=       2.2672688,     401833,          0
$$ Real data points
##PAGE= N=1
##DATA TABLE= (X++(R..R)), XYDATA
$$ [...]
1908G45J02j599Q70R72j045j45J358l33j660P89J010j053r18J179P6j483M14J128
1926D07n25n67Q97J01n33l06P39K00m49O5M50m72j0N54j32o10l37R01m9j135Q08
1947cP37q83j139J743N44j205k58J424p60j146J364L00j312j56J751p38j665J549
1965A47P09j987K05J828m30k066J243J615j650o54J979J18j863N57J987j857r53
1982a072J830L53k103J88K310j540j749J579J317j911m95K056l90j975J607J099
1998A104j361n91J876j61j590J205P92j314m14J150qj354N90M87l85m20J08O16
2016C30j91p12K22O18q46K16O77L81j187J93J061n21o49O13K92j086L26J440j064
2035A13q51R18P02j689J72J467o30r59O99J103j153o04J531j27j340P84P85j323
$$ y = [745, 847, -752, 118, 1090, 45, -100, 1258, 925, -735, 54, 1064, 11, -907, 272, 348, -1135, -721, 407, -118, -685, 212, 313, -220, -526, 213, 413, -36, 29, 479, 7, -3, 551, 419, -191, -528, 373, 324, -811, -3, 734, -149, -1288, 455, 999, -206, -464, 960, 200, -946, 418, 718, -594, -750, 1001, 263, -1402, 147, 856, -1131, -926, 902, 472, -1594, -351, 1264, -386, -1040, 939, 1057, -806, -249, 1738, -119, -1072, 758, 1111, -992, -804, 1506, -34, -1783, -204, 1113, -798, -1293, 763, 373, -1602, 5, 1104, -257, -848, 1028, 867, -723, 482, 1274, -40, -454, 696, 688, -666, -76, 411, 26, -394, -286, 330, 139, -573, -351, 267, -579, -363, 314, 695, -492, -299, 762, 241, -408, 205, 497, -589, -263, 1177, 113, -738, 180, 882, -807, -635, 832, 202, -757, -58, 1045, -108, -712, 819, 692, -648, 136, 921, -402]
2053d02j73Q37J72j292O31J248j351q59J135P63j409j88J864l59j078Q56N25j246
2071c26j84J423m53j312J065O66j487k15J659o77j755J257J349j810RJ622m33
2088C98j058O66R96j063M9N48l0n58J08M47n99k89N89m9k70n54M35K79l77m02
2108g34Q57L76j019m0J364p27o19J128M25j677K80J451j098q91J324L54j635j61
2126a042J719n35j217R82R14j109j19J176j99j480J354M74j169j97J333n62j230
2143i07R74K70o42l38J000p8r44N03L22k08j07M49K90l86k48M06r4k03Q2K25j50
2164B16l49J07J52l84j58O59m85l98L56M74o00p3N49M27q45K75P46k86p31Q07
2184D59L5p28M9O49p18k79N13K14q17K48O81n27n40P26L65r30M47O02k46o50O25
$$ y = [-402, -575, 262, 434, -858, -227, 1021, -330, -1189, -54, 709, -700, -888, 976, 617, -461, 395, 920, -326, -510, 913, 460, -852, 213, 879, -608, -823, 836, 159, -1596, -339, 1010, -800, -791, 831, 398, -660, 6, 1002, -61, -12, 536, 506, -52, 56, 503, -96, -385, 204, 155, -115, -669, -234, 45, -332, -734, 123, 499, -520, -560, 804, 77, -542, 586, 1011, -666, -386, 1065, -33, -924, 400, 754, -881, -1042, 677, 142, -1075, -93, 821, -288, -407, 769, 570, -910, 444, 918, -251, -448, 885, 323, -907, 67, 337, -305, -643, 357, 279, -665, -162, 160, -48, -155, 294, 584, 198, -50, 356, 262, 59, 141, 366, 216, -133, -26, 126, -258, -416, 243, -242, -640, -284, 190, -410, -483, 66, 493, -352, -77, 669, 383, -348, 459, 494, -234, -185, 464, -254, -533, -20, 194, -623, -375, 306, -221, -761, -35, 330, -600, -153, 449, 203, -447, 178]
2205A78L68o20j42O79k27n24J19P87q24k03N81J96r85M58O19m61n42N59M39m30
2225B5o43Q37j51o74R34q8n71j84O94l07p11R02K91l23m24O40J36m48j13O17l26
2246A13O3O4K35k46k3j18K86j07m36J03M29o47o08J058j17r37N47Q26o35o56R62
2267A56L90j032M26P41o90r2J055o35o88O68J39o97k83Q75l60n86N79M36j002
2286f00J4R63l36n47N80N77r75L64L85L0p05K50j13P1l6J74j86K86k54j10j12
2307b80K29J89l61K87l18P4K40L48p26N48j66l04o4M28j65j84L99k1k51l6N30
2328C96m79m40O39Q5l24nL29j3j51P4J68j12q8K15J39n33K17Qk56j80J20J94n88
2351e85N13J33k83k35M68L20l06l10N39J81k82k29N54k97k98K16Kl57j07L62n57
$$ y = [178, 546, -74, -216, 463, 236, -288, -169, 618, -206, -409, 172, 368, -617, -159, 460, -1, -543, 16, 455, 25, -618, 219, 68, -606, 328, 240, -331, -515, 179, -128, -839, 63, 354, 31, -393, 247, 383, -65, -178, 439, 113, 176, 240, 475, 229, 206, 88, 374, 267, -169, -66, 363, -284, -892, 166, 49, -888, -341, 485, -150, -806, 156, 546, -486, -60, 681, -9, -101, 954, 319, -369, 299, 438, -259, -542, 333, -27, -613, -34, 402, -600, -586, 377, 41, -506, 74, 651, -324, 40, 425, 455, -250, 0, -113, -42, -78, 96, -90, 196, -58, -168, -280, -51, 138, -223, 64, -254, -180, 60, 408, -318, 230, 64, -240, -304, 124, -41, -225, 174, 153, -98, -134, 396, -83, -523, 116, 201, -123, -128, 201, 188, 37, 111, 279, 167, 79, 294, 433, -100, 117, 125, -131, -311, -191, 3, -585, -72, 61, -222, -457, 11, 331, 25, -285, 254, 435, 153, -76, 478, 181, -117, 99, 101, -256, -363, -1, -558]
2372e58J46J17M36o14K1O57J60m63M9J48K21o77M28M12l30k77L6K08j49K62k02
2393C1l2k80L47M09n56k39M29p2j59Q7L83n2m60K19M07n44J43k19J77n5J82j25
2415B1n90L68O71o66m29O28k5O4k97K55K95j49J08J48q9n6j31j72J23l5J79k22
2437aM4m83J73K56j10J9r2K9j2J19L01j59m8N56o97j42K23J91j57k20N71l40n40
2460e19L90J76l79K84L52m51k00L35O3m70M36M40ko00L78N47j048j63P48k12o87
2481e82N95N8l11r8O15r0o13O11J24o19lO01l21m11P56j70l46J69J33m3l82M69
2503A42k23m12R5N99l03o31L40O60m62J98L0QN5j2K07l11Q2J51k37Q6J79l66j17
2526b42K01l4l31L23j58nJ32M00m68J27M01m4o35P10L29j039K46M30j90o98Q16
$$ y = [-558, -412, -295, 141, -473, -452, 205, 365, -98, -49, 99, 320, -357, 71, 483, 153, -124, -88, 120, -29, 233, 31, -1, -281, 66, 475, -81, -320, 109, 37, -122, -35, 348, 296, -164, 55, 462, -82, 61, -158, 19, -36, 146, 21, -569, -201, 470, -196, -625, 3, -22, 42, -255, 0, 295, 146, 254, 402, 313, 257, 126, -46, 77, 42, 221, -1, 43, -440, -267, -11, -121, -102, -194, -165, -177, -58, 243, 84, 36, 592, -105, -247, -24, 167, 10, -210, 361, 21, -519, -129, 47, -332, -48, 304, -147, -347, -12, 51, -419, 17, 457, 455, -145, 233, 780, -268, -431, 317, 105, -582, 13, 71, -240, -338, 277, 187, -426, 185, 309, -310, -313, 288, -33, -444, 312, 142, -204, -35, 98, 55, -327, 142, -81, -493, -398, 201, -102, -733, -393, 267, -195, 3, 33, 41, 96, 84, 291, -20, 62, 213, -24, 62, 241, -125, -242, -41, -75, -406, -83, -241, -246, -114, 286, -182, -55, 346, 302, -333, 377, 706, -333, -87, 343, 153, -545, 271]
2547B71j31n89J78N28k33o22O59J61q56N38N06n61m16P57J12n71K91J22j85r9
2567a40M81Nm21p0J06J24m53O31l52m8J46L18m51k56M08J57n96L30M71k88k16
2588a14J28P9j31M3M2L4k70L11k80O3l02N51k63J43k19N73l61k99L66N6m7j14
2610a1j22L13o3l03L92l19j00j73J83J81j24j47L88n2l06K01L43n98N66K75j85
2631C39o08N68J36j29m64N11k04l90M33j7n58K55O66o91m51O52l49k64M59L34
2651B28l97j65O94O5p57N02J97m78q1L90j67j58K69Ql93N1L50o4j32J67j37k02
2673b10K31L18k25J23oN9m79L27m3j94j19M19k05j35K53j49j18J54o0o5j23L50
2695A03Q8o4K69m40N4L03l06l24M68j10j74O7J19k09k39J57M20l03n0K01M6l35
$$ y = [271, 140, -449, -271, 257, 24, -598, 61, 222, -634, -96, 410, -151, -567, 190, 302, -269, 22, 144, -41, -140, 341, 346, -75, -145, -39, 85, -368, 263, -89, -137, 9, 327, -124, -380, 28, 185, -411, -81, 390, 102, -114, 14, 93, -38, 5, 47, 81, -189, 122, -158, -95, -397, 154, -109, 34, -185, 388, 27, -272, 94, 150, 103, -11, -133, 180, 117, -186, 206, -113, -213, -386, -203, -22, -146, -293, 95, 43, -263, -62, 281, -317, 249, 524, 339, -269, 299, 435, 306, -158, 353, 149, -241, 192, 175, -383, -128, 538, -153, -604, 48, -301, -565, -106, 228, -169, -334, 360, 425, -332, 170, 367, -111, -192, 198, 31, -127, 142, 150, -243, -192, 158, 94, -38, 129, -8, -210, 21, 339, 114, 237, 231, 290, -189, 138, 95, -99, -218, 201, -4, -139, 114, -35, -153, 1, -59, -124, -247, 103, 191, 127, 396, -44, 10, 313, 7, -317, 151, 41, -133, -66, 53, -156, -395, -238, 182, -121, -171, 30, 76, -259]
2717b59J93M36k71k5M33m02k99J12J04k32K97q9K43o17L65j42p8R4M47m13N7n3
2739i9J61n4j97K01K72m61P0O83l53k25m5m5N7K33j6j64j86P7Q9R7M8l83J21R8
2763b1J1R0P5J4N3j07Q4o7n47K43P3L15q02K99K14l7J00J66l91J42K39j01j34
2786h9j7L23k94J03rM1MJ54j59l10J64J6l13K74L1j01n3M35j0m93K67N63n06J
2810B2K20O5n35K88J40l62J56L00n4n74Q7J50j45M1L71k40j62R4J80j68r5K79
2832E8K47m06nJ87L9r1J50m50m8J56N1J69j37j2J63j21j50J80K02j44j81L60k61
2855d4K40j16K35k92j97K62L05o80L23j71j0k03K62l4l01K20L11j76M6M62j76
2876B66l86K88K07k45p2J86j15m14K02M92n05J80n5m8K2k28J85J27j41K19O3j11
$$ y = [-259, -66, 370, 99, 74, 507, 105, -194, -82, 22, -210, 87, -2, 241, -376, -11, -153, -231, -137, 310, -103, -46, -99, 62, 8, -189, 12, 284, -177, -107, 576, 223, -2, -47, -92, -35, 198, 182, 18, -168, -91, -2, 95, 143, -240, -119, -21, -10, 80, 155, 169, 222, 115, 199, 132, -415, -172, -99, 216, -586, -287, -73, -110, -10, 156, -235, -93, 146, 45, -89, -106, 217, -77, 26, 17, 58, 62, 216, 57, -253, -89, -73, -386, -112, -81, -182, -235, 200, 190, -303, -36, 527, 21, 22, 242, 307, -228, 60, 200, -162, -6, 294, 240, -334, -247, -97, -242, -201, 170, -70, -232, -138, 42, -126, -221, 58, 305, -101, -106, 81, 120, 29, 179, -271, -319, -163, -112, 57, -80, -92, 71, -50, -200, -20, 182, 38, -143, 217, -44, 196, 80, 315, 23, -174, 88, 393, -287, 36, -135, -145, -348, -86, -120, -421, -201, 110, -66, -20, 442, 266, -120, 168, 375, 130, 58, 244, 129, -285, -83, 409, -96, 84, 29, -19, 3, -225, -40, 87, -54, 165, 228, 117]
2898A17o2J01q4q8P9rOl11L58j62j00K59j86J72l91J44L68n88M34k67L20k75L57
2921A92K72l32o2J63k46j2k0k73L29j93J31j08m7l1J79K11k6n55O88j07k24Q8
2943A7L2j10m7L27k50m5N3P3l25k35O48j91j79L42Nm00J51J69J68k2k48L54l68
2966h1L74p6l42l5K58j10p2J8L50k27Q1n5J29n10J03K72k81J07K91J5k37K89p7
2989A84q8k83J97J29j98L30j86j20k36J61K8L2K21p7j54n2K51j36M2l42K28J46
3011G7K5k81L27l00J22K22q3j93J35j93J66p5K03l44K24m6k16J46m3o6j2K51k1
3034B5O8J28l2k12N4R3K96l54j46K06l53j1J78P0k92M22L44n62R3K93n72K25L53
3057C14k30M7k32M74l57p6q2J75j79N2j68N6j6K01L99o71J72J83J83l23J16k03
$$ y = [117, 55, 156, 72, -16, 63, 54, 60, -251, 107, -55, -155, 104, -82, 90, -301, -157, 211, -377, 57, -210, 110, -165, 192, 464, 132, 70, 233, -13, -25, -45, -318, 11, -182, -51, -159, -206, -237, -58, 153, 127, -428, 260, 153, -71, 17, 49, -61, -108, 219, -31, -76, -23, 50, -275, -510, 138, -53, -232, 110, 115, -285, -134, 35, 203, 181, -67, 287, -81, 293, 217, -125, -160, 98, -12, -84, -66, 284, 57, 138, 83, 212, -298, -195, 77, -204, -97, 194, 209, -28, 261, 184, 96, -187, 10, 139, -59, 271, 85, -35, -271, -110, -82, -50, 171, 94, -60, -112, 139, 3, 45, -297, -69, 77, 102, -179, 148, -152, -30, 192, 109, -84, 51, -142, 24, -51, 152, -192, 32, -14, -230, -84, -127, -193, -205, 46, 25, 93, 221, 189, -23, 31, 124, 420, 66, -80, 126, -227, -238, -60, 10, -282, 140, 484, -78, 15, 308, -264, -39, 314, 84, 131, -101, 373, 16, -60, -142, 33, -146, -94, -262, -206, -222, -21, 378, -293, -121, 62, 245, -78, 38, -165]
3079a65K70P7J66l64P3K11k03l9l7j12J39k22P0o9N54n14J21P3j9l1K87j81j41
3102e6j34N9J94K0Q6j14M9j95mj10oR0J77Q3j49p9rJ8J0Q9Q3k04k9M8J24K3n0
3129A4L83n30k06J54R8j09J95J43l05J27J96q2p8j65K91J07k08J42k83k8L06l39
3151a77K99P2j63j38m6J21l2q8N8p9p5M23l18J96q0r1J76N5j27K5J30k03j69q0
3175c11K18K02n2l6j33J81m40L71J74l37p1J96Q9J40l26J24j99K13l38L67j02
3196g0l2m6L16j85K03k23K13l00K37n6j25j16K56J8j84PK54j42N5J08l65K96n9
3219F0Q1M1m00LL64j75l5J37m9J8R0qJ02k85J66j83J25O7J6q8O5M27n90O8l69
3244c52O09k39J14j93j19P7N1j41P4P9J07J4j47J16O0M5m14M18j53q4O1J93j55
$$ y = [-165, 105, 182, 348, -16, 57, 268, 65, 26, -11, -123, 16, -206, -136, -205, 349, -165, -44, 29, 10, -21, 266, 85, -56, -190, -131, 63, 83, 169, 55, 104, -91, -95, -205, -211, -121, 56, 139, -10, -89, -98, -80, -70, 19, 102, -102, -131, -83, 41, 64, 14, 397, -133, -339, -185, -87, -196, -1, 142, -163, -36, 160, 78, 0, -165, 126, 233, 25, 167, -116, -144, 162, -177, 122, 194, 31, -107, -153, -32, -64, -152, -94, -173, -248, 175, -143, 53, -27, -118, 58, 113, -14, 11, 141, -62, -231, -311, -93, 109, 57, 21, -112, 69, -371, 0, 174, -163, -234, -38, 51, 191, -135, -11, -210, 3, -335, 32, -70, -102, -148, 168, -17, 186, -37, 176, -124, 113, 57, -68, -184, 72, 90, -94, -87, 167, 25, 80, 188, -177, 119, 60, 141, 182, -218, -215, 149, -26, -61, 76, 27, 45, 135, 127, 229, -56, 110, -73, 52, 119, 135, 47, 112, 539, -51, 17, -352, 257, 18, 132, -61, -180, -103, -52, -193, -119, -40, 67, 81, -66, 50, 110, 155, -259, 159, 6, -78, -17, 176, 21]
3267B1J17J05k81M73m94P3J03l35K6J08J11n5N4k24J52Qj00K17k50o6M8J88L2
3290C1j09M7M5j79J2M1K49p2K50j17j79j2j12M9K02k09R9p8J17l54K70m6L00k50
3314ek6j14J87Lj07J24j22K32k80L74k23k80K75j04K38K3j41k5r7p5q9J69Q9j59
3338a33K85k72J97k7J5j66K42j92J47J07j16N0q9p9J4N9k03J15l16J95K65M0O2
3361B00l66O7L1O2q7J86L1l15J85K64k01j72J09L38m34R0J29p7O6l04K00j77K79
3384A04m3k02K03p7J75l54J78J76n9j81K62j05j38J38j8q7m8j47J90q4K9k7K6
3407h9j36K44N0j84L4J25K79l49L08k35%j5O6J62l06NM3J77m61L97P5o4l91J94
3431g1O1l2n3L44m0j53J57j28L2j58L7L79m04J82J29j77k83L87j22k36K77k03
$$ y = [21, 138, 243, -38, 435, -59, 14, 117, -218, -192, -84, 27, -28, 26, -198, -46, -38, -138, 79, -171, -237, -189, -1, 31, -78, -31, 14, -165, -153, -112, 137, 65, 315, 198, 19, 7, -105, -56, 146, -63, 36, -42, 75, -279, -9, -55, 245, -5, -31, -145, 42, 45, -62, 62, -60, 172, -108, 266, 43, -237, 38, -66, 172, 195, 54, 29, -68, -143, -232, -63, 26, -133, 152, -120, 77, 50, 65, -101, 141, -51, 96, 203, 87, 137, 48, -31, -17, 42, -161, -46, -362, -167, 98, 138, 200, -166, -99, -68, -6, -93, 93, 124, -191, -6, 258, 57, -115, -6, 332, -102, -12, 117, 40, 106, -198, 2, -175, 104, 61, -141, 62, -15, 160, -194, -16, 160, 101, -80, 182, 77, -61, 77, 59, -28, -76, -223, -33, -117, -88, -115, -89, -225, 19, 69, -115, -81, 44, 323, -26, 282, 47, 47, 32, 98, 260, -46, -41, 2, 179, -282, 115, 190, 126, -265, -71, -10, -42, -95, 249, 209, 56, 213, 85, 117, -41, -4, 375, -29, 153, 282, 105, -178, 209, 87, -149, 128, -75]
3453g5r0m6J46K70j4o9k50J39J18m3L39o27K20M9j46o6K83j12nl26J89p2J02K57
3477A71l41N6RR0M33p46K40j09O68m96kK62l75O7N9j22r1L27j37K01k31K30k24
3500f1J25O7l8L2j26k35J78J76j16n0j64K14L56m94J08K84k42k25J11J05r7O8
3522b4j36L92oj64J3l9J28m02J38M71m58J76k19O6m3J68j29P1k01Q7l1R1Q8J52
3546A89k26J87K39k83k23N8K49k19o4L48o4j12j20J34j92J2m7q5M69l27j7N4l18
3569c58J71J24M1j57L09o7j99J27J78l77l8L25k93J97k70K12nn6M5O3J29j19j7
3592c5k3q5J09l5L43o7j37J07k31j07K15l26K56k17L3J26LQ2Q9m3j4K1m9M1R9
3617A55j15M9k36N56m57J28j37K88k26J00q8K75l74l9L45k36l9m4K04J12l5l10
$$ y = [-75, -165, -211, -65, 205, 191, 122, -128, 11, 129, 86, 425, -202, 18, 67, -79, -145, 138, 26, 21, -305, -116, -188, -86, 171, -170, -114, -105, -15, 418, -328, -88, -197, 471, -25, -27, 235, -140, -73, -14, -136, -227, 100, -37, 164, -67, 163, -61, 64, 131, 93, 125, -1, -236, -58, 118, 2, -48, -212, 2, 358, -136, -28, 256, 14, -211, -100, 5, -92, -24, -160, 232, 226, 62, 75, 36, 164, -238, -100, 371, -87, 89, -130, -64, -107, 61, -68, 3, -198, -111, -142, -51, 37, 189, -37, 150, 389, 106, -117, -59, 190, -29, -93, 255, 191, 79, -41, 93, -99, -87, -134, -219, 250, -77, -94, -40, -358, -187, -63, -22, -179, 130, 63, -136, -9, 169, -208, -246, 79, -214, -17, -287, -75, -80, -136, -91, -28, 101, -18, -35, -58, -143, -34, -69, 274, 207, 70, 177, -54, -161, 54, -272, -16, -233, -200, -74, -71, 11, 100, 57, 43, 64, 15, 56, 155, 40, 89, -147, 409, -48, 80, -57, 231, 5, 105, 17, 292, -82, -121, 224, -12, -51, -95, 109, 221, 186, -124]
3639a24L50k8j66r5K18l5K2p3n8L5q0m4j55Q4l3j18M04J5l10J76K2q6J20j89J12
3664c6J85Rj15R3l6r0j08j90K50j3K7L5L39k35O3k26L09j12m37K17j1P4K31j64
3688E9Q4k38R4j14j0K9j89M27k86n6L17q9m99M45J61j53LJ12j4k30L1r5K34l1
3712hJ09j68J2rj80N4l4L61l48R3K47k04J97n5J99l91L85k47L9k0j23K91j36j03
3736c9j03K16Q5N7j44l33M94k48J67m59N07j44l8J56l94K07r7r1j64K07N9K19
3758A20k59p9K51j80K92n6J51Qp4j67KJ53j63J19r4j7o2j24J89J30K10l63J00
3781H7j34J42j38J05q6k18O9L81Q7n59M86k51p3P3K65o08L07J06j1J90m6k57J07
3804B4l8O3l10K91n2K4Q5k55K50o3j39k3O20o38O7J55m7j76m3K42N0k15P9J01
$$ y = [-124, 226, 198, 32, -63, 155, 120, 142, 69, 11, 46, -34, -78, -233, -149, -182, -300, 104, 119, -191, -15, 7, -79, 41, -148, -36, 149, 158, 43, 136, 100, 10, -98, -288, -38, -51, -24, 11, 350, 115, 178, -48, 261, 149, -288, -71, -82, -8, 223, 59, 143, -95, -1, -115, -125, -96, -285, 142, -144, -200, 117, 28, -471, -26, 135, -18, -15, 97, 83, -147, -116, -211, 23, -8, 101, -67, -55, -64, -244, -190, -224, 137, -211, -118, 129, -75, 122, 67, 266, -125, 260, 13, 52, 32, -91, 200, 64, -39, -142, 74, 159, 216, 72, -261, 233, -15, 152, -307, 200, 56, 18, 174, -220, -13, -110, -201, -365, -158, -99, 120, -139, -218, 33, -147, 145, 89, 240, 248, 174, 7, 9, 162, -1, 118, 24, 7, -55, -179, 10, 140, 350, -13, 87, -47, 95, -43, 62, -24, -242, -173, 208, 295, -264, 222, -29, -102, -29, 236, -372, -65, 41, 30, 220, 174, -83, 24, -14, 49, -261, 30, -22, 2, 87, -168, 82, 19, -120, -143, 477, -161, -94, 61, 14, -162, -205, 37, 87, -128, -49, 52]
3828E2j81K36n0l08L69o6%L2j86L39l09J17r9J66j80j17M03j5l02o8K77k0k19
3851a29or5K35k73J68J4k1l1Pp9K42K49m59O2K3k89L00j23K99P8n18N80l02L94
3875C26l56J33k59K45k47J15J4J9N0k19K40Q7O6K3n7J45l25k49J02L42j53L0p2
3898@n0L0p3K00j49j03L1M02k82l57K97m9R0o6j63L44o06J86L33j03J19n2j45
3921a66lj95L57k17R8K90m32N33k20P0j0l4q9P6K7l4L07j18m65K37J26l56k5Q0
3945a63N80n72K52j48j89L82l67J6K56K9r9r5k1K18q4k73K40o5L1K53l8k76q9
3968b22M11j38k8Jk3r9J3Q2P4J25k39J95K27l21j35J86J19m79M88o11K91M31k64
3991H4J11k29K92j52l47R1k1J05Kom0Q6K42k01J38k76K45j69L7J69k41J96o6k8
$$ y = [52, -129, 107, 57, -251, 118, 52, 52, 84, -102, 237, -72, 45, -54, 112, -68, -185, 218, 203, -99, -167, 110, 90, -129, -135, -230, 5, -268, -100, -86, -107, -138, -131, -210, 32, 281, -178, -116, -93, -382, -82, -205, 94, 172, -346, 234, -68, 326, -30, 103, -156, 89, -158, -43, -29, -10, 40, -179, 61, 148, 214, 237, 180, 325, 0, -249, -147, 195, 42, 72, 0, -50, -20, -93, 107, -42, -145, -114, 288, 6, -351, -54, -103, -13, -79, -242, 102, -504, -318, 15, -88, 31, -21, -166, -169, -364, -7, -224, -126, 164, -268, 265, 45, 115, 105, 71, -18, 58, 85, 51, 358, 240, -225, 12, 138, -218, -243, -163, 417, -155, 97, -51, -240, 142, -225, -209, 47, 76, -23, -118, -139, 79, -5, -278, -38, -103, -72, 181, 143, -133, -222, 189, 51, 23, 24, 1, -98, -85, -3, 71, 196, -43, 152, 379, 58, -77, 109, 228, -251, 237, -374, -83, 348, 84, 195, -34, 258, 106, -241, -150, -171, -66, -64, -70, -110, -24, 218, 17, 155, -121, 124, -45, -8, 161, -80, 116, 50, 22]
4015B2OM6l84M12j03q6J5R2k14J80O9M9m3r3K13N0k74K46j14k30K96p7J35m16
4039b03J76j07J01Lj24K33j86K5K87j56J29m06K92j20L1L96j82k99O3r1J64J29
4061A55j80K2K7j59K86j63l9l7M6j49J66j85J87J53No0k25O1O3M4r8P1J98j32
4085E7k26K53o6M8R0j80K62j17k57J68k96M21k49N2P3k15K54o4K46l10J50k06
4107a12K11J42j56j40K11m4j7j39K41k61q4n1J27K13J17j37k14N6j2J70k03N3
4129b9j13M14k14j97K71p8jJ65j67R7k70J24M2J97j93l6K0M4j77o2J64j0M3J28
4153A62j89J08k56j03J76J14J16j41P6j80L85n59L47k04j63L88J07k41q0J68j09
4174g8J72q7O4j7m9k69L66q1k32J77R3n5j42K2J1M29k53jj12K49j90Q3j70O0j84
$$ y = [22, 28, 74, -310, 102, -1, -87, -72, 20, -194, -14, 55, 104, 61, -32, 181, 231, -43, 203, 89, -141, 155, 78, 213, -203, -27, -134, -33, -30, -154, 79, -107, -82, 205, 49, 178, -228, 64, -56, -25, 371, 189, -110, -47, -138, 26, 155, -25, -3, 24, -135, 151, -12, -51, -88, -42, -191, -25, -210, -23, 130, 135, 75, -150, -89, -26, 18, -80, -9, 189, 57, -169, 84, 18, 66, 156, -24, 238, 121, -136, 32, -264, 157, -92, -40, 33, -182, 72, 8, 254, -56, 94, -112, 99, 241, 85, -55, 156, 112, 95, -44, 197, -64, -148, -199, -72, 141, 258, 121, -93, -37, -49, 121, -82, -29, -142, 272, 58, -139, 132, 54, 53, 218, 51, 148, -122, 2, 44, 241, 48, 12, 32, 76, -101, -163, 1, -9, 34, 162, -27, 81, -175, -278, -102, 12, 128, -13, 63, -117, 268, -291, 56, -148, -311, 77, 184, -57, -137, 31, -78, 94, 7, 71, 54, 5, -264, 102, 21, -211, -34, 59, 4, -138, -116, -105, 324, 71, 70, -42, 207, 17, 100, -70, -10, -194]
4199a94j03L92l15J20L42l74J93k8m0j61N7J28J20m20K86K67J6j50j08m9J1K79
4221B69l59K30l44J77J57k7p0K90l77L1M5r6K66j22R4q8J0l28L02k02K4K80m08
4244b46K67r1R7k47R2K44j80J72j00l85K78P9kJ4R2Jq9J71j12J8j54RQ6k20K88
4269H2l32J73K2J52j08k67L89j25L0J07J19l79K9r5M01N6l27Nn8J26J78j9k03
4292d4r1P7nj2N1q4J17J03k01l03L97P1j16K44o1jQ6j95j92K87k29K60r9J6k65
4317a89J03J0M40j68l10m5J57Q8k13K55l1q6J3o6l47K21K31j4K8n7l13K26K11
4340A44j6J10k29J02J4j42M5Q5L65m39j65J44q7K33l1l10J41R8j49K34P8k18N4
4363F1k26K4J41k82M95j61J89j38n3j48q7K24Kj95L9M06p03N54J04k00k76J42
$$ y = [-194, -297, 95, -220, -100, 242, -132, 61, 33, -7, -168, -111, 17, 137, -283, 3, 270, 286, 136, 28, -21, -10, 269, -90, 140, -204, -27, 130, 103, 33, 323, -54, -23, 22, -74, 192, 70, 164, 76, 86, -242, 60, -142, -118, 162, -246, 21, -70, 27, -220, -128, 116, -64, 108, 8, -377, -99, -20, -22, -8, 84, 85, -4, 167, 55, 73, -81, -72, 14, -206, 82, -250, -77, -55, 97, -11, -278, 111, -14, 16, 123, 242, -137, -108, -203, 198, 254, -73, -68, -126, 0, 178, 159, -44, -135, -58, -63, -75, -24, -108, 9, 112, -89, -392, 5, 76, -40, 204, 143, 142, 228, 33, -159, 128, -101, 159, 60, 76, -189, -86, -76, 364, 196, -114, -159, -2, 86, -127, 128, 97, 11, 24, -42, -389, -168, 63, 49, 77, 20, -293, -67, 144, 128, 238, 9, 111, 125, -17, 28, 113, 478, 39, -126, 18, -69, 164, 133, -177, -36, 62, -87, 147, 225, 7, 61, -165, -141, 0, -282, 213, 52, 241, 103, 50, -98, -185, 39, 41, -154, -115, 291, -412, 142, 246, 46, -230, -88]
4385h8J81k74L67k32J90l7j71m0o7L48n28M02k69Q2O7J79r9K99l36L9JJ7L12l85
4409d2P5l04K03J49j41j87K03k22M86k61j0K84m92L40q7l32N40n3j23N0j14kk7
4432f7J61k00J90J08j13J33j59J09j30k86L08j41l4K29J47o14L70n0J3n3M6O1
4454B8k05K73k97K05k7K29R9j99n33L35j35J93j98J96l48L18K12m30K25O2j46
4475a43P6k8MN2j36L68j65J28J9k19J0J23N1k73K82k47j61R8J95J85l24K43l27
4498a89j63L92J3PL3J44k97K47j28k58J94J4K00j62l0j46M0R3Q3m17J42K02O3
4521G7o8J0Po1j35o2R0L13j24j72J03J76j0j56P7l26M77k78k72L53m5k37k30K98
4545a95J93P7r3k27L61J0l5o5q2O6L6J02l40J04PL47l61n4N78o88K04J69j10J16
$$ y = [-88, 93, -181, 186, -46, 144, 107, -64, -104, -171, 177, -351, 51, -218, -136, -69, 110, 11, 310, -26, 13, 14, 31, 343, -42, 33, -271, -68, 81, -60, -247, -44, -266, 220, -41, -51, 233, -259, 81, -6, -338, 202, 149, 26, 76, -38, -40, -67, 94, -106, 84, 192, 79, 212, 53, 162, 32, -254, 54, -87, -121, 108, 255, -359, 11, -39, -26, -79, -33, 28, -177, 96, -201, 4, -23, 206, 305, 106, -427, -92, -227, -34, -232, -36, -384, -66, 146, -284, -59, 3, -143, -67, -95, -91, -39, -175, 193, 28, 156, 175, -44, -34, 89, 140, -133, 149, -98, -259, -161, 34, 219, -105, 138, -189, -352, 40, 53, 60, 93, 237, -60, 187, 59, -199, -5, 9, 209, 47, 17, -129, -89, 4, 87, -330, -188, 14, 77, 9, 19, 26, -35, -170, -232, -142, 171, 47, -125, -22, 154, 144, -12, 65, -261, 216, -62, -334, 19, -26, -263, -493, -195, -2, 75, -18, -245, 116, 126, 91, 26, -56, 10, 46, 148, -192, -88, -81, 266, -95, -149, 429, -259, -55, 114, 4, 120]
4569A20j16P1K49l33Q0k02n8J31K5j02k0L30k14N1L6M9k33J9J44o9q9K16q8j30
4593a33J29K42j08p5o2L86m60K51l09L23j18r3R3j41J22j55L25j55k03J16j24
4614a49J1J79j39K6J79lj87N3j56O7K73L1o0n4k26k00O38q1m10J79N1J42N8k27
4638el2n5L1J06O5k58J25J7M8j0K02j13k00k85L89p5M1l29L00L1Q4L6k4j91J01
4663ak7L50m39J06l9J53N4k54j11O4J32Q7k58j49N36l25K31R1j99K3J9K03j73
4686G4j55Lr7M6L36l01%J10J22k71pJ10K39k57j05P2L08k18K20p0K9j26J13k54
4710g9J09j78J67j51P8o5K48K7j72J69j91o4j92K12J40Rj1n2J59k63J52j15L9
4733b4K93k33J06l02pL05l88O2L5K3N0o7Q0R2K0m0J41k5k66L82j58k8l2n4k9j66
$$ y = [120, 4, 75, 324, -9, 71, -131, -189, -58, -33, -135, -155, 175, -39, 12, 48, 97, -136, -117, 27, -42, -131, 85, -3, -133, -4, 238, 130, 55, -7, 379, -81, 170, -139, 184, 66, -27, 66, -75, 47, -108, 217, 62, -141, -25, -149, -138, 41, -98, -72, 107, 104, -83, -30, -186, -119, 154, 185, 125, 71, -155, -355, 283, 202, -208, -29, 22, 164, 222, -5, -37, -92, -61, 45, 110, -148, -23, -6, 42, 32, 234, 121, -79, -364, 25, -50, -9, -338, -38, -7, 77, 113, 89, -102, -1, -28, 322, -117, -11, -50, 103, 157, -97, -208, -144, -12, 75, -183, -332, 204, -121, 110, 201, 2, 25, 44, 247, 74, -81, -78, -175, -129, 207, -94, -94, 16, 138, -133, -140, -30, 209, -48, -153, -81, 227, 9, 229, 159, 188, 62, 175, -79, 30, -148, 19, -132, -54, -119, 129, 156, -16, 153, -38, -102, -294, -82, 58, 67, 56, 4, 163, -100, 52, -63, -24, 269, 36, 142, -160, -167, 138, -250, -188, -153, -130, -80, -147, -67, 25, 45, 5, 146, 121, -145, 237, 79, 51, 19, -35, -64, -230]
4759b30K27Q3k80K01J45l27K64n8M6j98L06j34j02J68q7P4k46P9M6J96k27K79
4781B25k44k2p1L00l48M93j38k86Q5m8J83j02r9k3J67j57J2K54j26n7l04L11m3
4804c8oj72R3j06J06J12M0J71j12j47L6J93j58L12j67q3m7J06j5J7j06k05N0m1
4828a67J88L09k13n1k68J94M41n58l3K63k87M2J01J4l59O11j79j82m6K32m01K36
4850a13K72o8k84J81M9QL1N7j84j4P5L34l84J03n0j70K88R0k20l5J80j61j09M17
4874B93l66j23P6J8J3O0o5j8K39P9j97j0j94L63k26L47k40J35l02N3Q4P8j13R3
4898G7K16l96r7J07M2J3L6k26K91J7p3j16N34l46J1l6m1j7j74j58O13l21L83m83
4922a44K0J48L50n22r8L53k05l7j4J60O5l39M95j16j65J8j1J36J7J02m61K06L4
$$ y = [-230, -3, 80, -200, 1, 146, -181, 83, 25, 71, -127, 179, 45, -57, 111, 24, 98, -148, -69, -23, 173, -54, 225, -19, -41, -112, 188, -160, 333, 195, -91, -6, -54, 129, 27, -72, -95, 72, -85, -73, 181, 55, -2, -306, 5, -38, -44, -216, -123, -229, -123, -11, 29, 200, 88, -59, -23, 170, 12, 324, 157, 74, 27, 133, 118, 135, 29, -176, -126, -167, 21, 330, 117, 66, -202, -8, 433, -125, -158, 105, -182, -140, -39, -25, -384, 227, 48, -134, -180, 52, -349, -113, 159, 91, -193, -12, 37, 45, 76, 133, -51, -65, 10, 344, -40, 63, 13, -157, 131, 221, 1, -34, 146, -15, -124, 293, -73, -196, -120, -102, -89, -29, -94, -112, 127, 206, 9, -1, -195, 168, -58, 289, 49, 184, -118, -65, 19, 97, -16, 77, 293, -103, -200, -93, -51, -38, -2, -228, 63, 80, 7, -109, 425, 79, 90, 54, 13, -4, -178, -336, 277, -44, 339, -144, -124, 24, 374, -148, -246, 107, -98, -135, -149, 11, 76, -263, 232, 116, -49, -31, -42, 94, 111, 213, -248, -42, -8]
4945hm8N2J12o7J91l02K68q6J70j33Mk88J28J84l08J68l7k53K30j44j17K22L3
4968b9K48k11o5m3k5K28J04k46lj11R5j37L69R1r6q7M9j11O3J50rj61p9j18L41
4993B07p9r2P8j9o4j32J07q7K53j51J7l69M86j99J93l07N00l74L23m69K34j42
5015h6j39J23K42j53N1m0M9k10Rl0R0K8J05J85m56K76n5q3K55k62K49m49K41j25
5039a85M40k10K00k23J52j48J40j17N7m3n4K00j76k2k03J27r9J33Q1O8L80m03
5061I5k37J05L6J00l50K94k01K10j30M2Lj67L37k20L6N4k3K63l28K67k01J56m9
5084I2l99M25j09J01k80N7J58J12j95Q6j56j44K61K09r7k20J34k02J25J44m13
5105c11L16j70K12Q0k17M24l54L89l66M3j14J03l07L56N8q9J33k68M81j99q9p2
$$ y = [-8, -56, -4, 108, 41, 232, -70, 198, 112, 282, 149, 153, -135, -7, 177, -131, 37, 0, -253, -23, -167, -284, -62, -29, 219, 8, -57, -100, -125, 103, 207, -39, -42, -153, -58, -195, 174, 265, 169, 82, 131, 20, 83, 233, 224, 63, -16, -134, 207, 128, 36, 114, 95, 31, -101, 6, -81, 172, 21, 38, -331, 155, -44, 149, -158, 342, -32, 291, -178, 56, -86, -225, -102, 140, -13, 38, -2, 47, -163, -154, -184, -94, -66, 39, 224, -232, 44, -11, -94, 161, -101, 148, -301, -60, -185, 255, 45, 245, 22, 174, 26, 166, 49, 106, 63, 9, 209, 33, 11, -192, -65, -164, -31, 50, 118, 498, 95, -142, -37, -1, 99, -251, 43, -158, 52, -78, -36, -33, -200, 137, -83, -47, 7, -16, 247, -81, 186, -15, 141, 92, -307, 118, 9, 110, -170, -113, 45, 157, -38, 48, -108, -252, 9, 218, 121, -99, 35, -167, -42, 102, -311, 5, -165, 47, 127, -90, 334, -20, 369, 3, 46, -68, 35, -272, 84, 142, 53, 186, -82, 399, 200, 111, 39]
5127C9k1J7j63lL18J7r9j8N8m6k91K36k09K99j64qr7K98k71m9J24Qj59K68l2k53
5153b01J4M05J6l76J94j9N5j44J41n9j94O9K17q5j23K58k09J99k30Q4O2k9J62
5176B07k12j9J50l32K96J9n3K3j54J50j26l7M9o9oLJ14K36j09N6l10K81J31l53
5200f5K62k24L64k71J0q8k98J06PJ85J37Jj24J40m0P7j59Lj29K62k03m8J79k08
5224a24J41L0J57j78m1k9qq9K41M2k72J52J5m1J70j96K76k79j16J14L02l88J74
5247E3J92l37J38o6r4K57J89j21m02M2j54M56k03l4J44n80P08k35J64j22M9J02
5269A46k62R0l85K04L38l1j45j50L16l18K58N1n7M5l99L69m4K9j27Q9k05K45M0
5292I7j61k28R1J81j8J77k74j99M48O5j71J86j44j49K74O4k16k16J95K58l25K43
$$ y = [39, 18, 35, -128, -131, 187, 204, 105, 87, 145, 99, -192, 44, -165, 134, -30, -38, -135, 163, -108, -157, -33, -25, -184, 84, 52, -201, -187, 218, 234, -142, 52, 33, 88, -56, 85, 26, -168, -99, 118, 33, -90, 168, -41, 158, -72, 12, 74, 45, 207, -5, -24, 126, -206, 90, 109, 56, 79, -75, 75, -51, -88, -39, -108, -114, -111, 3, 239, 130, 186, -124, 157, 288, -65, 197, -27, 337, 66, 76, -12, -310, -204, -197, -12, 125, 126, 2, 142, 102, 179, 20, 23, -106, 156, -47, -95, 84, -124, 17, 47, 204, 26, -15, -44, -52, -141, 100, 142, -130, 22, 37, -4, 166, -30, 246, -33, -149, -35, 267, -121, 53, 245, -92, 46, -20, -114, 143, 332, 211, -191, -149, -303, 153, -50, -84, 60, -520, 188, -47, 117, -5, 44, 146, -116, -26, -411, -207, 131, 100, -45, -195, 121, -197, 61, 112, 55, 100, -299, 70, 26, 55, -72, 17, -188, 57, 97, -64, -292, -201, -20, -38, 139, -135, -334, 114, 179, 8, 194, 50, -99, 175, 239, 23, -193, 2, 260, -65, 178]
5314A78m00P6Q7q8K82N4l39J23k60L83r4k07L18J21l11J90L50n12m7M02j97J20
5336B29m13K54J52m13L0k4K42l05J00K06r5q5j49L25l03M2M44j27J0m3R2l01p8
5359b10L08k02Q2j21M72k44r7L8j05K61J9j27l9Nm8k97J21L32l38L93o9nl7j52
5383f0j45J36J60K0k0k53R6j7k9K54k59J50j76K07J55r9j53k25N25j70j36J10
5405G1J09j17j42N3j99L11j65j52%L46J31m94N4J23J60K39l68K68k61j7j30K31
5427E1J03k56P6k65M16q8j76l4J53l18M31j56j8K49M8j71j92J25J26k16O3j40
5449a89K89j76J38r3M0l5j63L72j64m8J3J97o9j5K3K07k28Rj17k03L91j09j11
5472d1j19J38L8L6J43q1j22J82j98K01L1j80k28L98l12p5rj1o8K41J55j19R0j31
$$ y = [178, -222, -146, -59, -147, 135, 189, -150, -27, -287, 96, 2, -205, 113, 234, -77, 113, 463, -49, -96, 306, 109, 229, -184, 70, 222, -191, -161, -185, 57, -248, -148, 58, -37, -122, -271, 54, -249, -207, 237, 110, 120, 77, 169, -132, -210, 98, -104, -22, -143, 329, 85, -12, 26, -79, 182, 201, 74, 35, 40, -8, -305, -184, 148, -190, 203, 134, 129, 92, -60, -205, -69, 91, 111, 91, -162, -66, -83, -112, 142, -117, 33, -143, 64, 219, 120, -33, -258, 267, 97, -39, 71, 180, 63, -79, -26, -225, 86, -79, -231, -231, 115, 246, -248, -194, -71, 89, 328, -40, 228, -33, -50, -180, 51, 154, -102, -26, -291, 125, 37, -139, -173, -20, -338, 93, -63, -81, 168, 216, 45, -147, -22, 104, -112, -49, -189, 100, -76, 62, -31, 9, -26, -189, 183, 19, -29, -16, 181, 112, 97, 120, 327, 99, 108, -9, -212, 179, 70, -41, -160, -22, 16, 52, 195, 114, -8, 174, -24, 177, 208, 28, -200, 198, -114, -189, -198, -209, -277, -36, 119, 0, 90, -41]
5496d1j35J72j8q6J81j81K84m2k49o1L13l86M3L78J0m21L14q4Q5k80O16o03K09
5519A8q0K0R8K9j06Q4q3Rk01K72m1r8l39M08j22N7P6K00j81J64l43p2L88j79j31
5544a53Q1K64j28j54J63j93J28L01m39J43J68k80L50N2j00k53N8O2l90K88M7n2
5566c7k2K05k95M9K91l09J13R1l9M16k59o1j0m8J15J13j30k59KJ49J2j86J26K57
5590B84k60j81J12K7jR1k12M3j33L25p0k7O2l6j18P5m5j18P5K94j80J49l44q4
5614b72N11l13J40K95l00k1Q3K9j58r5K24j42j7n4j05J73K91j14j57O7j04j17
5636a56o4J67K7O2K23k94j82J22N1L12j84M3q3k16L14k89P6M7K17l37J96r9J19
5659G2j11R6r0R5J49Q9L3m36o5K84j48j82L19J20j94M0P5N3j4k26J34k35N5j20
$$ y = [-41, -176, -4, -22, -108, 73, -108, 176, 134, -115, -176, 137, -249, -206, 172, 182, -239, 75, -9, 76, -204, 412, -191, 18, -62, -42, 56, 85, -21, 63, -20, -11, -212, 60, 19, -79, -418, -10, -132, -75, 1, 201, 20, 184, -159, -231, 157, -22, -153, -72, 192, 64, -90, 73, -120, 8, 309, -130, 13, 181, -99, 251, 303, 203, -50, 8, 70, -320, -32, 15, -37, -59, 146, -149, -100, 191, -118, -5, 86, 47, 463, 204, 143, 133, 85, 200, 313, 183, -76, -74, 75, 87, -99, 27, 284, 24, -157, -45, -18, -19, 72, -140, -97, -230, 95, 25, -2, 60, 24, -94, -19, -64, -182, -107, 187, 7, 156, -188, -272, 239, -74, 66, 361, 61, 40, 123, 152, -6, -101, 123, -19, -36, -90, -195, -22, 269, 155, -2, 65, -39, -156, -220, -53, -26, 36, 259, -35, -217, -95, -44, 268, 84, 127, 44, -172, 142, -147, -71, -24, 193, -144, 52, -47, 72, -39, 57, -33, 62, 211, 300, 333, -103, -168, 116, -32, -214, 105, 225, 31, 71, 146, 199, 185, -41, 93, -142, -87, -207]
5683b07R5J09K6K5P4j07j42P0o0K6K0K88j30j05O1J2j72n6K96j9j63N8K41l73
5707a33J27J77k94J7J98p3P4K07k29j05N5j11J5j24j5J71r0j07K60M4Q1r8j30
5730h3K24j55K03p7l67K74k4R2r5j63o1L39k70q0N0K44J89r9k37R8J00J29k10
5753B1K86j09j02j10J19J66j01j42Jn6m3l2L4l03K74J41J16L9m74K59l3J66j21
5776dk7k87K57n0K24j51k26J67J31j66K51j02m8k3kk20J20J25L81n75J51K10l01
5799a65R4m2K01j06j35K78m86M39k2M2q7J56k42M8R7N0l1k4n4j40J58K96l49Q6
5823F2J5j83J57Qj24k1M01n07J75q5J27J73j4j20K17l89J05R0j14l8O9j8J55n1
5847I0L69k11l61jJ06j52J15J76N3l06J26J2j56L90Qj7j70N1k85L39N4m27L86
$$ y = [-207, -112, -3, 23, 48, 122, 15, -127, -57, -117, -91, -71, 217, 87, -18, 43, 55, -117, -173, 123, 104, -59, -1, 240, -133, -6, 171, -123, -106, 92, 19, 93, 300, 71, -34, 21, -90, -75, -199, -214, -43, -133, -240, 20, 64, 145, 47, -83, 141, -14, 189, 112, -255, 19, -5, 87, -8, -171, -232, 107, -163, -243, -193, 51, 240, 141, -96, 2, 102, 231, 21, 307, 198, 96, -14, 105, 271, 170, 28, 29, -27, -70, -102, -68, -371, -97, 44, 160, 199, -275, -16, -49, 117, -4, -31, -318, -61, -111, 113, -38, -264, -97, 34, -132, 119, 17, -31, -54, -56, -276, -156, -31, 350, -225, -74, 136, -165, -71, -113, 88, -18, -153, 125, -361, 78, 56, 98, 11, 167, -75, -27, 70, 120, 89, 65, 11, -129, 29, 325, -24, 62, 77, -106, 51, 59, -65, -86, 315, -192, -17, -102, 25, 198, 184, 64, 281, -108, -3, 87, -27, -65, 4, -14, 141, 90, 459, 248, -113, -114, -8, -160, -45, 131, 184, -122, 4, 16, -140, 250, 258, 241, 71, 122, -163, 176, 230, -197, 189]
5870A89j63P2k35K6L02j26q6j15M5o5o9L20O8j94o6J85m5p5j20K41j34J70J41
5893B66l33m6L3j06J80l57J64l4K93L8K2k62R0J76j72L5O9m6j02R4J43k09L26
5916B62k40L81l30J8r9k23M8M4O9K05p0J86K6m61N02o07K85m0J02q5J7q7J16K64
5940B83l77q5J05k6K7K3qL03m78K49k26L42j29K11q2j51J25J8N0K13k00l44J32
5963b5j29R6m7N4j57Q3J84l46N6R4K16O3l83K4J62K68j99j68L78k89j04Q3J84
5986I8l2Q3K14j61m76J71MJ76k1j96J14Q4p6R7j26K75k79K10k46M43l43q5K04
6009A32l28L38j24n3k37K24m2J62j75k6J90J33j31k45J14O0J69P4k70P1j43L17
6031B10j57m8j44rK17M9j93J44kj85n2J72L1k91M44j76JOQ3J53j52j62rJ95k80
$$ y = [189, 26, 98, -137, -111, 191, 65, -21, -136, -91, -156, -225, 95, 163, -31, -97, 88, 43, -32, -152, 89, -45, 125, 266, -67, -113, -80, -186, -6, -363, -199, -233, 60, 98, 120, -142, -52, 124, -48, -13, 56, 10, -92, 2, 145, -64, 262, 22, 403, 73, 91, -8, -231, -183, -139, -70, 135, 65, 251, 277, -184, 318, -289, -4, -44, 58, -27, -10, -97, 19, 283, -94, -179, -74, -100, -73, -50, -58, 245, -233, 16, -210, 132, 3, 214, 132, -19, 106, 124, 174, 387, 187, -157, -25, -154, -58, -105, -51, -208, -125, 59, -287, -231, -137, 79, 142, -241, -217, -55, 213, 14, -154, 224, -65, -169, -86, 98, 66, 149, 363, 202, -274, -103, -99, 77, 56, -140, -26, 58, -18, 79, -47, 228, -51, 159, -87, 356, 13, -72, 132, -196, 142, 18, -35, -272, -48, -90, 72, -103, -129, 61, 194, 63, -182, -68, -8, 161, 235, -35, 36, -107, 210, 53, 5, -139, -148, 69, 118, -75, 69, 67, -118, -170, 2, 33, -258, 186, 10, 11, 17, 100, 253, 101, -61, -70, 125, -155]
6056a55K91j00k31J24rJ07L2j73N81l44k18J68N0J05k23RK27j07K62n48k0j0K10
6079B8j43r6K69l41N54k15k40L13l29K93L8j57M3L12k14k30J7L2J85p4q0k22J26
6102a31J47k16J34K8J1p9K8N21n29L30j8k10k40K33Qr1K71j74o1J91l8m1j60K46
6126A60l24J19N6m4O5K48k94K40k29j40J75m0k5J61N7n59L16O5o5j10R9M6Q8l63
6150b98Q9R1QM6O8k68M10q5o3K6n6J75j39j75J35lKO6o3Q4k6j13K39k95L0J96
6176H1j52O4K53j94r0O7l40J82Q7J65j13l15K50j80L19k78l1L2K29r5L8J4N7O8
6200A18j75M6jK72j69oj48J20Ml42q2M9K30L55j76j13k27r5L56j66Q5j19L42l69
6224b11K49j35L1n9J20j49J69J71k46K15k32K47k9k67j5K26j16J89k32K36j73
$$ y = [-155, 136, 36, -195, -71, -80, 27, 59, -114, 467, 123, -95, 73, 123, 228, 5, 14, 241, 134, 396, -152, -172, -182, 28, -115, -211, 58, -283, 271, 56, -184, 129, -200, 93, 131, -26, 17, 329, 115, -115, -98, -66, 119, 45, -35, -257, -131, 16, -200, -66, -38, -27, -106, -78, 443, -86, 244, 226, 16, -224, 9, 17, -74, 197, 23, -38, 153, 115, 74, -86, 160, -164, -45, 11, -33, 32, 280, -14, 226, -3, -143, 32, -8, -33, 128, 185, -374, -58, 7, -58, -168, -69, -23, 65, -298, -209, -118, -110, -64, 4, -264, 146, 61, -2, 24, -32, 143, 4, -171, -36, -39, -37, 29, -34, 50, 24, -89, 150, -145, -115, 81, -71, -7, 246, 52, -38, 29, -311, -129, -42, 123, 10, -305, -55, -235, 84, -194, -225, -193, 36, -59, -21, -7, 50, 118, -57, -11, -12, 260, 91, 85, -63, 57, 61, -281, -363, -314, -84, 271, 95, -18, -245, -340, 16, -150, -65, -184, 158, -211, 38, -97, -66, -125, -5, -154, 15, 186, -60, 155, -77, 170, 141, -126, -141, 85, -31, 158, -74, 162, -11]
6245a1O3J45o5j74J87p2m8j66K06R8k69K42j39J2K70k97k08L97m84L25j82j4J69
6268a5J10n2L5j72ON0J73J26p9k36L6M7j94l9O7J22qj57R4j22J24M17j87k86o5
6293b05M3J74j00K44l5j92J74k84M23n25K38j01ko8q9J14J26n9j3J81Q1K89m38
6316b4l7L86l07r7r1L9J09j59K34m0j22K38k98R3J61j72K56K2k78K02J57j95J28
6339B05l4j48Q5l35L11Q8k65K21r9k21K55j51j8j41M23l15k89M88p1j08K00J12
6361A93k66rJ47R6K8k81o6Rj92J54K34l62L93j64K23j98R8J35J90l99L56j76J94
6384C37k25J7l2j54j96M47l58K87k00k86M86k43J0K68Ok45J51pm4k14M38k76K47
6407B14j27j86J09l64M91o5q4m6L44o07K70N0K22k34j98L63k17J89k46J38Rj53
$$ y = [-11, 52, 197, 132, -42, 145, 73, 25, -141, 65, 163, -106, 136, -3, 9, 279, -18, -226, 171, -313, 12, -170, -184, -15, 95, 43, 78, -94, -88, -38, 135, 261, 182, -54, -18, 29, -165, -204, -137, -15, -23, -180, -86, -208, -84, 333, 146, -140, -205, -162, 12, -88, 156, 121, -71, 103, -181, 242, -283, -45, -146, -148, -216, -305, -191, -65, -124, -137, 44, 125, 414, -24, -61, 325, 18, -79, -170, -131, -22, -181, 53, 13, -109, 129, -169, -76, 85, -87, 169, 191, -87, 115, 272, 77, 205, 171, 23, 108, -227, 84, 172, -93, 128, 29, -192, 63, -88, -106, -247, 176, -139, -428, 60, -11, -119, 81, 193, -73, -82, 65, 161, 189, -92, -158, -149, -341, -187, 47, -315, 78, -86, 137, -61, 37, 172, 362, -37, 319, 143, 337, 112, 129, 97, -57, -253, 194, -164, 123, -77, -363, 123, -120, -110, 158, 164, -81, 70, 63, 19, -195, 243, -33, 214, 87, -99, 10, -354, 137, 72, -12, -58, 286, -321, -51, -1, 221, -13, -211, 152, -65, 124, -122, 16, 25, -128]
6429a28J31j94P0L43m88J79J28J88j11l58O40m11j44K04k5m7K67k34P4j76J83
6450I1J25k63J9L07k28j1J19K7n6j61K0N9J02j43n7Q0M1J11j04Q1k02M72m79k9
6474g9J04J48r9N8N6j53K05l71P2j95J95q4NK12j44k20N84l69J01p0N5J23n2j5
6498F7K4l58K66K32m55M35k48j66o7L56j70j48Q7K13kj00j42L62J62l69N6J96
6520B31j76K21l55kN8p6K15k21j5L32l73m7J36J49KK26n50L50n5J89k61j5R3l6
6544B0j43J98J33k83p7O4L97n09M90l50O1J1R7K62l57pr3k1K03j65K23Jm5J32
6568B42k34N7r7J08j66K24o8l46L62l5R5j69j6J78M6j35O4J63k95O3j54m6L3R6
6592c0o9rJ05m8M1j4k28N04j42k24K37k04N25k09k17J0o6J37l20K68L40n31J35
$$ y = [-128, 3, -191, -121, 222, -266, -87, 41, 229, 118, -240, 400, -11, -155, 49, 24, -23, 244, 10, 84, -92, 91, 216, -47, -28, 279, 51, 40, 159, 186, 130, -31, -11, 48, 150, 7, -50, 30, 71, 182, 78, 159, -43, 429, -50, -79, 25, 173, 74, 132, 188, 35, 240, -131, -59, -254, -59, -143, -138, 74, -70, -290, 294, -75, 26, -44, 11, 134, 82, 67, 91, -267, -1, 231, -224, 211, -37, -203, -270, 86, -84, -232, -145, 68, 66, -34, -176, 186, 348, -21, 35, 231, 55, 276, -79, -81, -23, -99, 116, -105, -120, 212, -161, -208, -72, 77, 79, 305, -245, 105, 50, 239, -22, -37, 56, 20, -123, 75, 208, -75, -152, -88, 309, -200, 290, -60, 1, 12, 109, 371, 14, 7, -86, -107, 96, -69, 154, 155, 110, 242, 8, 65, -32, 76, -90, 134, 66, -280, 82, 47, 142, -27, -43, 135, 181, 46, 110, 273, -22, 41, -113, -159, -126, -30, -99, -108, -3, -51, -10, -24, -252, 252, 110, -114, 123, -81, 444, 235, 18, 28, -38, 99, -221, 47, 387, -144, -9]
6615iJ19m4k00m7J17k17M14j48J9J02J01m9k44L36k97P7Q6j75K3l1K11k65J57
6638C6K1n0j07O4P1k03N3o7R4R0k47K79J01o4k9O5L0l36J16O4j30m9K44q5j55
6663a94j98L36j9l8J41l22M70k71K02k14Q4k86K79J71j72L1j71J0J49K61l76J77
6685E0q6l8J50p6O6k75J00K81m4K30o21L27m60M01n5K18r2l96L56k25J37k91K15
6708a28J54p1J11k22k93L57K07nJ89j85o1J65j82K1L4Om0j42j41K00J39k59J25
6731b1J03Q7k35k88K62J27j76L02k08k4J95k89M00j2k37J2k67K70K7m9j57j43
6753c21L1M58j54K7k5k13K60L5j31o3J72p7J3Q9k6n7K6l27J93K6j35PJ11j61K77
6778C5l06K75O4J38l64J62j84K21r3K34j99P7O4J06k34p9K42n1PQ0k84KJ13k29
$$ y = [-9, 110, 66, -134, -181, -64, -281, 133, -15, 4, 106, 207, 158, -86, 250, -47, 30, 116, -59, -36, -67, 144, -121, 36, 57, 7, -100, -36, 35, -168, -115, -182, -88, 2, -245, 34, 135, 71, 42, 107, 137, -199, -83, -19, -149, -198, 46, -39, -194, -392, -56, -75, -113, 28, -294, 176, -95, 107, -107, -23, -309, -30, 141, -31, 0, -171, -161, -12, 249, -127, 50, -36, -74, 76, 0, 66, -209, -109, 172, 128, 358, -263, 64, -396, 5, -50, 168, 76, -320, 36, -189, -52, -343, -128, 26, -45, 66, -156, -449, -92, 115, 110, 299, 114, 53, 218, 36, 57, 91, 97, 57, -85, -226, -26, 113, -146, -21, 82, 169, -66, -354, -92, 35, -141, 161, -47, -71, 124, -165, 235, 223, -14, -2, -269, 1, 28, -21, -178, -321, -290, 168, 14, 41, 16, -197, 63, 98, -33, -96, 76, -1, 12, 101, 75, 18, 44, -283, -90, -64, -199, -192, -81, -242, 35, -271, 4, 68, 206, -158, 4, -180, 41, -52, 182, -17, 60, 124, 230, -4, -83, 159, 108, 115, 195, -89, -87, 26, -203]
6802b03J00J80q1m6j02L13r5J06j83J01L5j81Oq8Q6m4J37M6R2r6k2K32m05j22
6826b34K96k09L62N5j19m6j77R3J88m04L36l00J41j0j76J93P8j85n9K99K6q6R3
6849A55j07k2j32J89n0J17j52J33o0l27J03n8K62Q6m34K33o1j43J75R2J36m80
6871c45L88P6j58Nk7J77q9J49j71J28k02K54l15K68j99J78r4M3J8nK9j59r4J93
6895D8l15N1M39k46J94k26j40J34J8K63k00L4m9J35k96J63l85N03q8L6N4m39Q5
6918b27J71L22k10l44K84O0K9o2j70P8j2J84j14j69M68l15nK35k95K76m23K76
6940C7r9l5K23j47k07J91L76j71k45J58q8m0J54j92P2j19J16J3L0l0O7k10L92
6963B46J29m41J96Nj34j26J70l93J47M01k31l6O8j6M5O9q4qk3K25l71J49k22K61
$$ y = [-203, -103, 77, -4, -50, -152, 161, 66, 172, -11, 90, 125, -56, -50, -138, -52, -96, 41, 87, 179, 83, 61, 293, -112, -234, 62, -147, 215, 270, 151, 105, -72, 21, 209, -195, 141, -159, -18, -28, -204, -11, 67, -118, -177, 122, 148, 62, 155, 48, 26, -106, 83, 33, 150, -2, 131, 71, -256, -153, -211, 51, 137, -297, -64, -125, -268, -93, -1, 135, -345, 43, 119, -39, -34, -61, 116, 27, 176, 5, 133, -69, 185, -130, 138, -61, 117, 23, 66, 84, 79, 108, -51, -145, 48, -267, -216, 223, -23, 171, -55, -195, -61, -43, 220, 20, 54, 5, 140, -156, 7, -378, 125, 37, 73, 127, -312, -227, -56, 266, 56, -288, -4, 56, 85, 23, -147, -69, -81, 103, -11, -180, 288, -27, -32, 203, -92, 184, -239, 37, -62, -97, 126, -21, -228, -37, 339, 168, -77, 81, -7, -47, 107, -85, -13, -132, -16, -3, 27, -3, 64, -146, 246, 375, -66, 130, 135, 1, -125, 45, -348, -201, 200, -31, -67, 1, -15, 30, 99, 15, 7, -16, 209, -162, -13, -235, 26]
6987B6L6j32l8J03k77K04J77k35L2J55j98M54o86N50k01kl9j63J24Q5K9k9K16
7010A91J7J05m23j00J88j85j37L95N8L5q6k5j63J5j71K83j51M89l69j78K09P3
7032G0J50j26lj32M95m93J5l03K28K16J58m38nJ64j25J65J38j81M5n4o0K81m43
7055b38K43J20Jj25j39K89k02J50j44J73j36J8J02l62J2M08k45q0K38J32k77P2
7077A0j01J22r4K15l67K83J34k28J18o3J5j92K27j45KJ13m0J4L30j68l01K20j9
7100H5O2k46J74O8j57J25n7o3k25L68R3j28m9Q2j12k90L12R5l1O5j83J03L1L1
7124A53j06J45P1l26Q6J91m94K77RK9k5J43k92L6Q4J38j10j72Q4J06J49j86j21
7147a31K53k79L23l46J91P0j80J04j45l7K66J59j56l10K69o7j79J93k74K90P3
$$ y = [26, 62, -70, -108, -5, -282, -78, 99, -136, -104, 51, -147, 307, -379, 171, -30, -32, -71, -234, -110, -25, 4, -25, 191, 208, 313, -110, -210, -22, -207, -344, 51, 109, 144, 58, 33, -130, -115, -286, -3, -154, 335, -34, -212, -3, 70, 220, 94, 91, -41, 454, -39, -24, -327, -99, 117, 275, -163, -168, -4, -129, 36, 174, -7, 38, -16, -76, 205, -238, 5, 125, 126, 1, -138, 151, -51, 99, -45, 128, -8, 10, 112, -250, -238, 170, -75, -155, 83, 215, -62, 10, -91, 31, -63, 152, -215, 68, 202, -26, 92, 29, 44, -148, 79, -66, -64, 49, 9, 23, 353, 185, -116, 104, 85, 147, -99, 75, 143, -14, 111, 54, -9, -234, 134, 227, 99, 50, 132, 20, -270, 42, 137, 106, 171, -12, 91, 122, 153, 47, 192, 263, -63, 23, 214, -280, -3, 6, 35, 10, 153, -139, -103, -19, 119, 9, -163, -79, 27, 176, -10, -131, 122, -157, 166, -180, 11, 81, -99, 5, -140, -177, 89, 248, 92, -218, 51, -16, -195, -2, -276, 14, 87]
7168H7j63o2P2J6K10j78k99J57M1J61J28m9j57J86m6J20O0k41o2M3r3L5J15n0
7192C1M15l74j53J32j68q0J89j10P7J66Ml6j09J11k42J26O8J4O0Pk55N9K57j36
7216E3M4j88J65l76L53r2j11N2K07l37J64j45m2M6L58L00n83L04k56K18j1m0L5
7239A18j75j74K46K4l71N0qJ40K04O5Kj08n8J59j6j59n3J50j18n7j82N12j64k3
7263DJ24J56l97O5L54k30k38O2O9k5j90M90m06M4o0J75K15K15m02R5q6p0Nr7K52
7288A24j04k07L9K78j75J73r5j85N39o40K09J24k67K23M5m4M9J85k55k45L71j65
7310b3P3n8P1K64l44k03Q6K86l21O9L73l11M0l6j21j77M76k40K20j26O2K55k32
7333H3p8J96J14m87K9P8J54jl9l30L84R6n5k29K70j8j96k0n8R0J01j01j1k25Q3
$$ y = [87, -76, -138, -66, -50, 160, -18, -317, -160, -119, 42, 170, 121, -36, 150, 104, 224, 284, 43, -19, 24, -69, -34, 81, 31, 446, 72, -81, 51, -117, -197, -8, -118, -41, 125, 129, 93, -16, 95, -147, -21, 47, 61, 121, 128, -127, -68, 189, 53, 97, -91, 74, -302, 51, -41, -152, -100, 107, -230, -66, -211, -253, -207, 151, 451, -132, 172, -84, 134, 123, 83, 118, -57, -231, 15, 39, -332, -282, -290, -150, 54, 119, 121, 13, -45, 114, 98, -61, -114, 36, -82, -139, -321, 191, 27, 4, 128, 284, -113, -48, 306, 76, -162, -100, -31, -56, -246, 244, -162, -118, -178, -3, 212, 427, 25, 120, 34, -36, -31, -128, 124, 20, -187, -148, 130, -45, 128, 33, -152, 387, -253, -44, 80, -187, 36, 81, 37, 86, 271, 16, -229, 142, -23, 50, -8, 63, 327, -17, -220, -134, 152, -169, -100, 273, -38, 2, -34, -155, -332, 144, -96, 124, -2, 60, 315, 83, 5, 201, 315, -172, -143, -65, 89, 88, 49, -281, 103, 199, 144, -85, 185, 167, -29, -49, -107, -17, 84, -17, -28, -253, -170]
7358a70K39N6k12o3K08j66j11K88ol5J22o4k33k27O42l04K54j30M3j23j64P6L1
7381d9R0k16K67r1J95m20L23j71Q6o0J90k29L10J51k36j0j47J65k74q7mK69po2
7405a7K1J5O2k37K26K74k28l14K13k30J85p4k57L52O7Rk34K73j57J05j02M6M4
7428D2Qk24L86k09j6R1J13k9J00q8j20K03k67k0j08L49m29j29M98k83J3n8K59
7451H2q9j69j89L14K79k81K08j48M3j3j5r6L25l00mK52j88p1l8P2Q6J95n98L09
7475c4O7M9j04m1j47L23m5K07k48p3k41L85l61J60K96k80j22K27L5k13R9n7N51
7498D33o54J13m0r4L47K4j53j99J14J5K87k59r3j04JK84qK35k27j16J39j8L6j91
7522a28J77nm0j9O3j03K0Jj13k8K55mj79j36K38j35K40O6l10K50Mn5j57J02j07
$$ y = [-170, 69, 125, -87, -150, 58, -108, -219, 69, 63, 28, 150, 86, -147, -374, 268, -36, 218, 88, 131, 8, -156, -80, -49, 41, -175, 92, 1, 196, -224, 99, -72, 14, -46, 144, -85, 225, 376, 140, 130, -17, 148, -126, -213, -217, 52, 45, -17, 4, 19, 81, -156, 70, 344, 116, -198, 15, -215, -30, -104, -361, -9, 58, 67, -167, 106, -51, 54, -48, -2, 42, 50, -174, 212, 3, -13, 78, 191, 162, 262, 174, 54, 257, -10, -30, -138, 211, -218, -347, 151, -132, -119, -177, 82, -7, -176, -365, -51, 228, -53, 155, 7, 50, 37, 22, -74, 251, -49, -53, 199, 11, -60, -98, -26, 60, 255, -343, -34, 33, 82, -22, -63, -210, 113, 68, 275, 27, -46, -287, 98, -263, -103, 193, -87, -209, 18, 53, -160, -61, -118, 433, -221, -108, -148, -242, 105, 129, -24, -223, -109, -94, 193, -66, -159, -263, -262, 22, 14, 249, 22, -94, 45, 27, 63, -128, 49, 44, 4, -15, 48, -55, -35, -34, -147, -175, 80, 76, -103, -239, -1, -136, 104, 170, -140, 110, 114, 59, -98, 4, -103]
7547a03JJ63n7N8k85L66k19M09l07k67R1J9K04M6j37M6k40O5J12R5J95l61O9J8
7571a9j34J74m0kP8K33k14k51K81O0k11k18K37m2P7J9J2k59J90n9K62j49J68l16
7595a23K27p1J17m9m9j98K61k59J54P7m8j51J9L7j38L54j72J44k69K60N8j52m25
7618c96L61n2J86k66j23M75k95L16l22K07O6j6l83J79j40J68p1j32L99J16k59
7639A8j4k1k84K44R0rK3j52m2K31j78kJ20N0k2O8l56L50n3L3J7n4n7N3k08J3J25
7666a7l9j33O3J11j91O6j02N19j05J3j92o4J78j10j42MJ42P9r4K35l00K9J12J07
7690A69j89K32j64J9m6K9jj98K45r7L11l48J33j36K1J70p3k94L0L64j09kj73J26
7714A9N5j00j84J27K52M5j20o3q6R4J34j73J00P4j7J19l47J67k14J89j74jJ72
$$ y = [-103, -102, 61, 4, 62, -223, 143, -76, 333, 26, -241, -150, -131, 73, 119, -18, 28, -212, -147, -35, 60, 255, -106, -37, -19, -153, 21, -19, -21, 57, 290, 76, -175, 106, 166, -45, -263, -26, -68, 9, 28, 40, -219, -29, -88, 174, 25, 193, -123, 104, 33, 150, 101, 52, -146, 115, -144, 10, 87, 39, -112, -93, -56, -194, 160, -12, 132, -137, 123, 181, 29, -396, -35, -87, 99, -167, -290, 185, -110, 206, -116, 91, 157, 141, -242, -63, -203, -35, -106, -238, 161, 277, 18, 4, -17, -301, -57, 33, 24, 47, -105, -147, 84, -94, -96, 24, 74, 52, 120, -236, 114, 61, 94, 111, 57, 0, 53, -155, -142, -17, -56, -189, -126, -15, -206, -140, -242, 277, 172, 185, -7, -71, 107, -3, -145, -141, 1, 80, -14, 221, -79, -50, 62, 169, -20, 212, 48, 67, 21, 50, 49, -149, 96, -1, 310, -38, 95, -41, -20, 150, 77, -217, -187, 177, 68, 66, -107, 19, 74, -26, -210, -83, 169, 214, 94, 31, -55, 39, 173, 0, 100, 174, 157, 276, -71, 96, -118, 71, -103, -104, 68]
7737F8k48P0j89M61j03j43K03r8R3R9l40p7L05K01j09o3l1j10J62k54J08k4J60
7760A41j16k3M2k27K10j82j47J80m9K11N5K28q6n81O57m33J93K2k62O2J91j38
7782e2J5L7k16K39P4l63J60K90l95n0L08k17rN5J64Q4j26r4K7K4MOL45k60L6K0
7808A06k63K63j38k56L74K30k37K0pk65J67J5j2r1K20k14J16Mm06M48j12m8Q2
7831dQk03K24J25k57N3kl0m5J20n4J10N5q6J71j81j5m6j04O1K15k79J47j10P4
7856e3O5m1n7L38l16K2R7pK09k25K7N7k7J85j45l11J59Q4j72K40r4J33m05L06
7880F9j65K39L6k29J43m24J78K39J66j77Q8m88L44j61J27K44l27n3L8O7k1QL58
7903B99m46m9K67j5n2kJ65l26j4L66j77M8O8k01RJ67k32K05j86q3J77J0Q4LN6
$$ y = [68, -180, -110, -299, 162, 59, -84, 119, 21, 114, 213, -127, -204, 101, 302, 193, 130, 99, -11, 151, -103, 5, -19, 141, 25, 2, 44, -183, 27, -155, -302, -122, -171, 40, 95, 323, 237, -344, 313, -120, 73, 95, -167, -105, 86, -52, -37, 0, -216, 23, 97, -266, -106, 184, -211, -261, 47, -170, -179, -124, 40, 124, -2, -96, -69, -45, -41, -35, 310, 50, 86, 106, -157, 106, -32, -288, 86, 316, 79, 99, 92, -173, -6, 9, -3, -94, 126, -88, 28, 32, -374, 74, -38, -86, -4, 4, -199, 25, 150, -107, -54, -56, -86, -131, -11, -65, 45, 100, 14, 185, 4, -11, -57, -161, -100, 115, -164, -17, -127, -53, 12, -29, -86, 252, -64, -42, 55, 48, 257, 32, 59, 116, 89, 274, 129, -182, -23, 61, -111, 129, 35, 168, -237, 69, -96, 143, 179, -50, 93, -331, -153, 86, 252, 75, 163, -325, 19, -142, -15, 229, -98, -151, -113, -46, -67, -59, 299, -147, -196, 71, 56, 4, 2, 167, -159, -173, 193, 16, 64, 132, -69, -60, 107, -125, 80, -106, -189, -12, -2, 82, 85, 141]
7928A41j41J49m4N5k84O7P3Q2J4k41K79j79R3j73J80j26j29M96n22O0K14j9l46
7951c01K96P2J23j03m9o4J03k56N25k99j18L71m85K07nj50L2P4j98M18j17n9o7
7974e0N3J1P1o3P0J7k31K68rj70j16J52L2l22L66J78r7j33o2P7O0j39P6R1J08
7999B38k99L7n6J34M6j80j3R1p3J29j27j17L63j4r9j04O1j4j78M46m4Qj54l54
8023b73N20l65J43j97J43r2q0L60k26J49j12K12k98K79J01l87J65j98K00k7j45
8044a28O6J83L5Qj14q2K9j09K64j96j2j29M02l54J21k34N35k51j72K69k75K98
8066A54j2m89M47l08R2j08L60j16n4K86k76q1P8M9J92j47m23L46O4l1l5J89k04
8089b7M2J25k79M4J54m9P5J4Jo1j48O9OJ6J90j06j32O0n0J73k75N3K88M0j56J08
$$ y = [141, 0, 149, 105, 160, -124, -57, 16, 98, 112, -129, 150, -29, 64, -109, 71, -55, -184, 312, -210, -150, 64, 45, -301, -5, 67, 190, 87, 38, -26, 77, -179, 346, 47, -71, 300, -185, 22, 17, -133, -101, -27, -225, 193, 76, 17, -50, 3, 14, 85, 22, 92, 109, -122, 146, 137, -33, -149, 3, 35, -287, 79, 257, 160, 27, -35, 42, 102, -37, 39, 130, 238, -61, -24, -80, 54, 100, -80, -93, -2, -75, 54, -73, -190, 173, 159, 60, -44, 17, 3, -175, 271, 227, 235, 81, -273, 247, -118, 25, -172, -29, -121, -201, 159, -67, 82, -30, 182, -116, 163, 264, -123, 42, -156, 44, 17, -128, -62, 121, 156, 164, 50, -32, -3, -112, 152, -44, -56, -185, 217, -137, -16, -250, 285, 34, -138, 131, -144, 154, 142, -347, 100, -208, -116, -224, 136, 20, -34, 252, -24, -105, -27, 22, 214, 67, -356, -10, 54, 23, -12, 177, -27, 15, 140, -139, -95, 59, 10, 85, 99, 100, 39, -109, -40, -34, -18, 172, 66, -66, -6, -56, 117, -158, -105, 183, 223, 67, 175]
8115A75k1j10J70l46R9k13J95L60l06J49j73j24R5oJ60m1q0m3Q7j64K32j53K58
8138B00l28j20L80m52O8L01j80O1R2k89J03L24L2j97K8j37l2o8N9L08L6o0J40
8161B69l65L0p5L79j08j70J03j02J58k11n1j86L10J68k81J20j86K87k9j81L80
8182B59k27J10k29k31O60k67p2Mr4
$$ y = [175, 154, 44, 214, -132, -33, -246, -51, 309, 3, 152, -21, -145, -50, -56, 104, 63, -17, -60, 27, -137, 95, -58, 200, -128, -248, 132, -320, -252, 49, -131, -70, 22, -267, -164, 160, 192, -5, 23, -114, -146, -214, -155, 153, 189, 129, 269, -96, -66, -141, 238, 130, -40, 63, -39, 119, -92, -143, -329, -19, 149, -132, -12, -198, 89, 60, -121, 259, 32, 142, -87, -318, 342, 75, 3, 7, -87]
8191h7
$$ Imaginary data points
##PAGE= N=2
##DATA TABLE= (X++(I..I)), XYDATA
0@%%%%%%%%%%Qj6J6k4L2l9M7n6P2q8J04j20J44j71J96k33K72l12L61m17M80n48
32b92O23p06P98r00J013j136J272j422J584j760J955k168K399k651K927l229L557
49A864l919M317m754N241n780O380p058P825q699R710j0894J2301j4008J6130
63H656j8850K2479k7589L5371m8780P8058k54693K11802L95379n83777q1998M40465
75A76523k9848l43432J83869J49879j64085j6770J27746j07167j3093J28054o2142
86B9534j18222J14294L2726j08922K8476P7339q5755k7196Q1314o815n1064K9106
98e185O077j3697K0186j0769j5887N3316j5133p5462N8174P4097r6441m2932J08969
111D5313m891r5575N3984N8629q6130j2249R0590l1630o5659O5433L0622q3137
$$ y = [0, 0, 0, 0, 0, 0, 0, 0, 0, 0, 0, 8, -8, 8, -16, 16, -23, 24, -32, 40, -48, 56, -64, 80, -91, 105, -128, 144, -168, 193, -224, 256, -292, 331, -375, 423, -477, 536, -600, 672, -750, 834, -926, 1029, -1139, 1260, -1391, 1536, -1693, 1864, -2055, 2262, -2492, 2749, -3031, 3349, -3709, 4116, -4583, 5127, -5767, 6534, -7474, 8656, -10194, 12285, -15304, 20067, -28713, 49345, -205348, 6454, 401833, -181944, -263942, 176523, 146675, -196757, -12888, 136991, -27094, -43864, 83882, -23285, -36378, 91676, 29534, -88688, 25606, 58332, -50590, -22114, 55225, -30530, -57726, 23588, 16773, -34291, -5185, 892, -12805, 7381, -3388, -19275, 34041, 18908, -56554, 1620, 75717, -20724, -63656, 45313, 40422, -55153, -1169, 57460, -28670, -40919, 49671, 18041, -47618, 17815, 48437, -34700]
123c4700j811Q0398j4521o6799J4010M5796j4308l5853J3904L5312k3251m1653
135d3476L9325M4051n2821k5406O7934m782o6223N0094N7096q3056k5927R6756
147E3565j9022q6674O4307N0832r9952r430J00865m3068p8866Q0653L0989j02896
159e8697K1489R8705o6158o8637R5818K9290r8093J7798Q8420m7387o0077O3936
171A6407L0637o0011k893M5860j7409l1621K3725J7236k7075j2963K2264Q177
183A2334k4240q951K6679N547l1893J140L6528q772l3612K0582K5571k6231p656
196a2974L1443q911k8957K4476K1999l4775j0945L9600j124m1448R547L8682j5559
209A1054l6107J8690L0015k2595k2460K6776J1309l1649J146L1939j6718k7417
$$ y = [-34700, -36511, 43887, 29366, -37433, -23423, 22373, 8065, -27788, -13884, 21428, -1823, -43476, -4151, 39900, -12921, -38327, 29607, 24825, -41398, 8696, 65792, -17264, -43191, 53565, 34543, -52131, 12176, 63008, -36944, -46374, 54491, 11423, -67443, 13210, 44199, -58697, -37208, 61497, -4661, -73298, 22520, 51810, -46283, -28485, 59935, 12548, -47529, 16407, 47044, -12967, -15860, 30000, 12591, -19030, 4695, 21931, -5144, -18107, 4157, 12334, -11906, -20857, 5822, 11369, -20524, -19384, 17144, 8372, -25240, -4658, 20913, -5318, -12974, 18469, 9558, -19399, 5077, 27076, -7699, -18644, 20956, 19832, -21616, -12069, 26613, 11054, -25053, -6363, 23652, 1057, -21403, 5373, 16682, -14967, -13821, 18118, 1400, -26017]
221b6017L0999J3679m2904N889M7066k8006l8587M8569K2807n9075L571O1190
233C9181k4885m6911M3499K5469m9249K6M2518k3641k9759L5452P907m1678N524
246a6547L2115j8597k1560J9983R061j5875O07J1460j510k376M159L236O71k089
260B738K471O614n262q717J1140N312k1162m67K3029j3126k5173K0804J6943k9504
274a4360o397K9167o431k1092J9708J0327k3708N232K5804j6225j9459K4638J1379
287A8583k5764l241K2389l963j8132P381J3337j0955j0068J3285Q675j5478p106
300a1057K0905M000k5468K162K7785j2169k7818K1219K0445l0749j1835L3401
312A0821j578l1679J4231K3235k2564q700K8889k994k5821J7520K2401k2783j3040
$$ y = [-26017, 4982, 18661, -24243, -18354, 28712, 706, -37881, 10688, 33495, -25580, -22009, 39181, 14296, -32615, 10884, 36353, -12896, -12870, 29648, 6007, -23752, 11700, 19607, -22071, -16547, 15568, -3029, -24589, -4606, 4455, -11420, -10813, 647, -863, -3239, 920, 4156, 4827, 2738, 5209, 11823, 6561, -2156, 8984, 14296, -6866, -7333, 15696, 2570, -22603, -1799, 15144, -14360, -20757, 8410, 1979, -19113, 595, 10922, -12786, -7554, 18250, 2025, -17434, 7204, 18583, -7181, -10422, 11967, 8004, -10128, -2747, 10590, -365, -10433, 2852, 11527, -3951, -11057, 9848, 13848, -11620, -9458, 18327, 6158, -21660, -441, 20004, -10745, -22580, 10821, 9243, -22436, -8205, 15030, -7534, -16234, 12655, 9661, -16160, 1360, 23761, 978, -12062]
325a2062K5660N151k3184K20J5556o947j0599O769J492j1017J276J0812o911j3048
339a6832J0479J5608j3631j4737K0827J6117k3295r147K9081L492k8050O257K5399
352B1568j4159j8914J8582P735k1701J465J7170j3474j2547J8627L225k0930L609
365i744J9458r681j4096J3669Q643j3085k153J2886j484j0466M805J0313o653
378B412j0261Q551R979j0460q880J3325O767j5645l044J6240k523j3547P136Q467
392H517j1442k473J2102n926j0967J2482M007j7655L448J8133j1907j4707J9011
405B623Q519k2727J129K5338q500k0687J6456J6542j9887q320K2419P64k1784
418h115N401J7331j2364j3666J4520N482j8897q88J7552o999j5462J3159J0379
$$ y = [-12062, 13598, 18749, -4435, -4215, 11341, 4394, -6205, 564, 2056, -8961, -7685, 3127, -3784, -16832, -6353, 9255, -4376, -19113, 1714, 17831, -5464, -14611, 14470, 17962, -10088, -3831, 21568, 7409, -11505, 7077, 14812, -6889, -5424, 11746, -1728, -14275, 4352, 7577, -13353, -9744, 9714, 33, -14063, -394, 8249, -4836, -6989, 5897, 4413, -6053, -1248, 9065, 2412, -7849, 702, 10681, 221, -8659, 4666, 11433, -4212, -7256, 8984, 6461, -7086, 50, 8517, -2925, -5398, 6704, 778, -10189, 2293, 6300, -11355, -7907, 10226, -1681, -16388, 2623, 11142, -11585, -10456, 14882, 6382, -14305, 2151, 18693, -1194, -9514, 12905, 13669, -8115, -2714, 14617, 2253, -11413, 3107, 8589, -10308, -11196, 6356, -643, -16105, -2946, 7433]
431G433j8025k018K2924m423k1076J4892J9343j9917j0159K4993K337k5225O338
444b583K0415j4608j5078J7124N911k0617n55J6538o468j2085Q582P744r498l979
458i157J0567M009q666l362J0519M054j1691k160J4646j234j6172O440J3589j3545
472b163p059J9711l578k3793J5631K1646k5115j3404L2135R14l4354J2944K9120
485B2635k4264j8623K9008K850k9750J0813K2520k1460j1228K5092j585k1910
497a5902J5293J5710k1953m158K6312m384k2004J2981J5587j6261q628J5351J122
510I066j4251J348Q656n555p384L975L768m650j963M479J197m844K186Q120j860
525B288o698O364O993q540l118J1530P11j1896K037O687o332k094Q186n738j1770
$$ y = [7433, -10592, -12610, 10314, 5891, -15185, -293, 19050, -867, -11026, 13967, 16304, -8921, -2583, 17832, 3224, -11854, 5270, 11181, -9436, -9991, 6547, 79, -12006, -3424, 4320, -5178, -9157, 1410, 5419, -3247, -6609, 3910, 7964, -3727, -5887, 8759, 7525, -8647, -2207, 11382, -2163, -9222, 10489, 6911, -16882, -1251, 20395, -4720, -18124, 14011, 14925, -19429, -6485, 22635, -1629, -20252, 8756, 11606, -18144, -7331, 15189, -6271, -17499, 7593, 6008, -15902, -609, 15101, -6852, -11010, 15302, 10918, -11086, 1895, 17482, 1221, -7407, 7944, 9066, -5185, -3837, 4819, -736, -8120, -4145, -377, -5027, -6990, -2511, -1314, -6158, -3972, 4148, 2288, -4410, 1954, 8947, 407, -2711, 8819, 9530, -2366, -329, 6358, 26, -2068, 6118, 380, -11390]
540a1390R200J0545j1851p821J2411L728j2440M26J3463j475j2097L590J0446
553F735m827p597Q451N843j3060l463J6456j05j7466N821J5648j4292r799K1413
567I758K421k5657P094K4483j7472j7059K5461M113l0575Q799K9053k1520k2527
580b3628K9329R361l1719N909K7194j7964j7008K6630N577k5972Q510K2211j8164
593B66j2579K3315L622k0951L351J2394r189m334R581n126r898Q053M339q451
607e607m98O465k560l681K763K678K237J52n651K172R687l013q671Q243M937j3040
623c387J66J4414n949j4815Q772Q498j1841k802J0726m111q817Q573L793r498
637f278K610R729p700o513J2131M403j2857k6J1153l765q286Q084M051j1695M77
$$ y = [-11390, -2190, 8355, -3496, -11317, 1094, 4822, -7618, -7192, 6271, 4796, -7301, -3711, 6735, 1908, -5689, 2762, 8605, -4455, -7918, 8538, 8433, -9033, -3212, 12436, -1856, -11655, 9758, 12179, -13478, -6384, 18099, 627, -16432, 9029, 13142, -17433, -8634, 20419, -1101, -23628, 5701, 15062, -16657, -10748, 16446, -1518, -18526, 8104, 13681, -12291, -3781, 18430, 266, -12313, 11002, 14624, -6327, -2976, 9418, 229, -4105, 5476, 350, -9548, -1495, 2844, -5607, -6105, 360, -2200, -5881, -3118, -440, 1797, 1949, -3702, -1530, 8157, 5144, -3527, 4716, 9653, -3387, -3221, 11193, 5244, -9571, -799, 7699, -4142, -6944, 3782, -329, -9146, -573, 3220, -6278, -3668, 6061, -1639, -8152, 3979, 8382, -4475, -4501, 6652, 2887, -5399, 2685, 6736, -4959, -4482]
652d482J2415n216j1309R659Q288j3775l380J6205j670j6201O906J3334j2154
665a380q000J4544N71j6013N173J3296j0610q196J3580J657j3843N121J3156q751
679C05p713J1349M378r987M99R644l912q070N125N832o967n395M955L189o530
694c298l963O319K298p393m43O968n85n226M536M829o097p05Q729p45p735M113
710A602O249o539l528P351j043q584L060P104p160o068Q347L035j0251N9J0745
725D379k898r162O110Q090q112m800J0393K403j0765M52R790l686o889N729K827
740C861o359J660N376m930l689P422K76o813L107N086n384k980O322n04o135K468
756a216L382l392k071K166j03m27J107j663m39M087l18l547K415K728j616NJ849
$$ y = [-4482, 7933, 2717, -8592, 1067, 9355, -4420, -7800, 8405, 6735, -9466, -2560, 10774, -1380, -9380, 5164, 5735, -10278, -5105, 8191, -2419, -10615, 2965, 4622, -9221, -4100, 9056, 305, -7408, 3941, 8319, -1668, -1169, 8475, 4563, -3507, 1618, 7450, 483, -4912, 43, 3232, -3298, -7261, -942, 1356, -6037, -6480, 488, -97, -5323, -787, 4042, -2055, -2760, 5969, 5224, -2511, 1602, 7851, 1312, -2216, 5135, 4092, -4492, -1432, 5672, -1488, -7556, 791, 3826, -6425, -6366, 4379, 1481, -7681, -1571, 6519, -1593, -6393, 4000, 6403, -4362, -3910, 5880, 2194, -4695, 1034, 3861, -2498, -838, 4538, -392, -4081, 3341, 3617, -3196, -89, 4997, -387, -3367, 2955, 2451, -3684, -1216, 2166, -1226, -3297, -1131, -1234, -1661, -554, -2217, -2656, 1431, 1113, -2434, -19, 2709, 1093, 1098, 2947]
773B947j378N2K247k366j902L305q45m887K239K835o001p93O197k763n972N696
789a389L332o820J003P319l136m185O361K796o403Q91N789k688l243L221M89l373
805c6k22J595j761j451Q46M32n06j587J54K081k13k323K064K979l158j393N031
822B532J06n129K234M833l860l497M731N81m766J423L338k438j586L086o53k934
838a999K438K232k484j774K718J088k883j779L101J112m241j687M697N54n171
853d078J004N166k200m112M475L641m305p48N149o61l273J988K326l265j241K069
869A935l98k940J23J710j717k713J196J880j230k041K942J904l440Q14M887j279
885A633l421M062L486o219n06O861k433n959L935K608o416n14N984k963n200M209
$$ y = [2947, 1569, 1621, 3868, 1502, -400, 2905, 2060, -2827, -588, 2247, -3754, -4547, 1650, -1113, -7085, -1389, 1943, -4877, -3874, 3445, 309, -3876, 2485, 5281, -1122, -231, 5558, 2870, -373, 2848, 3337, -36, -258, 1337, -424, -1875, -1029, -597, -1103, -2690, -2536, -455, -668, -2991, -927, 2052, -1106, -2499, 2532, 2638, -2491, -257, 4576, 716, -2781, 1950, 2531, -2235, -812, 2526, 88, -1498, 1588, 935, -1999, 439, 2671, 187, -1587, 1131, 2219, -664, -2443, 658, 1770, -2471, -4158, 539, 1093, -4078, -3074, 2092, -108, -4220, 255, 3896, -409, -1157, 3992, 3331, 58, 2046, 4372, 1107, -134, 1935, 1537, -1403, -1280, 430, -1287, -4000, -2804, -924, -2154, -4195, -1253, 651, -2789, -1975, 2912, 1633, -1788, 2274, 5760, -459, -965, 5896, 3463, -2496, 1439, 4047, -2369, -2883, 3101, 138, -5062, -853]
901h53J957m821K368K918l575q90N552j317m629M261L080n879j030N796j318l708
917b088K488J730l786j9L462n79k400J355J053r31J19Q32l90m88l3M8L92r10j375
936a520J317R66k839j041K639Q17k634J29K782j85k067K256J526j667j55K907
952C231j080k268J671K452l338j856L701j431m667L091M041o282m294P791J923
967B685q458J180Q703m286o236P684M440q280o6Q218k912o716O925M361r048j350
983c156Q589l118q087O125N153q863k792R014q91p052L184M764n064j759O674
998B721j245n312L980L897n089j759N621o32m267J757K263j784l69P98j245L70
1014b95K205k391j183L679q54l407L352J821n147P6N146l114l318M553j64n578
$$ y = [-853, 1104, -3717, -1349, 1569, -2006, -2896, 2656, 1339, -3290, 971, 4051, -1828, -2858, 2938, 1620, -2088, 400, 2130, -1656, -1675, 1787, 1208, -1192, 163, 1216, 285, 404, 1236, 846, 358, 325, 373, 765, -145, -1520, -203, 763, -2076, -3117, -478, 339, -2295, -2166, 616, 431, -1636, 620, 2146, 479, 324, 3231, 2151, -117, 1554, 4006, 668, -1188, 2513, 1082, -3585, -494, 3547, -2735, -7029, 762, 2685, -5773, -4593, 4110, -176, -6412, 1272, 5712, -2568, -2634, 5584, 2672, -4044, 2881, 7242, -1806, -3156, 5433, 2315, -5772, 353, 5506, -3357, -6149, 2865, 1974, -5078, -1894, 2870, -2194, -3953, 2721, 1476, -3836, 144, 4041, -1048, -2807, 2814, 2182, -2085, -328, 1935, 151, -218, 580, -665, -295, 1910, -481, -1664, 2015, 1161, -2246, 1106, 2927, -2220, -2144, 3002, -112, -3430, 1123, 959, -4619]
1030d619L635M566o887r08P993l407o070P593M172r434J259R113n392n830R025
1045D809J336j0596L310Q367q737m851J0693j206j1233M847Q132p821l552Q476
1059A974o50p027N673M541o539n43P891k242o284N033M630o030l379N576Q91n354
1075a839j8L593j675k809J893J894l192o96L644L96l417J311L350j667k590K405
1091E83J390k626K11K034j354j596K195M12k565M4K221J98j615q98J396K481j407
1108A104k906K146K581l450j283L809j176m062L386K038o038J43P491l860o820
1123f897P590M377q400j370R696j912o904N186M471o359o61O096l520m431N264
1138B226J546p398J070N531l705m254M423J727m767J095M062k525k140M316J230
$$ y = [-4619, -984, 3582, -3305, -4213, 3780, 373, -5697, 1896, 6068, -3366, -2107, 7006, 1614, -4216, 4809, 6145, -4451, -1141, 7226, -1511, -6362, 4331, 3125, -8108, -3261, 4871, -2950, -6502, 1974, 1324, -5703, -30, 4511, -2028, -2571, 5320, 3078, -3206, 1827, 6457, 427, -2952, 2624, 3515, -1839, -1857, 1736, 61, -2748, -855, 1039, -2153, -2849, 795, 1191, -2226, -915, 2435, 768, -1822, 583, 1973, -653, -442, 1592, 238, -1358, 837, 1249, -1316, -1272, 949, 1147, -468, -1366, 30, 2511, 1104, -1802, 344, 2925, -525, -1808, 2001, 825, -3237, 149, 2187, -3851, -3708, 3783, -77, -6897, 693, 5070, -3330, -4700, 4996, 3084, -3820, 1366, 5837, -522, -1183, 4913, 1393, -3038, 2226, 3772, -3626, -2556, 2975, -730, -4984, -561, 1166, -3601, -2506, 1556, -969, -3109, 1207, 2437]
1153B437l861Q58L614j405k638K675R91k871j53K375j403k092J341J164j952o11
1169a531J156k46K53N10j795n9K566Q6k595R57K405j716r46J974n82j274J629
1186G92l92j809J903J395l615L47M378k785l565M850J405n572J486N205m235l349
1202c561O074J4o952L004N839n996l291O457N03o058K148M676m083j883N135j49
1218A877l473K109K284k280m60K082p62j163P16m2q54n09L21o9n10j332O10J812
1236C57j727k083L310J708l738K73M162q38l120K626K116k454j107K773r53j737
1252d32J469K72k094j37J270p89j011N37P85j83j292L45K125j29k153J304K260
1269B147k050j790L016O39l834J482K912k957k200M365k69m320K463L585m198
$$ y = [2437, -1424, -566, 3048, 1643, -995, 1680, 2671, -200, -353, 2022, 619, -1473, -132, 1032, -920, -1531, -375, -621, -368, 142, -1653, -1712, 854, 940, -1655, -698, 1707, -9, -955, 1019, 437, -837, 792, 400, -1409, 494, 1889, -1726, -1379, 2999, 214, -3351, 1499, 2904, -2668, -1182, 4023, -212, -3561, 2513, 2527, -4425, -1421, 4418, -1578, -4869, 1588, 2091, -3967, -1819, 2857, -1226, -3109, 2026, 1877, -1596, 513, 2797, 517, 57, 2139, 1377, 214, 930, 888, 34, -475, -154, -223, -733, -2065, -1455, 357, -1370, -3453, -143, 1565, -2173, -1900, 2262, 1424, -1696, 930, 3046, 592, -515, 2258, 1305, -432, 1037, 1309, -785, -922, 348, -441, -1452, -915, -130, -313, -1605, -1260, 865, 736, -1417, -113, 2147, 97, -1693, 1323, 1962, -1872, -390, 2522, -435, -2635, 1730, 1461, -2859, -396, 3189, -1009]
1284a009j300M678n76m109K716K636l685n41L037j650k736L131L82l347Q56K838
1300A321k330j759K655J107k046K55J211J06K9L59J59pP16r35k23Q63r20n21M04
1319D44r93q14J092o7j579N92J866j820j666L468N05l074J576L182k327j954L551
1336A982L33l336J260K754k740j693K983N10l773l16L970j372l307J935K483k472
1352g99j699L228R35l490N15L168j427k608K450K180k756j914L065R43l621J308
1368e22K718k662j757L389Q08l632P75L468j625l528L137K643m033j181L547J17
1384A662m160J149L440k685k375L011J373l350N38L274k238k247L761J686m571
1399a732NN550j289n330L251L562l799k075L282j57l364J659J478k733n01L066
$$ y = [-1009, -2309, 2369, 1793, -2316, 400, 3036, -649, -1190, 1847, 197, -2539, 592, 974, -2373, -1517, 1321, -1009, -2768, -113, 994, -1052, -797, 414, 520, 549, 908, 1067, 1060, 1776, 841, 618, 1481, 561, 40, 444, -549, -1363, -271, -338, -1917, -1325, 541, -1279, -2945, 523, 1028, -2046, -470, 2712, 385, -1569, 1982, 2315, -1021, 239, 2993, 253, -1440, 1543, 2053, -1720, -2036, 1934, 562, -2745, -810, 1673, -799, -2498, 730, 1665, -1825, -1310, 1858, 431, -2177, 273, 2453, -303, -2217, 848, 1791, -1830, -522, 2196, -466, -2223, 1166, 1974, -1658, -883, 2585, 960, -2568, 569, 3212, -821, -2002, 1545, 1662, -2498, -1349, 2091, -594, -2969, 42, 1415, -1935, -1397, 1877, -361, -2608, 1153, 2839, -1732, -1727, 3823, 2534, -2796, 455, 4017, 218, -1857, 1425, 1268, -2096, -437, 1041, -1692, -2193, 873]
1415H73j257k636K558J692k211p17K931J51j982Q71J411l70r96L77K16m81J61
1432E91j48j18m95l31P12j64j196N42J430j674j389K698J439l237m90M100j396
1449H74l142K910K226m300l03L951j139l361K431K215m230l99M915j260m799L131
1465b80L636l925j862N000k07m940J742M090l604k715N080K7n885J805N308l290
1481b0n068N926K343n613j12O004j823m683M062L266m706j361N078j517m355L178
1497E99K321l957j678L781n72l263J977J823k731l18K735j67j853R78J737j221
1513A91n40R38P36k18j389J03J594j81k307M73J790j496j647K217P26k712M79
1530a243K676j895j504L584j30l910J587L751k868k564L964Q85n023J315M390
$$ y = [873, -384, -3020, -462, 1230, -981, -1698, 1233, 1384, -598, 273, 1684, 1314, 318, 695, 911, 430, 591, 443, 325, -170, -501, 211, 47, -1149, -607, 823, -851, -2240, 458, 1897, -1340, -1830, 2270, 874, -2268, 642, 2868, -1432, -1735, 2216, 1077, -2284, 147, 2362, -1868, -2267, 2648, 1388, -3411, -280, 3356, -569, -2431, 2569, 2362, -2578, -836, 3254, -350, -3065, 2015, 2042, -3843, -2038, 3270, -20, -5088, 838, 3181, -2432, -2544, 3460, 1637, -3046, 1016, 4282, -424, -1785, 3293, 1776, -2579, 599, 2920, -1037, -2715, 1066, 494, -2769, -792, 1031, -1700, -2018, 717, 550, -1303, -325, 1412, 191, -349, 589, 1325, 1107, -282, -179, 1415, 1234, -1073, -600, 1190, -306, -1953, 264, 990, -1722, -1243, 1433, -462, -1966, 1618, 1488, -2422, -835, 2916, 48, -2516, 1448, 2333, -2690, -1375, 3015]
1545C015l170l136M536J101m966J391M570l494l236N285J054n535J346M914l426
1560B49l535N106J224o007Q75M466k851k964M367Q89m767J468M346l460k487M375
1576A294J126m446J092M124k312k536L128L38k314J35K108k107j162K022p7j306
1592h93k73J153j89p53k28J160L06r32n33K017P83k197j81K803j145k050K037
1609H85J228l193Q1L275j527l190K877J602l816l67L592q59l402K726K143l152
1625a097p39M065r31l338J654L012k526j949K892N05l225N45L324k291k270L051
1641F82J233l557J02L658j365k651K407J810k907n72K836q32k506J588J459k120
1657g35j099K428m82j957J519J275j878j58K172k37j704J061J302j110n13J078
$$ y = [3015, -155, -3291, 1245, 2346, -2620, -1229, 3341, -153, -3389, 1896, 2950, -2585, -1239, 3675, 249, -3286, 1820, 3044, -2963, -2088, 2378, -473, -3437, 930, 1819, -2948, -1480, 2866, -594, -3081, 1294, 2420, -2026, -934, 3190, 878, -1658, 1470, 1808, -506, -371, 1737, -370, -1532, 490, 413, -893, -1166, -13, -202, -955, -1183, -23, 283, -649, -1182, 835, 1618, -579, -760, 2043, 898, -1152, 885, 2113, -1080, -999, 2276, 749, -2441, 436, 2038, -1778, -2145, 1447, 588, -2814, -88, 2055, -1097, -1836, 2229, 1298, -2040, -386, 2626, 100, -1849, 1043, 1548, -1677, -1132, 2192, -99, -2369, 682, 1915, -1642, -1540, 2118, 753, -1898, 509, 2319, -588, -1160, 1676, 844, -1662, -74, 1385, -735, -1834, 594, 112, -1845, -326, 949, -929, -1087, 1085, 848, -856, 205, 1507, 397, -116, 962]
1673I62K6j184J03N94n02l86k81M22n7n94J77L53k73N6N09j70k01J81J301n69
1693D67j229J591J388k336j054K610k13k518J013J969k149j096K446p19k185J838
1709a77J702k764o61L598o71l047J732K739k964j261K855J52k477R70J446j688
1725e16q45J970o0j915J138J503j387q48J641L02j672j60J823N8j568n8J566m16
1743E56j596M93J011o70j189J303P45j632j64K026m83k117J770J502k013k06K266
1760A602k99k197J321J274k139k33J776q45j720R77J111j444o95J729j05j204
1776a091L84J114k98q35R37Q70q74l10J005J08j375K02J185o47j333O25J586k035
1794g82m15J615N5j672P12J427j546R7J199m50j325J491Q59j763l58J943n44j761
$$ y = [962, 988, -196, -93, 501, -1, -387, -668, -246, -303, -897, -720, -367, -640, -584, -75, -245, -446, -265, 1036, 467, -762, 829, 2217, -119, -1173, 1437, 1224, -1294, -281, 1688, -461, -1557, 889, 170, -2015, -177, 1525, -1239, -1900, 1698, 1027, -2020, -288, 2451, -513, -1774, 1081, 1233, -1244, -274, 1172, -516, -1361, 609, 549, -1366, -228, 1275, -112, -960, 681, 983, -689, -849, 974, 1032, -536, -594, 972, 556, -1040, -547, 464, -206, -1395, -92, 653, -979, -1143, 883, 400, -1717, 53, 1555, -458, -664, 1602, 1303, -894, 427, 1701, -438, -671, 1105, 260, -1460, -483, 628, -816, -1511, 218, 113, -1091, -707, 407, 109, -726, 211, 1081, 207, -103, 902, 1010, -365, -163, 1022, 375, -958, -333, 1253, -782, -1197, 418, 473, -1199, -487, 940, -606, -509, 690, 240, -1085, 406, 1265, -498, -856, 1087, 543, -1218]
1812a218J170J198j290p55J477P8j520N80O91n45l94J071P0j010J34J012j62q36
1830b49K2J074q30q57R05Q28j461j78J105l07j133Q59J009j367k26J743k55j982
1848a300J755J416j660q61J637J73j871L25J596j189j087Q13O38j220j82J115
1864I8l66j006P79J053r25p54J586K37j398N52J324l90j525R25J349j713r05J589
1882E10K23j995M65J522j040r36J513J86j324J82J627n93j221J393O46j521o55
1899a018K032j77j935R38J473j340j290J630M77j717K86J340r01p43J491M74j722
1916g02M89J204p44q91J398K5j222l36J632p88r92M36N58n00n24Q44j35q5L05
1935b8N42k89j93K74O01p36k42P46j12r29J86J024p98j171P94Q11j239l86J464
$$ y = [-1218, -48, 1150, -140, -895, 582, 660, -860, -280, 411, -134, -528, 543, 613, -397, -263, 749, 587, -249, -227, 847, 17, -840, 65, 893, -568, -746, 359, 52, -1081, -222, 787, -580, -806, 937, 682, -1300, 455, 1871, 211, -650, 987, 1160, -711, -386, 1210, 21, -1066, -253, 385, -835, -1017, 98, -268, -1274, -495, 558, -367, -1121, 465, 702, -696, -144, 1180, 790, -735, 190, 1539, -174, -1079, 510, 733, -1262, -797, 725, -315, -1251, 262, 448, -876, -694, 933, 340, -881, 512, 1158, -363, -1018, 1014, 837, -1098, -160, 1313, -27, -1317, 313, 790, -927, -641, 699, -202, -945, 546, 1020, -702, -213, 991, 247, -644, 754, 779, -443, -779, 853, 65, -927, -491, 67, -433, -957, -113, -248, -333, -28, 514, 225, 32, 306, 907, 171, -71, 675, 563, -366, -180, 844, 46, -1125, -331, 480, -759, -1145, 319]
1954C19k62j341J302Q95j331k62J808n36j286J062Q32j491n20J964l90j581N25
1971b93J869j480j217J667o9j373K32J599q67j285J615P28j753K3J971p46j851
1988a230R84J745j827q80K033j44j852J063J392j788n13J583r7j212M59J323j282
2005b43n66J277K14j211L18P96l24n90J35P52n46p62L19P28n51l91M28Q18j030
2024d29J49R44k31p98O05P80r86l30J373l81j655J330L68j085l88J164m30j204
2042a204N28J304q16o79R40L56j167P90P12q99m10J306N7r36P3J176r45q75J128
2061D39O29j561m71J694o24j356R85P57j140k14J642m87j520J282J306j639m11
2078f89J805n42j527P80J254j504q30J607n2j050K43J143p39m05Q22k61j67M63
$$ y = [319, 57, -1284, 18, 913, -418, -680, 1128, 592, -694, 368, 1200, -291, -811, 1153, 763, -818, -293, 1576, 96, -1121, 546, 477, -896, -664, 935, 68, -1217, 398, 1126, -627, -604, 1367, 621, -1230, -246, 1499, -328, -1208, 825, 681, -1171, -108, 1284, -504, -1017, 566, 469, -743, -284, 1039, -243, -809, 468, 682, -529, -211, 585, 261, -329, -194, 558, 12, -750, -431, 297, -254, -645, -217, 601, -429, -280, 664, 433, -365, 240, 1020, 34, -296, 1077, 696, -959, 371, 739, -346, -734, 430, 0, -1204, -676, 628, -188, -867, 73, 429, -738, 52, 764, -135, -545, 761, 818, -118, -45, 1131, 186, -689, 439, 1068, -493, -964, 730, 106, -1250, -265, 492, -648, -862, 780, 293, -1227, 55, 1361, -278, -689, 1116, 574, -953, -173, 1081, -423, -1253, 354, 302, -748, -505, 638, -101, -506, 316, 55, -112, 351]
2096C51j05J51m56K55L39n07k49K95L94o86k61N72L44j033n6J096n91n55Q58O35
2116G91o69l25J310o39r78P98J113j828l88J761n88j303O04J133j011j134J644
2133B91k10j188R75P43r29l30J398K19j560P34R43r09o88J123J7j082M00N95m91
2152E1p92P61L08n73j80M18J06j98J82Mq1l63N99o1k62J22L39J7p40K28M70n74
2174b19k83O30j3n02O8Q35l74l50L95M8n86M06L96l93n06N50N34j204N62K69k00
2195F3o94P29K36o76j32P18J37j001N65N36m42l61P70j78k82K73M90q53l81Q14
2215C31K51j103J17N73N5j051L32O98o28QL78M9k26J32P09n47m24P91K68r95J20
2236a62J006n72m57L33K3l42l43L66q3j6J86j53M63l83J82l8J59q2k43O54l76
$$ y = [351, 246, 397, -59, 196, 535, 28, -221, 74, 468, -218, -479, 93, 437, -596, -652, 444, -147, -702, 156, 791, 122, -203, 1107, 468, -510, 288, 1401, -427, -815, 946, 358, -945, -341, 792, -219, -1353, 291, 81, -1107, -132, 611, -318, -648, 750, 969, -591, 143, 1086, 177, -511, 612, 629, -453, -53, 542, 51, -741, 20, 328, -245, -425, -7, 99, -99, 83, 87, 6, -357, 242, 181, -81, 41, 380, 397, -343, -115, 355, -219, -502, 128, 115, -387, -319, 516, 142, -208, 187, 235, -351, 55, 451, 58, -448, 102, 636, -568, -6, 263, 63, -631, 98, 334, -342, -474, 244, 381, -620, -55, 481, 39, -322, 448, 270, -12, 261, 751, -102, -483, 331, 582, -521, -404, 169, 224, -827, -495, 203, -425, -417, -39, 10, -216, -84, 625, 78, -346, 445, 713, -282, -162, 844, 272, -185, 148, 171, -171, -514, -148, -231, -247, -61, -214, 249, -134, 48, 10, 169, 87, -156, 498, 122]
2257A22l77O55p8o64J08Q70p13l59P35J28p49j74Q42k06n99M77M30q67L76P85
2277G42r76k15J141j05j064L30P00q31k96O97Q5n69k9Q21m40k43N27k17J9K34
2297C11j63j23K8M74n04l7J34n0j69rJ61j95k17N5R2K11j41l91N48K48j72L7R7
2320B25p2k03K43J07l9j5J04l60k37L94J65p24J91M07n7q08M54M98n45N7L19N5
2342A59l35M99j34k64R1L59k65m29r5P92m48j64L22L42n89l08N08K49o53L64K36
2363B37K79l91QJ80k63j61J08j17L5J27j39j58L5J95J62k47l72O59Q9m41J34K32
2385A91J82k82r0K64O6k39NQ3k53L60l3m17J56l8M2l59J93K87j60j67J93o0q7
2408a63O1L71p0j19J24j3j29o7L90l74m0J39m4k87j43P94m71J7l15L95k85L00
$$ y = [122, -255, 400, 322, -342, -234, 636, -77, -436, 299, 427, -322, -496, 346, 140, -459, 18, 448, -419, -43, 742, -234, -449, 692, 587, -477, -147, 553, -278, -574, 123, 208, -361, -390, 431, -9, -252, 275, 58, 77, 311, 148, 25, 53, 527, 23, -14, 120, 70, -99, -108, 53, -142, -359, -304, -212, -1, -142, -533, 15, 263, 91, 128, 225, 153, -50, 193, 300, 261, 246, 350, -10, -247, 147, 312, -412, -221, 186, 129, -679, -225, 273, -272, -215, 104, 159, -176, 323, 189, -75, 16, 375, 110, -319, -414, 378, -70, -234, 88, 430, -159, -467, 41, 290, -363, 1, 237, 516, 125, 133, 313, 50, -111, -3, -120, -85, 42, -97, -255, -220, -25, 137, -110, -482, 177, 266, -175, -41, 191, 373, 91, 1, 265, 331, 92, 97, 180, -73, 287, 254, -163, -7, -45, -3, -362, -169, 118, -42, -209, -16, -76, -163, -102, 269, 199, 80, 204, 191, 62, -5, 385, 11, -29, 110, 66, -221, -364, 430, -41, -24, -339, 56, -229, 71]
2430G1l8J08p6n7l7N2j10P9n9L07j02l1j21K90m72L02o3m10K38K57j71p8J72K71
2454C22n25J79L16l62l2L96j6l61J00M27q72n9Q11k97n75L62J89pm09O06O4n06
2476b49J49N49l40m52P03J85m66q3O00n29j48j5M28r16J50P77k53n99M26M32n12
2497a63J95J87K0n79N92J43l91k3M62l33k21q4J46j00k17M99k63l45L07kM55N
2519B90k83P1l5K28j52j66K43l9m09M05j03k34K67K24o04m6M24J30p81M24P54
2540F08r96J22O79l28o02N88J55n56Q9P29n02p09Q93j36m45K3P48o56j22O28K0
2561B30n83L08N43o90q9M71J66n66L59K9k40m54O44k14q1LM26k04k79K46q5n71
2583f31N51L20j58k98J57M59m43p1M22k00j9n0K24k95k94K86R7L7j92L81k78j92
$$ y = [71, 33, 141, 65, 8, -29, 23, -87, -8, -67, 240, 138, 107, -14, 276, -196, 106, 43, -367, -129, 128, -43, -121, 51, 322, -203, -24, 292, -70, -102, 294, 278, -83, 17, 444, -428, -487, 324, 27, -548, -186, 3, -4, -413, 193, 257, -249, -100, 449, 109, -343, 360, 545, 79, -4, 596, 67, -81, -96, 332, -584, -434, 343, 90, -509, -83, 349, -163, 32, 219, 239, -340, 252, 395, 4, -19, 443, 110, -111, -195, -49, -149, -366, 133, -130, -475, -168, -170, 285, 290, 7, 78, 43, 271, 119, -47, 196, 157, -252, 153, 50, -184, 83, 307, -297, -343, 81, 211, -570, -146, 608, -388, -266, 413, 85, -517, 71, 226, -330, -241, 488, -14, -723, 170, 34, -411, -388, 360, -296, -418, 210, 230, -353, -45, 498, -192, -281, 190, 356, -210, 149, 178, -62, -516, 128, -86, -167, -164, 262, 58, -221, 25, -60, -631, -80, 240, 82, -216, -59, 400, -43, -114, 308, 108, 89, 39, 263, -32, -326, -40, 57, 94, -98, 283, 5, -187]
2605a87m9K79q3M9jm8J66L8n3K71j91ll27J96Mj30J29j5m06J91K64o43N43L94
2629C88n75j16L73N16p64K60L98l29n32N13J14p93N13N65o17l95P60p2q28M37
2649a84N41o32M9M92P3m56L9M90l96J36L56m30j38J51K31k47k49N29j81l80J51
2670e5r8j42J78J22k45P2L78m0j52J61m2k71P1J92j91J59k8K05j87j40Q8n4N0
2693C1K6k90R7K36j53N9J35k12K46j47K33j93p1r2K03n21O38P5m44l42L83r1J45
2716d9J45p1j47n4M13o6m75M20M7r9j02L45j62l69M67kk02K3p1j80J40O0K64k24
2740E1m6R6K21n11M14K0j72M0K67o35J79J10Q1j05j86K90j13l0J29o7p0mj20J53
2764hK07J1k21l2L2K32q3m0O8J73j64P0J90m09j62Q8L8N6j3j86n2m5K80k8m9q0
$$ y = [-187, -236, 43, -40, 9, 8, -40, 126, 164, 111, 382, 191, 188, -139, 57, 61, -69, 60, 45, -361, -170, 94, -549, -6, 388, -187, -303, 70, 586, -178, 82, 480, 151, -381, 132, 246, -547, -34, 531, -86, -481, 279, 207, -621, -184, 357, -275, -226, 266, 339, -117, -78, 412, 16, 152, 508, 78, -60, 91, 322, 75, -174, 355, 174, -206, -55, -153, -295, -117, 5, -240, -168, 210, 170, 18, 179, 137, -134, -63, 129, -62, 97, 69, 274, 87, -53, 35, -19, 31, 57, -233, -136, 100, -53, 6, 141, -71, 175, 28, 261, 68, -3, -95, 108, -413, 225, 300, -144, -486, -103, -194, -49, 96, 25, -122, -176, 237, 171, -304, 116, 163, 64, -38, 307, 145, -224, 243, 241, 39, 62, -9, -189, -49, 11, 275, 51, 5, 101, 322, -189, 225, 245, 73, 113, 380, -255, -76, 34, 115, 10, -176, 114, 1, -29, 100, 33, -37, -41, -161, -8, 199, 210, -11, -43, -11, 221, 138, 98, 166, 339, 175, 245, 435, 26, -136, -48, -10, 46, 33, -153, -205, -250, 30, 2, -47, -127]
2790a27O9K15pM8j83K6M15m13LR9k01j23L43k2k70j26L11O2l99M31J6l46J55J02
2814G8q7M3L58l70k57L94P8p9k63K73j6k89K2J35N3k58M2K3j88L30N8l80L80O8
2838A48j65J75k50K51J82l63J20K9m7m01K12J08P0k56J70O0q1n09M92K97j94J70
2860B18l12L61k49K6j22qL01l96P2L22l23J47k06J25K7m42N80K82o61R2L19j0
2882A43m43M55J53j56k23K50l87K54kJ60q4j64L55k36k24K65j34N6j42K98j8p9
2904I7j51K31r4L9j09K50Ol95q3K48p7l06J19m0K08j65K65j39l3K65n5l07K78
2927E2R1J5j66k8L68l92o5K6J46l35N8L34J11k12J17n6k1k1l4K1%N7K94l38l90
2952c68N46J6m31K26O71p85k16M15k17l4N6K91j11k92Q57o74P9J74N9r6l43M90
$$ y = [-127, -58, 157, 150, 198, 15, 41, 456, 43, 46, 145, -56, -179, 164, 142, -128, -254, 57, 119, -280, 151, 167, -179, -24, 78, -9, 34, 392, 22, -235, 159, 237, 158, -105, 168, 152, -137, -115, 20, 73, -185, -143, -120, -308, 22, 80, -300, 80, 148, -17, 158, -92, 159, 341, -22, 98, 127, 80, -321, -109, -1, 69, -187, -17, 43, -38, -547, -55, 242, 48, 218, -94, 267, 18, 44, -78, -86, 215, -181, -109, 213, -110, 37, -169, -44, -17, -459, 121, 403, -258, -166, 153, 143, -300, 155, 308, 152, -71, 179, -208, 46, 44, 204, 120, -44, 311, 75, -149, 116, -18, 38, -104, 194, 176, 97, -54, 177, 83, 122, 13, 263, 269, -126, -209, 39, -38, -344, -225, -265, -57, -222, 43, -96, -129, 136, 81, -226, 52, 143, 158, -8, -36, 332, -60, -125, -99, 47, -288, -230, 104, 215, 3, 120, 64, 43, 22, -12, 9, 9, 66, 360, 22, -368, 178, 194, -237, -11, 660, -125, -341, 74, -143, -177, -121, 170, 59, -233, 624, -50, 29, 203, 262, 166, -177, 313]
2974C13m08K42o4L00o49J70J03r9j18L93r2j12K75l18l0J34K4j56j86N79j94j79
2996g2K21m0q9J29j25N4L9O0k09oj26J44k3J74j78m7M53l11k22K67k04R3J42k80
3020a56M52k55j04R9k6QJ05k29L07m61J17L06Ol53n7K28k9L0K83l0n18M77k0o39
3044d59L78M88l49j06k75L47j28m1q3M60j75L5j25L01o21M71P0r4l2K89k59M8
3066A40J64m69J53L2o7k4j76J32k8J75l1J79m28L76l0n09K69k7M27k96O7J4j67
3089a24Q9K43n89M21K34j32k52j06J94j10Q1p0Q0L1n2m4L04M4k84j8K40Mj76L9
3113D7J14O3P4m66J34k53o1K96J60N3M4k31J75o4LR9M0l27J81j15j23K96Nm81
3137c37K35J5n9M5m12L65K67j69l24M53n5KL2j73J36P9k4j29L20l32j06J61p3
$$ y = [313, -95, 147, 83, 383, -266, -96, 7, -92, -210, 183, 91, -21, 254, -64, -94, 40, 64, -92, -278, 301, 107, -72, 149, 109, 20, 149, 24, 78, 117, 177, -32, -38, -164, -20, -43, 131, -47, -94, 359, 48, -174, 93, -111, -18, 124, -156, 296, 41, -63, 36, 10, 18, 123, -106, 201, -260, -143, 163, 169, -184, -241, -13, -42, -12, 271, 241, -277, 200, 180, -459, -81, 407, 58, -48, -323, 24, -104, -145, -228, 232, 57, 92, -33, 268, -353, 118, 188, 94, 62, 351, 92, 140, 304, -165, -12, 20, -47, -71, -247, -115, -143, 32, 1, 180, -248, 128, 98, -411, -142, -169, 258, -38, 29, 43, -124, -35, 208, -381, 40, 274, 142, -110, -216, -22, -132, -51, -121, -41, -10, -62, -106, 198, 242, -42, -60, 180, 184, 8, 47, 161, 224, 298, -168, -34, -287, -348, -52, 108, 161, 205, -26, 149, 85, 88, 187, 227, -100, 81, -34, -157, 139, 144, -337, -102, -87, -146, -101, -513, -148, 119, -50, -374, 79, 24, 26, 58, -115, 21, 100, 76, -53, 267, -65, -171, -10, -83]
3160h3M8j16L61l85M69R3j41j85k1j4L48k83JN1j9J86p8l89K24j62R0L4j84K3
3184a32M9j30K48J8j75j04M46l55J63J24o9j28J07k4k02J14K99m03K57j34o7O1
3206c7q7J14k38k27K71J58k7K23k86L20p6m3j45J32k64J46n8KK14Q8p4K00n48
3229b42K39j31j38o0L86k36Q0K0K40r6k2J78j36L5j58N1j48L78k36o7j42M54j48
3252A01J16k73J56k94j79K03J81j02L37j64j60K90l35o5K69k58K8K72j00k22L9
3273a60o0J20P8pl18M46n8J8k59L14lrk8J82M8l49L32j98lj18K05l5r1m0K44j70
3299H1l83K83J92J00kl26m0R7K07J4k37J9J01L7o2k07K89j58Q7j52J22q0j22K44
3323A04k11K14k14J80J69l20M4K73n50M20P6l43L29j63J0%J8p9OJ04n3L07l67
$$ y = [-83, -35, -151, 210, -175, 294, 387, 246, 61, 40, 26, 374, 91, 92, 143, 124, 310, 232, -157, 67, -95, -5, 29, -155, -132, -83, -213, 35, 53, -122, -226, 220, -135, 28, 152, 83, -45, 62, 38, -164, -50, 249, -154, 103, -31, -98, -37, -124, -10, -248, -475, -204, -46, -73, 150, -136, 184, 108, 65, -80, 52, -212, -66, -124, -122, 92, 180, 106, 306, -242, -3, -134, -272, -332, 54, -182, -102, -82, 158, 62, 40, 218, 82, 117, -41, 10, -138, 240, 4, -63, -205, 249, 101, 217, -56, 100, -194, -373, -170, 11, -91, 246, 82, -78, 212, -123, -188, 81, -177, -149, 123, 23, -199, -160, -220, -100, -22, -29, -347, 99, 41, 59, -200, 114, 111, 102, 74, 256, 304, -45, 287, 89, 86, -32, 173, 138, 47, 7, 251, 81, -302, -19, 173, 273, 271, -55, -95, 2, 209, 223, -14, 5, 106, 143, 81, -126, 163, 5, 92, -60, 62, -18, -140, 104, -107, 107, -107, 73, 242, -78, -34, 239, -311, 109, 185, -158, 171, 8, 18, 18, 36, -43, -37, 67, 14, 321, -46]
3346d6R5K8k49K61r9p3l4K5R1j58J08o1K01j10j49Rj05J06K1K51j82M6j25K58
3370A09k44L70j39K14k52k48Q4K33j62K0J15J6p2p3l59L87p8M41n22L8K05N2j20
3393A5n3K24k84J73J8j97K15j79J03l0J6P2J4m38L10L20m93M95m70L1j14M44j47
3416D5J72m72K5J36L13l14K56l72J75j98J59o1J09k4K31k96M0J68J10m78J21J27
3438b8K36r3o5O3mk03K20j81K4J03J93m31P6j14k16M06l14N79j16k25L7K09j83
3461b7j89O24n07j54L64o1r0Q6J51j62m15L56R8j89q4M34n04K32Q6k0k13J93j3
3484dmk08J60J34q3N5j80J79p3P7k52K89l37K67J77j84m4op8K00J4p0p1O1M2K18
3510B79l92J09J10k3k11K33J2k8J90k05N5MOj62j16j53K88k51L35k8J69k10L21
$$ y = [-46, 49, 77, -172, 89, -10, -83, -117, -92, -1, -159, -51, -112, 89, -21, -170, -161, -266, -160, -139, 112, -70, -24, -149, 109, -135, 235, 96, 310, 58, -190, -106, 127, -35, -15, 100, 116, 44, -29, -388, -1, -79, 362, -160, -122, 83, 135, 15, -38, 186, -98, 75, 93, -104, 111, -68, 35, 5, 21, 93, 107, -331, -21, 299, -194, 301, -169, -138, -252, 192, 45, 217, -255, -230, -94, 219, -95, 161, -211, -36, -234, -75, -136, -27, -51, 180, -116, -76, 92, 202, -276, -155, -28, 208, 115, 50, 113, 109, -94, 126, -55, -31, 72, 265, -166, -90, -204, -420, -14, -328, 251, 135, -90, -53, 156, -27, -216, 408, -99, -253, 111, 50, -40, 46, 197, 35, -380, -24, 74, -115, -199, 235, -269, -37, 49, 29, -184, 9, -4, -8, -216, -56, 78, -5, 50, -130, 49, -24, 53, -199, 90, -247, 20, 197, 13, -31, -37, -115, 85, 99, 29, -42, 19, 61, 279, -113, -4, 106, 83, -128, 105, 117, 89, 279, 74, 129, 133, 139, -23, -139, -292, -4, -255, 80, 52, 221, 11, 332]
3533C32j16j85K6R2k27K25p6o6J00l05L48j90j26j54K89J25j61p9M7J88j77K63
3555A73R4l46Jo9M05l89K40Pj94p3K14J30k69J75j25j8o7K32l7j41r0J37j96m9
3579b55J02M38m04J45J2L5l42N26j51O1l85K39k03J36l15L01r6J42l3K5K73l19
3601f8P5j39J68n5j26J08j64J7J19r9j62M64J22l14L03k90K25k42m18M09K36k10
3623d1P7k01%P6R6K3K35n83L02J19n7k8J33j15j67J48M6Q3k92J29j40k4K06j74
3647a49K56j46j24L24k9j84K6j0O4O0k22M8J36l84L33k4o5R5L02j1l16k2J21j17
3671c8J49n4K06m93K72J9r7KK1j51j38K16N6N5J56k91K3K36k23K57k46PJ50o5
3695B9R0k22K53j33l9J1j12oK47J3k10K10l59L35j22j09r3P2Q0n6K6J98j42K08
$$ y = [332, 216, 31, 57, 149, -78, 147, 71, 5, 105, -200, 148, -42, -168, -322, -33, 92, -69, -148, -101, 87, -90, 173, 267, -79, -78, -147, 258, -131, 109, 116, -78, -151, 63, 193, -76, 99, -26, -44, -111, 121, 84, -57, -147, -10, -206, -255, -153, 285, -119, 26, 38, 73, -269, 257, 106, 167, -218, 21, -182, -46, -361, -60, -156, -14, -47, -22, 251, -68, 7, -132, 36, -19, -145, -37, -201, -184, -65, -164, -326, 138, 260, -54, 249, -41, 184, -58, -476, -67, 169, -41, 36, -165, -165, -89, 7, 30, 265, -318, -16, 103, 46, 18, 151, 36, -131, 17, 63, 146, -146, -17, -157, -181, 25, -149, 107, -39, -163, 161, 132, -52, -26, -36, 28, 88, -134, -86, 50, -334, -1, -25, -90, 5, 307, 296, -20, -42, 79, -38, 111, 57, 263, -230, 42, 61, -36, -34, -13, -164, -302, -86, -30, 25, 181, -110, -87, 149, -74, 183, -63, -56, 94, 29, 119, -103, 150, 17, -22, -11, -123, -129, 118, 131, -79, 131, -228, 107, -15, -124, -217, -145, -65, -121, -95, 103, -39, 169]
3719A69j1l09J78j35n6K93l19R6L44q9R8n79J33K96o0l9k5Q7j42L17k37n4LJ29
3743H8R4k73J1L02j0j66O6L0lQk52J34L3l85K70M9j10K52k21K67l11L75j92J4
3767G0m5Mk85J27J42k4P4j98L80k38K41l14J0J7M3K95m03J15J14n1N3O1j77m8
3791c7j31J23rK41%l81K23o5m09K59l1J71%J9n7O9N8o0J21l42M11k64N0j90K97
3816F6Jl51K29q5J43j08K0K13K8k68O1j21K99Q3k41j19K88k92L9j02N05m48J19
3839d1J54k37M2L0J71m1P8o7m3m3o5J93j59j90K22J31q1k05K4n2M72j91j58nJ32
3864G1L1J5P4M6n82N16R1k08J37l10K99p9r4n1O5o8r8J87K49j94O5j79J02j43
3888e8J82l9k06J66m12M74L28n85K11j61J86r1J70K8j8n1k12R1R0r1k05L34j95
$$ y = [169, 158, -151, 27, -108, -164, 129, -190, -94, 250, 161, 259, -320, -187, 109, 49, 10, -15, 72, -70, 247, 10, -44, -41, 88, 182, -91, -80, 222, 212, 46, 112, 142, 139, 147, -105, 29, 62, -323, -53, -4, -114, 138, -83, 184, -127, 248, 56, 70, 25, 29, -256, -129, 13, -11, 63, -135, 245, 7, 248, -66, -56, -39, 4, 299, -104, 11, 125, 74, 127, 188, 11, -37, -168, -45, -54, 187, 187, -194, 29, -36, -445, -186, -217, -46, -46, -27, -84, -15, 43, -17, 104, -238, 173, -91, -41, -231, 66, 67, -284, -55, -140, 3, -105, -85, 128, 156, -112, -51, -172, 127, 210, -31, -150, 138, -154, -115, -217, 288, -160, -41, 113, -124, -82, -52, 119, 78, 156, 89, 46, 3, -62, 131, -28, -218, 4, 135, 54, -151, -127, -179, 293, 102, -56, -61, 71, 102, 117, 191, 237, -345, 171, 262, 54, 191, -119, 180, 101, 7, -44, 21, -47, -145, 42, 291, 97, 162, -17, 85, -58, 124, 85, -121, 45, -367, 107, 435, -150, 61, -100, 86, -5, 165, 193, 175, 124, -88, 3, 93, 2, -203, 131, -64]
3911f4K86k55J27R7j78N8P3j81p4K95n4j66M0J05K72o12n8Q0J33J5J41M8k35o7
3935a74K35o6j04J27k13N44m32o3J41J18o1j69P3l8o2k0K45m54L42K15K8k98J15
3958B9L43m04j31o2M11r4R6k32q3l12L98m6K92p02K36L70oj28Q5j40O3k10OK52
3982C1m3j40J41o4L1J70j39j02J78j96J38J89l00j93J5L97l43M05j97Q9r3K05
4004A79j33J11k35J35j03Q6P4j34j4j75L01m10N35j56P2p1j0j72K16l08M83m30
4026a59P3L14k64o1q3Q9L09k71Q5j81L49k15k52K26pJ05J3l36L21L9k35K30q7
4049BM8J14k29J75r8j17q9L05K7q2k01R7j00J72m2K5J14R2j54L91k83j46r4K4
4073d9j15L1L59j79Nj59K15j3j20L58m55K62k23j5J14M3j0j69J69J20O2m0q7k91
$$ y = [-64, 222, -33, 94, 191, 13, 71, 144, -37, -111, 184, 130, -36, 4, 109, 381, -231, -289, -209, -76, -61, 80, 128, -107, -174, 61, -5, -109, 18, -195, 349, -83, -146, -5, 113, 52, -117, -44, -82, -144, -164, 81, -373, -31, 184, 212, -86, 29, 372, -32, -163, -225, 186, 92, 188, -44, -127, -439, -41, -87, 205, -497, -261, 109, 103, -25, 60, -80, -17, -227, -221, 31, -12, -152, -11, -75, -44, 126, -13, -115, 63, -133, 5, 194, -106, -299, -284, 113, -230, 175, -22, 67, -26, 179, 46, 157, -78, 57, -46, 40, 114, -20, -34, -209, 92, -318, 217, 61, 133, 62, 52, -120, 96, -212, 271, -159, -86, 228, -36, -97, -180, -91, 218, -53, 32, -149, 200, -15, -267, -41, -48, 57, 70, -266, 55, 94, -141, 89, 2, 50, 164, -65, 110, 12, -105, -194, 111, 138, 56, -145, -48, -148, 24, -18, 7, 121, 213, 59, 450, 167, 21, -73, -49, -164, -133, 226, 47, 52, -107, 108, 95, -25, 333, -122, 140, -83, -98, 16, 59, 49, -120, 49, 169, 231, 191, 104, -187]
4097a87J07P3j74L33j55p8O8J77k85J84j67L50ok59L0p3P4M2O6k39J0J15J28J
4121A35o2K11m21K8L12l77P9n3Q0RM4J83P4m09L05k81L13k53J77M1k48L48rl12
4145h6K3k5P9J48j81%oKJ92j25n5j78L16n2j88P7J56k9J13k34j56Q8J72q1k27
4170b57J86o5J08N2J01r6k1p4L99k97K7N6j2l04M18l49k13L06j29K80j43K29j23
4193G9j14L08l58J8Q8K58k92J98j81pj7o8K40j46K57n56L10p0j13K59J86l48J24
4216E5N4j51O8Pj92J00J96M5k70K19o2Jk38J35j17P3K99j05k44J6k15N71l17J08
4240C6m7k7n9m4L49O4l59m5L25k79N1j45N01m87Q9l7K93k40j97k4K51J57l70K00
4264d4L4j34K53o4j48K09o9J18m1M8k68q6K05p4M2K41l05Q7nk28OK68Q9J98l94
$$ y = [-187, -80, -7, -181, 152, -3, -81, -13, 164, -121, 63, -104, 246, 240, -19, 11, -62, 12, 54, 120, -119, -109, 6, 134, 135, 73, 284, -137, -109, 203, -174, -95, -148, -68, -59, -15, 168, 242, -167, 138, -143, 170, -83, 94, 135, -113, 235, 226, -86, -63, -88, -9, 139, -42, -42, -48, -46, 146, 21, -34, -212, 104, 52, -136, -59, 97, 68, 181, -53, -209, -121, 51, -30, -257, -71, -136, -28, 24, 125, 29, 8, -66, 333, 36, 63, 119, 107, -197, 221, -128, -341, -35, -164, 116, -27, 202, 79, -35, 273, -85, -67, 21, 279, -13, 185, 4, -3, -20, -88, 152, 6, 263, -293, 17, -53, -166, 93, 279, -69, 55, 109, -42, 26, 33, -159, -59, 137, 182, -88, 131, 69, 70, -168, -33, -150, -77, 222, 117, -127, -111, -326, 245, -72, 36, -11, -38, -97, -141, 208, 272, -87, -132, 193, -86, -35, -180, 321, -166, -77, -114, 179, -61, -258, -282, -31, 126, -244, -44, -10, -144, 109, 45, -103, 106, 37, 155, 114, 162, -106, -192, 13, -61, -19, 222, -83, 4, -1, -229, -223, 45, 134, 332, -62]
4289f2K08J35l36J59l41M48l65K8J69m6k11k6K34J5k21J58J29L54m67l19P60m32
4311b9J8J55j98o9J76M4l19J84M7r6j01P4k5o9R0J8K91k36J69K30l09K91m00J75
4335A11j19n6Q2k11J64Rr2J57j85L24n8j99J11l29K94pj58M56m05k5K83j16nq3
4359e7J61k25J6k9J73j63k1k07L05N9q0L6K17k43R5r8K27l60M57k05m5R5J73n7
4383B24j76K20l10J22p6QJ07j73l3L7r8J3K47j41qJ20m0k76P12k94j50J59n50
4406c56J56L58J21j16r8j24L48l24R9k52r3N00l18J34j42L23l42Q0j34l5K31l7
4428b1j44N2m0K77q5k09M09m03PK06l23K22j40L47K21n14R7K6j17m7J5R2j86J62
4452i6L4P4j29J83N6Q4m39K69n4l8j75J14L64m9k96m2l7J81J12j56J85k69L02
$$ y = [-62, 146, 281, -55, 104, -237, 211, -154, -126, 43, -3, -214, -240, -6, 9, -212, -54, 75, 429, -38, -357, 403, -29, -11, 144, -54, -123, 53, 97, -222, -38, 9, -87, -188, -114, -139, -208, -118, -100, 191, -45, 124, 354, 45, 336, -64, 111, -8, -64, 18, -193, -29, -20, -112, 45, -140, 184, 126, -73, 38, -291, 3, -4, -162, 294, -111, -136, 147, 31, 26, -57, 104, -121, -105, -134, 39, -124, -145, -352, -47, 12, -68, -32, 185, -58, 37, -61, 166, -194, 263, 58, 13, 108, 281, 224, 48, 268, -42, 80, 4, 12, 119, -54, -87, -50, -148, -135, 112, -29, -37, 83, 43, -233, 479, 185, 35, 194, -356, -200, 158, 279, 163, 65, -59, 289, -35, 64, -188, -281, 219, -99, 35, -107, 216, -126, -46, -180, -215, 16, -21, -165, -113, -153, 124, 39, -170, 239, -164, -157, 49, -274, -52, -192, 155, 376, -138, -41, -15, -132, -179, -164, -72, -258, -96, -62, 12, -117, 66, 122, 206, -233, 36, -18, -56, -231, -117, 247, 198, -98, -140, -177, 4, 116, -40, 145, -124, 178]
4475A78k79J42m0o7qQ4n3Q9r2m2N3m7K09j60J16n3j07K76m29Lj2J8J90K21p5l5
4501H0j12KJ94k84j17K16P1K0m9J3M0j48r5L89j48M0j09r4q2L20j97q7K91j28
4525B6j32L47o0m37K19J56m2j79L50j47j99L02j02q3J47l24M11n6o6m5m70L39
4547d5M2j71M08L1l42n5Q9N1k26M52l39K45k2j54rJ46N8j53J04Mk68J70J35k40
4571h9K29l05K49j68l4L1K94P8l46L25k26p3J43j57Q2K7j47j8M78l17k55K45J83
4594B29r9k65P0K05k52Q2L38l29j79L92k40j85J73r4J60k83P6L38J3o7j72mJ35
4617D2j24J60K52n34K40l6j96K60j03OM4l0J20k25q2L10q0k4n2RJ11K41l05L3
4641C7P6j11m3n1J67MK75j27k73J07R9k38l4J40j40J56j54RJ57mk92M04M6j20
$$ y = [178, -101, 41, 1, -66, -74, 10, -43, 46, -46, -88, -35, -82, 127, -33, 83, 30, -77, 199, -230, -227, -239, -221, -31, 190, 115, 80, -32, -30, 164, -120, -237, -21, 50, 70, 21, 34, 74, -74, -169, 220, 72, 112, 3, -91, -173, 147, -50, -137, 154, 26, -106, 241, 181, -256, -37, 119, 77, -102, 248, 101, -98, 204, 102, 19, 166, -158, 253, 197, 131, 86, -384, -45, -3, -174, 234, 265, -77, -132, -43, 8, -218, 234, -105, 140, 118, -36, -45, 101, 159, 6, 110, 114, -154, 16, 151, -89, 140, -165, 84, -84, -118, -87, 207, 285, -61, 264, 38, -35, 108, -49, 33, 60, -87, -105, 373, 56, -199, 46, 229, 130, -135, -65, 140, -112, -30, 308, -21, -200, 192, -48, -233, -60, -154, 6, -277, -201, 137, 150, 83, -89, -93, 42, -82, 78, 330, -204, 36, 0, -196, 64, -39, -33, 11, -19, 101, -124, -206, 104, 24, 0, -52, -43, 68, 309, 4, 37, 113, 2, -41, -92, 75, 79, 354, 227, -46, 61, 160, -78, -112, 28, -112, 44, -110, -101, 56, 52, -240, 164, 210, 90]
4665I0pj36l9j5qK54k04J82m9r7j80L8L44j14j61L29j45o5J42j87Jj78L31j87
4689f1K91k36L42l05J03m00K04K91k23J59k88l1K36j51J66k40J83q7K5J60j67
4710b9m2P1K1k2l5K77o2j24j9j38J58j79L51n4k09J63j18M3J11P9l16J22j32J23
4734D0j23K36j29J74j42j14P4k02q2kJ81j01R8J84m40L29J34L4j29p4j10L20j85
4757b9J09o7J46k44J34k51J87R6j1p1J8P9Qj06k53L65Q2l50P5j1l3J15K83j95
4781G6L0l95K59J02m99Q20l53J99m05L2L51n3l24J71J67p0K5k1K20l27J30k29
4803i4K20r3K63l29J30J53k56m69K50Q1j26K76J22m44L90j40j11j9L34p3m7J41
4825A59l94J34O4J50J3J97l69j10J30j27K68p5j07L4k0J7R4MO5l27J15L15j68
$$ y = [90, 83, -53, -92, -107, -115, 139, -65, 117, 68, -29, -209, -171, 173, 59, -102, 227, 82, 17, 159, -28, -27, -205, 126, -61, 230, -6, 336, 31, 134, -266, -62, 229, 6, 165, -123, -154, 82, -69, 97, -143, 40, -47, -22, 138, -29, -71, 0, 21, -1, -36, 241, 179, 55, 36, -102, 56, -123, 228, 174, -35, 128, 10, 53, 164, 243, -73, 49, -83, 40, -83, 153, 24, 198, 56, -58, 16, -186, -268, -270, -89, -190, -92, 92, -348, -19, 115, 149, 20, -54, -164, 156, -29, 80, 13, 159, -85, 49, -202, -15, 81, 70, -1, 17, 96, 104, -2, -255, 110, 192, -158, -83, -94, -127, -12, 271, 76, 106, -289, -30, 72, -427, 393, 40, 239, -166, -134, 217, 164, -160, 11, 178, 108, 133, 112, 332, 5, 135, -94, 126, 33, 296, -33, 97, 250, -6, -475, -225, -144, -270, 6, 128, -316, 74, -66, -177, -196, 138, 65, 18, 159, -235, -101, -37, 113, 126, 323, -46, -156, -26, -153, 115, 40, -67, -33, -53, -36, 58, 62, 127, -200, -85, 230, 62]
4848F2j17r6L48k09K27j19J65ml97o1J43m83L48K24k11J51K4J00R0j56J26p5o
4871G4j03j55J30QK8o0m7K23R8k52j04Q8J8j35L18j11P9k52K88j48J6rq2M25l28
4896GJ49k68JK56m16J61Pk01L68j74j46K28P8J00kj07j13K92j39o1K2K35j80r5
4920BN2j58K65K5j69k96M11K1nj17J23J1j70K16o7j86q1J64j45L43j78k85O0N1
4944a13J46J6m9j06M26l87k78M26j97K11J30j24k23K83O5l9k96J28l6N1l7j21
4966a24J72p6L55k17j33KK07l00J41L35l57j94P4P5kL6L57n76N00j61l41J74j08
4989a61K51j14n4R7n6J15q7j85J03l8J06J40l26M85m69J87J07r4J57j47L0j09
5011f2O9j34J10o7J50J19j29Q7m64M28M4l92L31j9J70o0k21r8K42l50M54j72j54
$$ y = [62, -55, -151, 197, -12, 215, 96, 261, 257, -140, -201, -58, -541, -193, 31, -180, -29, -5, 95, 185, 29, 155, 80, 74, -29, -184, -54, -46, -18, -78, -125, 98, 196, -56, -160, -72, -54, -189, 129, 18, 97, -155, 133, -15, 1, -8, -90, 335, 7, 156, -112, -111, 145, -271, -110, -103, -304, 64, -110, -256, -28, 50, 150, 148, 41, -72, 220, 81, 20, 42, 277, 97, 2, 54, -104, 161, 186, 17, -279, 132, 153, 148, 31, 154, 165, -5, 211, 144, -42, -123, 41, -104, 239, 61, -224, -164, -113, 33, 49, 0, -106, 320, -67, -345, 81, -116, 95, 225, 101, -122, 161, 226, 187, -109, 19, -17, 34, -3, -124, 48, -28, 327, 110, -23, -21, 186, -114, 27, 362, 5, -189, -115, -40, -42, -6, 351, -225, 275, 114, -227, -53, -161, 90, -24, -78, 19, -37, 78, -9, -194, -91, -129, -23, 117, -209, 276, -193, -6, 101, 7, 164, 17, 47, -62, 7, -127, -17, -84, 66, 185, 56, 143, -321, 107, 151, -241, 90, 71, 241, 181, -40, -138, 104, -246, 208, 36, -118]
5034a18P6l0j35K3J70J15L5j58o6J10P1p9j97L65L5l56O4J4K80j86j45P8q8Q3
5058c9Q8j09K94o3k09j79k9M51j65k46J47j4P2K04m83J52Q0j50J83L4N5Q7j98
5081c7P2k2j38J01K71k16r7%J91l40K9J29r3mm3N7O2N7L16n05K06o7J41o8j51
5106a49L06j34pM4M3k11O1j59J95j7n5P5J67p0l59L89k60K20pj66k82N65j26l09
5130b46N98k61m4N3K18m22J42Rm4K53m18P3R4m8j08J26J63j27j53K29j68J31n0
5153@q2K6K55j49N3j48P6M6j21l17L76N3K27m27k6L98o8l64J94j59K63M7k71J24
5177Fm7Q7k0J06r6K54l71OO3PO4J19MJ06j97m3k49o6J63L84n09RK61J82l10J97
5203A10p2R4l43J89K70l83rR1Q9j84J87j66R7M5J2j0m9j2J33n8l54L71k8P0m4
$$ y = [-118, -42, -72, -207, -184, -14, 101, 136, -22, -88, 22, 93, 14, -183, 182, 217, -139, -75, -61, 219, 33, -112, -34, -122, -39, 49, -60, 234, 171, -38, -217, -246, 205, 40, -206, -59, -73, -1, 203, -280, -128, -48, -198, -15, 19, 74, 161, -37, 35, 13, -125, -24, 247, 31, -66, -66, 125, -215, -186, -57, -150, -154, -197, -140, -78, -21, 295, -210, -4, -71, 70, 2, -149, 157, 23, 16, 60, 103, -108, -47, -206, -11, -28, -83, -8, 159, 89, -270, 119, -141, 79, 72, -94, -376, 189, 63, -246, 352, 91, 47, 100, 318, -104, 38, 47, 3, 256, -162, -89, 5, -43, -151, -25, 138, 11, -142, 87, -81, 50, 0, -82, -56, 199, 50, 103, -45, 31, 77, -44, -361, 15, 68, 295, -132, -158, 240, 172, -192, 2, -157, 106, 153, -118, 6, -41, 46, 26, 132, 36, 290, -81, -75, -12, -5, 59, 178, 182, 288, 91, 48, -201, -267, -104, 280, -229, -220, 41, 223, -87, 110, 38, 132, -211, -22, 248, -135, -144, -53, 36, -148, 39, -127, -30, 15, 27, 17, -32, -44, 89, 31, -323, 48, 20, 90, 46]
5228D6M6N6l38J1R0LJ7P9j11J10j33K94m6m9j27J60N2j11j01L0J30K33j66l26
5252a51n0K59J16l95k4L44k33L27l76J04j98J26N57p22K17JJ08M8j02L11j48O5
5274A84J0Mp6j27o1l5J42L8J13j94p1l03K81mK13j90K9O8L5K20Jm77J94K22n20
5299c04L50j62J04m4J64k36K39m37K91Q2K50l59J91L9j73N5q0r7K48q2M3j17J78
5322A43K7j00l65Q3P7J12n5nk28OJ98Q9l07N04L2J12k05j57K2j5Nk9K53j78j42
5347a23k13L08J73j40p9R4k18K27j21J58j35jJ9L74m30k7K8o2P0K54o7k18J68
5370C9j18Lj42M97k44k2k50j11K71J30j35J18K8k87K96K7j92M0J25Q9k82m0k22
5393c82M56k55j1m3L87p8J16j17M0j5j31r2r9K50k40m7K44j0j36K14k74K78K9
$$ y = [46, 92, 148, -190, -179, -89, -86, -69, 10, -101, 9, -124, 170, 124, 75, -52, 108, 160, 49, -52, -22, 108, 341, 175, -151, -201, 58, 174, -221, -245, 99, -134, 193, -183, -79, -277, -151, 406, -316, -99, -98, 10, 58, -44, 267, 119, 184, 194, 198, 122, -5, -66, -101, 41, 79, 192, -2, -73, -376, -95, -99, 114, -76, -47, 21, 56, 276, 277, -200, -6, 216, -304, 46, -116, -12, -56, 108, -128, 111, -326, -35, 47, 297, -62, 129, 168, -5, 50, -30, -127, 121, 39, 82, -35, 143, 170, 70, -295, -212, -135, -23, -78, -83, -311, -305, -107, -18, -325, 179, 211, 323, 118, -39, -17, -32, -27, -56, 197, 19, -123, -336, -28, 145, 5, -74, 20, -198, 29, -92, 66, -69, -70, -51, 323, -107, -134, -106, -168, -98, 156, 89, -129, 39, -79, -76, -218, 279, 35, 13, -237, -348, -77, 53, -82, 36, 64, -223, 73, 100, -92, -52, 73, 162, -120, -160, -382, 74, -181, -192, -235, 152, 74, 190, 73, 113, 98, -33, -125, -224, 26, -214, -261, -17, -27, -163, 51, -223, 55, 84]
5416H4l11K36J74k99N6J37J55j86K5k12L70n8J7Qk28P4r5J27o0p2l54J83L08K4
5440A03K2J42k45K61k78J84k44L42k72k46M27k00K1n9R7q3j20QL98k33k06L35
5462A54l48j2L51k96J43J10l9l7K1K09L7m32J42M2kJ2O7j97K29r5k43Q5L43l28
5486h4J42O9j31N0l16K95j5J96k16J11J41n16L92r5j78K8L3J86k98L54k57M1J93
5509A25L0m96L69j5r1J61j5J22l05J71J79k82r3J70P3k09J94l7Q4M1j61k68J88
5532f5J56Pk26M08Q9n09j34K86K7K6q6J39j21j77R9J28j80k08L98k66J83lP0P5
5556A16p8l14K81K26o5m4j14O6LJ71l05J19M0M0k97L09j67P6L6n7j62o3J56m4
5580g1Q1J42j49P0p9R2k9k67K47k30Q1o4K27k30L13j65k35K83j06Q8J48J19j58
$$ y = [84, -227, 9, 183, -116, -60, 77, 232, 46, 71, -141, 229, 171, 188, 196, -32, 42, -53, 74, 14, -58, -412, -229, 79, 103, 125, 267, 22, 283, 5, 189, -55, 287, 15, -231, 196, -4, 17, -42, 55, -28, -148, -140, 258, 25, -181, 154, -194, -206, 145, -151, -8, 102, 63, 26, 47, 256, 293, -139, 3, 45, 43, 55, 122, -75, 154, 59, -184, -99, 244, -84, 58, 127, -4, 46, -270, 25, 10, 206, -10, 101, 242, -274, 118, 23, -155, -127, -94, 92, -206, 148, -109, -68, 125, 155, -341, 28, 13, -78, 83, 68, 190, -115, 56, 235, -47, -140, 30, 103, -106, 88, 51, 135, 176, 15, -253, -65, 91, 98, -128, 280, 369, -140, -274, 12, 39, 65, -21, 118, -3, -180, -81, 47, -133, -341, 57, -209, -26, -29, 41, 116, 38, -276, 5, 231, 166, 122, 8, 74, 77, 248, -57, 62, 102, 142, -155, 154, -13, 63, 99, 42, -120, -183, -27, -71, 10, 152, 3, 73, -6, 86, 57, -210, 37, -193, -112, -176, 51, -179, 134, -31, -266, 17, -89, -1, 147, 266, 108]
5603A08j11j46J43J06R9j57M6J09k12J01Q9j4j83r4j29K98j24j32K15p8J42j00
5625b4Q3j31M9J55r8k32L64j23j63q3nK83o1o6J57j75%%nnK72K39o59R7j07K85
$$ y = [108, -3, -149, -6, 100, 199, 42, 88, 197, -15, 86, 175, 161, -22, -116, -245, 53, -71, -203, 12, -66, 76, -24, 59, -72, -23, 132, 34, -198, 166, 43, -120, -203, -208, 75, 14, -52, 105, -70, -70, -70, -75, -80, 192, 431, -228, -131, -238, 47]
$$ [...]
8191h7
##END NTUPLES=NMR FID
##END=
