##TITLE=1H_ART-AcOHH2SO4-Cratals
 200.13MHz, CDCl3,
 8 sc
 
 17.1.2025
##JCAMPDX= 6.0         $$ Bruker NMR JCAMP-DX V2.0
##DATA TYPE= NMR FID
##DATA CLASS= NTUPLES
##ORIGIN= UXNMR, Bruker Analytische Messtechnik GmbH
##OWNER= pz
$$ XWIN-NMR		Version 3.5
$$ Fri Jan 17 14:21:56 2025 Russian Standard Time (UT+4h)  she@DPX200
##.OBSERVE FREQUENCY= 200.1313
##.OBSERVE NUCLEUS= ^1H
##.DELAY= (6, 6)
##.ACQUISITION MODE= SIMULTANEOUS
##.ACQUISITION SCHEME= undefined
##.AVERAGES= 8
##.DIGITISER RES= 18
##SPECTROMETER/DATA SYSTEM= spect
##.PULSE SEQUENCE= zg30
##.SOLVENT NAME= DMSO
##.SHIFT REFERENCE= (INTERNAL, DMSO, 0, 14.3821)
##AUDIT TRAIL= $$ (NUMBER, WHEN, WHO, WHERE, WHAT)
$$ ##TITLE= Audit trail, XWIN-NMR		Version 3.5
$$ ##JCAMPDX= 5.01
$$ ##ORIGIN= Bruker BioSpin GmbH
$$ ##OWNER= she
$$ F:/spectra/data/she/nmr/H-C/1/audita.txt
$$ ##AUDIT TRAIL=  $$ (NUMBER, WHEN, WHO, WHERE, WHAT)
(   1,<2025-01-17 14:21:01.48 +0400>,<she>,<DPX200>,
      <created by zg, POWCHK disabled, PULCHK disabled
       configuration hash MD5:
       00 E9 B6 7A A2 85 ED C7 34 08 36 98 17 FE 4E 26
       data hash MD5: 16K
       84 AD 58 97 4F E7 B9 EA B6 B2 F6 30 B5 AD 62 49>)
$$ ##END=
$$ 
$$ hash MD5
$$ 0D 24 DE ED 2A 72 BC D2 3F 8E 26 E0 AF BF 38 A1
##$RELAX= 
##$RELAX= 
##$RELAX= 
##$RELAX= 
##$RELAX= 
##$RELAX= 
$$ Bruker specific parameters
$$ --------------------------
##$DU= <F:/spectra>
##$EXPNO= 1
##$NAME= <H-C>
##$PROCNO= 1
##$TYPE= <nmr>
##$USER= <she>
##$AMP= (0..31)
100 100 100 100 100 100 100 100 100 100 100 100 100 100 100 100 100 100 
100 100 100 100 100 100 100 100 100 100 100 100 100 100 
##$AQSEQ= 0
##$AQ_mod= 1
##$AUNM= <au_zg>
##$AUTOPOS= <>
##$BF1= 200.13
##$BF2= 200.13
##$BF3= 200.13
##$BF4= 200.13
##$BF5= 200.13
##$BF6= 200.13
##$BF7= 200.13
##$BF8= 200.13
##$BYTORDA= 1
##$CFDGTYP= 0
##$CFRGTYP= 5
##$CHEMSTR= <none>
##$CNST= (0..31)
1 1 145 1 1 1 1 1 1 1 1 1 1 1 1 1 1 1 1 1 1 1 1 1 1 1 1 1 1 1 1 1 
##$CPDPRG= <>
##$CPDPRG1= <>
##$CPDPRG2= <>
##$CPDPRG3= <>
##$CPDPRG4= <mlev>
##$CPDPRG5= <mlev>
##$CPDPRG6= <mlev>
##$CPDPRG7= <mlev>
##$CPDPRG8= <mlev>
##$CPDPRGB= <>
##$CPDPRGT= <>
##$D= (0..31)
0 0.7 0 0 0 0 0 0 0 0 0 0.03 0 0 0 0 0 0 0 0 0 0 0 0 0 0 0 0 0 0 0 0 
##$DATE= 1737109260
##$DBL= (0..7)
120 120 120 120 120 120 120 120 
##$DBP= (0..7)
150 150 150 150 150 150 150 150 
##$DBP07= 0
##$DBPNAM0= <>
##$DBPNAM1= <>
##$DBPNAM2= <>
##$DBPNAM3= <>
##$DBPNAM4= <>
##$DBPNAM5= <>
##$DBPNAM6= <>
##$DBPNAM7= <>
##$DBPOAL= (0..7)
0.5 0.5 0.5 0.5 0.5 0.5 0.5 0.5 
##$DBPOFFS= (0..7)
0 0 0 0 0 0 0 0 
##$DE= 6
##$DECBNUC= <off>
##$DECIM= 32
##$DECNUC= <off>
##$DECSTAT= 4
##$DIGMOD= 1
##$DIGTYP= 9
##$DL= (0..7)
0 120 120 120 120 120 120 120 
##$DP= (0..7)
150 150 150 150 150 150 150 150 
##$DP07= 0
##$DPNAME0= <>
##$DPNAME1= <>
##$DPNAME2= <>
##$DPNAME3= <>
##$DPNAME4= <>
##$DPNAME5= <>
##$DPNAME6= <>
##$DPNAME7= <>
##$DPOAL= (0..7)
0.5 0.5 0.5 0.5 0.5 0.5 0.5 0.5 
##$DPOFFS= (0..7)
0 0 0 0 0 0 0 0 
##$DQDMODE= 0
##$DR= 18
##$DS= 0
$$ [...]
##$SUBNAM0= <"">
##$SUBNAM1= <"">
##$SUBNAM2= <"">
##$SUBNAM3= <"">
##$SUBNAM4= <"">
##$SUBNAM5= <"">
##$SUBNAM6= <"">
##$SUBNAM7= <"">
##$SUBNAM8= <"">
##$SUBNAM9= <"">
##$SW= 18.0517328524113
##$SWIBOX= (0..15)
0 0 2 0 0 0 0 0 0 0 0 0 0 0 0 0 
##$SW_h= 3612.71676300578
##$TD= 16384
##$TD0= 1
##$TE= 0
##$TE2= 300
##$TE3= 300
##$TEG= 300
##$TL= (0..7)
0 120 120 120 120 120 120 120 
##$TP= (0..7)
150 150 150 150 150 150 150 150 
##$TP07= 0
##$TPNAME0= <>
##$TPNAME1= <>
##$TPNAME2= <>
##$TPNAME3= <>
##$TPNAME4= <>
##$TPNAME5= <>
##$TPNAME6= <>
##$TPNAME7= <>
##$TPOAL= (0..7)
0.5 0.5 0.5 0.5 0.5 0.5 0.5 0.5 
##$TPOFFS= (0..7)
0 0 0 0 0 0 0 0 
##$TUNHIN= 0
##$TUNHOUT= 0
##$TUNXOUT= 0
##$USERA1= <user>
##$USERA2= <user>
##$USERA3= <user>
##$USERA4= <user>
##$USERA5= <user>
##$V9= 5
##$VALIST= <valist>
##$VCLIST= <CCCCCCCCCCCCCCC>
##$VD= 0
##$VDLIST= <DDDDDDDDDDDDDDD>
##$VPLIST= <PPPPPPPPPPPPPPP>
##$VTLIST= <TTTTTTTTTTTTTTT>
##$WBST= 1024
##$WBSW= 4
##$XGAIN= (0..3)
0 0 0 0 
##$XL= 0
##$YL= 0
##$YMAX_a= 149462
##$YMIN_a= -151739
##$ZGOPTNS= <>
##$ZL1= 120
##$ZL2= 120
##$ZL3= 120
##$ZL4= 120
##$ABSF1= 10
##$ABSF2= 0
##$ABSG= 5
##$ABSL= 3
##$ALPHA= 0
##$AQORDER= 0
##$ASSFAC= 0
##$ASSFACI= 0
##$ASSFACX= 0
##$ASSWID= 0
##$AUNMP= <proc_1d>
##$AZFE= 0.1
##$AZFW= 0.1
##$BCFW= 1
##$BC_mod= 2
##$BYTORDP= 1
##$COROFFS= 0
##$CY= -3
##$DATMOD= 1
##$DC= 2
##$DFILT= <>
##$DTYPP= 0
##$F1P= 0
##$F2P= 0
##$FCOR= 0.5
##$FTSIZE= 0
##$FT_mod= 4
##$GAMMA= 1
##$GB= 0.15
##$INTBC= 1
##$INTSCL= 1
##$ISEN= 128
##$LB= 0.25
##$LEV0= 0
##$LPBIN= 0
##$MAXI= 10000
##$MC2= 0
##$MEAN= 0
##$ME_mod= 0
##$MI= 1.114404
##$NCOEF= 0
##$NC_proc= 0
##$NLEV= 6
##$NOISF1= 3.799351
##$NOISF2= 2.8
##$NSP= 1
##$NTH_PI= 0
##$NZP= 0
##$OFFSET= 14.38212
##$PC= 1
##$PHC0= 251.9908
##$PHC1= 10.9922
##$PH_mod= 1
##$PKNL= yes
##$PPARMOD= 0
##$PSCAL= 0
##$PSIGN= 0
##$REVERSE= no
##$SF= 200.129724274929
##$SI= 16384
##$SIGF1= 3
##$SIGF2= 2
##$SINO= 400
##$SIOLD= 16384
##$SREGLST= <1H.CDCl3>
##$SSB= 0
##$STSI= 0
##$STSR= 0
##$SW_p= 3205.1282051282
##$SYMM= 0
##$S_DEV= 0
##$TDeff= 0
##$TDoff= 0
##$TI= <>
##$TILT= no
##$TM1= 0
##$TM2= 0
##$TOPLEV= 0
##$USERP1= <user>
##$USERP2= <user>
##$USERP3= <user>
##$USERP4= <user>
##$USERP5= <user>
##$WDW= 1
##$XDIM= 8192
##$YMAX_p= 0
##$YMIN_p= 0
$$ End of Bruker specific parameters
$$ ---------------------------------
##NTUPLES= NMR FID
##VAR_NAME=  TIME,          FID/REAL,        FID/IMAG
##SYMBOL=    X,             R,               I
##VAR_TYPE=  INDEPENDENT,   DEPENDENT,       DEPENDENT
##VAR_FORM=  AFFN,          ASDF,            ASDF
##VAR_DIM=   8192,          8192,            8192
##UNITS=     SECONDS,       ARBITRARY UNITS, ARBITRARY UNITS
##FACTOR=    0.0002768,     1,               1
##FIRST=     0,             0,               0
##LAST=      2.2672688,     0,               0
##MIN=       0,             -151739,         0
##MAX=       2.2672688,     149462,          0
$$ Real data points
##PAGE= N=1
##DATA TABLE= (X++(R..R)), XYDATA
0@%%%%%%%%%%%%%%%%%%%%JpJ4j6J6j6J6j6K1k7K9l1L7m2M4n2N8o1O8p7Q5r5J05
43E4j15J28j41J56j71J87k06K27k49K74l04L36l72M16m70N33o06O99q19R76j190
64f57J501j990K831m540R205m2987j15102J84445R8105j69622m1751J29002l963
77D4477p2303K9442J5236l6547K4425J8633m4512J884L7347k5449j3691L5868
89A4810j4675l0513M0172J5947m7735J2176M3927l5212k5347N3140M387o0198
101b9121J1629N2785k1936m2037J7727K4687j0757j3603j162N727R048Or025J280
115d752N892K778M408l182j1140O867J4579q330j3482L854N803J740k778j6022
129a3765O64K8397q228l9303K1095M3514l4474l4640M6677K1857m5595j475L6481
$$ plain form
0 0 0 0 0 0 0 0 0 0 0 0 0 0 0 0 0 0 0 0 0 0 1 -6 8 -8 8 -8 8 -8 13 -14 15 -16 21 -21 23 -29 29 -32 36 -41 44 -51 54
43 54 -61 67 -74 82 -89 98 -108 119 -130 144 -160 176 -196 220 -250 283 -323 376 -443 533 -657
64 -657 844 -1146 1685 -2855 6350 -36637 -151739 32706 130811 -38811 -80562 48440 44477
77 44477 -27826 1616 16852 -19695 4730 23363 -21149 -19265 18082 -7367 -21058 14810
89 14810 135 -30378 9794 25741 -21994 -9818 34109 -1103 -26450 26690 31077 -29121
101 -29121 -17492 35293 13357 -28680 -10953 13734 2977 -10626 -11788 -6061 2987 2993 -6032 -4752
115 -4752 1140 3918 8326 5144 -5996 871 15450 7120 -6362 -2508 3295 5035 2257 -13765
129 -13765 -13101 15296 7068 -32235 -11140 32374 -2100 -36740 9937 31794 -13801 -15276 21205
142B1205j3424j5267K0347j0698j7260L0668J045m5087J8371M0190l9325k5046
154c4281N0774M48n0091K6086L9309m2097j6144M8981n800l8242K4646J9952l2225
167h684K074K6275k1794j3537K8252p157k5686K1643R910l0247J0547K7012k7204
180h596j3672L9113j876l6623J9685K7479k8292j0531K9189o420k1496J7143O300
193A1403k3419N286J9731j6250j3570J7938N303j3804J182O652j593L216K486
206D561q314J854J2555l896j1137M285Q192m070o511q82M578J477p572l590J0108
221A638J138j2859K994J3959n013r123Q389L458m735N693L39j1985O974J4893
235A5760j4231j3793J5016O076j3941Q49M568r296N682J3452j5915j1755K3491
$$ plain form
142 21205 7781 -7486 12861 2163 -15097 15571 16616 -28471 -10100 30090 -9235 -34281
154 -34281 16493 16941 -33150 -7064 32245 -9852 -25996 22985 17185 -21057 3589 23541 -8684
167 -8684 -6610 19665 -2129 -15666 12586 5429 -20257 1386 11296 -18951 -8404 18608 -8596
180 -8596 -22268 16845 14969 -21654 -1969 25510 -2782 -13313 15876 9456 -12040 5103 11403
193 11403 -12016 -6730 13001 -3249 -16819 1119 6422 -7382 -6200 452 -1141 2075 4561
206 4561 -3753 -1899 10656 6760 -4377 -92 8100 4030 -2481 -3363 1215 2692 -4880 -8470 1638
221 1638 2776 -10083 -7089 6870 1857 -7266 1123 4581 -154 5539 5878 -6107 867 15760
235 15760 1529 -12264 2752 8828 -5113 -4264 304 -8992 -3310 10142 -5773 -17528 5963
248E963P521k2245K018J6941p980m649J2436p509j1797J7208M580k2836L129J9152
262A1932j3258j3419J8588K757j9923N795J6325j0021o837J1042j122n391J1081
275G549J79j4953N056J5839p813j2937M299O426n30k020p027l896J1564N396j3803
290f671m617J2787L729o640M74Q45j074O532L415j0385k681J0680J139r866j392
305c725N362k07m053j262K092J759l546l004O743N036q373m497J1366N868r366
320A93m588O607M314j569l799n206K206Q522k942j1350R47R346q56o619k3K511
336b306J585K827j507m329M234N656l492m208N377J362o451P25O824m879q949
351g531N632Q235p585q327O703P012o002m137N727K680m116J634M233k652k127
$$ plain form
248 5963 13484 -8761 -6743 10198 2218 -2431 10005 2496 -9301 7907 12487 -10349 -7220 11932
262 11932 -1326 -14745 3843 6600 -13323 -7528 8797 -1224 -8061 2981 1859 -3532 7549
275 7549 7728 -7225 -2169 13670 5857 -7080 -2781 3645 3115 1095 -5932 -9828 1736 7132 -6671
290 -6671 -11288 1499 5228 -1412 -938 -93 -1167 5365 8780 -1605 -4286 6394 7533 -2333 -3725
305 -3725 1637 1430 -2623 -3885 -1793 -34 -3580 -6584 159 5195 -3178 -7675 3691 9559 193
320 193 -4395 2212 6526 4957 1158 -4048 -1842 6680 3738 -7612 -6665 2681 1825 -4794 -4817 -2306
336 -2306 -721 2106 599 -3730 504 6160 2668 -1540 3837 5199 -1252 -527 6297 1418 -7531
351 -7531 -1899 6336 -1249 -9576 -2873 4139 -1863 -6000 -273 2407 -1709 -75 4158 1506 -621
366f21M516O54l985J23J050j766r0J317l425k405L473J724l841q98K705Q94O34
383E9P63j972N35N269k84n886J483N596k218n509K242K138k838j755J783j235
399a829j541K126O45k578P97L416q82r20J950N55o42J805R59l946j55M808j418
416C150o802J871N105m532m223M955M91n647M176M637o700j950J0143n53q639
431d518M799P029o819k219Q227l681q317Q143L854j1840N45R469o874n780J0560
446B578o02j1475P513J0549j0901m971J2951m92q551P244K369j1440N569J1697
460A2038j3093j0057J4934M326j4903Q27Q708o446q16Q936o750p257J3427M286
474H160j4122K043J2781o002p660R577J650j0661L317P663o801m947N716p40m442
$$ plain form
366 -621 3895 4549 564 687 1737 -29 -119 1198 -2227 -4632 -1159 565 -3276 -4174 -1469 -575 59
383 59 822 -1150 -615 4654 4370 -1516 -33 5563 3345 -2164 78 2216 -622 -2377 -594 -1829
399 -1829 -3370 -1244 -599 -3177 -2380 1036 154 -766 1184 1739 1097 2902 3861 -85 -240 4568 3150
416 3150 -3652 -1781 3324 -1208 -5431 -476 15 -5632 -1456 3181 -3519 -5469 4674 4121 -4518
431 -4518 281 7310 491 -1728 6499 2818 -5499 2644 6498 -5342 -4797 4672 -2202 -7982 2578
446 2578 1976 -9499 -1986 8563 -2338 -7309 5642 5150 -3401 3843 6212 -5228 341 12038
460 12038 -1055 -11112 3822 8148 -6755 -5928 2780 -3666 -4482 4454 -2296 -9553 3874 8160
474 8160 -5962 -3919 8862 2860 -4800 4777 6427 -4234 -917 6746 -55 -5002 714 -26 -4468
489d468M615J003p393J575R180k046p378K592O795q14k974k16M26R50K277n96
505C528o326j630P362J976r385l193Q470J342o210J692K928m196K964P215p064
520e27n715J1319L385j2427K730R803q935n461J2000k567j3381Q428Q619j3458
534f187j358J3359o829r389J5187K843j7993O058J7884j2014r946J4985N27j3588
548f461R393O556j6642N52J7799j0488j3799J5156M482j6505N561J3040j3359
561d715n085J8157k348j5970J0225J0730j3241j150J2318p576q049J2053J297
574F646j4442M303R642r116l798R904k605q744Q252N365r326n46Q939j041m923
589a490L338N26k473K557K203n471l147N167K465m871m316L118M354j930m227
$$ plain form
489 -4468 147 1150 -6243 -4668 4512 2466 -4912 -2320 4475 3661 687 471 897 1847 4124 3528
505 3528 -2798 -4428 2934 4910 -4475 -7668 802 2144 -4066 -2374 554 -3642 -678 6537 -527
520 -527 -6242 5077 8462 -3965 -1235 8568 -367 -5828 6172 3605 -9776 -1348 7271 -6187
534 -6187 -7545 5814 -1015 -10404 4783 7626 -10367 -4309 13575 1561 -8385 6600 7127 -6461
548 -6461 2932 9488 -7154 -6602 11197 709 -13090 2066 6548 -9957 -4396 8644 -4715
561 -4715 -9800 8357 6009 -9961 264 10994 -2247 -3397 8921 1345 -6704 5349 6646
574 6646 -7796 -3493 6149 -2967 -6765 3139 534 -8210 42 5407 -3919 -4465 4474 3433 -1490
589 -1490 1848 2374 -99 2458 4661 -810 -3957 1210 3675 -1196 -5512 -2394 1960 30 -4197
604d197J788K687j97P03Q5l371K761O704m981p186P976N142j0234j481Q529m344
620C84o074P601K77r651N337P750j0226k273J3126l991j0023J1235M959j4572
634f141L644J4496j0753r977J4589J560j4945O247R050j4130j228J6324q455j3838
648a3557J4540Q644j6566l13J4818n986o494J0355j267j0395R683O147j4457o8
662d916J3545p318r507J1239J315j3388O133J0737j1028o132J2617J504r897M424
676f72N462o342N65P460m968n789O647L023o332j526K894j124J63P94l340r41
692d026M315P51l093n02K283K172m12k146R80K612j769j727L563n88n079K660
708fL579m926k803N349j464m889N747J750q290J947J0743n405p679P897L905o155
$$ plain form
604 -4197 -2409 278 81 784 869 -2502 259 6963 1982 -5204 2772 7914 -2320 -3801 4728 384
620 384 -5690 1911 2188 -7463 -2126 5624 -4602 -6875 6251 2260 -7763 3472 8431 -6141
634 -6141 -2497 11999 1246 -8731 5858 7418 -7527 -1280 7770 -6360 -7588 8736 281 -13557
648 -13557 983 9627 -6939 -7252 7566 1580 -4914 5441 4174 -6221 3462 9609 -4848 -4916
662 -4916 8629 1311 -8196 3043 4358 -9030 -2897 7840 -3188 -9320 3297 4801 -5096 -672
676 -672 4790 -1552 -987 6473 1505 -4284 2363 5386 -946 -2472 422 -702 -539 255 -3085 -4026
692 -4026 289 1040 -2053 -2555 -272 1900 1488 -658 322 2934 1165 -562 3001 2413 -2666 -6
708 -6 3573 -1353 -4156 1193 -271 -5160 587 2337 -5953 -4006 6737 1332 -6347 1550 5455 -700
724g00J874L029o935K115R085q361q621J1380L812j2911J687R432p075m849J0640
739C602r23j0063O719O895q257m85Q513n249m352R508n76j1382N137Q230q299
754i82m297P692k456n591P064N99q788L815Q541n987m710P341N54m432L830K151
770D344o284J101N860l337m630K649J463j884L12r89k258L012K521m210p90M472
786A352m65j782K072O04j921J014K034j659j028P34j081J029O17l279j167L523
802E97j63l879J789J928k228J346K444k800j051N200m49m655L106K823m082r42
818a016M359k961l346L884Q11m611P62K849k710j18K682j930j153M959n94m875
834c008L266M571m453j973M417l60l649J346J381k909K07J725k363o32K741j312
$$ plain form
724 -700 1174 4203 -2732 -617 8468 107 -8514 2866 6678 -6233 -4546 4886 -2189 -7038 3602
739 3602 2679 -7384 -665 6230 -2027 -2512 6001 752 -3600 5908 5332 -6050 -913 7317 -982
754 -982 -5279 2413 -43 -5634 1430 2029 -6759 -2944 5597 -390 -5100 2241 2795 -1637 2193 4344
770 4344 -1940 -839 5021 1684 -2946 -297 1166 -718 -406 -1395 -3653 -641 1880 -2330 -3120 1352
786 1352 887 -895 1177 1781 -140 874 2908 1249 221 955 -126 903 1520 -1759 -2926 597
802 597 434 -3445 -1656 272 -1956 -610 1834 -966 -2017 3183 2734 -1921 1185 4008 -74 -1016
818 -1016 3343 382 -2964 920 1731 -2880 -2118 731 -1979 -2097 585 -1345 -2498 2461 1867 -3008
834 -3008 258 4829 376 -1597 2820 2460 -1189 157 1538 -1371 -1164 561 -1802 -2434 307 -1005
850a005j670K529R77k473J379K372k190m1K419r59j066J957q83k648K364Q77l794
867a855o13L139j052k187J855M7j094J982L38k313J533L049k158j212K684j59
883A984k819K557Q65l677o5L050j614l093J866O40k218K242J130l638K72M909
899B391o49m074K469K677j864l23J279j790o79L002r73l685J113K250k157j178
915b191J738m64j569K194J545k289p41L138M48j498L00Q50j147Q21J268k172j858
932a627K062J936l101k307K072R27j208M77M9j452J377L034j901k374K631K452
948C047k130o87J665j677o19L094j417m302J359M097k869l159L063P94k735J710
964g66K534l618p3M590j00m094J412L073j962p67J526j692j724L453O2m763kM519
$$ plain form
850 -1005 -2675 -146 831 -1642 -263 2109 -81 -122 2297 1338 272 2229 1346 -1302 1062 1939 -1855
867 -1855 -2468 671 -381 -2568 -713 -666 -1760 222 560 -1753 -220 2829 671 -541 2143 1984
883 1984 -835 1722 2587 -1090 -1155 1895 281 -2812 -946 -306 -2524 -282 848 -2790 -2518 2391
899 2391 1742 -2332 137 2814 950 627 1906 116 -563 2439 1466 -2219 -1106 1144 -1013 -2191
915 -2191 -453 -917 -2486 -292 1253 -1036 -1777 1361 1809 311 611 1461 314 1135 2403 231 -1627
932 -1627 435 2371 -730 -3037 -965 -38 -1246 -769 -720 -2172 -795 2239 338 -2036 595 3047
948 3047 917 230 1895 218 -401 2693 1276 -3026 -1667 2430 -439 -3598 -535 259 -2476 -766
964 -766 1768 -1850 -1923 2667 2567 -1527 -115 2958 996 229 1755 63 -1661 1792 1854 -2909 -2911 1608
982A608j534l076K704O89k060J121L093k873j862M112J676m130N2L306j535k368
998a077K662n40l231J607K598m050j344L931j61l023K014K315l454N55M624k511
1014I15l701M615K504n648L76M841l576l740N041Q79o243J361N017m134k777N483
1030A213k10n193M041L707n390l51O530k097m889M475J829n153O06M776m182l536
1046c824N516R0o285K760M459n045j488N883j009m468L803L336m826k23M372j531
1062A520k669K473J021m085J435K705l496j983L904J30m035R48L698j707k437
1077b578K700J628k689J095K143j835j135K487N12l186L73K438j327k756K105
1092b5Q54l271N89L504k637k508M468J061m187J071M170k656k206M847l96n591
$$ plain form
982 1608 74 -3002 -298 391 -1669 -548 2545 -328 -2190 1922 3598 -532 -480 2826 1291 -1077
998 -1077 1585 1045 -2186 -579 2019 -2031 -3375 556 395 -2628 -614 1701 -1753 -1198 3426 915
1014 915 -2786 1829 4333 -1315 -939 3902 326 -3414 1627 2506 -3737 -2376 2641 -1493 -4270 1213
1030 1213 1003 -4190 -149 3558 -1832 -2183 4347 2250 -2639 1836 3665 -1488 -882 3894 -288 -3824
1046 -3824 1692 1782 -4503 -1743 2716 -2329 -3817 2066 1057 -3411 392 3728 -1098 -1321 3051 1520
1062 1520 -1149 1324 2345 -1740 -305 2400 -1096 -3079 825 955 -3080 -2132 1566 -141 -2578
1077 -2578 122 1750 -939 156 2299 464 -671 1816 2328 -858 -485 1953 626 -2130 -25
1092 -25 829 -2442 -1853 1651 -986 -3494 974 2035 -2152 -1081 3089 433 -1773 3074 2678 -2913
1108b913L383M174o119j891N750j093n247L711K286o047J826O233n045m180P670
1123B498J341p010K124N960m809k045O207k627n560N664K620p425L65O170m340
1138h67l901O406N45o959K780O078m688k866N579k92l483L681J016n195J723M979
1154D536m142l994M732J366n152Q57L046k701j427M047o44l179J544K946j434
1169D01r18J524j49o88J103L39j430n55J161N44k027q75J427L96j226j81M90q52
1187a516R49J988j488k717L299K621l280p93L155q47k140K818l37m867K381M105
1203C331m518k799N093J16n010L138L215n012o16O569j901n184M334L271m930
1218i03M43M039m067k019N927j935o220M861L924o948j071O326k346m210M862
$$ plain form
1108 -2913 470 4644 -1475 -3366 2384 1291 -3956 -245 2041 -4006 -2180 4053 -992 -5172 2498
1123 2498 3839 -3171 -1047 4913 104 -1941 4266 1639 -3921 1743 4363 -3062 -2697 3473 -867
1138 -867 -4768 1638 2183 -4776 -1996 4082 -606 -3472 2107 1815 -1668 2013 3029 -2166 -443 4536
1154 4536 394 -3600 1132 2498 -2654 -1797 1249 -1452 -2879 1168 524 -2655 -1111 1835 401
1169 401 -517 1007 858 170 1273 1612 182 -373 788 1332 -695 -1570 -143 253 -973 -1154 -664 -1516
1187 -1516 -567 1421 -67 -2784 515 3136 -144 -937 2218 1371 -769 2049 1712 -3155 -774 3331
1203 3331 -1187 -3986 1107 1223 -3787 -649 2566 -2446 -3062 3507 1606 -3578 756 4027 -903
1218 -903 -460 3579 -488 -2507 3420 1485 -4735 126 4050 -2898 -3969 2357 11 -4199 663
1233F63J710n204J403N051l766j557M521j363l513L591J584n115Q4M671k579l402
1249c221L333Q64l299J178K128k356O9K725j068j738K705O25k384O25K115j890
1265D11r26J543k7j146o47M87j66k79n01K15J206m83j188J535O61j107M33J597
1283A618j242m15J559l67j633J486M11k319K38J839k228j114L074q10k853K083
1299f73K067k970K47L012j610j023L055q18l186L504J768m670K5L942k244l445
1315c019L294J184l765L18L500k388j323K996o42j733K890K71k720J382K821k807
1331B59j611L125m9k859J196P24k290P54J571k133j128K906l50j581J112Q09j072
1348f17P25J693j861k58K216n60j844J167J48j788O84J520j798j150J908l07j457
$$ plain form
1233 663 2373 -2831 -1428 3623 -143 -1700 2821 1458 -2055 1536 3120 -1995 -1911 2760 181 -3221
1249 -3221 112 976 -2323 -1145 983 -1373 -1304 1421 353 -1385 1320 1945 -439 186 2301 411
1265 411 -515 1028 1001 -145 -792 -305 -471 -750 -1251 -1036 170 -313 -1501 34 695 -412 21 1618
1283 1618 376 -39 1520 1153 -480 1006 1417 -902 -664 1175 -1053 -2167 907 97 -2756 -673
1299 -673 1394 -1576 -1329 1683 73 -950 2105 1287 -1899 1605 3373 -1297 -1272 2670 426 -3019
1315 -3019 275 1459 -2306 -1988 1512 -876 -2199 797 155 -1578 1312 1583 -1137 245 3066 259
1331 259 -1352 1773 1724 -1135 61 785 -1505 -751 820 -1313 -2441 465 115 -1466 -354 455 -617
1348 -617 108 1801 -60 -318 1898 1338 -506 661 809 -979 -295 1225 -573 -1723 185 -122 -1579
1365a579J194K39j308J616J013j732n22K510L70j998Q91j34p78J531N5l017M46
1382a203K682j616k180J854R17j623j2J737j107j33J564Rj066Q87K21j363J540
1399A108L41k142l22K242m54k179K25R43k63j28N88j395M57J544q5j132Q58Q52
1417A058l61K1J05n46O7Q13l08j175K36k38Q8K92p91o88J269L41j253M46Q49n37
1437c12M60Q62p39q31J482P56j662L2J241j459m71J150m27k072J648J202k247
1454a387OJ925r66p92K096k35j908J756J780k273n30K399r35j862J494P58k449
1471a123O6K533k048j720J960R23k239R59J455j649j59K420p46j692J700J306
1487A946k023k94J875o39j780J164Q30k275J57J771j403j025J398J098k024O48
$$ plain form
1365 -1579 -385 -146 -1454 162 1175 -557 -1079 1431 1801 -197 694 560 -218 1313 1368 -1649 -1203
1382 -1203 1479 -137 -2317 -463 454 -1169 -1181 556 -551 -684 880 889 -177 710 931 -432 1108
1399 1108 1449 -693 -1015 1227 773 -1406 -1181 -238 -501 -629 -41 -1436 -979 565 480 -652 206 1058
1417 1058 697 718 823 277 344 1157 849 -326 -90 -328 -240 52 -739 -1427 -158 183 -1070 -624 225 -312
1437 -312 148 1010 271 -560 922 1678 16 48 1289 -170 -641 509 82 -1990 -342 860 -1387
1454 -1387 -1381 544 -422 -1214 882 647 -1261 495 2275 2 -528 1871 936 -926 568 1326 -1123
1471 -1123 -1057 1476 -572 -2292 -332 591 -1648 -689 766 -883 -1042 1378 632 -1060 640 1946
1487 1946 -77 -371 1504 865 -915 249 1079 -1196 -1039 732 -671 -1696 -298 800 -1224 -576
1503e76J330m79p76J517r5j321O55J284j142q36J360Rj865K55J366j699m09J532
1521A10j79j765J421J708j523q99K303n69j542J778J094k399k68K585q62k225
1537a232J234R10j682k78J151r55o56K068l77k414J972K020j955j313K934J67
1553A594j949Q52J142j893n15K381r89k450J583J473k078m90J671o02j201J431
1569d0R72k162O48K206r41j029J424M52k147P85J672j973j403K242L71k727L02
1586a348K270j527j126K267l70j976J828J549j843n62K674k44k661J701J122k499
1602g45K29K184j601k043K349K20k577Q91K208k269q27L058j71k848J945K125
1618B128k410o60K861j086j927J985Q09l082M43K673j681k177K248K92k185J240
$$ plain form
1503 -576 754 275 -501 1016 921 -400 255 1539 397 -439 921 930 -935 -680 686 -1013 -1422 110
1521 110 -69 -1834 -413 1295 -228 -1127 1176 607 -935 843 1937 -462 -730 1855 993 -1232
1537 -1232 2 912 -770 -1048 103 -852 -1508 560 183 -2231 -259 1761 -194 -1507 1427 1594
1553 1594 -355 497 1639 -254 -769 1612 623 -1827 -244 1229 -849 -1339 332 -270 -1471 -40
1569 -40 932 -1230 -582 1624 683 -346 1078 1530 -617 168 1840 -133 -1536 706 1077 -1650 -1348
1586 -1348 922 -605 -1731 536 166 -1810 18 1567 -276 -838 1836 1592 -1069 632 1754 -745
1602 -745 -516 1668 67 -1976 373 593 -1984 -1093 1115 -1154 -1981 1077 906 -1942 3 2128
1618 2128 -282 -942 1919 833 -1094 891 1700 -1382 -939 1734 53 -2124 124 416 -1769 -529
1634e29J543k293k35K718J95k450R97J495j336m25J642o81j461J278P19k071j54
1651a048J533k64j530P46M16n75L06J073q32j128J767R17j362m78J522k15j051
1668b03Q79K98j424R5J316q03j563J193Q03j944L07J907j160j221K118P39k554
1685a217O22K471j417j030J867m3k290J237J233k414n26L039j461k498K243J357
1701A173k731M23K404j641j087K698N3k474J385J926k081r15K597j270k317K448
1717E91P81k898K47K330j594j451K204L73j743Q82J475j815j10K240q69j402J661
1734I02M38j533L7J099j002r78J455k56r51K50M60m39q4N29K6l49K83P05l96j73
1754B3O05K01o49k03L47M22q63o5J53J92o52K55j88l84L45J020j104n31J656K69
$$ plain form
1634 -529 1014 -1279 -1514 1204 1399 -1051 -54 1441 105 -320 1322 641 -820 458 1177 -894 -1048
1651 -1048 485 221 -1309 -563 -147 -722 -416 657 -175 -1303 464 1381 19 -459 1063 848 -203
1668 -203 676 974 -450 -355 961 158 -1405 -212 591 -1353 -1046 861 -299 -1520 598 1337 -1217
1685 -1217 -595 1876 459 -571 1296 1253 -1037 200 1433 -981 -1507 1532 71 -2427 -184 1173
1701 1173 -1558 -1135 1269 -372 -1459 1239 1292 -1182 203 2129 48 -867 1730 460 -1857 591
1717 591 1372 -1526 -1279 1051 -543 -1994 210 583 -1160 -278 1197 -618 -728 1512 643 -759 902
1734 902 1340 -193 -156 943 -59 -1037 418 162 -789 -539 -79 -518 -602 -73 -47 -396 -113 592 196 23
1754 23 628 829 180 -23 324 746 -117 -182 -29 163 -489 -234 -422 -806 -461 559 -545 -1076 580 849
1774H49j311P01Q93j087k93J409o50j502J594J71j870J29J572j181p27J580M3
1791C20j749J034J542j648j74J757p66q55J469K56j996Q69J566j805q60J905m37
1808D28j593J103M39j743L93K190j524j364J970P64j776J031N84j099N29P62r41
1825A53r36J583J86j419J73O65r47j96P44l28o03M54J011j082L74N48p68M76J086
1844A174o33m15N35P9o94K16m8n59M24Np80J16M56l85j27M92k30m20J197L17q74
1865a54n7J088l51o80Q54l63n56O16j7j014L0R30o93n96J288k39r52P15N03n32
1885a80j06J198n20q43J449m51o51M28O76j328k00P09k04q61P50J57p57K93L69
1904g2q72M49J056l31n03P44Kn90O92J5m72k42P39m88m32P18n65l50M24O8j016
$$ plain form
1774 849 -462 239 1132 45 -248 1161 511 -991 603 774 -1096 -967 605 -576 -1303 277 320
1791 320 -1429 -395 1147 -501 -675 1082 316 -539 930 1186 -810 59 1625 -180 -1040 865 428
1808 428 -1165 -62 377 -1366 -973 1217 -307 -1671 299 1063 -713 318 902 -197 332 1094 153
1825 153 -783 800 986 -433 -260 405 -542 -738 6 -322 -925 -471 540 -542 -168 380 -388 88 1174
1844 1174 541 126 661 740 46 262 214 -345 79 84 -696 -580 -124 -509 -636 -144 -374 -794 403 720 -154
1865 -154 -211 877 526 -154 700 337 -219 397 380 -634 -604 326 -367 -963 325 86 -866 -151 352 -180
1885 -180 -286 912 392 -451 998 547 -104 324 1000 -328 -528 181 -23 -884 -134 23 -734 -441 -72
1904 -72 -944 -495 561 230 -273 471 473 -117 575 590 118 -124 615 127 -305 413 -152 -502 -78 -10 -1026
1925a026N27P03p13m1Q40J4n63O07O05j016K57O51m28q45R05O3j326N80L59j132
1945i79K91J049o94n64J057m7r18J178L92j133L37J347j239n49J203N4j164N27
1963A48M87r44k63J087m59r18M32P46o81p7L51R7l80O59K69n98L11N74j042J90
1983a1N58m23o96L23M34l55j05o6M8l22N41P2j25k9L42j5j03j23P72j14o59K41
2005A85K02k14q82R81l27j74L6L4j75j08N88n93j63R30K08j053K12J174p31j21
2025IO34l59o31R61j88q43o2R57o71j096R88N12r56J26J265r19m45J195M5j186
2045f64P86R03r56m17P80J61j448J244L94j301j65J102o53m17P39j69p39O39J015
2064H34q74m57J068J84j125L61P58p59r6Q34o32j006J171K99j079k75Q51m05l65
$$ plain form
1925 -1026 -499 204 -509 -550 290 304 -259 348 953 -63 194 845 417 -428 477 540 -786 -206 153 -979
1945 -979 -688 361 -333 -897 160 113 -805 373 765 -368 -31 1316 77 -472 731 785 -379 148
1963 148 635 -309 -572 515 56 -862 -430 316 -365 -442 -91 6 -374 285 554 -44 267 841 -201 -11
1983 -11 547 124 -572 -249 185 -170 -275 -341 -293 -615 -74 -2 -127 -156 186 171 68 -55 717 603 -56 185
2005 185 387 173 -709 272 -55 -229 -193 -159 -334 -442 146 -447 -610 320 528 -525 -313 861 130 9
2025 9 643 284 -347 614 426 -417 -479 478 -193 -1289 -301 211 -745 -619 646 -273 -718 477 522 -664
2045 -664 122 1025 69 -348 432 593 -855 389 783 -518 -683 419 -234 -651 88 -81 -820 -181 834
2064 834 -40 -497 571 755 -370 -9 749 -10 -106 728 96 -910 261 560 -519 -794 57 -348 -713
2083g13Q99O6p30L77Q83m06q33J014L94r61j67R10o77o78R63K17r41N5O74n64
2103b18n54J035k06o87Q22J52n91j72J140j35r79O08P14q50j72O50n21n85O23
2122G4M52j142L7Q22k78o36N09M34j051O12O01p09k4J020l44o36M55P28q73m91
2142d40Q29l58r54P71L96p77k92J111n93o72J040L44l02k72P48k52m48N54K93
2161G26j066J35O39n54l19O54q6p88N3J097o72p33J113j53p43P87P45j088J38
2180a15P73j85o50N35N17j231q6J057n28j044J069J92j301O63R59j000l75J036
2198B86N9j182J269M22p75m45J158m49o26P43J45r70lN25j47q62Q35j86o26O97
2218a32M26k97m95J000j80l22J13L02m66j03K96N29q87L61L04n19n31P72l63o79
$$ plain form
2083 -713 186 252 -478 -101 782 376 -457 557 951 -10 -177 733 56 -622 341 558 -383 -328 346 -218
2103 -218 -772 263 57 -630 192 344 -247 -419 721 586 -393 215 929 79 -93 557 36 -549 74
2122 74 526 -616 -579 243 -35 -671 -162 272 -779 -167 434 -275 -299 721 377 -259 196 924 51 -440
2142 -440 389 31 -923 -152 244 -533 -825 286 -307 -979 61 405 103 -169 579 327 -121 433 726
2161 726 -340 -205 434 -120 -439 215 129 -659 -606 491 -181 -914 199 46 -697 90 835 -253 -115
2180 -115 658 473 -177 358 875 -356 -442 615 87 -957 112 304 -997 -334 625 -375 -750 286
2198 286 345 -837 432 854 79 -366 792 343 -283 460 605 -365 -368 157 10 -852 -17 -203 -829 -132
2218 -132 294 -3 -498 502 322 0 113 415 -51 -154 142 671 -216 145 449 -70 -601 171 -192 -871
2238h71R58K18o91j11Q05p1k42J12L73n10L65Q8k17n04M96L97r25N3P99m84m30
2259c92R4L43n73LP73k75m83R39p2q85O26P96q74k98Q24nr88P6P73o36l64R13
2281C15n38o23R88R3r77K79J304q20k69N77P9m99K56L37p24k12J048k50j042P27
2301D9J36r42L98K27n8l11L15K93m06K54O62m80J37O4n1m02N27Q0n99K87q5k91
2323a96k16O2l1M0J52J76k43pL33M3j82R9K64L1j74qL5o7k52J79Kl25K08R9n7
2348c5k18J91J0k90K22pj14n0L07L81l61K71J92n74k12P22k07l77J38L25n79K8
2370b37L69k91j19J69K1j98J99M13o22P1N54j05l97N01K96r14L47K21l21r4L03
2391A66l85Q6L0P2k32K19J75m94J05N13k27r0N20j83k97L36J60m99o8K88j00k48
$$ plain form
2238 -871 87 305 -386 -497 308 237 -5 107 480 -30 335 423 206 -298 198 595 -330 -277 522 38 -392
2259 -392 -298 45 -528 -525 248 -27 -510 429 357 -528 98 894 20 -278 546 541 -447 -371 402 -234 -598 315
2281 315 -223 -846 142 235 -742 -463 841 21 -248 329 408 -91 165 502 -222 -434 614 364 -678 49
2301 49 185 -757 -359 -132 -190 -501 -186 107 -299 -45 617 137 274 338 287 -115 412 492 -107 180 95 -196
2323 -196 -412 -350 -381 -341 -189 -13 -256 -263 70 113 -69 30 294 325 151 143 178 111 -141 38 40 -285 -77 22 -35
2348 -35 -253 -62 -52 -342 -120 -127 -241 -291 16 397 36 307 499 -75 -287 435 228 -149 -11 314 -265 -237
2370 -237 132 -159 -278 -109 -88 -286 -87 326 -296 -225 329 224 -173 328 624 -290 57 278 -43 -137 166
2391 166 -219 -133 -103 -31 -263 -44 131 -363 -258 255 28 -62 458 275 -22 314 474 -25 -93 195 95 -153
2413a53j2K5j61K18J70k30l3N5L95n78M56L93o23J15N63n99K78K65m14j93M9p8
2435i2j97R7K08j75k55M63j73M1K17j4l18L12K66j24m81N26j0n24L27K19n22K58
2457D9K55m97J80j49J15m28K75J34j25l0N85l46M4L62l2k60O2K5j0k47L65l53
2479b6k71M81j63K6m06K6J84J97k87J06K39J07m4j6M8l55J18N03n16M6L28o7m03
2502a45n1L62m38n6L48j30m08N21L22o25M44K15j31n92N83o8l41M92J23p58O2
2523b71L55n4o95O42P7o82O14K14o21J07O80j48o01L41N24n69M1K64k76n99J003
2544C46k66l30K18k3n7l71O57l63k0m1K53m45J83K58J28l98K79L45j56l74L75
2565A98j68j39N0K05j49j59K05r9l12L84J7j55K35K00k95l22O56Kk49k69O17q4
$$ plain form
2413 -153 -165 -140 -301 -83 87 -143 -176 -121 274 -304 152 545 -78 37 600 1 279 544 130 -63 -14 -92
2435 -92 -289 -192 16 -159 -414 49 -124 -83 134 120 -198 114 380 256 -225 301 291 -233 94 313 -209 49
2457 49 304 -193 -13 -162 -47 -475 -200 -66 -191 -221 364 18 62 424 392 132 194 219 209 -38 327 -26
2479 -26 -297 184 21 47 -359 -333 -149 48 -239 -133 106 213 169 153 201 -154 -36 467 -49 -3 325 258 -145
2502 -145 -196 166 -272 -328 20 -110 -518 3 325 -300 144 359 228 -364 219 151 -190 302 425 -333 -271
2523 -271 84 30 -665 -23 54 -628 -14 200 -421 -314 366 218 -383 -42 482 -87 -46 218 -58 -657 346
2544 346 80 -250 -32 -55 -112 -483 174 -189 -209 -250 3 -442 -259 -1 127 -271 8 353 197 -177 198
2565 198 30 -109 -59 146 -3 -162 43 -56 -368 16 33 -122 113 313 18 -304 352 354 105 -164 453 369
2587C69j91j82K45j95n31N96j67l49K39J91m34R4N35k48k37Q37l74m57M89N30
2607G60n72j78N44j33l95K3J44q32L57N58n41o90J092k26j95K92M41o78R3K59
2627A23j33j67L71J96m53n7M60m2l30l10L30m56M28L36l96l32M95J63l71J57M84
2648D96k65l98K65M28p84N90L7l04q4M28m30o7j06j9k43L95K1N5m39O09K75o47
2670a87k3M17q5m8K69J8p13M49L13k09n16L93J03l91J18J25N9o72N81j13J91J31
2692B10J19l34j00M97Q8n58K04L44n57K0J69Q2m39K6J86n19L38L78k70n26R71
2713C29m9m62K46J77o9k63O03j92p19N28L90m40n72Q04m20J4J43m4m83K0K63J44
2735e2k4O8M49l81k4L63j38l18K98L50q22n9N00j82n15K71L47m30J02J88n22K81
$$ plain form
2587 369 178 -4 241 46 -485 111 -56 -405 -166 25 -409 -315 220 -28 -265 572 198 -259 230 760
2607 760 188 10 554 421 26 49 193 -639 -282 276 -265 -955 137 -89 -284 8 449 -229 -136 123
2627 123 -10 -177 194 390 -63 -120 340 298 -32 -342 -12 -468 -40 296 -100 -432 63 226 -145 12 496
2648 496 231 -167 98 526 -258 332 369 65 -19 409 -21 -88 -194 -213 -456 -61 -40 15 -424 185 460 -187
2670 -187 -210 207 122 74 343 361 -352 97 410 201 -315 78 181 -210 -92 33 92 -580 1 -112 79 210
2692 210 329 -5 -105 392 480 -78 126 470 -87 -67 102 184 -255 -229 -43 -562 -224 154 -116 -642 329
2713 329 280 -182 64 241 172 -91 512 320 -399 129 519 79 -493 311 -109 -95 48 4 -479 -459 -196 -52
2735 -52 -76 -8 441 60 36 399 261 -57 241 591 -231 -290 210 28 -487 -216 131 -299 -197 -9 -531 -250
2757b50N29k84l55L87K13j8m20L60P5n68M41M31q11j37M32l7j19j20K36k85K95
2778eM61p76J13L89q4j97J74J69k03J47l8l25m9L13n0K15n77M27j76q7J85r2j2
2801g8o0M19l53n7K93J41l27J37J74l35o2J51K45n29L44j97J2l79K32J88j98P2
2823a67J41J2j16R0J22k84J98J35Q6nj35J63j57j45j30N2k34K63j92J73n0M34
2845B54j33m72L14j40n1N11j79j57J9M08l71j32K03J6l65J41K08m29j2O12k87
2866d2l66O98j03j39l95J11M1%M32j30k36J74K25k70J29J09j98p5k91K52k57L41
2888A0J97l27J74m6J16m57L00N5k69N51k06n6j95j06K97j94p1K12l06L05L8j84
2910a62K73j75o1j35L27k1k48L27Q4j81l2J82m1j44J69kk68L18n8m16K33Lp6o9
$$ plain form
2757 -250 279 -5 -360 27 240 222 -198 162 237 -331 110 541 -270 -407 25 -12 -131 -251 -15 -300 -5
2778 -5 456 -320 -207 182 98 -99 75 244 41 188 150 -175 -224 89 39 254 -323 104 -72 -159 26 -66 -78
2801 -78 -138 281 -72 -129 164 305 -22 115 289 -46 -108 43 288 -241 103 -94 -82 -461 -229 -41 -239 -167
2823 -167 -26 -14 -130 -40 82 -202 -4 131 217 212 77 240 83 -62 -192 -140 -374 -111 -303 -130 -180 254
2845 254 121 -351 -37 -177 -228 283 104 -53 -34 374 3 -129 74 90 -275 -134 74 -355 -367 245 -42
2866 -42 -408 290 187 48 -347 -236 -195 -195 237 107 -129 45 270 0 129 238 40 -35 -326 -74 -331 10
2888 10 207 -120 54 8 124 -333 -33 22 -247 304 98 42 -153 -259 38 -156 -227 -15 -321 -16 22 -162
2910 -162 111 -64 -125 -260 67 46 -202 125 209 28 -4 178 137 -7 162 160 -108 210 152 -264 -31 -28 -104 -173
2934a73L2j18L75m4k88L19j13L16k52o7J1J67Q3l1J24m51J43m5p2K4L4J05k50
2957a71M88n74K95J08p4J33k59K11J90l16J13ml67L11n4l1j83L76q9j03n4j30
2979a84K37j83L02l2j54M1k13K99K39m35j75O3L01j40j03m0j17L41K8l58K84q0
3001g9N5j00K11j08Q6m2j07r6M64j64K16n68L00K08k28k19K30R4m12K30K12k85
3023a02j49L94k52J0M31o0l91L80ql20M1j6J91j55q0M1J17j33Oj53J16j73L14
3046D9l09K88q4L6j08K88l0l90P5M35k64j0O7J88k56j22K29o7j8L9j08J6k02K32
3070b6p0m5K11k07Q7K04K5J61m77R6j04J32l4J67O8n86N36q6p0k8J45l66j8K73
3094a2J29l66P6L91j81k03L63m03J86L94k08l68NK23Nm22K51K59j02o6N0j28n1
$$ plain form
2934 -173 -141 -259 116 72 -216 103 -10 306 54 -13 -2 165 248 217 341 -110 33 -12 -84 -60 -26 79 -171
2957 -171 317 -257 38 146 72 205 -54 157 347 31 144 140 -227 84 30 -1 -184 192 103 0 -54 -184
2979 -184 53 -130 172 140 -14 27 -186 113 352 -83 -258 -195 106 -34 -137 -177 -294 47 75 -283 1 -79
3001 -79 -24 -124 87 -21 65 23 -84 -180 284 120 336 -232 68 276 48 -171 59 153 -259 -29 183 -102
3023 -102 -251 143 -109 -99 332 272 -119 261 253 -67 -26 -42 149 -6 -86 -45 72 -61 -55 -208 -92 -265 49
3046 49 -260 28 -56 -20 -128 160 130 -260 -185 250 -14 -24 43 231 -25 -147 82 15 -3 36 -72 -56 -258 -26
3070 -26 -96 -141 70 -137 -50 154 179 340 -137 -41 -145 -13 -47 120 188 -398 138 52 -18 -46 99 -267 -285 -12
3094 -12 117 -249 -173 218 37 -166 197 -206 -20 374 166 -202 -197 26 31 -391 -140 119 17 -49 1 -127 -178
3117a78j5J95j12R3L55k92K3J6j95J98j46K20n4j9j88j44M84l74J73k65L00J01
3139A76l45M22j4j81j25L06J06l92N7JL40o95J89K16r0L36k32j99J76j7K82l47
3161c0O8J45l4l38M34k2m02N8L74k69o1j68M47j38M3K7M8k51k41L80m35L89K70
3184B94k48j78k0L36j37J93M5l45K33k59r5J84j39L38m08J91k6P0J0L0Q9l24k13
3207c79N56k06j37K59Mj53p3L09l30%J90O5j28o8q0K12j71j84K66k30L45N4m83
3230c62M19j13L16j95k7J21q4j10M1q7J14q2J68j94M2J54l21r3M45j80j06L4K91
3253A91j10m3L0K00l13p7M09k41k98K80p3qJ13O8q6j86K38l15J35J57K44j96p8
3276D1n8K20q7P4N0k38k3k8j08J66R9n6j85K07k50J72l55L04L05n44M42l25K3
$$ plain form
3117 -178 -193 2 -110 -17 338 46 69 85 -110 88 -58 162 108 89 -99 -243 241 -133 40 -225 75 176
3139 176 -169 253 239 58 -67 239 345 -47 10 11 351 -344 -155 61 -29 307 75 -124 52 35 317 -30
3161 -30 38 183 149 -189 245 223 -179 -121 253 -16 -77 -245 202 64 107 134 182 -69 -310 70 -365 24 294
3184 294 46 -132 -152 184 47 240 285 -60 173 -86 -181 3 -136 202 -206 -15 -41 29 39 69 158 -166 -379
3207 -379 177 -29 -166 93 97 -56 -129 180 -150 -150 40 105 -23 -91 -171 41 -130 -314 -48 -278 67 121 -362
3230 -362 57 -56 260 65 38 159 75 -35 6 -81 33 -49 119 -75 -33 121 -200 -293 152 -28 -134 -100 191
3253 191 81 38 68 268 -45 -122 287 46 -252 28 -45 -53 60 128 42 -144 94 -221 -86 71 315 119 41
3276 41 -17 203 116 190 240 2 -21 -49 -157 9 108 52 -133 74 -176 -4 -359 -55 250 -294 148 -177 -154
3299a54K02R1J11l49J58o1R4q1J67k15j13J7Q5M1j43J18KJ82j60k13K46N4q8L03
3323B94l23l4K91k42J00J87l23j02Mj5j70N20j43j61J44ok7k28L49P2j24L8K26
3346C27k58k10M17j85j18J04J73k05j12J12k5m1N3l3k94L31J3R4J46j23j62K86
3368B90j91j9l51L64j04J41j74J97K5k5j25K50k84M5p2q2j97K15J53j86J01K01
3390A72l91K07n5j2KK56J0J5k46K28l76J37J01N5l2k48K45J9j26J57k61J84J2
3413E3L4m2Q4j38r2K98k31Nk72K37K8o8o6J63K69k52O0qR2j1oj54K32k82J62J62
3439B57j69j38m1k5K41k47q7K28j16L25k70O1n9K35m1j03k75L78l82M09j47j40
3461a06K8q4J25J28l3J44m28K56l69J53M6K80k46P4j65K38M9j92M2J51p3J59j84
$$ plain form
3299 -154 48 139 250 -99 59 -2 92 11 178 -37 -150 -133 -48 -7 -150 -32 -30 152 -8 -221 25 79 -9 294
3323 294 -29 -63 228 -14 86 273 -50 -152 -148 -163 -333 187 44 -117 27 21 -6 -234 115 187 63 101 327
3346 327 69 -141 276 91 -27 77 250 45 -67 45 20 -21 32 -1 -295 36 49 143 289 166 4 290
3368 290 99 80 -271 93 -11 130 -44 153 178 153 28 278 -6 39 -33 -115 -312 -97 56 -130 -29 172
3390 172 -219 -12 -67 -79 -77 179 189 204 -42 186 -190 -53 48 103 71 -177 68 87 -39 118 -143 41 53
3413 53 87 45 129 -9 -101 197 -34 -29 -301 -64 -36 -104 -170 -7 262 10 70 62 154 143 137 -17 215 -67 95 257
3439 257 88 -50 -91 -116 125 -122 -209 19 -97 228 -42 19 -40 195 154 51 -224 154 -228 181 34 -106
3461 -106 -78 -162 -37 91 58 202 -226 30 -339 -186 -140 140 -106 -32 -197 41 90 -102 -60 91 18 177 -7
3484gl7J36r0N5L5L6l62J89j01J65J53P9l77j1L38j58J22k60j7L89l87L11k96
3507i5P5K7k44K95J04Ok38K1O0j16J3J45q5Po0OM2J66k21J39j01K05j21k0J84
3532A94j87j41J76r5J64l92K77j10J56J44l4o0J67j71oj60J44j75j2K27l60L76
3554A22j83r5K67k45J26J05n5J26J25m05o7J49j7J64O6j7k86J63K02m74K28K7
3576B6j3k35J83oj83J99J04R7l88J16K9n9J54j40K66m1l69K22R9p0j15L23j11
3599H8NJ00Q1j21n19L15Q6K1o0j54L79j55K96l12J39l35K65j40M4j49J65q9J50
3622A00k43L10m21J36J26Mj5P1j47p2L0j29L47r4N2q5K63o02L95j5J45j27J16
3645A45k60j81J95K4J38M3j77N0k86L18m7k26L60k07J54J70l54L14m26L04j92
$$ plain form
3484 -7 -44 92 2 57 92 128 -234 -45 -146 19 172 251 -126 -137 201 43 165 -95 -112 277 -110 201 -95
3507 -95 -20 7 -237 58 162 168 -70 -49 11 -105 -92 53 -32 -25 -85 -79 -37 129 -92 47 -54 151 30 10 194
3532 194 7 -134 42 -53 111 -281 -4 -114 42 186 152 92 259 88 82 -78 66 -109 -121 106 -254 122
3554 122 -61 -156 111 -134 -8 97 42 168 293 -112 -179 -30 -47 117 183 166 -120 43 245 -229 -1 26
3576 26 13 -222 -39 -45 -228 -29 75 172 -216 -100 -71 -130 24 -116 150 109 -260 -38 61 -9 -124 199 88
3599 88 93 193 274 153 -366 -51 35 56 -4 -158 221 66 362 50 189 -146 119 -21 23 -126 39 -50 100
3622 100 -143 167 -254 -118 8 12 -3 68 -79 -151 -121 -250 97 3 55 -30 233 -369 26 11 156 29 145
3645 145 -115 -296 -101 -77 61 104 -73 -23 -309 9 -38 -264 96 -111 43 213 -141 173 -253 51 -141
3666a41m9L51j61j74L75p8l79L45l8p6Qk74J97J35P4n4j9m7Q2M0l05L01J22J0
3690B45j50o2K6j22k17K68J33l67J10M96l17m7K40k08o8k1R2N9j29j4n6M3o5K24
3714I3j01m8J31k36o6K83J0ml3Ok21P1N3J61j45L11rl26K62j97K0oq2QL6J24R0
3741A85m21M01l6j2k89L29k37q2J44K41q2k91j3J49L43m04K58j17k48K36k4j24
3763i4K72k43J72m9J33l36J63L4j68Q4J45l74K75j55K39O3o4O8r8l7j08K83l19
3786a14P0K06l52J18L64l38LRJ16M2J0k38L0O0oj47J67n0j8j41L88l41M97m62
3810a27j32P7J14O6k05J86p9j23j3m8M09j69J43l12J84j20J68K59n97K47J45K
3832G5l6J6J79l37L27l26J28J05l19K39j22q0L1K73J73m28J35K42j63L1m01K61
$$ plain form
3666 -141 -190 161 0 -174 201 123 -256 89 51 -25 -17 -291 -94 41 115 61 42 -5 77 117 -188 113 235 245
3690 245 95 33 59 -63 -280 -12 121 -246 -136 360 43 -4 236 28 -40 -61 31 90 -39 -53 -109 -66 -131 93
3714 93 -8 -56 75 -161 -227 56 66 62 29 35 -186 -115 -62 99 -46 265 256 -70 192 -5 15 9 -73 -65 -29 95 185
3741 185 -236 165 129 117 -172 157 -80 -162 -18 223 141 -150 -163 -14 329 -75 183 66 -182 54 30 -94
3763 -94 178 -65 107 58 191 -145 18 52 -116 -32 113 -261 14 -141 98 161 97 165 67 30 -78 205 -114
3786 -114 -44 162 -190 -72 292 -46 -43 -34 82 124 134 -104 -74 -14 -20 -167 0 -50 -68 -209 179 -162 335 -127
3810 -127 -259 -182 -68 -2 -207 -21 -100 -223 -236 -284 125 -44 99 -213 -29 -149 19 278 -319 -72 73 75
3832 75 39 55 234 -103 224 -102 26 131 -188 51 -71 -151 -120 153 326 -102 33 275 112 143 -258 3
3854Cj55J47N8j1m18J74K12K6j93J98P8k09P8rq3K46l08kj07M96k47K49k71p9
3878a27J4O7q8L49l52M44n39L67j50j84M04l77J25K1P7n5L9j93J97j97K77r1P8
3901A06k95K93k8J7l47M00L0M2j11n2j52N6p3K16j49%J49p5Or1j35M25p8o1j39
3926d6q0K87j83j75O2K54j16J24k79L83k17j59K15N4Rk30J39kj31j69M4J96k10
3949b30N3J51K4o7N8m4J90k25m5L06R5m57L30j70K3J21J08ok76J15J14j39k4l61
3973c56L11k12J96J90l12K62rp8K96k57k69L20k7M3l49L6J17J96R8k64K22j63
3995ij2k57J15L73k18J12j7J6k47J87j31n0M0P1K8P8j16q7J84j39J43J31l11K54
4019A38j85K12k97J31L99m26K12q3j9k02J20q7J33j29j38L82n0n0j43Q0K54l09
$$ plain form
3854 3 -152 -5 53 42 -376 -202 10 36 -157 41 119 -90 -12 -21 -104 142 -166 -168 -275 221 -26 223 -48 -127
3878 -127 -113 -46 -134 215 -137 307 -232 135 -15 -199 205 -172 -47 -26 51 -4 35 -158 39 -158 119 28 106
3901 106 -189 104 76 93 -254 146 176 218 107 55 -97 -41 -114 102 -47 -47 102 27 33 -58 -193 232 154 93 -46
3926 -46 -126 161 -22 -197 -135 119 3 127 -152 231 14 -145 70 124 133 -97 42 40 -91 -260 -216 -20 -230
3949 -230 -177 -26 -2 -69 -11 -55 135 -90 -135 171 266 -191 139 -31 -8 113 221 215 -61 54 168 29 5 -356
3973 -356 -45 -257 -61 129 -183 79 70 -8 288 31 -238 82 55 98 -251 -215 -98 98 196 -68 154 -9
3995 -9 -21 -278 -163 210 -8 104 87 103 -144 43 -88 -138 -98 -27 1 79 -37 -124 60 -79 64 195 -116 138
4019 138 -47 165 -132 -1 398 -28 184 101 82 -120 0 -87 46 -83 -221 161 111 61 -82 -2 252 -57
4041e7J04j38j38N79l09m31L62k11p1K6n9L15Q9M0R6j50p4R9jK54l60j65J29j62
4065b33J96p3N6J21oQ2j58RK91l40J33j24j68K0K72n0j40R7m3J39j8r8K89n97
4089c43M23j70J15j89L44j53N7M9m57N06pj16L4l00j10N77j00j99j91P1LL70n
4112B09Ok01j51K6o0J76J0J28n9J07k86R7P8k7j21j49J40K30j80k3K19k94J86
4135F1j45O8J64k9j97m5N3K2J40m25M36J07o9l91R5P5k08O8N41k09l7J8k36K7
4159a16j18K13k18K36j01j66K08L2JJ46k12J20o6K34j53J9K9k88K82j41R4R1j90
4182f4J00k67j64P10l90O0k42K80J66j66K6l5m32M25m3L7o9N3l8rJ24j99K32o0
4206C5j74L12j18k88M66k9j15N0j35K34j07j77J34l9K6J20k03j41P4L73k81o9
$$ plain form
4041 -57 47 -91 -229 350 41 -390 -28 -239 -310 -284 -343 -28 61 101 197 47 -27 72 71 325 -35 -200 -71 -233
4065 -233 -37 -110 -54 67 61 143 -15 -6 285 -55 78 -46 -214 -194 78 28 -112 -15 -58 81 63 -35 254 -343
4089 -343 80 -90 25 -164 180 27 84 133 -324 182 175 59 93 -207 -317 260 160 -39 -230 -159 -156 214 209
4112 209 215 14 -137 -111 -171 5 15 143 84 191 -95 2 80 53 -68 -217 -77 153 -27 -50 169 -125 61
4135 61 -84 -16 148 119 -78 -123 -70 -48 92 -333 103 210 141 -250 -155 -80 -288 -220 321 112 75 93 -143 -116
4159 -116 -234 -21 -239 -3 -104 -270 -62 -30 -29 117 -95 25 -41 193 40 59 88 -200 82 -59 35 126 -64
4182 -64 36 -231 -395 315 -75 -15 -257 23 189 23 49 14 -418 7 -36 1 -68 -15 -53 -62 62 -137 95 35
4206 35 -139 173 55 -233 233 204 89 139 4 238 131 -46 88 49 75 195 -8 -149 -75 298 17 -52
4228e2J02o8k10L84j30k19m5J48K02j03J42k17k11N27n19L81k23M7J57j46K24
4249A71k80J43J85k29o1J77J67k10o4Q2L41l82l7m8J00P5k19p1J87J46k74K65
4271A64j45k95L90j11k32K57q9K06pl43J92J64p5j40r8J1J03n0j66L14j16L0J53
4294A17l31J23J41k59J45M5J14m22J22K75L0l19K17K4j26J73J03j56l79K18K05
4315F0o9O7K1O3j42O6j69J41P2j04p0L39J2m13J62k1m9L90l36K07m02J02j33Q9
4339a17K8k03K89J62k6k31R0J78k99K03M0j74p3L13k73L8j20J3K69Qj65Q9J84
4362B23k83L12j87m0J52k61K90l9K0jk21r1K27p6j8J21k80L6m6j28q2K55m54O96
4386A25k00O2m5N2J60k25P7K10k56K16m67J07K54P5k40NJ93m05L01J9n0r6J69
$$ plain form
4228 -52 50 -18 -228 156 26 -193 -238 -90 112 9 151 -66 -277 250 -269 112 -111 -64 93 -53 171
4249 171 -109 34 219 -10 -71 106 273 63 -1 81 422 40 3 -45 55 130 -89 -160 27 173 -101 164
4271 164 19 -276 114 3 -229 28 -61 145 138 -205 -13 151 76 -64 -162 -151 -48 -98 -264 50 -66 -36 117
4294 117 -214 -91 50 -209 -64 -19 95 -327 -205 70 100 -219 -2 22 -104 69 172 16 -363 -145 60
4315 60 -9 58 79 142 0 66 -103 38 110 6 -64 275 287 -126 36 15 -34 356 20 227 -175 -73 -206 -117
4339 -117 -89 -292 -3 159 133 -98 -8 170 -129 74 114 -60 -133 180 -93 -55 -175 -162 107 115 -50 39 223
4362 223 -60 252 65 25 177 -84 206 167 187 186 -35 -126 101 25 7 128 -152 -116 -162 -290 -372 -117 -571 125
4386 125 -75 -13 -58 -6 154 -71 6 216 -40 176 -291 -184 70 145 -95 -90 103 -302 -1 18 -32 -128 41
4409D1J47l8l2p6p3P8lK64m04lqML59j91k76L08J19r3k01nOJ9j51J61J46j34K55
4436B19l07Q5jq3J11L2j25L5J81j32k35K01K28l65J52J01j32j1J85l34R5K42k45
4459a03L00l35J84M0k7r1Q9R3m52N73n14m7L32k2j04P6J60p8J6J3k42L59j17l98
4483b95K45j6J81j65R5o4Q0j7r4P5m4K7k8N7k6L2j99P4K76m48J01J86J96j63k26
4508a60K62M7n2r5n1J63p2j18p3K98j74M2j23K22l59K15J24l21K71M0J60k84K82
4531B44k71j1j0O4J7K2j9j05j36J12K30k91L44O9l71o6J08J92k0o1o9k4j83O18
4555C83l89N7l50J19K06j08k26K57J39Q2k37L56l62K11R3k53o1Q6J55kk05Q9J78
4578B18k70K96j91J93l00j59N34j96j52k06K97J99k66p7L03l67K92j57J00j70
$$ plain form
4409 41 188 150 118 42 -31 47 44 308 -96 -99 -107 -103 256 65 -211 97 216 123 -78 -83 -77 -58 -209 -48 98 -36 219
4436 219 -88 -3 -4 -87 24 56 -69 -34 147 15 -220 -19 209 -156 -4 97 -35 -46 139 -195 -100 142 -103
4459 -103 197 -138 46 86 59 -32 57 150 -302 271 -243 -290 42 20 -84 -8 152 74 90 103 -139 220 103 -295
4483 -295 -50 -66 115 -50 45 -19 61 44 -50 25 -19 8 -20 37 11 43 -156 -82 194 -254 -153 33 229 66 -160
4508 -160 102 149 97 2 -49 114 42 -76 -149 149 -25 17 -106 116 -243 -28 96 -225 46 86 246 -38 244
4531 244 -27 -38 -48 16 33 55 36 -69 -205 -93 137 -154 190 259 -112 -178 -70 122 102 41 -28 -52 -235 383
4555 383 -6 51 -299 -180 26 -82 -308 -51 88 170 -67 289 -73 138 231 -22 -83 3 158 156 -49 40 218
4578 218 -52 244 53 246 -54 -213 321 125 -27 -233 64 263 -3 -80 223 -144 148 -9 91 -79
4598g9J68J83n47K32J54j98J96k46j56L88o6K10k27N9p1q2K48L2j64K8j40p2l6
4621a86R5J08n5J04QR0k4k69K8M3J95l76L13j33k5L11l04R1j05q1P0K12mJ11m10
4646a93j00J40M5N2N7J10j91J91j98J01J2k28L07o4k00M9J84j41K28k03j06K17
4668F9j28k0J62l7j66j1J61K0R8k09M2l0N2j89K50k10p4J92J87r1j5j60j60J83
4692h4J01j20J4K17j10k89K28J38k5k5p7L33k72r7J45k74o6K67lK06l83M38m64
4715b02Q4K17qq4n8N2K12m71O6J18J64J14N9k12J42j17j52k45K77R1j70M9J38
4738F4k48J39o7rp3L69J84l12M0j94J06J15p5q3J56m4J4J25j31o9K50k64j89J14
4762h2j79J02K61k09K45j25J67l08o0J89k1L52o15M05k0k13K87l62L00j72j58
$$ plain form
4598 -79 89 272 -275 -43 111 -87 109 -137 -293 95 29 239 12 71 0 -82 166 198 34 62 -78 -150 -186
4621 -186 -91 17 -38 66 74 164 140 -129 -101 -58 137 -239 74 -59 -84 227 -77 14 -91 -172 -102 110 106 217 -193
4646 -193 -293 -153 -108 -56 1 111 -80 111 -87 14 26 -202 105 41 -159 -110 74 -67 161 -42 -148 69
4668 69 -59 -79 83 46 -120 -131 30 50 148 -61 -19 -49 3 -186 64 -146 -220 -28 159 68 53 -107 -267 -84
4692 -84 17 -103 -89 128 18 -271 -43 95 70 45 -32 301 29 -68 77 -197 -263 4 1 207 -176 262 -202
4715 -202 -118 99 91 7 -51 1 213 -258 -192 -74 90 204 263 51 193 76 -76 -321 -44 47 -123 -74 64
4738 64 -184 -45 -112 -121 -194 175 359 47 87 -107 -1 114 39 -44 112 68 82 207 76 7 257 -7 -196 -82
4762 -82 -261 -159 102 -107 138 13 180 -128 -188 1 -20 332 -283 122 102 -111 176 -186 114 -58 -216
4783b16M39k35k20L05J12j67l5J93J5j13j00k8j33J81j21J08l9j35J8n5L26k74
4805a74o5K10L1k15K74l4R8o1j78K14j5K9m5k10J37j41J05K5K27m37K49P1j76
4828h1N8K73m25J18J36j78M07k30K2j19K5J95p7j45o3J99j50J32nMP3j90L78k12
4852A45j7j29K31m06N3k02M74j34P8L04k80N8q2p1k94K50R2K67l80J72j20j05
4874i6K09Q9r6p4j8l07R5L3J61l1L4q0J93o8k30J60J18J8j42j31O8J2j97J92R4
4899Fk7O3lq5o7N3R3M2j68J34J7j48J77p5J8k08k3K98k71K5J08J2N0j11k05L22
4925B7J98j40j07K69n5k28j3j60K43n5m4K95j76Oj38k20M53j50l5k9J0k43M13
4948A21l4k07J35J28j13p3J98m43N36j86n82N16l08L00l3j32K75j52J19q7r1L32
$$ plain form
4783 -216 223 -12 -232 73 185 18 -17 176 191 78 -22 -50 -183 -2 -123 -15 -54 -189 -171 -226 100 -174
4805 -174 -239 -29 2 -213 61 27 125 64 -114 100 85 114 69 -141 -4 -145 -40 -15 212 -225 24 95 -81
4828 -81 -23 250 -175 -57 79 -99 308 78 100 -19 6 201 124 -21 -84 115 -35 97 92 96 169 -21 357 145
4852 145 128 -1 230 -176 -123 -325 149 15 93 397 117 175 93 22 -272 -22 70 337 -43 129 9 -96
4874 -96 113 202 106 32 14 -293 -198 -165 -4 -35 -1 -81 112 44 -186 -26 92 110 -32 -163 -95 -83 -280 -88 6
4899 6 -21 42 39 -46 -113 -60 33 75 -93 41 58 -90 87 12 30 -178 -201 97 -174 -149 -41 -29 21 -90 -295 27
4925 27 225 85 -22 247 192 -36 -49 -209 34 -21 -65 230 54 60 -78 -298 155 5 -30 -59 -49 -292 121
4948 121 87 -120 15 143 30 -43 155 -288 248 62 -520 -4 -312 -12 -45 -177 98 -54 65 -22 -113 219
4970B19j2k94J30l0M0L4p2O1l7j01J81j12K3j50J57k80K59p8J42k5l06J6M99l13
4994d9j03r0K39K01k16j90L62k6j57K41j95j01K05j13J1N9k56K26r9Q2l8j31K23
5017H5J2J51l00K87j64k1j44J49k52K79l5n9p6k13L40q3j09K42J99j79J90k85
5039A4k29K22j52J91j48K88l34K70j29p9K22j62pN4Q1P5k68J37q1K37l56M12m26
5062a68J30J23j8j12Q4l1J91k5k38J48j04J99r0n0k60L26k23J94l82L48J2J79
5084B33q0n3J8r0K82k77K3L2K03l85k5Q2j76K72k67j33M81j00R3l62pK53O9j98
5108a12J71O6j64L09m19L18Qj33q3j01n9K53j28L59k19j29N7on9J02J42m35K40
5131b2N4k11J86N9J39l86J47J54j81j63Q2K78k25qJ41K34l82j35J25M2J7n3L34
$$ plain form
4970 219 207 -87 43 13 53 87 15 76 39 -62 119 7 30 -120 37 -243 16 -62 80 55 -251 -235 264 -49
4994 -49 -152 -242 -3 198 -18 -208 154 128 -29 212 17 -84 121 8 19 78 -178 48 -51 31 -7 -138 85
5017 85 97 248 -52 235 71 50 -94 55 -197 82 47 -12 -88 -301 39 -44 -153 89 288 109 299 14
5039 14 -215 7 -145 46 -102 186 -148 122 -7 -86 136 -26 -33 21 102 177 -91 46 -35 202 -154 258 -168
5062 -168 -38 85 67 -45 39 8 199 174 -64 84 -20 179 89 39 -221 105 -118 76 -306 42 54 233
5084 233 153 100 118 28 310 33 56 88 291 -94 -119 -37 -213 59 -208 -341 140 40 133 -229 -236 17 86 -112
5108 -112 59 125 -39 270 -149 169 177 44 -39 -140 -199 54 -74 285 66 -63 -6 -12 -71 31 173 -262 -22
5131 -22 32 -179 7 66 205 -181 -34 120 -61 -224 -142 136 -89 -97 44 278 -104 -239 -114 -72 -55 -108 226
5154B26j81J21j74J49j19j62J02J24k20K21k07J52Q6q1J45k91j63L06P0j93P8
5175a1Q2K60n23J29Qk47J93j9mQ8j11K05k59K97j89M5r1L32q6K3J26m62K47k1
5199A2j08j4K74j18o1j54P9L7r1K27O1n3J13j29k45J5M23j27J03l70Q4j45K20
5222C3L6j58J19n6J9n0Q7k12j12K09R1j27r3j4K04P0k10J02jR4j56k8L20k6j47
5247fJ54j85J15j90K4J63j88J41k00K29J98k35k86K64m6j13J51j88O6Q1J87l71
5269b35L01k4K36j59q3o7J83j56L6J08O8m58J49q8Q2Q6p0r7K22K43k96M0k76J22
5293a33M6j46J48J79J23l82L71j61L3J89l02J26m5j26J47j92L05m36J95J66q4
5314B1j23Q7j07M4o3J07j67J12k85M39r1P2K1q9r0MR5M6q9J69j23J41J15k83M6
$$ plain form
5154 226 45 166 -8 141 22 -140 -38 86 -134 87 -120 32 118 37 182 -109 -272 34 104 -89 -11
5175 -11 71 331 -192 -63 -55 -302 -109 -128 -132 -44 -155 50 -209 88 -101 -56 -147 185 99 122 248 -214 33 12
5199 12 -96 -110 164 46 -15 -169 -90 -53 -144 83 144 91 204 75 -170 -155 268 141 244 -126 -42 -187 33
5222 33 69 -89 30 -26 -7 -57 30 -182 -294 -85 6 -121 -214 -228 -24 46 -164 -62 -63 31 -125 -153 167 141 -6
5247 -6 148 -37 78 -112 -88 75 -113 28 -172 57 255 20 -266 -2 -48 -161 -10 -198 -132 -51 136 -235
5269 -235 66 42 278 119 36 -31 152 -4 32 140 208 -250 -101 -189 -107 -21 -91 -188 34 277 -19 21 -255 -133
5293 -133 -87 -233 -85 94 217 -165 206 45 78 267 -35 91 46 -80 67 -125 180 -256 -61 105 21
5314 21 -102 -15 -122 -78 -141 -34 -201 -89 -374 65 -26 46 67 -22 -112 -108 -13 33 -56 113 -10 131 246 -37 9
5339Ij30no0j13M60N0K45k67l3l82L41q8r3p1Q7K02j84M32j45l66m5j67L23mN9
5364E5k65R8o1p0J39J02l83M26l03J70n8K85Q9o54N87j58q6O8J76k95J91o6J35
5387A22j4nk73L60r8P2j14m8J52k12J93k1j56j33K6Q0R8q0K23j17J77m69J33J7
5411h7K21J43j77j77J72j29j00q8K22nK53k35J69l08K11K09m41R3p5N0M4J85j81
5434c1K4M2j59l0K84o6J69m16J76j9K04l00J17k6K9kN8l2k34K05j04R2j84K11
5458Hm8r1L5j34J99J96j76J14k62P6j4K86Ml47J94j15q7J11K40j65Ok23K41K21
5482B69n78K31L17k94K28m02N46j34ol0k72J33O7L4J1k11J74m7j71J01j04K21
5504H3j01M6n3k1J21K5N5q3m9q0L08j05m9j32n0N8K6P7j04J2J43k61P8J45j80
$$ plain form
5339 9 -121 -126 -186 -299 161 211 456 189 156 -226 115 27 -66 -137 -50 152 -32 400 255 -111 -156 -323 0 -4 55
5364 55 -210 -112 -173 -243 -104 -2 -385 41 -262 -92 -150 135 224 -430 157 -1 -87 -19 157 -138 53 -13 122
5387 122 108 103 -170 190 92 164 50 2 154 -58 135 114 -42 -175 -149 -69 29 -51 172 55 232 -237 -104 -87
5411 -87 134 277 100 -77 95 -34 -134 -222 0 -5 248 13 182 -126 85 294 -147 -54 -129 -79 -35 150 -31
5434 -31 -7 35 -124 -154 130 64 233 -183 -7 -26 178 -122 -5 -31 -2 -4 54 22 -212 -7 -111 -19 -203 8
5458 8 -40 -131 -96 -230 -31 165 -11 103 -159 -83 -97 189 193 -154 40 -75 -162 -51 189 24 30 -193 48 269
5482 269 -309 -78 239 -55 173 -229 317 183 177 147 -125 8 75 109 120 -91 83 36 -135 -34 -138 83
5504 83 -18 28 -25 -46 75 100 155 72 23 -57 251 146 97 -35 -85 -27 -1 76 -28 -16 127 -134 -56 89 -91
5529i1JP1M9j80O0K82j74n2R0J14l12L56l54lQp9J71K6J86j32o2N9J77j52n2L9
5555D6j50K00j07k26K34K04k32K31k52J50j39K0K4j68K08J03k6m3N4j1l41N34
5577C13j65j69J02Nk76K71J39n7j62p3J36r5O3p5o7j34K15O3k72L52k47Q5L0k36
5601b54L22k5lJ58j40M8j05L18l24P8k48M1K15m42M28r1j74K36j41J13m3M6O7
5624H0k49K08j0PP2j86L04j59J00j87k7K5j31K83j33L26m51J80J16K8n38L06J36
5647A00j07n9Q6K85o66L51J46j05N9M8k92K19Ln6k04O3K26k60K06M3r8K28j35
5670H1J21l42J08n1L59k91k11L17j35j4j74K62j44j4J35o4J92j60K01k12K46q3
5692A27r4J83k14r4K1L0j17J48j33r3J68q9K42j71k1O2J23j17j76J80K1k2J53
$$ plain form
5529 -91 -90 -19 30 -150 -90 192 18 -34 56 170 -142 214 -140 -143 -135 -214 -43 -17 169 37 -25 34 211 59 7 46
5555 46 -104 96 -11 -237 -3 201 -31 200 -52 98 -41 -21 3 -165 43 146 120 77 131 120 -221 313
5577 313 148 -21 81 86 -190 81 220 163 1 -72 64 -31 32 -43 -110 -244 -29 34 -238 114 -133 -48 -18 -254
5601 -254 68 43 40 198 58 106 1 319 -5 73 -175 -134 81 -361 67 -24 -198 38 -103 10 -33 13 80
5624 80 -169 39 29 36 108 -78 226 67 167 -20 -47 -22 -153 130 -3 323 -128 52 168 196 -342 -36 100
5647 100 -7 -66 20 305 -361 -10 136 31 90 138 -154 65 68 12 -192 -129 97 -163 43 86 -12 216 81
5670 81 202 -140 -32 -83 276 -15 -226 91 -44 -58 -232 30 -114 -128 7 -57 135 -25 176 -36 210 127
5692 127 33 216 2 -92 -71 -41 -158 -10 -143 -236 -68 -157 85 -86 -107 -45 78 -39 -215 -35 -14 -36 117
5715A17R5j26j50J4K7k20L44q2k32P4K57j97r0L07j84j22K73l05M4p6M2K82k54
5738a62J06L57o49K28L27k10K5o8L11l48nK9j04o8K51K40j04k94L81k66j02J42
5760A7j16M8L04k84j04j4R2J93j16j07J72k07j50L52p5j15O3J01K55l9k55k68
5782b53J86K26l73J65QM71n44o1K70J75k71j54L11j29q1J19n6K9M1qj56K07k56
5805a34J87J47k45J8k60J67Nl0K5j0j1q2K91l6J1j29L14k51l22L62o9J96k66o4
5829a86L92l17j29K77j86K10K10k44p6L0j41j8J66p4j05L73j95R3M05m50J88m6
5851A77P4k01J48k10J24K22l43j5M7N5l17K52K2j40l5L6L46j96n6L2j76K35%m5
5875C6l12K24j90K63J61k00k1K8J01k7k9J01j68o8Q1q0J78J68l99M22j78k09J63
$$ plain form
5715 117 212 86 -64 -50 -23 -243 101 19 -213 -139 118 -79 -169 138 -46 -168 105 -200 -156 -232 -190 92 -162
5738 -162 -56 301 -348 -120 207 -3 22 -46 265 -83 -88 -59 -163 -231 20 260 156 -138 243 -23 -125 17
5760 17 -99 -51 253 -31 -135 -149 -57 136 20 -87 85 -122 -272 80 5 -110 -47 54 309 270 15 -253
5782 -253 -67 159 -214 -49 -41 430 -114 -175 95 270 -1 -155 156 27 -54 65 9 38 79 71 -85 122 -134
5805 -134 53 200 -45 -27 -287 -120 -115 -145 -120 -130 -141 -223 68 32 43 -86 228 -23 -345 17 -52 144 -122 -186
5829 -186 206 -111 -240 37 -149 61 271 27 -49 -19 -160 -178 -12 -86 -191 182 -13 80 485 35 223 177
5851 177 251 50 198 -12 112 334 -9 -24 23 78 -239 13 35 -105 -140 -104 242 46 -10 22 -154 81 81 36
5875 36 -276 -52 -242 21 182 -18 -39 -11 90 63 34 135 -33 -101 -20 -100 78 246 -153 269 91 -118 45
5898D5r6M7j85o8L81r4j35J95j90J6p9K4J99o8J29l14J14J03K5k37K34j40q2J69
5922gL66j02k21K42k87q3J27J8k40J54J9q2J51j31P6P1j34j6J38m40J51MJ17q6
5946a95J87Q9j2k26O2J46k83m3J73J58m4j70OQ9j67OK14pP6k2l79N01o5j93j06
5971b05K23K6j71J54k8J67K27n36J10j09J46l6J66k11N6P9o1KR1q7O5L3j48n2
5995i9j92K32J3k09M86j44l9l53K34K20j78n2K42l59L18j72N56o42j2N2J55k54
6017a97J23J81j33L1J69J9k48R9K75m72J31km8J72j34K30j17o9j58j1J61o0L4
6040b4J31K07l09R4j98J12j76M76l72J52k73k20P52l53m0J5j69L79m03J8K03J6
6062A8k59K54J67j31j27j61J66J6K83j9k15M1k34K8J31J32j03p3N1J04Lk5j26
$$ plain form
5898 45 -51 -4 -189 -257 124 30 -105 90 -100 -84 -163 -139 60 -8 121 -193 -79 24 49 -188 46 -94 -176 -7
5922 -7 359 257 36 278 -9 -92 35 53 -187 -33 -14 -96 55 -76 0 71 -63 -79 59 -381 -230 -226 -109 -195
5946 -195 -8 81 69 -157 -95 51 -232 -275 -102 56 12 -158 -152 -63 -230 -224 -10 -17 59 37 -342 159 94 -99 -205
5971 -205 18 44 -127 27 -1 166 393 -143 -33 -142 4 -32 134 -77 -21 58 -3 -1 90 3 68 101 -47 -99
5995 -99 -291 -59 -46 -255 231 87 48 -305 -71 149 -29 -81 161 -198 120 -52 504 -138 -150 -98 57 -197
6017 -197 -74 107 -26 5 174 193 -55 44 319 -153 -22 -24 -72 100 -34 196 79 10 -148 -159 2 -58 -24
6040 -24 107 314 5 99 -99 13 -163 313 -59 93 -180 -400 352 -1 -41 -26 -195 184 -219 -201 2 18
6062 18 -241 13 180 49 -78 -239 -73 -57 226 207 -8 33 -201 -173 -42 90 -13 -86 -35 69 72 47 -79
6085g9M36l86K55j29OJ05k67J37Kl82L16J4N4K0n0J1k0j34N5J11j03J31J10k67
6109e4K97k87NM43l12j13j70P6K60N4k00J13j25j52K16Q8k46J85j80j36K96R5
6131A53j6m49L56J97k99M31k90j86R5p9J64p2j26Q3O3k2m0K08l77K80q0J52j37
6154IK69q3j28j76K2oj37K43NL0l9q5q2J15k19Q6J79k77NJ77J24j66j22L61p9
6179B6j04J97l36L64k57j23L03j40R0l9j35J99j00o6j56L3L51qk36Nl9r9J3J44
6203a13K20k22J77l20K55MK6R1l3q3N6r5M3j20P5K8L7J09k19L2r2q3K43J38j64
6228a0J27k02k9j52M66pl68J05K49k68J07j37L17k69j14J37K12J8j78j4J07k69
6250a72L79l7k31J64o4L6o9J29r9k98M10Jj17k56m6o0M83k62K66o1j40R9k2j17
$$ plain form
6085 -79 357 -29 226 97 103 208 -59 78 80 -302 14 28 82 102 52 63 43 -91 -36 75 -28 103 213 -54
6109 -54 243 -44 -39 404 92 -21 -191 -115 145 199 -1 112 -13 -165 51 139 -107 78 -102 -238 58 153
6131 153 137 -312 44 241 -58 373 83 -103 -8 -87 77 5 -121 -38 25 3 -37 171 -206 74 -6 146 9
6154 9 278 195 67 -109 -87 -93 -230 13 18 48 9 -76 -158 -43 -262 -176 3 -274 -269 -92 32 -134 -256 105 26
6179 26 -78 119 -217 147 -110 -233 70 -70 20 -19 -154 45 -55 -121 -277 -244 107 99 -137 -132 -171 -270 -257 -113
6203 -113 107 -115 62 -258 -3 1 27 118 85 2 58 -37 6 -114 -39 -11 26 135 -84 -52 -144 -227 16 154 -10
6228 -10 117 -85 -114 -266 200 193 -175 -70 179 -89 18 -119 198 -71 -185 -48 164 182 4 -10 97 -172
6250 -172 207 170 -61 103 39 75 6 135 36 -262 148 149 32 -224 -270 -330 153 -109 157 96 -44 55 33 -84
6274h4k2M16j15j90O8L0k12J15K14J0o75K45L44l15k5j59M90l34J76J13l38K57
6296IK54m30J51J00j71L88n94L37k48J75M7j08J07O6k48L12j02L5j86K09k62K69
6318A10r5J15m2nj62k1J83k11J92k69Q2J5p3K61j4M4j65J61j21L76m59L1J61O0
6342A54J95k18k05L42q2l58q6M04j63K13j37n7l26K69Q2n0o0J72j64j00L94m04
6364a85N3K09j22J0%o4L9J53m9K7l79M80l66rL59l5n8K42p6O0l77L5qo8R6O6p7
6391d4M5k23K81j28K07k78O5J85j98k30L15Rl0J41j43nj27K98k45J75L8l74l2
6414b98L26P6j7j31N8K67k68k3q6J92J8q1K5k57J00J17L3J81n4j03Q7j80O2j38
6438i4J36k39n7K23j10R0K54k72l3J72p3j84K86K67m38O4L9r9p1J53q8N7oJ91
$$ plain form
6274 -84 -106 310 195 5 73 103 -109 6 220 230 -445 -200 144 -171 -196 -355 135 -199 -23 90 -248 9
6296 9 263 -167 -16 84 -87 301 -293 44 -204 -29 18 -90 17 83 -165 147 45 80 -106 103 -159 110
6318 110 15 130 88 83 -79 -100 83 -128 64 -205 -123 -108 -181 80 66 110 -55 106 -15 361 -98 -67 94 154
6342 154 349 131 -74 268 186 -172 -258 146 -17 196 59 2 -324 -55 27 -23 -83 89 -75 -175 219 -185
6364 -185 -132 77 -45 -35 -35 -99 -60 93 44 71 -308 172 -194 -203 156 121 63 305 229 289 -88 -53 -61 -129 -33 33 -44
6391 -44 1 -222 59 -69 138 -140 -75 110 -88 -318 -3 6 -24 117 -26 -31 -158 140 -105 70 108 -266 -298
6414 -298 28 104 87 -44 14 281 13 -10 -96 96 114 33 58 -199 -99 18 51 232 178 75 162 -18 44 -94
6438 -94 42 -197 -254 -31 -141 -51 203 -69 -102 70 -3 -187 99 366 -72 -8 31 -68 -139 14 -74 -17 -23 168
6462A68k76Q2K8M0k2KN0k67L28j75K60l35J82O1j32j26P6K68k09J02k1j45R7j18
6486h2j17J15J88k0l30M13k76OK25m82K91R4j83L02k94K66k20K2j65J19K22%j11
6509a7J01j27j60K39J04jk52J37K5J7k8J10j51J24K26l60m8J8j43J29m8j39N03
6532B59l46Q4k4k48J34M79j51m3j50K02j51J22j19J24j79J18j73r8L16j58K7l90
6554c65L06Q1Q8k17M6P5K16k71J78O2k21O3r5j09L07k98J74p9L3Q0p6j57J75J10
6578A06j94J73k74K88j68J59O4j78N2j19N5p3Q5K0K10k75J5J24J4j56N7K84l9
6601B30n10K60l62L95m5lok4J69k38O4L42k29j51LK32m5k31J73k72K45J6k01J62
6625b6L7n6j3P4j31Q6j12K17j44J17j26K56j26k09m3J56j09J45j15R5K58l22J81
$$ plain form
6462 168 -108 -26 2 42 20 22 72 -195 133 -42 218 -117 65 126 -6 -132 -56 212 3 105 84 -61 36 -82
6486 -82 -199 -84 104 84 -246 167 -109 -103 122 -360 -69 25 -158 144 -150 116 -104 -82 -247 -128 94 94 -17
6509 -17 84 -43 -203 36 140 139 -113 24 49 66 38 148 -3 121 347 -13 -61 -43 -186 -57 -105 -244 259
6532 259 -87 -3 -27 -275 -141 338 187 144 -6 196 45 167 48 172 -7 111 -62 -160 156 -2 25 -365
6554 -365 -59 22 110 -107 -61 14 230 -41 137 199 -22 41 -54 -163 144 -154 20 -59 -26 54 -22 -179 -4 106
6578 106 -88 85 -189 99 -69 90 154 -24 28 -91 -36 -109 -24 -4 206 -69 -54 70 84 -72 -15 269 230
6601 230 -280 -20 -382 13 -32 -35 -41 -65 104 -134 -70 272 43 -108 -105 127 82 -149 24 -248 -3 13 -188 -26
6625 -26 11 -45 -58 16 -115 -29 -141 76 -68 49 -77 179 53 -156 -199 -43 -152 -7 -122 -27 231 -91 90
6648I0k7m4j14L53k79K8m1pq5J54o8R3j78N5J76k65J48R7j6j83J49O1k46J44J53
6673A48o6r3l2q7J11J58k21L74j49j09J58k0j39J03l7m9j20l3K15m91N37J01k00
6696E9K5j04L3r5j24J09J59N9k40J47M4J36l90L60l2j20j82j14J02k6P9K0N7q1
6720a19L90j80k80L48k95N97l23J52n47N7K17j11K19j23J75k18k54J93j29L68
6740A37j98O1J55No1j3k61K10j37K55l54P3P4qJ67RJ79j98j53j20L2n3K79j04
6764b4l43L00K7J41rj8j33P4J65k33K32k90J85p9j08O9Kj44Q6P3J33M2q2j27K19
6789A58k9k82K29J31j25k87K24m8K40j39l81K82K4mJ24j80j22M4N4L66l28J55
6811A06l22K61k10m7o0J29R4J88j02m9K6k6k59M09k69j15L02k20l0K90l13J05
$$ plain form
6648 90 63 19 -95 258 -21 7 -34 -41 -126 28 -40 53 -125 -70 106 -159 -11 86 70 -113 36 97 -149 -5 148
6673 148 82 -11 -43 -130 -19 139 -82 292 143 34 192 172 33 136 99 50 -70 -103 112 -379 158 259 59
6696 59 84 -20 13 -82 -206 -97 62 121 -119 28 72 208 -182 178 146 26 -156 -270 -168 -194 -115 -95 -38 -119
6720 -119 271 91 -189 159 -136 461 138 290 -257 -200 17 -94 125 2 177 -41 -295 -102 -231 137
6740 137 -61 0 155 160 99 86 -175 35 -102 153 -201 -128 -54 -62 105 114 293 95 -58 -178 -146 -199 80 -24
6764 -24 -367 -67 -40 101 92 74 -59 15 180 -53 179 -111 74 -5 -113 -44 -42 -186 -100 -27 106 148 66 -61 158
6789 158 129 -153 76 207 82 -205 19 -29 211 72 -309 -27 -3 -7 117 -63 -185 -141 -87 279 -49 106
6811 106 -216 45 -165 -212 -272 -143 -49 139 37 -12 14 -12 -271 138 -131 -246 56 -164 -194 96 -217 -112
6833a12Q7J52j46J02j81K92k56Q0r0N3m18L13j23J33J36J53Qk19J13n1Q1l12K16
6856A1j9p3j03K72j83p1mJ71k4O0j09j11M68k29m4j03J95j02m27M53K91k65j06
6879e2R3J99j15j43J81k22Q8j81K06k8j75K60k01n8M1J06OP9R8k63L42j75k1k78
6903b13L70O9j55j44n2o5P1k8J22j15j47L56L9l02L82n6m1j65j3Lj21K00k4J98
6927A69n3j41J87j75lR2J08O5l10M6J93l21L5J1L7J28k77M53j2j54k25K92r9k26
6951a80K35K75n22R8R1j45R1j92K63M8l9J30k21kn6L00k14m03L96K21j92K8J32
6974A42k68K72k37O8j17L18j91n9R4L8r5q7J49N5J23j72J51J11l62K69j63l46
6996c07L13j8R0n7l0J44l54J47J9j38M41k97K59k38n5J39j48J69Kk5O6p7k19K8
$$ plain form
6833 -112 -25 127 -19 83 -98 194 -62 18 -72 -19 -437 -124 -247 -114 22 175 183 -36 77 26 107 -205 11
6856 11 -8 -81 -184 88 -95 -166 -170 1 -23 37 -72 -183 285 56 12 -91 104 2 -425 28 319 54 -52
6879 -52 41 240 125 -18 163 -59 29 -152 54 26 -149 111 -90 -148 -107 -1 5 84 182 -81 261 86 65 -213
6903 -213 157 226 71 -73 -125 -190 -119 -147 -25 -140 -287 69 108 -194 188 132 91 -74 -87 -84 -205 -5 -29 169
6927 169 116 -25 162 -13 -16 76 184 249 -61 -15 178 -143 -108 -97 -60 68 -209 244 232 78 -147 145 46 -180
6951 -180 55 330 -192 -94 -3 -148 -57 -249 14 62 23 153 -68 -70 -126 174 -40 -443 -47 174 -18 10 142
6974 142 -126 146 -91 -23 -140 178 -13 -72 22 60 -35 -122 27 82 205 33 184 295 -67 202 39 -307
6996 -307 6 -12 78 21 -9 135 -219 -72 -53 -191 250 -47 212 -26 -81 58 -90 79 81 56 122 45 -174 -146
7020a46J26M6J54j76k05J88J22k79R5K65j72J49j17K3lk65J92N0Jj06j52K00l2
7043d2Q4J9L3P5l04J41Q1m4J13M9j11l9l7k01L80J7Mk65K12j5k21j0k21K30j82
7068b54j77K59J51r7J18p3M2K24j12j26KL7nj9K2Qm9K50j75k55K43j8j27O1mM8
7094b6j18P4M9O5L3k9J43m8j29k70M96q3j90lJ05k03Q1o3K50k15o4k9L3J79j42
7119a04J28p0K4M89n21J41n7r4RJ11q6j12K3K10m2k37K76O5Nm0L3j60k2q4j2L50
7145B23k09J9N6p5k52J42j05k9J16Q2K56k55L5J98k70k59J50M29m38K71j21p8
7167a14M77m97L99j54NK3k79J75J6K6J9l61M22l19Q5J41m4j70J08J97K3m20J33
7190a09k0N1M12l22nJ97K9l32K04j26L0J16m59J31K4jJ67k63K08kK51k03m7N26
$$ plain form
7020 -146 -20 26 180 4 -201 -13 109 -170 -75 190 18 167 50 73 70 -195 -3 47 48 -58 -210 -10 -42
7043 -42 42 61 94 169 -135 6 87 43 156 205 94 55 18 -183 197 214 218 -47 165 150 -71 -81 -302 -72 -254
7068 -254 -431 -172 -21 -118 0 -73 -31 193 81 -45 -43 -6 -11 -30 -8 0 -49 201 26 -229 14 -4 -131 -70 -74 -26
7094 -26 -144 -70 -21 44 77 48 191 143 14 -256 240 157 -33 -36 69 -134 -53 -116 134 -81 -145 -174 -141 38 -104
7119 -104 24 -46 -22 467 -54 87 30 -64 -55 56 -30 -142 -119 91 49 -188 88 153 158 118 151 -9 -31 -115 -127 223
7145 223 14 33 89 14 -238 -96 -201 -230 -114 -32 224 -31 4 202 -68 -327 -177 252 -186 85 -36 -114
7167 -114 363 -134 265 111 116 139 -140 35 51 77 96 -265 157 -162 -77 64 20 -150 -42 155 178 -242 -109
7190 -109 -129 -78 334 12 7 204 233 -99 105 -21 9 125 -334 -203 -179 -180 -13 -276 -68 -70 181 -22 -69 457
7214D57k50m44L86k69Q1K77j92r8N6l3Q1r9P9j86L12j30j52M64l98Rr9K55j17
7237a0K56m69O8J93o5J75j60R5j01L18m91K97j30J96l81K18K6j7k6j2L95m86K07
7260I6J22k77K01l0k56Q1J42k24j68K95l21L35J45j4m1J5l4J87j63k39L37O0k54
7283ej45K20m9Q0K92m08J29r6k7j07K45l77N79l61r4J42J56L5l62k45P71m79P8
7306b8N1m2L8J17l7q0J28p0j38J47j7J11k14K71J4k64PL8J68l2j60J6k3l25K53
7331g1l9k0J14N5J47k13K03l24L9J62Qj99K71l8R4k65J28J11j84k48L14N2l11
7354b14M88o2j71L5k70M41j22k70L36o1l24J29L0O5J0R8j51p7K73j66O0q6k41
7377b50K10J8J44M2m5K9l35J53J10K71l49J63j95K87j1m96J90M41j69j96Q5j0
$$ plain form
7214 457 207 -237 149 -120 -39 238 46 -52 4 -29 52 -47 32 -154 158 28 -124 340 -58 -49 -148 107 -10
7237 -10 246 -223 -155 38 -27 148 -12 83 -18 300 -191 106 -24 172 -209 9 35 18 -8 -20 375 -111 96
7260 96 218 -59 142 112 -144 -63 79 -145 -313 -18 -339 -4 141 127 86 101 67 254 91 -148 189 249 -5
7283 -5 -150 70 21 101 393 -15 114 18 -9 -116 129 -248 331 -30 -124 18 174 209 -153 -398 373 -106 -28
7306 -28 23 -19 19 136 99 19 147 77 -61 86 69 180 -34 237 251 -13 -6 32 200 168 8 24 1 -324 -71
7331 -71 -110 -130 -16 39 186 -27 176 -148 -109 53 61 -138 133 95 189 -76 52 163 -21 -269 45 97 -214
7354 -214 274 212 41 76 -194 247 125 -145 191 130 -194 -65 -35 30 40 138 -13 -90 183 17 77 -9 -250
7377 -250 -40 -22 122 164 119 148 -187 -34 76 347 -2 161 -34 253 242 -254 -64 377 208 12 97 87
7399H7J2qk38L3K02k15pL4k8J72o1k64J96J6k1K45n0Pk36L34k39q0K01J8k39o5
7425a94L06M0k92J88l7o6Mk3J84k3kM8j99J48M4J41l16L53k67KR7o9pk13J94J71
7451B12m23J40P0j29K27K2J6k00k65K64j05J74K50j17j79M2J98o1j0j76Q3J40
7473A73l01nk3R2J57j09K06j21jj22K74k46j06K24J41l54J94j97P7n1MP2J04n8
7497B4q8R7j34K86o0L8L0m3J59m57L53l53K21J47m47L96k33j96L7Q7J57j00K22
7520A43j20m4N1J41k73m6J82P8j85J85j97l6J72K6j59p1L83k47K4J93l06jJ37
7543C0j29J42l8O3k7l6J64j54N6l7k6J30m7J4K3k92J48K31k05k34J89j22P3Q4
7567@oO4J23M9m66L03J10N3k36m2O4n9j15j5K68kj26J4n8k4j19N84o22K69Q0j61
$$ plain form
7399 87 99 91 -147 -114 88 -127 -134 -100 -128 44 -17 -281 -85 -69 -90 155 105 112 -124 210 -29 -109 92 110 -129 -194
7425 -194 112 152 -140 48 11 -55 -51 -74 110 87 85 133 -66 82 126 267 -49 304 37 39 136 67 60 -153 41 212
7451 212 -211 -71 -1 -130 97 119 135 -65 -330 -66 -171 3 253 136 -43 -1 197 136 126 -50 33 173
7473 173 -128 -133 -156 -64 93 -16 190 69 68 -54 220 -26 -132 92 233 -121 73 -124 -47 -98 -94 -22 82 24
7497 24 -64 33 -101 185 125 163 193 150 309 -148 205 -148 73 220 -227 169 -64 -260 -223 -136 21 -79 143
7520 143 23 -21 30 171 -102 -148 34 112 -73 112 -85 -121 51 77 -82 -153 230 -17 7 200 -106 -107 30
7543 30 -99 43 5 68 41 5 169 15 71 34 8 138 91 105 128 -164 -16 215 10 -224 -35 -157 -84 0
7567 0 -6 58 181 230 -236 67 177 230 -6 -48 16 -43 -158 -173 95 93 -33 -19 -77 -101 -220 364 -258 11 91 -70
7593g0J61k11rQ6K8r6J9J02j92J39P0Pk15J06J68j54MJ12K5L34m56j0K27j98M8
7618B5j4J0J81o0j10m9p2K13r3O8K09k49j57l7r1L24m9j64%R9J43j62L05l6k23
7643A1l9o1p6K52l6J0k52J64L9k19J68M1K6n4L1k34O5L36j69j65M1K40o8o1j33
7668a43K69q8J21r5K92n26J3N6M7q1J76k7q7J93j05M4m1J33k05O2k04N5L77r0
7692A46j77R3k4Q6k14K21j21j1p7L67m05J97j78O8J0k5M0r8J19J24l37L54l94
7715b36O53m18j13j6L7m6oJ8J12K63l26K38k37L8L1J09m58N74n6p0l35L68j91
7738f7L32l32j40K64j01n6R6Q7j76J13K62n02O0J59L10m01J73Pr7p7p8K65q5Q6
7762A02n3j67L2j97K05j9J0J47L1K5O0P3m4k73N13l56l27N24j11k21q9J96r0m1
$$ plain form
7593 -70 91 -120 -129 -43 -15 -111 -92 10 -182 -43 27 34 -181 -75 93 -61 -57 55 80 414 -42 -52 175 -23 25
7618 25 11 21 202 142 32 -17 -89 124 31 99 308 59 -98 -135 -226 98 49 -115 -115 -16 127 -35 270 234 11
7643 11 -28 -89 -165 87 51 61 -191 -27 12 -207 -39 2 28 -26 5 -229 -164 172 3 -162 -121 119 51 -10 -143
7668 -143 126 38 159 64 356 -170 -157 -101 -54 -135 41 14 -73 120 15 59 18 151 -54 8 -196 -141 236 146
7692 146 -31 62 38 124 -90 131 10 -1 -78 289 -116 81 -97 -29 -19 -44 -4 -102 17 141 -196 158 -236
7715 -236 417 -1 -114 -130 -93 -139 -145 -127 -15 248 -78 160 -77 -39 -8 101 -357 217 161 91 -244 124 -67
7738 -67 265 -67 -207 57 -44 -100 -4 83 -93 20 282 -220 -160 -1 309 -92 81 88 -9 -86 -164 101 16 102
7762 102 49 -118 -86 -283 -78 -97 -87 60 91 116 176 249 205 -68 445 89 -238 286 175 -46 -135 61 -29 -70
7786g0j1o8J60o1j11L02j67j02L94j20l59J20J79l3J17k90M18k7l84L55l99j35
7808b92L19Pk24J81n7K63l87L21J25j33Q8k60nn6L6qk9J42m06O50k54k33K50l52
7832c14kJ04M01l15K89o5k95K33q1P8n6Mj48M31j93J43j97j50P3J68j90J15Q7
7855A20j49k42J58O2n8K27M6j7p5qp6K6o2M6oj75k1J66O3j92k3J73j57M08j01
7880A33j89j77K54J01Q5q0j77K00k33j28J60j05O1M1j52J02J97L2l16K76J5j11
7902a1j84K02L17m81O8P4j43K06j9K60l26j11J69K28l99J34m1p1J31l28N12Lq8
7925A02j52J58j41R7j28k65N19l91L31j10O6K2N9Lp5k40J74J62l18k0O6J28J6
7948F3L0l30KJ88kJ89K67n64K73rl09J06J69j13m3J8P5r6J1M7p8K01j2r2K60j90
$$ plain form
7786 -70 -81 -149 11 -50 -161 141 -26 -128 266 146 -213 -93 86 53 170 -120 298 271 -113 242 -157 -292
7808 -292 27 34 -190 -9 -66 197 -190 131 256 123 211 -49 -54 -110 -74 -82 -111 31 -375 275 21 -212 38 -314
7832 -314 -316 -212 189 -126 163 98 -197 36 -45 33 -23 -19 -167 264 71 214 17 -133 -60 108 -82 33 120
7855 120 -29 -271 -113 -51 -109 118 164 147 72 64 -12 14 -48 -2 -8 -183 -204 -38 25 -167 -190 -17 -174 234 133
7880 133 -56 -233 21 122 207 127 -50 150 -83 -211 -51 -156 -95 -54 -206 -104 93 125 -191 85 100 -11
7902 -11 -195 7 324 -157 -89 -15 -158 48 29 289 -37 -148 21 249 -150 -16 -57 -128 3 -325 187 190 102
7925 102 -50 108 -33 64 -64 -329 190 -201 130 20 86 108 167 170 95 -145 29 191 -127 -147 -81 47 63
7948 63 93 -237 -235 -47 -49 140 407 -157 116 107 -202 -96 73 -40 -83 -65 10 -86 -75 -28 -106 95 83 -9 251 61
7974F1mk7m8J32j16J57k22j37P3J07j81J24J69l08K77j58L64l37o3K29l09o7M07
7997A23j10j10K22m4l37K08R0Q3k33O7j35J19K43k22j68J47L6J2j3P2J73j93k81
8020b51K35N1J49j05M5l17m6L35J52l55J59j88J45J30j81K60l52k16L11J42j75
8041g2L09j65l58J03K07m0J42l27J58J08m6Rj93J83J79k74K01l57K27j9J13J22
8063B10j76L03m90M46k03j63L25k13q2r5J8Q5K87k67K0L57k38j45J55j88j6n6
8085a26O41o01n0L2L4Q2l4M8n1J03l55K34j66L2R4K87l9l16O9J68j24K84j56k4
8109F6o0m8R6k24L1J27O0k22K16p0j79J39J99p8j95J10J26j64j95M23r0j6J73
8132B25k51M24l86j04R9J16l7K1Kk89J88j72O5L39k89n2J57L8k38K29rrM2j69
$$ plain form
7974 61 57 30 -18 114 -2 155 -67 -204 -131 -24 -205 -81 88 -220 57 -101 263 -74 -137 92 -217 -284 123
7997 123 13 -97 125 81 -256 -48 42 125 -108 -41 -176 -57 186 -36 -204 -57 -21 -9 -22 50 223 30 -251
8020 -251 -16 35 184 79 124 -193 -239 96 248 -107 52 -136 9 139 -42 218 -134 -350 -39 103 -72
8041 -72 237 72 -286 -183 24 -16 126 -201 -43 65 19 28 -165 18 197 -77 124 -233 -6 -25 88 210
8063 210 34 337 -153 293 90 -73 252 39 -43 -138 -120 -35 252 -15 5 362 124 -21 134 -54 -70 -126
8085 -126 515 -86 -136 -104 -70 12 -22 26 -25 78 -277 -43 -209 -177 -83 204 165 -151 -82 86 -38 246 90 66
8109 66 6 -42 54 -170 -139 -12 48 -174 42 -28 -207 -68 131 53 -142 -32 94 -70 -265 158 68 52 225
8132 225 -26 398 12 -92 7 123 86 107 109 -180 8 -164 -99 240 -49 -101 56 94 -144 85 76 67 109 -60
8156f0J31j35K7J38J48k46j00J93o3N5j89M6n0K35m6j70Q0J70R3k57j24J97l0
8179D3j8J53l39k9j49o2N46l06N7J50k09L14
$$ plain form
8156 -60 71 -64 -37 101 249 3 -97 96 33 88 -101 -55 -105 130 84 -86 -6 164 257 0 -124 73 43
8179 43 25 178 -161 -190 -339 -401 145 -161 -104 46 -163 151
8191A51
$$ Imaginary data points
##PAGE= N=2
##DATA TABLE= (X++(I..I)), XYDATA
0@%%%%%%%%%%%%%qJ6j6J6j7K5l2M0m8N6o4P2q8J04j20J37j55J79k07K34k64L01
35A61l39L80m28M77n34N97o62P34q13R00r95J101j214J336j473J623j790J972
53A033k173K401k657K944l273L656m099M627n272O071p094Q461j0389J3327j8406
68a0843K9589j01615P8961J53370j99741n4431J43018K7507j07063K7637L8709
79B5098l0268M069L3076m1318p387L9967j3421l1033L2515l757l4611K6048K4990
92B3968m7324p96M7393k1812l5423M7980J5778n5827N413N9000j7905m7474K0635
105f394L3233j6529j9897L243P582L872l351j1244M3P822Q90m46j928p226O898
120c432J5196o728j3580Q316J0367j552l795r193L5K1439m947l6053J2662M0835
$$ plain form
0 0 0 0 0 0 0 0 0 0 0 0 0 0 0 -8 8 -8 8 -9 16 -16 24 -24 32 -32 40 -48 56 -64 73 -82 97 -110 124 -140 161
35 161 -178 202 -226 251 -283 314 -348 386 -427 473 -522 579 -635 701 -772 851 -939 1033
53 1033 -1140 1261 -1396 1548 -1725 1931 -2168 2459 -2813 3258 -3836 4625 -5764 7563 -10843
68 -10843 18746 -82869 -3908 149462 -50279 -104710 38308 65815 -41248 -13611 25098
79 25098 -5170 -1101 31975 -9343 -16730 23237 9816 -21217 11298 7541 -27070 -1022 23968
92 23968 -23356 -24152 23241 1429 -33994 13986 29764 -26063 -20650 38350 20445 -27029 -6394
105 -6394 26839 10310 -9587 -6344 1238 5110 1759 -9485 -9442 -1620 -730 -1176 -3104 -10330 -3432
120 -3432 11764 5036 -8544 -228 10139 8587 4792 -4401 -4366 17073 12126 -23927 -11265 29570
134B9570k8701m0670M0668K9295m7182j1093M3658n448k5731J9808L942j9529
146a1413K2596J0509l9395Q015M3641k9885l5584M5073J2073n3658J2240M5287
158B9499l5843k8252M7258N368m4265J7282L1493k8494p808L1749j1820k0381
170a4214K6840K881k9167J4755J7739k8558j334K9084k0483k2455L3905N906l9042
183b4143J1598L3864k4396j8336L1508L128k5636J3408J5073k1018n03K2385j1621
196E311j8389J6640Q852j7858k927R721k674k055K528o136L48J1957k403j1148
210h233N770J0339l465o321K256N273R90o162l735Q108J517j2982j78J3095n050
225A222j2263O873O654o395J684L708q128M063J5120r443j4462J5438J0896j5710
$$ plain form
134 29570 869 -39801 867 30162 -17020 -28113 15545 10097 -15634 4174 8116 -11413
146 -11413 11183 21692 -17703 -9688 33953 4068 -31516 13557 25630 -28028 -15788 29499
158 29499 -6344 -34596 12662 18030 -26235 -8953 22540 -5954 -13762 17987 6167 -14214
170 -14214 12626 15507 -13660 1095 18834 -9724 -11058 18026 -2457 -24912 8993 14899 -24143
183 -24143 -12545 21319 -3077 -21413 10095 13223 -12413 995 16068 -4950 -5453 16932 5311
196 5311 -13078 3562 12414 -5444 -8371 1350 -1324 -3379 -851 -6987 -6639 5318 2915 -8233
210 -8233 -2463 7876 4411 -1910 346 5619 6609 447 -3288 4820 6337 -6645 -6823 6272 1222
225 1222 -11041 -4168 2486 -3909 -2225 1483 -6645 -2582 12538 3095 -11367 4071 14967 -743
239g43k580Q949o115j95J0676j2696j3690J9827R551k4280k819K0968m973j0645
253h765J1907n78j1683J3714R455k0280m72K1621q673j6910J5566P145k0690P52
267g891J7862r358j2582J0772K773q444O885L517j2376L398J7238o246j4134P430
281a156R990k968l788l592k041R249M057j4388o267J3097L674j0347k100L870
295b710l40L532L046p917k241J1704L191j0222n32P489P14m831q45K225N02l526
311g61l224M263L106p872m822R431N883j0270n009R095N476l078l372j323L685
326A208P220k363j0462J263J0342j289r277n64L822L08o91j808l965L091N690
341B525l840m335N643L639n224P60O985k550p392N115Q088o557r057N985P010
$$ plain form
239 -743 -3323 5626 -489 -684 9992 -2704 -16394 3433 12984 -11296 -14115 6853 1880 -8765
253 -8765 3142 2564 -9119 4595 14050 -6230 -6702 14919 6246 -10664 4902 12047 -8643 -7891
267 -7891 9971 613 -11969 -1197 1576 -6868 17 3534 -8842 -5444 11794 5548 -8586 -1156
281 -1156 8834 5866 2078 -1514 -3555 5694 9751 -4637 -10904 2193 5867 -4480 -6580 -2710
295 -2710 -3050 482 3528 -4389 -6630 5074 8265 -1957 -2489 5000 5714 883 38 2263 2765 -761
311 -761 -3985 278 3384 -4488 -9310 121 6004 -4266 -9275 -180 5296 2218 -1154 -2477 1208
326 1208 8428 6065 -4397 -3134 7208 5919 -3358 -3922 -100 208 -483 -2291 -6256 -3165 2525
341 2525 -1315 -5650 -7 3632 -1592 -832 6153 3603 -3789 1326 9414 2857 -6200 -215 6795
356F795o944o817N331L410n251n14M184j612k478M349K303l711M64L169m21o60
372A597J983j622k582L144J159m517k054K677j19j474k50j474r1M361J78n140
388d224J486O927j260n103K800M676k678k198J920k70k071R23K71l218m13K481
404D9j121k856J438J569j408J117K012j813j22M916K09n658J964O186l519n383
420b420M469J380n809Q28M549n882l984Q461J020r714K749Q576n134m132Q599
435C556o5p896O462O642j0120j638J0329m288q312Q245J979j2407L598J0961r823
450b777q217J2442K892j0892M798O252r146K408J2757r190j0813J4543P371j5755
464c327j932J1688m909n302P211l671q874R938N974j4457j255J4722l406j0569
$$ plain form
356 6795 -149 -6966 -1635 1775 -3476 -3990 194 -1418 -3896 453 2756 -955 -491 2678 2257 1597
372 1597 3580 1958 -624 2520 3679 -838 -2892 -215 -334 -1808 -2058 -3532 -3623 738 916 -4224
388 -4224 -2738 4189 2929 -2174 626 5302 2624 426 2346 2076 5 928 1199 -2019 -2432 49
404 49 -1072 -3928 -2490 -921 -2329 -1212 800 -1013 -1135 3781 3990 -1668 296 6482 2963 -2420
420 -2420 2049 3429 -2380 -1552 2997 -2885 -6869 1592 2612 -7102 -4353 4223 -911 -5043 3556
435 3556 3491 -4405 2057 8699 -1421 -3059 7270 2982 -5330 2915 4894 -7513 -3915 7046 -2777
450 -2777 -10994 1448 4340 -6552 -1754 4498 -4648 -2240 10517 1327 -9486 5057 12428 -3327
464 -3327 -5259 6429 1520 -3782 3429 -242 -9116 822 6796 -7661 -8916 5806 2400 -8169
478h169R384N216j0033J657R790m742o811O458J962n682J876K158o805l21P944
493C882k462q738K297P236j071m494M45K628J304J765l34l822l51O967J871q766
509a643l061Q356K128q096q33L816l270MN604n410o225R783N183j1572j43J2508
525G129n310p547J1336J538j3064N737J0716j1869o017J3715l445j2739J1091
538A271O223j7657J534J8910r346j3935J4753N843j4157N458J0918j3127l109
551f421J8249n523j6850J2468R206j6688k31J4189j0193r655J6397Q37j7722O889
565e048J4518j1862n362J3817k767j0201J1111N003j3756J702J2022p345p577
578e745R703r9j0073N161O303r293l432R821p36o464K840L393k740J927L055l949
$$ plain form
478 -8169 1215 6431 -3602 -1945 7845 3103 -3708 2750 4712 -970 906 3064 -3741 -4062 3882
493 3882 1420 -7318 -5021 2215 1144 -3350 -2905 -277 1027 2792 2458 -1364 -1715 5252 7123 -1643
509 -1643 -4704 3652 5780 -2316 -3149 667 -2603 -2599 3005 -2405 -8630 1153 6336 -5236 -5379 7129
525 7129 1819 -5728 5608 7146 -5918 -181 10535 -1334 -7351 6364 2919 -9820 1271
538 1271 7494 -10163 -8629 10281 935 -13000 1753 7596 -6561 -1103 9815 -3312 -6421
551 -6421 11828 6305 -10545 1923 11129 -5559 -5790 8399 -1794 -11449 4948 5785 -11937 -5048
565 -5048 9470 -2392 -7754 6063 3296 -6905 4206 9209 -4547 -2845 9177 1832 -5745
578 -5745 3958 3859 -6214 -1053 5250 -4043 -7475 2346 1610 -4854 -2014 1379 -1361 566 3621 -328
594c28j803N490K500m931l717L464L939l318m751J052L413j876p69J25k313J567
610b256N522l182o681P250P121q873l305R844q06p949N639L550r891K504Q543
625G030r010n914J2168j181j2586Q090P994j3052m88J5719o801j2358J3840O743
639A0194j5470K530J2690j0362n820J5225m234j6431J1545J1325j6851m863J6031
652E509l001j1122R114K856j0344O744Q757j2198k507J5044l792j1944R786N514
666H416j3342K211J1871r632r258J1993L486j1970J490Q129n824k119Q061k980
680E32o061O731M869o356j690M452J65j130O89k465j558L646L43m196j421K699
696g51J064j340j784Q16K615n15j963K910J145l675J404N184m039l440N343K10
$$ plain form
594 -328 -2131 3359 5859 928 -2789 675 4614 1296 -3455 -2403 1010 -866 -1635 -1510 -3823 -2256
610 -2256 3266 84 -6597 653 7774 -1099 -4404 5440 4634 -3315 2324 5874 -4017 -1513 7030
625 7030 -1980 -7894 4274 3093 -9493 -1403 6591 -6461 -6949 8770 1969 -10389 3451 10194
639 10194 -5276 -2746 9944 -418 -6238 8987 4753 -11678 -133 11192 -5659 -10522 5509
652 5509 2508 -8614 500 3356 -6988 -244 8513 -3685 -6192 8852 5060 -6884 2902 8416
666 8416 -4926 -2715 9156 -476 -9734 2259 5745 -6225 -4735 3394 -2430 -4549 3512 532
680 532 -5529 1202 6071 -285 -1975 2477 2642 1512 2201 -264 -1822 1824 2167 -2029 -3450 -751
696 -751 313 -1027 -2811 -1995 620 105 -1858 1052 2197 -1478 -74 5110 1071 -2369 2974 3184
712C184n584L071K901q018j14R555m323r260O947O109o790o64N294m306J54Q522
728F678m818r060J0318O267j2559j557J1415m942p879Q586J405j1049L940Q521
742E266q107l552R057k223o077Q398K571j0610L260J0390o755n915P860O49p276
757c064M404K717q638J341Q282n256p087O961K840o010K081L591m298l10O989
772D543k095n195L481L282k899m29M14k279K126K047m381k240M095O3l295J262
788a500J261j726N97K533r98p20J542K02L6J302j843j457L222L36m168j6K894
805A497k398r33K201j935k228M524K24m822K380M335l024j673M505n28l537L508
821B096J998m964j8L373k168j828K182r02k834L813j68m766K004N047l777k783
$$ plain form
712 3184 -2400 671 3572 -4446 -4560 4995 672 -8588 -1641 4468 -2322 -2986 2308 -1998 -1844 6678
728 6678 1860 -7200 3118 9385 -3174 -4731 6684 1742 -6137 2449 3854 -7195 -3255 5266
742 5266 -2841 -6393 2664 441 -5636 2762 5333 -5277 -2017 8373 1618 -4297 3563 4212 -3064
757 -3064 1340 4057 -4581 -3240 5042 -214 -7301 -340 2500 -3510 -1429 2162 -2136 -2446 4543
772 4543 2448 -2747 734 4016 1117 688 1102 -1177 949 2996 -1385 -3625 470 533 -2762 -1500
788 -1500 -239 -1965 -1368 1165 167 -553 989 1191 1227 2529 686 -771 2451 2787 -1381 -1397 1497
805 1497 -901 -1834 367 -1568 -3796 728 952 -3870 -1490 2845 -179 -1852 2653 2125 -1412 2096
821 2096 4094 -870 -888 2485 317 -1511 671 -231 -3065 748 580 -4186 -2182 2865 -912 -3695
837c695N152J312l949J301K826k149l37K059j646j582K156j122k486J511J351
852G02l188P21K381j955j147K615L46j853J907P49j775J725K054l085j040L431
868B588o51l059R06Q90j887P67M82k358M67K916j821k094K905R02k324J798K169
885B596k764n60M062r22l599J878J330k554N00J437l550p17M126o27n072K352
901b084L602j740j506K289j09j064K804J96l388J032L121j622k453J613j02k106
917a517J211J268k859j135K878Q03k553M6J781L33j92J400j076j570K765K105
933C688l076k048K505J150k464m25O26j450L27K078j831k562K289K413j906r83
949a669K059N4p58K504L53l877Q13M729k341m070K182J777k937j16J834k376j058
$$ plain form
837 -3695 1457 2769 -1180 121 2947 798 461 2520 874 -708 1448 326 -2160 -649 702
852 702 -2486 -1765 616 -1339 -2486 129 475 -1378 529 1278 -497 1228 3282 197 -843 2588
868 2588 1937 -1122 -216 674 -1213 -446 36 -2322 -1855 1061 -760 -2854 51 953 -1371 427 2596
885 2596 -168 -728 3334 2412 -1187 691 2021 -533 -33 1404 -2146 -2863 1263 636 -4436 -2084
901 -2084 1518 -222 -1728 561 452 -612 2192 2388 -1000 32 3153 1531 -922 691 589 -1517
917 -1517 -306 962 -1897 -3032 -154 649 -1904 -1858 -77 256 64 1464 388 -1182 1583 3688
933 3688 612 -1436 1069 2219 -245 -670 -44 -1494 -1167 911 -920 -3482 -1193 1220 -686 -1669
949 -1669 390 444 -314 2190 2543 -1334 -521 4208 1867 -2203 -21 1756 -1181 -1297 537 -1839 -2897
966b897L844K33m683J085M047j060j620K085j0j671K708J176m239k94M306r14
982B096l986R93K164k849M1K662k557k267L739K177m117n19M002j80k254J921
998A066J141k728J440K304k686k573L324Q31l758L54K370l032o59M023j350m236
1014d169L958L138m961o6N566j785m564M492K688n940L72N447l155m390M517P84
1030A932n488J942M372m901k159O390o33n521L660L892m753m95N740k539m510
1045c071N299K048o510J006M983m127l403N115K63n744K558L884l853j875N011
1060A584j07l938K924K123l209J91L831k760k347L648Q29m252j68L784j985l163
1076c015K325J477k712k10K746p27j859K317J681k906l9L404l76k987K010J584
$$ plain form
966 -2897 947 1180 -3503 -2418 1629 569 -1051 1034 1024 -647 2061 3237 -1002 -1296 3010 2096
982 2096 -1890 -897 1267 -1582 -1541 1121 -1436 -3703 36 2213 -1904 -2423 1579 1399 -855 1066
998 1066 2207 -521 919 3223 537 -2036 1288 2119 -1639 -1285 1085 -1947 -2606 1417 67 -4169
1014 -4169 -211 2927 -2034 -2100 3466 1681 -2883 1609 4297 -1643 -1271 4176 1021 -3369 1148 1932
1030 1932 -3556 -1614 2758 -2143 -4302 2088 1455 -4066 -406 3486 -1267 -1762 3978 1439 -3071
1045 -3071 2228 4276 -2234 -1228 3755 -372 -3775 1340 1603 -4141 -1583 2301 -1552 -3427 1584
1060 1584 1477 -2461 463 2586 -623 -432 3399 639 -1708 1940 2769 -1483 -1651 2133 148 -3015
1076 -3015 -690 787 -1925 -2135 611 -116 -1975 342 2023 -883 -922 2482 2106 -881 1129 2713
1092B713l247o53K947j752k748K994J697m758j23M406j547l464M453J412n337
1107c007K457N166m688l301O412Q50o076K258L569n256p25O087l747n812O440
1122F27K954p347M9O865l466l313N995j81n697M109M558o400j276O980k359o005
1138c907N529K246p609J281O399m288m606N383J051m281K100K591m069O18N764
1153D202l190m289M979K466m740p17L946k288k168L220m7m138Q65L223j864j841
1169b381J520P79j020J171O04q96k82J874R33j990p48J441Q31j529o72L94n85
1186e56k39J477j318k462K396K676k972j895L754L28k456K169J429l815J191M491
1202D198l156l893M584J454n413R38M240m609k474O056p01o145L542M550m580
$$ plain form
1092 2713 -534 -1187 1760 8 -2740 254 1951 -2807 -2930 1476 -71 -3535 918 2330 -3007
1107 -3007 -550 4616 -72 -3373 3039 3889 -2187 71 3640 -1616 -2341 3746 -1 -5813 627
1122 627 3581 -3766 -3717 3148 -318 -3631 2364 2183 -3514 595 5153 -1247 -2523 4457 2098 -3907
1138 -3907 1622 3868 -3741 -2460 3939 -349 -4955 428 1479 -2802 -702 1889 -2180 -1562 4202
1153 4202 1012 -3277 1702 4168 -572 -1289 2657 369 -1799 1421 1374 -2764 -1899 1324 -540 -2381
1169 -2381 -861 -82 -1102 69 673 -223 -505 1369 2302 312 -436 1005 1836 307 -365 29 -556
1186 -556 -795 682 -636 -3098 -702 1974 -998 -2893 861 1189 -1267 902 2331 -1484 -293 4198
1202 4198 1042 -2851 1733 3187 -2226 -1288 2952 -1657 -4131 1925 1224 -4921 -1379 3171 -1409
1217a409j095N046k290k698N635j58o346L360N533o254l131O858r74o157L730
1232c50K895n749K40N445l085k973M236O86m205K981L410m766M2M620j540m210
1248b323L399J634l593k46K458j883j314K614r67k024J670J206k240K11K613j102
1264A13j045J875N66j257J22O00r3l30n68L82K88o92j286R56N80j690K45J706
1282D72p63j453K086O10j772J294J302k110N78K168j924j570K705l39l167J173
1298g10K319k877q83K802p53j942K177N21l059K373K523l276r57M459p86l583
1314a652K309K447l919m89L448j894k266K546j38k346J415J246k637O23L007j720
1330b0j865L182Q82k974J066J670j453o56K157j780j796K275O46k755K41J393
$$ plain form
1217 -1409 -2504 2542 252 -2446 3189 3031 -3315 45 5578 -676 -3807 3051 2077 -4080 -350
1232 -350 2545 -3204 -2964 2481 -604 -3577 659 1345 -2860 121 3531 -1235 -1193 3427 1887 -2323
1248 -2323 1076 2710 -883 -1129 1329 -554 -1868 746 -221 -2245 -575 631 -1609 -1398 1215 113
1264 113 -932 943 1509 252 374 974 881 551 -17 365 653 -39 -1325 -369 211 -1479 -1234 472
1282 472 -291 -1744 342 952 -820 474 1776 -334 244 2412 488 -1082 1623 1284 -1883 -710
1298 -710 1609 -1268 -2151 651 -102 -2044 133 654 -2405 -32 2491 -785 -1742 2717 1931 -1652
1314 -1652 657 3104 -815 -1304 2144 250 -2016 530 392 -1954 -539 707 -1930 -1307 1700 -20
1330 -20 -1885 1297 2179 -795 271 1941 488 -168 1989 209 -1587 688 1334 -1421 -1180 213
1346B13j207o6J398j462m74K332J42j947J181J336j132J23J090j200r78J962m35
1363H76j770P88K66j491P41J172j776j212K500M40j673O79R67n27Q08P28j906
1380c90J2K781j186k761J512J904k316m18J388j041j314J579J28j385O50J093
1396B36q89O11J200j366k75K260k02j997O09J253j018n49O04j087l58J329n40
1413a79j488O02J139m81l21M15k75M86J026k87m62M26K4J73J80q35m54M86N09
1432F84j149m22N63k36l12P47m16j082J616Q97j639J69J642l97p24J214J1j918
1450g52J257R84j702p18J521j81j834J456J68k102J058K274k587o33L101j91k044
1467i25J193J634k216p5K696j324k427J975R46k468L7J543j177j241J950K02k263
$$ plain form
1346 213 -994 -1060 338 -1124 -1598 734 876 -1071 110 1446 314 437 1527 327 -651 1311 876
1363 876 -894 -106 160 -1331 -590 582 -1194 -2406 94 534 -1139 -460 507 -20 788 1516 -390
1380 -390 -378 2403 1217 -1544 -32 1872 -444 -862 526 -515 -1829 -250 -122 -1507 -857 236
1396 236 -653 -42 1158 -208 -483 1777 1575 -422 187 1440 422 -127 477 -610 -968 361 -179
1413 -179 -1667 -1065 74 -407 -728 -313 -588 -102 924 637 175 601 625 798 978 143 -311 175 684
1432 684 -465 -887 -324 -560 -872 -125 -541 -1623 -7 890 -749 -580 1062 665 -59 1155 1166 -752
1450 -752 505 1489 -213 -931 590 409 -1425 31 199 -1903 -845 1429 -1158 -1791 1310 1119 -925
1467 -925 268 1902 -314 -389 2307 983 -1444 531 1477 -991 -954 589 -588 -1829 121 323 -1940
1484a940J024J911j369p26K189j70j293J266Q05j775k24K148j446j719J104J263
1500A048j781q04J646m20r72J110P08j566M27J816q91j258K072N11j983L37J887
1517A887j438j211J731j02k186L06K053j717j291K181n67j320J382J131j309n97
1533a067K513j58k378J434J764j760p74J245l05j538J583k02k187Q69K451k066
1549e76j474K296P48k019O14J922j630p09K450m83k148R95K054j796r61J514J15
1566I12k272Q28R90j755k44K193q19j569J639J160j920M83J873j311j012K262
1582A438O38k518j20K483j465j637J560M33k330Q18J990k257r38K738k0k438J451
1599a74J647j737p38K685o95j899J574J413k672J73K148j562k000K645J68l409
$$ plain form
1484 -1940 -916 995 -374 -1100 1089 919 -374 892 1697 -78 -302 1846 400 -1319 -215 1048
1500 1048 -733 -1537 109 -311 -1283 -173 535 -1031 -604 1212 321 -937 1135 1646 -337 0 1887
1517 1887 449 -762 969 867 -1319 -1013 1040 -677 -1968 213 -354 -1674 -292 839 -470 -1067
1533 -1067 1446 1288 -1090 344 2108 348 -426 819 514 -1024 559 357 -1830 -961 1490 -576
1549 -576 -2050 246 994 -1025 -411 1511 -119 -828 1622 1139 -1009 -14 2040 244 -717 797 912
1566 912 -1360 -532 458 -1297 -1541 652 -167 -1736 -97 1063 -857 -374 1499 188 -824 1438
1582 1438 2076 -442 -562 1921 456 -1181 379 812 -1518 -700 1290 -967 -1905 833 813 -1625 -174
1599 -174 1473 -264 -1002 1683 988 -911 663 2076 -596 -423 1725 163 -1837 808 976 -2433
1615b433J229K648k153j450K945J33k156J426J623k471n2K820r81k336J565J024
1631A381k028R4J827k070j096K631k84k547Q57K041j043r36K042k64j308J343
1647F40J016j598p14J659J84j580M18Q17r43n06P93l83j498J265J013j216o86
1664a319J611L15j181O88R26j127QJ301k82j619J245R30j903n63J674p18j834
1681a848J967O71k388L45K607j292j760K061Q17k123R87J889j977r06K657p98
1697I09k507J820J679l363j14L035j417k143K149R61k668N69K132j446r97K822
1713A421l92k466J992J744k421p04K804r28k642J991N62k348N49J767j514j170
1729a755J859J97j825J187J391j363j22J401k49j278J242N22j432K59R83r19o03
$$ plain form
1615 -2433 -1204 1444 -709 -2159 786 919 -1237 189 1812 -659 -711 2109 1128 -1208 357 1381
1631 1381 -647 -553 1274 -796 -1892 739 455 -2092 -1235 806 -237 -1173 869 605 -703 640
1647 640 1656 58 -656 1003 1187 -393 25 842 -101 -607 186 -197 -1695 -430 583 -633 -1319
1664 -1319 292 607 -574 114 1040 -87 -79 1222 940 -679 566 1496 -407 -970 704 -14 -1848
1681 -1848 119 790 -1598 -1253 1354 62 -1698 363 1180 -943 44 1933 -44 -950 1707 909
1697 909 -1598 222 1901 -1462 -1576 1459 42 -2101 48 1009 -1659 -1090 1042 -404 -1401 1421
1713 1421 1029 -1437 555 2299 -122 -826 1978 1050 -1592 399 961 -1387 -838 929 -585 -1755
1729 -1755 104 301 -1524 -337 1054 -309 -431 970 721 -557 685 1207 -225 34 1017 98 -505
1746e05M44N8p42J37M57m83j49R67l80j07J24P27n7m33J01L40K65n82J13K21q33
1767c17J41P08j116p38J448J24r04O7J206r34k90J150j39j050R61J149j825J23
1785b36J642q97j696K049q4k002P81J734j829j075J766J46j429J194P39j668M07
1802d58K095j352j065J682J32j611Q84J151j792l96J737r93j566J617R63k147
1818a119L64J360r57n83J424l34q50J115O70j184PJ098p38o59J065m9j244N14
1836a00M39n87m84O34k79K4M45m82j26Q39J08o48M88K44j50J49K89m27o17O60
1856D19j4p97L75M2p74M60L83r66J1Q47N7o52R29K12p06N06N37j011J32R86m35
1877E41r88N87M51j203K16M52q89j89J320k13j027Q38L12n21M56L89l76l25P99
$$ plain form
1746 -505 -61 -3 -745 -608 -151 -634 -783 184 -196 -303 -179 548 491 58 159 499 764 182 295 516 -317
1767 -317 -176 532 -584 -1322 126 250 -654 -587 619 -315 -605 545 406 -644 317 1466 -359 -236
1785 -236 1406 509 -1187 862 778 -1224 -443 1291 -538 -1613 153 299 -1130 64 803 -865 -458
1802 -458 1637 285 -780 902 1034 -577 307 1458 -334 -730 1007 14 -1552 65 1028 -1119
1818 -1119 -755 605 -352 -935 489 155 -695 420 1090 -94 -87 1011 273 -386 679 630 -614 -100
1836 -100 339 -248 -732 -98 -377 -353 92 -390 -516 323 431 -217 271 515 365 514 803 376 -241 419
1856 419 405 -392 -17 25 -749 -289 94 -872 -861 -14 43 -609 320 532 -174 332 869 -142 -10 976 541
1877 541 -447 140 591 -612 -396 56 -833 -1022 298 85 -942 -104 208 -313 143 532 156 -169 630
1896F30K66j157M95N05q63L11K46r83J2R68q55p65R51K52m17K66L75o95J96P71
1916E09O6l42J63Q1m20M03R6n02o60R28n24n44P78l30n14N29L68p23K36J424q43
1937A79o56J197j18p63N17M61r40l48J009o42o85R42J29j534R17P35j064J63Q23
1956C22m32q26J266N76j167L59R45o50m91P34n5q95M42K77p34l83N75m6l26J92
1976c17M15o81K22P52l25j86Q48l67n79K67R12o26l26L27m61j64J99L06o25p5
1996d84J13J83j80L9M72j81k77K04L74l2j62M52j36l50J14J12l88%M28o30l86
2017g15Q04J17j064L08R63o14n09J128j52r83J359K13j225J61J222m63j286R98
2035B62K38r46n3Q06n19j031J160K48j050L56J224r82j52J153k95j027O85R56
$$ plain form
1896 630 896 -261 234 739 -124 187 433 -550 -538 430 -425 -1190 -239 13 -404 -138 237 -458 -262 509
1916 509 575 233 396 477 57 460 556 54 -606 322 -202 -746 32 -298 -812 -283 85 -638 -402 1022 179
1937 179 -477 720 602 -161 356 817 -123 -471 538 -104 -789 153 282 -1252 -335 400 -664 -501 322
1956 322 -110 -936 330 906 -261 98 1043 393 -98 636 581 -314 128 405 -329 -712 -137 -183 -509 -317
1976 -317 98 -583 -361 391 66 -120 728 361 -218 49 961 335 9 336 -125 -289 -90 216 -409 -484
1996 -484 -371 -188 -368 -329 143 -38 -315 -111 263 231 69 521 385 35 149 261 -127 -127 301 -329 -715
2017 -715 89 206 -858 -550 413 -201 -710 418 266 -717 642 855 -370 -209 1013 550 -736 262
2035 262 500 -446 -499 307 -212 -1243 -83 165 -885 -529 695 -287 -439 714 419 -608 77 1033
2053A033j094k56J118l85j206J076L56j518M94R43r76p58J464N4j152L21Q90l58
2071D6k94R32m13o72N18J008j185o60J057P7j053M56M38r60K28P14l27j012J298
2090A96J44m53k52N93j81j69N31N60j233J58R29m26r03M98L27o43j21N40n32p74
2110a211J657k86p36L73P81o43m51J220n4j134J054M68j185k93J068m52j112R33
2128cM42j005k35J116m57o84J048K54j122O49Q09p30l30J146m62o42J82P84j057
2147b97l02J002j46j033N70L49o93l18J327n15m77N41N99p87J1J098m74r77R22
2166D00L08q24j65P18l37o05Q63k27j100N77P89o49o00R42M26j206O41R66r26
2185ij45O60j57q02P98L48j133r1J247q47n98N54N09j253M19P71j93p19R51L18
$$ plain form
2053 1033 -61 -317 801 416 -790 286 642 -876 -382 561 -415 -1173 291 345 -807 -486 404 46
2071 46 -248 684 271 -401 117 1125 -60 -720 337 414 -639 -183 255 -705 -477 237 -90 -1102 196
2090 196 340 -113 -365 228 47 -122 409 969 -264 -106 823 397 -506 -8 319 -324 -445 95 -437 -1211
2110 -1211 446 160 -576 -203 578 -65 -516 704 650 -484 570 1038 -147 -440 628 176 -936 -3
2128 -3 439 -566 -801 315 -142 -826 222 476 -646 3 812 82 -248 898 436 -206 -24 760 -297
2147 -297 -599 403 257 -776 -206 143 -550 -868 459 -56 -533 8 607 -180 -169 929 455 -522 400
2166 400 708 -116 -281 437 100 -505 358 131 -969 -392 397 -252 -852 90 516 -690 -49 917 -9
2185 -9 -154 506 349 -453 345 693 -440 -531 716 -131 -729 -175 334 -919 -500 271 78 -641 310 628
2205F28j117M61Q76o90l56J109o45o03N40L31q79J38O32n30p86Q15K31p99M29
2224b15K79k98k41R90k19l51J32K71k28j49L39L7m71J55L11m54p11O13L63m73
2244c20j06O37n68j14M97J50m02L42N16o70k21N44K92o41L13J55m92m40P43j63
2264E2p11P82J03p31M08O34p55j18Q06j47o44K31J101q75k37N29l14n28O37K44
2284D67j159m1J459o71j053Q54O52q79M56J77n14Q8P99j54q24N23K16n19k84P94
2304C87j96r08R03j23o61M3N95k95k56M64o4l59M41N54p03J53K90n2O2j05J35
2325C05m86J76Q0j50j61O7j7o2p0J81J03J43j87j6K52o1J90K01m45K40q1Q6j04
2348A84j33K0k29j48K58k28r5J46J49l80o1P97K4o34L85M23o20M54M50p27O8J53
$$ plain form
2205 628 -489 -28 848 158 -198 911 266 -337 203 534 -345 -207 425 -105 -891 -76 155 -644 -215
2224 -215 64 -234 -475 515 296 -55 77 348 120 -29 310 347 -124 31 342 -112 -823 -210 153 -320
2244 -320 -426 211 -357 -471 26 176 -226 116 632 -38 -259 285 577 -64 249 404 -88 -528 215 52
2264 52 -659 123 226 -505 -97 537 -218 -336 470 323 -321 -90 1011 136 -101 428 114 -414 223 467
2284 467 -692 -733 726 55 -998 -144 508 -371 85 262 -252 -164 635 481 -343 180 396 -123 -407 387
2304 387 191 -717 186 63 -598 -555 40 -255 -511 -47 -111 -470 -29 525 -178 -25 265 213 275 170 305
2325 305 -181 -5 75 -75 -236 -169 -186 -248 -318 -137 -34 109 -78 -94 158 97 287 488 43 283 202 288 184
2348 184 51 71 -158 -306 -48 -276 -371 -225 -76 -456 -517 280 304 -330 55 478 -142 312 762 35 103 256
2370B56j19n11J32M26n02q1M84n50P3O96l35l54M54K95n46O3M91l68k10K46L30
2391C70n30O22j25p17j76P76m48k88M80m2l82K13N47m86J07K88J29m77M58j79
2411A40j85L23J30n44q2M36k90j60M48k90l44K34L9k87L52N60m82j57L64P1l24
2432d8J86L76n81L00K84p64j46N93k62m23N79q9p6j21L79m33j86O52P3l92J25
2453B6K48k79j28M77pm72K42K59m99K44r1j91Rm3L8J65P9k80J93n8K77k81K90
2476B18J73k43m3K54n0j56j59j81K71n5L6l74K47J48k94J17M3j1j9J5J75j06R5
2499A01K41m73J89O87q03j14M00P3o57M01k5m98L13R2k86j70M67M64p26K90K46
2520B12k51k60P94m83k62N32n2n84K34J85j8r90J145k43p45O47N28n13l16N05
$$ plain form
2370 256 137 -374 -242 184 -318 -399 85 -465 -392 304 -31 -385 69 364 -182 -119 372 4 -206 40 370
2391 370 -160 462 337 -380 -556 220 -228 -516 -36 -78 -460 -247 300 -186 -79 209 338 -139 319 140
2411 140 -45 278 408 -136 -218 218 -72 -232 216 -74 -418 -184 -145 -432 -80 480 -2 -159 205 276 -48
2432 -48 138 514 -67 233 517 -247 -393 200 -62 -485 94 5 -71 -192 187 -246 -432 220 293 -99 26
2453 26 274 -5 -133 344 337 -135 107 366 -133 111 20 -171 -162 -205 -167 -2 77 -203 -10 -68 209 -72 218
2476 218 391 148 105 359 309 153 -6 -187 84 29 65 -309 -62 86 -208 -91 -48 -59 -78 -63 112 6 101
2499 101 342 -131 58 745 -58 -172 228 301 -356 45 20 -478 -165 -73 -359 -529 -62 402 -324 -34 212
2520 212 -39 -299 495 12 -250 282 230 -354 -120 65 47 -943 202 -41 -786 -139 389 -124 -440 65
2540F5J02n35O49j19r3jP63n73l87L00l5j61K65M4n18o8M46m09l1J74J67N4l05
2563b06L70P8k71J76L46m14Q7J67k97j94M26J51l40k60j41J47LO5L31n76L89O2
2585I9K16n38K24L53k35r6N48j94o37M16k7k47R4J46j35m60L15K3k85M05J42l37
2607b10r9N68l0j23k8L67m86K6J60J49m85N40j47l96j71M71j29l16M26Q8o70K57
2629b38M78j57l17M65P2m18K25M22o28J14K57k28k32K80n0n82L9N37j79k66M17
2650A1J66o8J0K34J5l94M08M9m40q9O63k83m88N92k50n08J54K73j49m01M69j74
2672b00n27N23L29j28p7M96m2o45M34K91n45o4L81l81O3n8J66l71K11K14k05o76
2694h11R01q1k50j22N47k6l36L58J26l69J59L42o40q3K82l60J39Q6L74j87l62
$$ plain form
2540 65 167 -368 281 162 69 68 831 258 -129 171 136 -25 240 284 -234 -302 144 -265 -296 -122 45 99 -206
2563 -206 164 242 -29 147 493 79 166 333 36 -158 268 419 79 -181 -322 -175 -172 -107 224 -352 37 99
2585 99 315 -223 1 354 119 23 571 377 -260 156 129 -118 -24 122 -13 -473 -158 -135 -420 -15 127 -210
2607 -210 -309 259 229 106 78 445 -41 -15 145 294 -191 349 202 -194 -365 106 -23 -339 87 175 -495 -238
2629 -238 240 83 -234 231 303 -115 110 532 -96 18 275 47 -185 95 45 -537 -498 39 -140 -406 11
2650 11 177 109 119 353 368 -26 382 431 -9 -98 565 282 -206 386 136 -372 -218 55 -94 -495 -26 -200
2672 -200 -727 -204 125 -3 -80 416 374 -271 163 454 -91 -155 226 -155 -92 -150 16 -355 -144 70 -135 -811
2694 -811 90 9 -241 -363 184 158 -178 180 306 -63 96 438 -202 -285 -3 -363 -224 -138 236 49 -313
2715c13N92k51k94L61J14k41j58O98j62k85k7K63l89K08K58o18m6JK66j75j76
2736c74L36l08KK90p5K49L6J18l60L9P20l30n61J20K16P5k50Q6K0k49K16Q8m71
2759c67K67L33q7n71N90L5k36O2K09k13N2K69j65k84k5J81l08l44O67K7p22P33
2781A03k9m46J77J48k8J87j42m2N0L1K09J59l96N53m36k47J45L04m08l7L32j89
2803bj10kN4J74l17M50o1j66L04j87p6o6J44m05J59Q4J87j54J39m50K53l69K74
2826a43qK5k02L39K12l24K08O5p7J63r4r0L7q4Oj96r2L32k71o7J21O7k06J12K79
2851A12l39j14K10J95l72N38o0l70J71L87n43J03L53k29j66nK36o9l35K8K89l54
2873c34O7L38M1J89pm00J1K18K03j83k63M62k23m04M19j11l55K99oj42J58j02
$$ plain form
2715 -313 279 28 -266 95 209 -32 -190 508 346 61 34 297 -92 116 374 -244 -290 -289 -23 -198 -374
2736 -374 -38 -346 -344 -54 -129 120 156 274 -86 -47 673 343 -218 -98 118 193 -57 29 49 -200 16 104 -367
2759 -367 -100 233 146 -425 165 200 -36 26 235 22 74 343 178 -106 -131 50 -258 -602 65 92 -630 103
2781 103 74 -372 -195 -47 -75 112 -30 -72 -22 9 218 377 -19 534 98 -149 -4 300 -108 -145 187 -2
2803 -2 -112 -114 -60 114 -203 247 186 20 324 137 61 -5 139 -266 -107 -23 164 10 149 -301 -48 -417 -143
2826 -143 -151 -126 -328 11 223 -101 107 172 95 258 164 74 111 27 33 -163 -255 77 -194 -261 -140 -73 -279 -167 112
2851 112 -227 -341 -131 64 -308 230 170 -200 -29 358 -185 -82 271 42 -124 -129 107 38 -297 -269 20 -334
2873 -334 -267 71 112 301 294 -106 -95 123 326 143 -120 342 119 -285 134 23 -332 -33 -39 -181 -23 -125
2895a25K11m4l8k25M57l18N0J34J64o1l42K82K31m25j68J95Q8r3r6q0J85Qk57
2918b67L25j60J5L0J09J88l4o8r1J51m39L88J2k84l03N32l06R4R4P3O9j28J42
2941A42j26L3k40M04j02J96k23k3J43j4m5q4k17k7L4K2Q0j46R0j76J42l7j36L46
2965C6m0O1J93l02j64K96J6n2n1Q1J43k94Q9J5Nj12j17J98r7P6l8K31l72J45K
2990e2O9k17O22m23K78l5k96L0Q5M14l19l85J53L73k22n4P2P2m81K64J88K9j27
3013C8o6L49n47K42J9k52n0O6K7OL85l52j91K28K52l99M2L12R2k33M2J13k17K59
3037A65j31L3MJ42l76K73m9k7j67j76J75k33K37K29l32M27k76K75j21J63K4k08
3059E1q4Q1j13J80J2k34K54k70p6PK40r3k28L17o4k78K11K17r3O9q9k20J97J07
$$ plain form
2895 -125 86 42 4 -221 236 -82 -32 102 266 205 -137 145 376 -49 -217 -22 66 -27 -123 -203 -18 -10 -267
2918 -267 58 -102 -87 -57 52 240 206 138 47 198 -241 147 159 -125 -428 104 -202 -108 -14 59 128 0 142
2941 142 16 49 -191 213 111 307 84 61 204 190 145 61 -156 -183 -149 -127 -47 -193 -103 -279 -137 -174 -310 36
2965 36 -4 57 250 -52 -216 80 96 44 -7 74 217 -77 12 27 32 -80 -197 1 -96 -20 -58 173 -199 -54 -52
2990 -52 17 -200 422 -1 277 242 -54 -24 61 475 156 -229 -76 297 75 21 93 165 -316 -52 136 165 38
3013 38 -28 321 -226 16 35 -217 -267 -201 -174 -168 217 -135 -326 -98 154 -245 -203 109 201 -32 10 123 -94 165
3037 165 34 67 71 213 -163 110 61 34 -133 -309 -134 -367 -130 99 -233 194 -82 193 72 235 259 51
3059 51 -33 48 -65 115 127 -107 147 -123 -199 -192 48 -45 -273 44 -20 -298 -87 130 37 106 17 -203 -6 101
3083A01K2m0N5O6k94m8K74o7l09L30k2p7j64K03j32j30K73J14k51Q2Q8k59K04
3106A9K02K57m69K07K3l53L5P8J50k86p7M20j52j25K09l1O7k88Q3q0P4k42J69
3129a10kL71Kn39M01J9k92OJ70M3k44j9N0m5K31L4j10p1K51K28l67J17J61k70
$$ plain form
3083 101 123 83 138 204 -90 -138 136 69 -240 90 68 -9 -173 30 -102 -232 41 155 -96 -14 74 -185 19
3106 19 221 478 9 216 239 -114 -79 -1 149 -137 -214 206 54 -71 138 107 174 -114 -31 -111 -37 -279 -110
3129 -110 -112 259 261 -278 123 142 -150 -144 26 69 -175 -194 -144 -189 42 76 -34 -105 146 374 7 124 285 15
$$ [...]
8191A33
##END NTUPLES=NMR FID
##END=
