##TITLE=1H_ANob-PE-part
 CDCl3, 8 sc, 
 22.11.2019
##JCAMPDX= 6.0         $$ Bruker NMR JCAMP-DX V2.0
##DATA TYPE= NMR FID
##DATA CLASS= NTUPLES
##ORIGIN= UXNMR, Bruker Analytische Messtechnik GmbH
##OWNER= root
$$ XWIN-NMR		Version 3.5
$$ Fri Nov 22 13:48:01 2019 Russian Standard Time (UT+4h)  she@DPX200
##.OBSERVE FREQUENCY= 200.1315
##.OBSERVE NUCLEUS= ^1H
##.DELAY= (6, 6)
##.ACQUISITION MODE= SIMULTANEOUS
##.ACQUISITION SCHEME= undefined
##.AVERAGES= 8
##.DIGITISER RES= 18
##SPECTROMETER/DATA SYSTEM= spect
##.PULSE SEQUENCE= zg30
##.SOLVENT NAME= CDCl3
##.SHIFT REFERENCE= (INTERNAL, CDCl3, 0, 15.7039)
##AUDIT TRAIL= $$ (NUMBER, WHEN, WHO, WHERE, WHAT)
$$ ##TITLE= Audit trail, XWIN-NMR		Version 3.5
$$ ##JCAMPDX= 5.01
$$ ##ORIGIN= Bruker BioSpin GmbH
$$ ##OWNER= she
$$ F:/spectra/data/she/nmr/H-F/1/audita.txt
$$ ##AUDIT TRAIL=  $$ (NUMBER, WHEN, WHO, WHERE, WHAT)
(   1,<2019-11-22 13:46:45.34 +0400>,<she>,<DPX200>,
      <created by zg, POWCHK disabled, PULCHK disabled
       configuration hash MD5:
       00 E9 B6 7A A2 85 ED C7 34 08 36 98 17 FE 4E 26
       data hash MD5: 16K
       89 CD F9 8C B3 29 70 FF 9E 4C D4 38 47 CF 82 1F>)
$$ ##END=
$$ 
$$ hash MD5
$$ 76 96 16 1E 70 2B 50 F7 F7 6A 53 00 E7 4A 6F 17
##$RELAX= 
##$RELAX= 
##$RELAX= 
##$RELAX= 
##$RELAX= 
##$RELAX= 
$$ Bruker specific parameters
$$ --------------------------
##$DU= <F:/spectra>
##$EXPNO= 1
##$NAME= <H-F>
##$PROCNO= 1
##$TYPE= <nmr>
##$USER= <she>
##$AMP= (0..31)
100 100 100 100 100 100 100 100 100 100 100 100 100 100 100 100 100 100 
100 100 100 100 100 100 100 100 100 100 100 100 100 100 
##$AQSEQ= 0
##$AQ_mod= 1
##$AUNM= <au_zg>
##$AUTOPOS= <>
##$BF1= 200.13
##$BF2= 200.13
##$BF3= 200.13
##$BF4= 200.13
##$BF5= 200.13
##$BF6= 200.13
##$BF7= 200.13
##$BF8= 200.13
##$BYTORDA= 1
##$CFDGTYP= 0
##$CFRGTYP= 5
##$CHEMSTR= <none>
##$CNST= (0..31)
1 1 145 1 1 1 1 1 1 1 1 1 1 1 1 1 1 1 1 1 1 1 1 1 1 1 1 1 1 1 1 1 
##$CPDPRG= <>
##$CPDPRG1= <>
##$CPDPRG2= <>
##$CPDPRG3= <>
##$CPDPRG4= <mlev>
##$CPDPRG5= <mlev>
##$CPDPRG6= <mlev>
##$CPDPRG7= <mlev>
##$CPDPRG8= <mlev>
##$CPDPRGB= <>
##$CPDPRGT= <>
##$D= (0..31)
0 1.2 0 0 0 0 0 0 0 0.06 0 0.03 0 0 0 0 0.0002 0 0 0 0 0 0 0 0 0 0 0 0 
0 0 0 
##$DATE= 1574416004
##$DBL= (0..7)
120 120 120 120 120 120 120 120 
##$DBP= (0..7)
150 150 150 150 150 150 150 150 
##$DBP07= 0
##$DBPNAM0= <>
##$DBPNAM1= <>
##$DBPNAM2= <>
##$DBPNAM3= <>
##$DBPNAM4= <>
##$DBPNAM5= <>
##$DBPNAM6= <>
##$DBPNAM7= <>
##$DBPOAL= (0..7)
0.5 0.5 0.5 0.5 0.5 0.5 0.5 0.5 
##$DBPOFFS= (0..7)
0 0 0 0 0 0 0 0 
##$DE= 6
##$DECBNUC= <off>
##$DECIM= 24
##$DECNUC= <off>
##$DECSTAT= 4
##$DIGMOD= 1
##$DIGTYP= 9
##$DL= (0..7)
0 120 120 120 120 120 120 120 
##$DP= (0..7)
150 150 150 150 150 150 150 150 
##$DP07= 0
##$DPNAME0= <>
##$DPNAME1= <>
##$DPNAME2= <>
##$DPNAME3= <>
##$DPNAME4= <>
##$DPNAME5= <>
##$DPNAME6= <>
##$DPNAME7= <>
##$DPOAL= (0..7)
0.5 0.5 0.5 0.5 0.5 0.5 0.5 0.5 
##$DPOFFS= (0..7)
0 0 0 0 0 0 0 0 
##$DQDMODE= 0
##$DR= 18
##$DS= 0
##$DSLIST= <SSSSSSSSSSSSSSS>
$$ [...]
##$SUBNAM2= <"">
##$SUBNAM3= <"">
##$SUBNAM4= <"">
##$SUBNAM5= <"">
##$SUBNAM6= <"">
##$SUBNAM7= <"">
##$SUBNAM8= <"">
##$SUBNAM9= <"">
##$SW= 24.9337058887773
##$SWIBOX= (0..15)
0 0 2 0 0 0 0 0 0 0 0 0 0 0 0 0 
##$SW_h= 4990.01996007984
##$TD= 16384
##$TD0= 1
##$TE= 0
##$TE2= 300
##$TE3= 300
##$TEG= 300
##$TL= (0..7)
0 120 120 120 120 120 120 120 
##$TP= (0..7)
150 150 150 150 150 150 150 150 
##$TP07= 0
##$TPNAME0= <>
##$TPNAME1= <>
##$TPNAME2= <>
##$TPNAME3= <>
##$TPNAME4= <>
##$TPNAME5= <>
##$TPNAME6= <>
##$TPNAME7= <>
##$TPOAL= (0..7)
0.5 0.5 0.5 0.5 0.5 0.5 0.5 0.5 
##$TPOFFS= (0..7)
0 0 0 0 0 0 0 0 
##$TUNHIN= 0
##$TUNHOUT= 0
##$TUNXOUT= 0
##$USERA1= <user>
##$USERA2= <user>
##$USERA3= <user>
##$USERA4= <user>
##$USERA5= <user>
##$V9= 5
##$VALIST= <valist>
##$VCLIST= <CCCCCCCCCCCCCCC>
##$VD= 0
##$VDLIST= <DDDDDDDDDDDDDDD>
##$VPLIST= <PPPPPPPPPPPPPPP>
##$VTLIST= <TTTTTTTTTTTTTTT>
##$WBST= 1024
##$WBSW= 4
##$XGAIN= (0..3)
0 0 0 0 
##$XL= 0
##$YL= 0
##$YMAX_a= 849467
##$YMIN_a= -621308
##$ZGOPTNS= <>
##$ZL1= 120
##$ZL2= 120
##$ZL3= 120
##$ZL4= 120
##$ABSF1= 10
##$ABSF2= 0
##$ABSG= 5
##$ABSL= 3
##$ALPHA= 0
##$AQORDER= 0
##$ASSFAC= 0
##$ASSFACI= 0
##$ASSFACX= 0
##$ASSWID= 0
##$AUNMP= <proc_1d>
##$AZFE= 0.1
##$AZFW= 0.1
##$BCFW= 1
##$BC_mod= 2
##$BYTORDP= 1
##$COROFFS= 0
##$CY= 11.3945322036743
##$DATMOD= 1
##$DC= 2
##$DFILT= <>
##$DTYPP= 0
##$F1P= 16.9975609425685
##$F2P= -3.02152046262296
##$FCOR= 0.5
##$FTSIZE= 0
##$FT_mod= 4
##$GAMMA= 1
##$GB= 0.15
##$INTBC= 1
##$INTSCL= 1
##$ISEN= 128
##$LB= 0.24
##$LEV0= 0
##$LPBIN= 0
##$MAXI= 10000
##$MC2= 0
##$MEAN= 0
##$ME_mod= 0
##$MI= 1.114404
##$NCOEF= 0
##$NC_proc= 0
##$NLEV= 6
##$NOISF1= 3.799351
##$NOISF2= 2.8
##$NSP= 1
##$NTH_PI= 0
##$NZP= 0
##$OFFSET= 15.70392
##$PC= 1
##$PHC0= -9795.906
##$PHC1= 25.40086
##$PH_mod= 1
##$PKNL= yes
##$PPARMOD= 0
##$PSCAL= 0
##$PSIGN= 0
##$REVERSE= no
##$SF= 200.130013532006
##$SI= 16384
##$SIGF1= 3
##$SIGF2= 2
##$SINO= 400
##$SIOLD= 16384
##$SREGLST= <1H.CDCl3>
##$SSB= 0
##$STSI= 0
##$STSR= 0
##$SW_p= 3612.71676300578
##$SYMM= 0
##$S_DEV= 0
##$TDeff= 0
##$TDoff= 0
##$TI= <>
##$TILT= no
##$TM1= 0
##$TM2= 0
##$TOPLEV= 0
##$USERP1= <user>
##$USERP2= <user>
##$USERP3= <user>
##$USERP4= <user>
##$USERP5= <user>
##$WDW= 1
##$XDIM= 8192
##$YMAX_p= 0
##$YMIN_p= 0
$$ End of Bruker specific parameters
$$ ---------------------------------
##NTUPLES= NMR FID
##VAR_NAME=  TIME,          FID/REAL,        FID/IMAG
##SYMBOL=    X,             R,               I
##VAR_TYPE=  INDEPENDENT,   DEPENDENT,       DEPENDENT
##VAR_FORM=  AFFN,          ASDF,            ASDF
##VAR_DIM=   8192,          8192,            8192
##UNITS=     SECONDS,       ARBITRARY UNITS, ARBITRARY UNITS
##FACTOR=    0.0002004,     1,               1
##FIRST=     0,             0,               0
##LAST=      1.6414764,     0,               0
##MIN=       0,             -621308,         0
##MAX=       1.6414764,     849467,          0
$$ Real data points
##PAGE= N=1
##DATA TABLE= (X++(R..R)), XYDATA
$$ plain form
0 0 0 0 0 0 -8 13 -8 8 -24 25 -30 36 -50 64 -73 89 -110 132 -156 181 -214 253 -291 337 -388 447 -510 579
28 579 -659 745 -841 945 -1061 1189 -1327 1480 -1650 1834 -2033 2257 -2501 2768 -3065 3394
44 3394 -3758 4165 -4622 5142 -5736 6418 -7218 8169 -9320 10746 -12566 14991 -18383
57 -18383 23486 -32104 50118 -159955 613650 720554 -621308 -592693 471978 511734 -493614
68 -493614 -456629 361892 330214 -390550 -283841 290947 177984 -285522 -87400 271092
78 271092 38530 -278972 -10910 259032 19001 -215710 29 179620 17758 -111418
88 -111418 16410 99896 28971 -13528 15752 17369 24505 39090 4816 -5795 74402 82715
100 82715 -26298 -21426 115361 85478 -80967 -30136 155939 82880 -109294 5738 220622
$$ packed form
0@%%%%qK1k1J6l2M9n5O6q6J14j37J62j99K42k88L37l95M67n44O28p25Q35r57J089
28E79j238J404j586J786k006K250k516K807l130L484l867M290m758N269n833O459
44C394p152P923q787R764j0878J2154j3636J5387j7489K0066k3312K7557l3374
57a8383M1869n5590Q2222k10073P73605J06904j341862K8615J064671L9756j005348
68d93614L6985Q18521l1678p20764J06709N74788j12963m63506J98122L58492
78B71092k32562l17502K68062K69942k40031k34711K15739J79591j61862j29176
88a11418J27828Q3486p0925m2499K9280J617P136J4585l4274j0611Q0197Q313
100H2715j09013M872J36787k9883j66445N0831J86075p3059j92174J15032K14884
$$ plain form
111 220622 75930 -156397 4730 242098 69625 -152705 40283 233501 -2550 -180279
121 -180279 103078 288020 -17167 -202208 118550 304439 -19837 -201485 120489 294910
131 294910 -26277 -203555 102406 288731 21826 -155233 68858 221176 27110 -98273
141 -98273 74139 178909 26571 -56787 81345 147452 18990 -32870 92175 134959 4493
152 4493 -48832 75462 144230 33066 -49280 46074 139169 59958 -39337 29639 134519 68011
164 68011 -54534 -5076 113257 66871 -41123 21010 131521 51908 -69464 21353 152609
175 152609 48000 -102844 -2732 151173 49366 -108338 -3101 161067 56095 -114992
185 -114992 -19358 146099 55403 -102511 -17603 123354 33732 -94539 546 119426 21203
$$ packed form
111B20622j44692k32327J61127K37368j72473k22330J92988J93218k36051j77729
121a80279K83357J84942l05187j85041L20758J85889l24276j81648L21974J74421
131B94910l21187j77278L05961J86325k66905j77059K24091J52318j94066j25383
141i8273J72412J04770j52338q3358J38132O6107j28462n1860J25045M2784j30466
152D493n3325J24294O8768j11164q2346R5354R3095p9211r9295O8976J04880o6508
164F8011j22545M9458J18333m6386j07994O2133J10511p9613j21372R0817J31256
175A52609j04609j50844J00112J53905j01807j57704J05237J64168j04972j71087
185a14992R5634J65457r0696j57914Q4908J40957q9622j28271R5085J18880r8223
$$ plain form
196 21203 -91555 1018 98551 3170 -88937 5966 97286 9464 -82383 -6833 87078 27498
208 27498 -64246 -24776 52875 16115 -59490 -27548 49000 24256 -52055 -34846 40729 28066
220 28066 -46091 -34479 40770 21884 -71246 -59028 45616 43236 -67160 -72921 36243 41926
232 41926 -69313 -71632 39826 35873 -80373 -76420 37076 25574 -88373 -73638 37790
243 37790 13506 -102811 -74513 46444 18005 -109812 -88134 37643 19124 -105163 -88969
254 -88969 33950 20780 -103284 -102288 8505 8532 -92347 -92538 47 750 -81473 -78377 -382
267 -382 -7307 -85308 -81335 -7696 -14017 -87228 -77487 954 -8987 -95239 -89814 3809 9605 -83564
281 -83564 -95011 -2384 13785 -80179 -102566 -7379 22868 -70381 -106364 -14509 28437 -56781
$$ packed form
196B1203j12758R2573R7533r5381r2107R4903R1320q7822r1847P5550R3911n9580
208B7498r1744L9470P7651l6760p5605L1942P6548k4744p6311J7209P5575j2663
220B8066p4157J1612P5249j8886r3130J2218J04644k380j10396n761J09164N683
232D1926j11239k319J11458l953j16246L953J13496j1502j13947J4735J11428
243C7790k4284j16317K8298J20957k8439j27817K1678J25777j8519j24287J6194
254h8969J22919j3170j24064R96J10793K7j00879j91R2585P03q2223L096P7995
267c82o925p8001L973P3639o321p3211R741P8441r941q6252N425R3623N796r3169
281h3564j1447R2627J6169r3964k2387R5187L0247r3249l5983R1855M2946q5218
$$ plain form
293 -56781 -98516 -14563 24609 -60781 -96570 -4317 35233 -56470 -94786 -4417 29298 -61578
305 -61578 -87533 7550 30225 -65972 -83051 17764 34940 -61644 -70900 28024 32901 -69314
317 -69314 -72370 32026 37165 -65012 -71233 26299 36059 -49280 -50650 33612 36193 -42013 -45063
330 -45063 25378 28219 -31886 -29293 27509 25110 -27112 -23734 30643 34939 -15497 -22497 27509
343 27509 41699 -3984 -18470 29565 48620 -252 -23314 30675 63320 10034 -27371 28964
355 28964 73285 17839 -28579 33048 89204 30093 -29346 29423 90414 32490 -29006 27852
367 27852 86079 30001 -20559 42079 93653 33123 -13847 45071 84370 23101 -11441 52682
379 52682 86091 19933 -13852 50433 85229 26383 -5123 50610 78371 22998 -4969 50454
$$ packed form
293e6781m1735Q3953L9172q5390l5789R2253L9550r1703l8316R0369L3715r0876
305f1578k5955R5083K2675r6197j7079J00815J7176r6584r256R8924M877j02215
317f9314l056J04396N139j02177o221R7532R760q5339j370Q4262K581p8206l050
330d5063P0441K841o0105K593N6802k399n2222L378N4377M296n0436p000N0006
343B7509J4190m5683j4486M8035J9055m8872k3062N3989L2645n3286l7405N6335
355B8964M4321n5446m6418O1627N6156n9111n9439N8769O0991n7924o1496N6858
367B7852N8227n6078n0560O2638N1574o0530m6970N8918L9299o1269l4542O4123
379E2682L3409o6158l3785O4285L4796n8846l1506N5733K7761n5373k7967N5423
$$ plain form
391 50454 80536 25480 -8511 40016 74695 29753 -5639 37665 73215 27557 -14449 30442
403 30442 79961 40281 -13861 20290 74421 40555 -16123 15759 73297 39163 -22308 9871
415 9871 72087 41530 -19018 13483 71671 34719 -26573 13301 76779 33729 -34726 5960
427 5960 74279 31881 -39231 3629 79334 38594 -40635 -6613 70988 42247 -31245 -7880
439 -7880 57201 31891 -31076 -7036 52357 29295 -27797 -6786 42549 18217 -27310 3237
451 3237 48595 11250 -42658 -8183 50810 18464 -43158 -16716 42594 14205 -49866 -22911
463 -22911 45104 23158 -49724 -34960 35098 23805 -45006 -36950 26751 14717 -51664 -41286
475 -41286 26134 16829 -49907 -42824 20874 11528 -51851 -41876 22093 10638 -54830 -48229 12160
$$ packed form
391E0454L0082n5056l3991M8527L4679m4942l5392M3304L5550m5658m2006M4891
403C0442M9519l9680n4142L4151N4131l3866n6678L1882N7538l4134o1471L2179
415I871O2216l0557o0548L2501N8188l6952o1292L9874O3478m3050o8455M0686
427E960O8319m2398p1112M2860P5705m0740p9229L4022P7601k8741p3492K3365
439g880O5081k5310o2967K4040N9393k3062n7092K1011M9335k4332m5527L0547
451C237M5358l7345n3908L4475N8993l2346o1622K6442N9310k8389o4071K6955
463b2911O8015k1946p2882J4764P0058j1293o8811Q056O3701j2034o6381J0378
475d1286O7420r305o6736P083O3698r346o3379R975O3969j1455o5468O601O0389
$$ plain form
488 12160 4407 -52642 -41938 11923 -2154 -57379 -41117 15681 -738 -58509 -44574 11010
500 11010 -4298 -59732 -44356 13085 -1741 -64360 -57150 4238 5019 -50666 -53752 -3788 -1885
513 -1885 -49924 -51271 -3250 -848 -49725 -56215 -10902 -5194 -49351 -53068 -6695 -3453 -54528
526 -54528 -60128 -4365 7531 -48771 -66190 -13593 2868 -51049 -68440 -10209 12744 -44685
538 -44685 -73689 -21061 9206 -38654 -65036 -14810 10485 -42815 -71922 -18218 16048 -33474
550 -33474 -68833 -23379 10558 -33044 -64172 -16025 20785 -25465 -66548 -25260 17944 -13813
562 -13813 -50575 -19761 11367 -21651 -50200 -12245 19053 -16788 -44559 -4772 22652 -19139
574 -19139 -44006 5436 34825 -17640 -51651 1795 42792 -4295 -43603 2939 41396 -2008
$$ packed form
488A2160p753n7049J0704N3861j4077n5225J6262N6798j6419n7771J3935N5584
500A1010j5308n5434J5376N7441j4826o2619P210O1388P81n5685l086M9964J903
513a885m8039j347M8021K402m8877o490M5313N708m4157l717M6373L242n1075
526e4528n600N5763J1896n6302j7419N2597J6461n3917j7391N8231K2953n7429
538d4685k9004N2628L0267m7860k6382N0226K5295n3300k9107N3704L4266m9522
550c3474l5359M5454L3937m3602l1128M8147L6810m6250m1083M1288M3204l1757
562a3813l6762L0814L1128l3018k8549L7955L1298l5841k7771L9787K7424m1791
574a9139k4867M9442K9389n2465l4011N3446M0997m7087l9308M6542L8457m3404
$$ plain form
586 -2008 -38039 5559 43357 6577 -25439 9696 34825 197 -16561 23775 39078 -4201
598 -4201 -19364 26887 44727 3213 -11002 30638 42332 -248 -10991 34214 49452 7929
610 7929 -10042 26291 44056 14112 327 30506 45333 15794 -1722 25872 48689 28299
622 28299 4333 19940 43578 30635 6917 18498 46341 37292 6350 10421 43998 44555 13559
635 13559 14106 45850 42316 6249 10644 50899 47981 5818 10432 52070 41980 -2532 13759
648 13759 67771 49268 -12864 2647 66753 53648 -9579 3627 65158 49214 -14828 671
660 671 64869 51533 -9774 1115 53456 40515 -4500 13764 54652 29480 -12675 11212
672 11212 49646 25036 -9698 15056 44716 17557 -12691 14860 44495 17676 -12263 8712
$$ packed form
586b008l6031M3598L7798l6780l2016L5135K5129l4628j6758M0336J5303m3279
598d201j5163M6251J7840m1514j4215M1640J1694m2580j0743M5205J5238m1523
610G929j7971L6333J7765k9944j3785L0179J4827k9539j7516K7594K2817k0390
622B8299k3966J5607K3638j2943k3718J1581K7843r049l0942M071L3577N57l0996
635A3559N47L1744l534l6067M395M0255k918m2163M614M1638j0090m4512J6291
648A3759N4012j8503o2132J5511O4106j3105o3227J3206O1531j5944o4042J5499
660F71O4198j3336o1307J0889N2341j2941m5015J8264M0888k5172m2155K3887
672A1212L8434k4610l4734K4754K9660k7159l0248K7551K9635k6819k9939K0975
$$ plain form
684 8712 34412 14404 -10621 8001 31731 12674 -15519 -2273 26400 18067 -9837 -4945 21159
697 21159 15559 -14515 -11221 22022 23062 -13629 -21277 9825 17124 -12613 -16073 15755 15267 -21187
711 -21187 -21579 16898 16858 -22473 -21634 16159 9091 -32144 -21315 24712 12745 -38103 -29688 20434
725 20434 13139 -33125 -25812 17030 6853 -35777 -27389 13205 5053 -32167 -25609 5932 -3407
738 -3407 -32149 -21037 6147 -6350 -33809 -23645 1922 -6896 -30781 -23231 -1562 -11508 -36095
751 -36095 -29123 -4147 -6838 -30716 -31109 -10479 -11134 -31783 -31006 -7825 -7643 -34509 -39979 -13790
765 -13790 -5974 -31013 -40310 -15497 -7181 -33327 -42349 -13891 -1828 -30039 -45254 -20623 -5297
778 -5297 -27652 -40449 -18908 -7800 -30087 -40182 -17226 -6667 -27455 -37237 -18047 -10968 -29283
$$ packed form
684H712K5700k0008k5025J8622K3730j9057k8193J3246K8673q333k7904M892K6104
697B1159n600l0074L294L3243J040l6691p648L1102P299k9737l460L1828m88l6454
711b1187l92L8477m0l9331Q39L7793p068m1235J0829M6027j1967n0848Q415N0122
725B0434p295m6264P313M2842j0177m2630Q388M0594q152l7220O558L1541r339
738c407k8742J1112K7184j2497k7459J0164K5567q818k3885P550K1669r946k4587
751c6095O972K4976k691k3878l93K0630o55k0649P77K3181J82k6866n470K6189
765a3790P816k5039r297K4813Q316k6146r022K8458J2063k8211j5215K4631J5326
778e297k2355j2797K1541J1108k2287j0095K2956J0559k0788r782J9190P079j8315
$$ plain form
791 -29283 -31182 -10359 -8900 -33004 -37294 -11188 -3896 -28380 -36448 -11390 -572 -25298 -38381
804 -38381 -13258 4983 -16297 -35345 -17419 1264 -14876 -32304 -15184 3345 -12107 -29485
816 -29485 -15366 2243 -8874 -22355 -8624 2271 -14001 -24192 -4074 8680 -11392 -23895
828 -23895 -2922 9814 -10458 -20338 3659 15519 -9691 -22744 2353 18955 -834 -15321
840 -15321 1588 14580 -39 -9476 7564 19536 3923 -9552 4204 19816 11341 -88
852 -88 8661 19325 10945 1743 11369 22909 15006 4229 12287 24087 17381 8058 16654 28755
866 28755 20165 7572 17439 32273 21810 5773 17635 35991 25341 5946 17027 39245
878 39245 31640 9452 13586 34041 32506 15158 15742 31160 31126 17631 17290 29481 31457 20678
$$ packed form
791b9283j899K0823J459k4104m290K6106P292k4484q068K5058J0818k4726j3083
804c8381K5123J8241k1280j9048J7926J8683j6140j7428J7120J8529j5452j7378
816b9485J4119J7609j1117j3481J3731J0895j6272j0191K0118J2754k0072j2503
828b3895K0973J2736k0272r880K3997J1860k5210j3053K5097J6602j9789j4487
840a5321J6909J2992j4619r437J7040J1972j5613j3475J3756J5612q475j1429
852h8Q749J0664q380r202R626J1540p903j0777Q058J1800o706r323Q596J2101
866B8755q590j2593R867J4834j0463j6037J1862J8356j0650j9395J1081K2218
878C9245p605k2188M134K0455j535j7348N84J5418l4j3495l41J2191J976j0779
$$ plain form
892 20678 18134 25475 25758 17797 20297 32028 30951 15548 11922 27388 33608 18582 10403 24557
906 24557 31562 14783 6838 26820 37043 15603 2685 22212 32986 12741 4162 26645 31079
919 31079 3890 -1228 28209 33605 2903 -2030 27680 30423 -541 -2733 27344 28491 -651
932 -651 -3540 21506 21732 -281 2267 22300 15365 -5155 2254 21374 11731 -6227 3732 19298
946 19298 6886 -9564 1813 18071 9387 -7454 -4382 7445 6209 -3216 -3580 3620 4368 -3190
960 -3190 -6423 -514 3755 -1742 -7376 -5683 -2700 -6610 -8255 -2877 -589 -9046 -14017 -4904 1280
975 1280 -8713 -17640 -8419 -1103 -13229 -22177 -7461 3622 -12029 -25280 -11989 -122 -13377
988 -13377 -23224 -10015 -1961 -18462 -28022 -10892 1914 -13712 -27109 -15209 -4376 -16852 -26749
$$ packed form
892B0678k544P341K83p961K500J1731j077j5403l626J5466O220j5026q179J4154
906B4557P005j6779p945J9982J0223k1440j2918J9527J0774k0245q579K2483M434
919C1079k7189n118K9437N396l0702m933K9710K743l0964k192L0077J147k9142
932f51k889K5046K26k2013K548K0033o935k0520P409J9120r643j7958R959J5566
946A9298j2412j6450J1377J6258q684j6841L072J1827j236r425l64P200P48p558
960c190l233N909M269n497n634J693K983l910j645N378K288q457m971R113O184
975A280r993q927R221P316j2126q948J4716J1083j5651j3251J3291J1867j3255
988a3377r847J3209Q054j6501r560J7130J2806j5626j3397J1900J0833j2476r897
$$ plain form
1001 -26749 -13911 -3087 -15779 -27390 -16944 -6631 -14237 -20605 -13839 -12346 -22100 -23452 -12407
1014 -12407 -9745 -20078 -23331 -13502 -10371 -20150 -25006 -14554 -6747 -16800 -28917 -22613 -8693
1027 -8693 -10826 -23856 -23638 -11235 -11445 -24319 -26010 -12354 -7613 -20002 -26240 -16662 -12104 -19967
1041 -19967 -20834 -9711 -11635 -26845 -25156 -7160 -7796 -25088 -24191 -6583 -9769 -28710 -22376 -503
1055 -503 -4795 -27403 -24915 -4442 -6122 -23282 -18610 -1399 -8177 -24887 -15974 2190 -3834 -20768
1069 -20768 -13916 636 -7450 -19918 -9400 4803 -4300 -16942 -8241 3525 -2391 -9672 -2236
1082 -2236 3941 -4349 -10010 -1237 6242 1007 -4141 2262 7280 1293 -3977 4088 12885 6926 -3703
1097 -3703 -603 11187 13072 4461 3526 11947 13384 4449 1801 12806 19814 10722 2725 10093 18290
$$ packed form
1001b6749J2838J0824j2692j1611J0446J0313p606o368O766J493r754j352J1045
1014a2407K662j0333l253R829L131r779m856J0452P807j0053j2117O304J3920
1027h693k133j3030K18J2403k10j2874j691J3656M741j2389o238R578M558p863
1041a9967q67J1123j924j5210J689J7996o36j7292Q97J7608l186j8941O334K1873
1055e03m292k2608K488K0473j680j7160M672J7211o778j6710Q913J8164o024j6934
1069b0768O852J4552q086j2468J0518J4203r103j2642Q701J1766n916p281P436
1082b236O177q290n661Q773P479n235n148O403N018n987n270Q065Q797n959j0629
1097c703L100J1790J885q611r35Q421J437q935k648J1005P008r092p997P368Q197
$$ plain form
1112 18290 12776 8359 16903 20601 9632 5124 17282 23123 12864 8332 19637 23149 11029
1125 11029 8246 22888 28450 14398 6890 19013 26005 15748 11070 22977 27291 13893 9399
1138 9399 22217 28401 17723 13469 21533 23250 15236 14243 24482 27432 17870 12336 18614 25002
1152 25002 20311 15657 20104 22988 16078 11533 19918 26123 18875 11588 17204 22364 15087 10095 20023
1167 20023 25718 12824 3740 15503 26551 14995 4216 14844 24281 10957 -258 12181
1179 12181 23391 11723 595 10251 17723 7592 1325 11898 16262 3894 -1630 8314 11349
1192 11349 2662 1157 9832 9231 -2536 -3743 6766 10002 -238 -4853 1394 4327 -2142 -4546
1206 -4546 2364 5629 -2672 -9822 -4649 3218 556 -8093 -6569 163 -3229 -11670 -6817 3485 -1864
$$ packed form
1112A8290n514m417Q544L698j0969m508J2158N841j0259m532J1305L512j2120
1125A1029k783J4642N562j4052p508J2123O992j0257m678J1907M314j3398m494
1138I399J2818O184j0678m254Q064J717q014r93J0239K950r562n534O278O388
1152B5002m691m654M447K884o910m545Q385O205p248p287N616N160p277m992R928
1167B0023N695j2894r084J1763J1048j1556j0779J0628R437j3324j1215J2439
1179A2181J1210j1668j1128R656P472j0131o267J0573M364j2368n524R944L035
1192A1349q687j505Q675o01j1767j207J0509L236j0240m615O247K933o469k404
1206d546O910L265q301p150N173P867k662q649J524O732l392q441M853J0302n349
$$ plain form
1221 -1864 -15404 -11975 935 -2457 -14739 -10277 912 -5261 -18532 -12049 1096 -4472 -16534
1234 -16534 -12993 -3688 -8763 -16904 -10850 -3177 -10271 -18210 -12526 -5156 -11052 -17499 -11124 -5713 -12787
1249 -12787 -19965 -14635 -6204 -9039 -16998 -17035 -10774 -10063 -15757 -17440 -11997 -8981 -16133 -21145 -15096
1264 -15096 -8465 -13304 -19196 -14497 -10636 -17394 -20588 -11039 -7376 -18731 -23777 -13012 -7747 -18267
1278 -18267 -22585 -9849 -6174 -20049 -25055 -10243 -4471 -18253 -23723 -10731 -7218 -20282 -20852
1291 -20852 -5381 -5420 -21678 -21827 -5547 -5208 -21622 -20576 -2700 -3871 -21734 -21118 -2981 -1649
1305 -1649 -18020 -18813 -4665 -5061 -16847 -14242 -2032 -4740 -16456 -12034 -450 -5471 -16140 -8983
1319 -8983 2267 -4479 -17137 -10689 3959 830 -12588 -11258 1787 2125 -8762 -9195 1593 3649
$$ packed form
1221a864j3540L429J2910l392j2282M462J1189o173j3271O483J3145n568j2062
1234a6534L541R305n075q141O054P673p094p939N684P370n896o447O375N411p074
1249a2787p178N330Q431k835p959l7O261P11n694j683N443L016p152n012O049
1264a5096O631m839n892M699L861o758l194R549L663j1355n046J0765N265j0520
1278a8267m318J2736L675j3875n006J4812N772j3782n470J2992L513j3064n70
1291b0852J5471l9j6258j49J6280L39j6414J046J7876j171j7863O16J8137J332
1305a649j6371p93J4148l96j1786K605J2210k708j1716M422J1584n021j0669P157
1319h983J1250o746j2658O448J4648l129j3418J330J3045L38j0887m33J0788K056
$$ plain form
1333 3649 -5731 -8053 1182 4852 -2478 -4404 3223 4651 -3434 -3579 6571 8259 -1894 -3345 8068
1348 8068 10817 87 -2031 9415 12771 2344 -494 9888 13288 4741 3759 12454 12797 4684
1362 4684 5693 15326 15021 6402 6570 15366 15985 8977 9258 16681 17727 10944 8655 14176 19326 17145
1378 17145 11851 12055 16558 18104 15762 15131 17579 16648 13697 15752 19932 17672 13252 16517 22031
1393 22031 16974 9940 16696 26454 18275 6272 13606 26854 20870 6708 11791 24656 20141 8174
1407 8174 12731 22656 17881 8825 13972 21256 13498 7302 15833 21844 11086 4432 14938 21185
1421 21185 10920 3419 13163 20569 11413 2015 7835 16332 12844 5309 6554 11456 8795 5034
1435 5034 7896 11174 7356 2302 4767 9158 6805 1483 3878 9488 5438 -2412 224 9569 7662
$$ packed form
1333C649r380k322R235L670p330j926P627J428q085j45J0150J688j0153j451J1413
1348H068K749j0730k118J1446L356j0427k838J0382L400q547r82Q695L43q113
1362D684J009R633l05q619J68Q796O19p008K81P423J046o783k289N521N150k181
1378A7145n294K04M503J546k342o31K448r31k951K055M180k260m420L265N514
1393B2031n057p034O756R758q179j2003P334J3248n984j4162N083J2865m515j1967
1407H174M557R925m775r056N147P284p758o196Q531O011j0758o654J0506O247
1421B1185j0265p501R744P406r156r398N820Q497l488p535J245M902k661l761
1435E034K862L278l818n054K465M391k353n322K395N610m050p850K636R345j907
$$ plain form
1450 7662 -4555 -5533 5517 7798 -2807 -5056 3672 4426 -5730 -5709 4340 2368 -8637 -7246
1464 -7246 3471 226 -11754 -7636 5260 -88 -14772 -10896 3301 -731 -14715 -10729 1524
1477 1524 -3704 -15301 -10934 -686 -6647 -14706 -9635 -3383 -10777 -16098 -7817 -2702 -10775 -16382
1491 -16382 -9957 -6102 -11349 -13920 -9482 -8917 -12837 -13409 -10935 -11121 -11508 -10083 -11916 -15036 -12870 -9139
1507 -9139 -11109 -14165 -11274 -10604 -15499 -14481 -7174 -9079 -18099 -15177 -5583 -10157 -20843 -14364 -1105
1522 -1105 -9444 -23643 -15276 -1268 -9426 -22314 -12173 -533 -12731 -24317 -10557 570 -12762
1535 -12762 -22145 -7774 -975 -17429 -22885 -3275 2421 -17331 -23105 -4415 464 -16500 -19360
1548 -19360 -2663 -1046 -17760 -18626 -2465 -1327 -14757 -14998 -3511 -4411 -14976 -12217 -584 -3216
$$ packed form
1450G662j2217r78J1050K281j0605k249Q728P54j0156K1J0049j972j1005J391
1464g246J0717l245j1980M118J2896n348j4684L876J4197m032j3984L986J2253
1477A524n228j1597M367J0248n961q059N071O252p394n321Q281N115q073n607
1491a6382O425L855n247k571M438N65l920n72K474j86l87J425j833l120K166L731
1507i139j970l056K891O70m895J018P307j905r020K922R594m574j0686O479J3259
1522a105q339j4199Q367J4008q158j2888J0141J1640j2198j1586J3760J1127j3332
1535a2762r383J4371O799j6454n456J9610N696j9752n774J8690M879j6964k860
1548a9360J6697J617j6714q66J6161J138j3430k41J1487r00j0565K759J1633k632
$$ plain form
1562 -3216 -14041 -12639 -2260 -2048 -10592 -9852 -2023 -2149 -10266 -10128 -1572 1057 -5939 -9363 -3239
1577 -3239 207 -4847 -6898 -37 3150 -4730 -8547 281 5967 -1973 -6302 2405 7183 -2610 -6817
1592 -6817 4701 10868 509 -5054 4204 9162 1372 -775 7763 10169 1065 -874 8169 10897
1606 10897 4672 4008 10583 9794 2339 4063 12546 13011 5616 4629 10050 11879 8921 8547 11805 12960
1622 12960 10253 6607 8978 14868 15701 10124 7601 12675 15039 10859 10201 16400 16971 8429 7137
1637 7137 16272 19045 10169 9247 18542 17108 6234 9353 22903 20387 5457 6845 21381 18824
1651 18824 5477 9710 23771 17319 3146 9060 23147 17006 5248 12135 21676 12456 2600
1664 2600 12748 22992 13111 3062 11796 19547 10708 3689 12388 18711 9716 2190 9423 15450
$$ packed form
1562c216j0825J402J0379K12q544P40P829j26q117J38Q556K629o996l424O124
1577c239L446n054k051O861L187p880l817Q828N686p940m329Q707M778r793m207
1592f817J1518O167j0359n563R258M958p790k147Q538K406r104j939R043K728
1606A0897o225o64O575p89p455J724Q483M65p395r87N421J829k958l74L258J155
1622A2960k707l646K371N890Q33n577k523N074K364m180o58O199N71q542j292
1637G137R135K773q876r22R295j434j0874L119J3550k516j4930J388J4536k557
1651A8824j3347M233J4061o452j4173N914J4087o141j1758O887R541r220r856
1664B600J0148J0244r881j0049Q734P751q839p019Q699O323q995p526P233O027
$$ plain form
1678 15450 9896 5627 9877 11318 6134 3236 8816 11552 7632 3355 3910 6647 6592 3958 4064 7055
1694 7055 5257 -210 -1389 5586 8721 976 -3603 2018 4951 -1541 -3837 3936 5288 -4901 -8071
1709 -8071 1327 3968 -5438 -7654 2104 1346 -10245 -9758 3158 2514 -11293 -10926 884 -480 -12548
1724 -12548 -10257 1675 -1772 -13985 -11606 -820 -3808 -12859 -9635 -1905 -7024 -15183 -10395 -2569
1738 -2569 -6644 -13993 -10519 -5329 -9127 -13708 -9290 -4533 -8120 -13648 -12210 -8511 -8193 -9799 -9940
1753 -9940 -10350 -10811 -11079 -10974 -9455 -8312 -9916 -13198 -12493 -8559 -8862 -12121 -10459 -7536 -11373 -16610
1769 -16610 -11449 -3533 -7782 -16813 -13149 -4974 -8566 -16261 -11205 -3008 -9036 -17865 -11682 -2896 -8680
1784 -8680 -15698 -9040 -3061 -11718 -17572 -6853 -375 -11250 -17891 -6676 -397 -11123 -16834 -4960
$$ packed form
1678A5450n554m269M250J441n184k898N580K736l920m277N55K737n5k634J06K991
1694G055j798n467j179O975L135p745m579N621K933o492k296P773J352j0189l170
1709h071R398K641r406k216R758p58j1591M87J2916o44j3807L67J1810j364j2068
1724a2548K291J1932l447j2213K379J0786k988r051L224P730n119q159M788P826
1738b569m075p349L474N190l798m581M418M757l587n528J438L699L18j606j41
1753i940m10m61k68J05J519J143j604l282P05L934l03l259J662K923l837n237
1769a6610N161P916m249r031L664Q175l592p695N056Q197o028q829O183Q786n784
1784h680p018O658N979q657n854J0719O478j0875o641J1215O279j0726n711J1874
$$ plain form
1798 -4960 1136 -10289 -16577 -6707 -658 -9148 -12607 -3890 -970 -10398 -12509 -2796 365 -8360 -11179
1813 -11179 -2837 -437 -8622 -9887 -662 2382 -6550 -11110 -2801 2807 -3012 -7898 -2846 1332 -2911
1828 -2911 -6391 -924 3000 -1568 -5587 -1586 2871 -591 -3561 920 4239 -837 -4784 1548 6967
1843 6967 2068 -3749 561 7072 3476 -2185 1503 7910 4781 -1332 1871 7786 6046 1445 3866
1858 3866 8995 6084 1677 4905 10375 7717 2673 5305 11397 8566 3607 6389 13366 10825 3076
1873 3076 4738 12629 12798 6478 6817 13013 11645 6072 8337 15334 13324 6321 7826 15053 13199
1888 13199 6328 9325 17525 14443 4812 7390 17904 16687 6435 6679 15793 15602 7036 8257 16360
1903 16360 15431 7454 8465 15542 13776 6547 9282 16373 13341 4341 7648 17301 14576 4357 5422
$$ packed form
1798d960O096j1425o288R870O049q490l459Q717K920r428k111R713L161q725k819
1813a1179Q342K400q185j265R225L044q932m560Q309N608n819m886N052M178m243
1828b911l480N467L924m568m019M001M457l462k970M481L319n076l947O332N419
1843F967m899n817M310O511l596n661L688O407l129o113L203N915j740m601K421
1858C866N129k911m407L228N470k658n044K632O092k831m959K782O977k541p749
1873C076J662P891J69o320L39O196j368n573K265O997k010p003J505P227j854
1888A3199o871K997Q200l082r631K578J0514j217j0252K44R114j91q566J221Q103
1903A6360r29p977J011P077j766p229K735P091l032r000L307R653k725j0219J065
$$ plain form
1918 5422 15628 14189 4092 4637 14465 14003 4150 3075 11687 12495 4829 3845 10821 9372 1849
1933 1849 3583 12095 9651 -468 1389 10844 8916 -1343 193 10679 8616 -3080 -2426 8581
1947 8581 8104 -2938 -2801 6046 5068 -3925 -2666 5943 3521 -5499 -3840 4457 2164 -6379 -4283
1962 -4283 4208 1398 -8090 -6555 2263 671 -7670 -7254 -599 -1875 -7860 -6896 -822 -2150 -9212
1977 -9212 -8870 -2540 -3510 -9828 -8792 -2336 -4419 -12273 -11326 -2317 -2030 -11754 -13438 -5130 -3192 -11539
1993 -11539 -13080 -5132 -3948 -12657 -14080 -5656 -4476 -12193 -12789 -5891 -6665 -14343 -12446 -3820 -5612
2008 -5612 -15206 -13985 -4391 -5371 -14685 -13961 -4327 -4854 -13872 -13621 -5953 -5274 -11091 -11513 -6378 -7427
2024 -7427 -11711 -10250 -5944 -6747 -10754 -10237 -6875 -7274 -9920 -8960 -5418 -5838 -9832 -11587 -6761 -2577
$$ packed form
1918E422J0206j439j0097N45R828m62r853j075Q612Q08p666r84O976j449p523
1933A849J734Q512k444j0119J857R455j928j0259J536J0486k063j1696O54J1007
1947H581m77j1042J37Q847r78q993J259Q609k422r020J659Q297k293q543K096
1962d283Q491k810r488J535Q818j592q341M16O655j276n985R64O074j328p062
1977i212L42O330r70o318J036O456k083p854R47R009K87r724j684Q308J938q347
1993a1539j541P948J184q709j423Q424J180p717n96O898p74p678J897Q626j792
2008e612r594J221R594r80r314P24R634n27r018K51P668O79n817m22N135j049
2024g427m284J461M306q03m007N17L362l99k646R60L542m20l994j755M826M184
$$ plain form
2040 -2577 -6694 -11348 -8683 -3531 -5496 -10115 -7161 -1717 -5386 -11896 -7648 -812 -3735 -10576 -6757
2055 -6757 -535 -5149 -11470 -4888 2567 -4299 -11975 -5054 2456 -4294 -11168 -2779 3667 -5141 -10648
2070 -10648 -1712 4269 -4381 -9158 -53 4037 -5692 -8961 2166 6232 -4281 -8375 1874 5862
2084 5862 -3679 -5825 3861 6320 -3322 -5599 3404 6484 -476 -2049 3695 4278 -1447 -673 6119
2099 6119 5826 -226 -310 5630 6122 1718 2052 6908 6954 1943 1119 6339 8916 5218 2707 5235 8155
2116 8155 6301 3713 6183 9643 8415 3628 4711 9512 9477 5766 6561 9941 8763 4527 6850 12010
2132 12010 10591 5158 6232 11675 9913 5597 8413 13716 10321 4075 6616 13225 12289 6333 7651
2147 7651 13068 10492 4941 7882 14459 12074 5317 6557 12691 11321 6508 8114 13184 10721 4625
$$ packed form
2040b577m117m654K665N152j965m619K954N444l669o510M248O836k923o841L819
2055f757O222m614o321O582P455o866p676O921P510o750o874Q389O446q808n507
2070a0648Q936N981q650m777R105M090r729l269J1127M066j0513m094J0249L988
2084E862r541k146R686K459r642k277R003L080o960j573N744N83n725P74O792
2099F119k93o052q4N940M92m404L34M856M6n011q24N220K577l698k511K528K920
2116H155j854k588K470L460j228m787J083M801l5l711P95L380j178m236K323N160
2132A2010j419n433J074N443j762m316K816N303l395o246K541O609r36n956J318
2147G651N417k576n551K941O577k385o757J240O134j370m813J606N070k463o096
$$ plain form
2162 4625 6548 13185 11882 5575 6127 11923 10457 4487 6228 12883 10920 3659 4670 11747 10248
2177 10248 3082 4884 11538 8703 1118 3598 11335 9256 738 2938 9986 6893 -840 2620 10593
2192 10593 6855 -1830 -17 7949 5646 -1737 1406 7126 3285 -3815 -123 6225 2903 -3629 -851
2207 -851 3685 -264 -4771 -622 4205 -814 -6770 -3775 2198 -630 -5630 -3629 87 -3039 -7745
2222 -7745 -5744 -404 -1654 -7036 -6848 -3136 -3969 -7193 -6313 -2730 -4340 -9545 -8677 -3604 -3448 -9016
2238 -9016 -9808 -4122 -4526 -10205 -10799 -4343 -3616 -9788 -11126 -5555 -5306 -10405 -9752 -4171 -5714 -12251
2254 -12251 -10987 -4123 -5726 -12448 -9973 -3397 -6077 -13980 -10508 -3210 -5182 -12406 -11022 -5361 -6606
2269 -6606 -10581 -8550 -4811 -7944 -10971 -8390 -5999 -8091 -8982 -6721 -6039 -9266 -9718 -6852 -5097 -6877
$$ packed form
2162D625J923O637j303o307N52N796j466n970J741O655j963p261J011P077j499
2177A0248p166J802O654k835p585K480P737k079q518K200P048l093p733L460P973
2192A0593l738q685J813P966k303p383L143N720l841p100L692O348l322o532K778
2207h51M536l949m507M149M827n019n956K995N973k828n000K001L716l126m706
2222g745K001N340j250n382J88L712q33l224Q80L583j610n205Q68N073J56n568
2238i016p92N686m04n679n94O456P27o172j338N571K49n099O53N581j543o537
2254a2251J264O864j603o722K475O576k680p903L472P298j972p224J384N661j245
2269f606l975K031L739l133l027K581K391k092q91K261O82l227m52K866J755j780
$$ plain form
2285 -6877 -8442 -8375 -6940 -6010 -5719 -7286 -7495 -5425 -5365 -8291 -7853 -3024 -3015 -7971 -8251 -3535 -3176 -7678
2303 -7678 -5729 -599 -3672 -9506 -5722 1272 -2593 -9341 -4315 2365 -3378 -9730 -3257 4053 -2121
2318 -2121 -8991 -2360 2915 -3218 -6917 877 3654 -4062 -6558 2111 3821 -4285 -4628 4068 3964
2333 3964 -4576 -4517 4716 4944 -3003 -2512 3961 3292 -2032 -318 5192 3527 -1459 695 4736 3351
2349 3351 328 2605 5284 2847 7 2784 6277 4910 2133 2326 4312 4248 4329 4088 4614 5158 4721
2366 4721 4324 4654 6218 6296 4847 4135 5369 6628 5475 5657 7481 6725 4118 5495 9069 8218 4362
2383 4362 5507 9645 8765 4261 5332 10472 10107 5125 5397 9769 9971 5815 6777 10593 9400 5803
2399 5803 6907 10700 9103 5873 8115 11640 8146 3726 7503 12642 9721 4594 6312 10760 8735
$$ packed form
2285f877j565O7J435R30K91j567k09K070O0k926M38M829Rm956k80M716L59m502
2303g678J949N130l073n834L784O994l865o748N026O680n743o352O473P310o174
2318b121o870O631N275o133l699P794K777p716k496Q669J710q106l43Q696j04
2333C964q540N9R233K28p947M91O473o69n324J714N510j665m986K154M041j385
2349C351l023K277K679k437k840K777L493j367k777J93J986o4Q1k41N26N44m37
2366D721l97L30J564P8j449p12J234J259j153J82J824p56k607J377L574q51l856
2383D362J145M138q80m504J071N140l65m982K72M372K02m156R62L816j193l597
2399E803J104L793j597l230K242L525l494m420L777N139k921n127J718M448k025
$$ plain form
2414 8735 5385 6869 10434 8251 4558 6469 9330 7987 5158 6394 7807 6127 4232 6952 8803
2429 8803 5930 2786 4580 8058 6536 2972 3831 6263 5432 2343 3064 5687 5139 1804 1887 4137
2445 4137 3934 1361 1428 3721 3085 -357 333 3866 2588 -940 -829 2643 1717 -2517 -1913 1904 2108
2462 2108 -2466 -3077 142 53 -3557 -3093 16 -1230 -5297 -4689 -533 -1444 -5543 -5272 -1446 -3508 -7113
2479 -7113 -5713 -969 -2670 -8186 -7578 -3013 -3412 -7263 -7263 -3847 -4688 -8631 -7630 -3722 -4978 -8593
2495 -8593 -8047 -5206 -5938 -8837 -7869 -5456 -6665 -9439 -8969 -5761 -6113 -9048 -9048 -6440 -6195 -8775 -9619
2512 -9619 -7226 -6371 -7989 -9307 -8058 -6546 -7841 -8410 -7077 -6298 -8246 -9349 -7090 -5557 -7364 -8645
2528 -8645 -6715 -5762 -8151 -8764 -5324 -3325 -7033 -9715 -6689 -3416 -5205 -7431 -5554 -3814 -6165
$$ packed form
2414H735l350J484L565k183l693J911K861j343k829J236J413j680j895K720J851
2429H803k873l144J794L478j522l564Q59K432q31l089P21K623n48l335Q3K250
2445D137k03k573O7K293o36l442O90L533j278l528J11L472r26m234O04L817K04
2462B108m574o11L219q9l610M64L109j246m067O08M156r11m099K71L826k062l605
2479g113J400M744j701n516O08M565l99l851%L416q41l943J001L908j256l615
2495h593N46K841p32k899R68K413j209k774M70L208l52k935%K608K45k580q44
2512i619K393Q55j618j318J249J512j295n69J333P79j948j103K259J533j807j281
2528h645J930R53k389o13L440J999l708k682L026L273j789k226J877J740k351
$$ plain form
2543 -6165 -7539 -4620 -2151 -4801 -7436 -4952 -2539 -4609 -6120 -3281 -1450 -4969 -7159 -2873 -46
2558 -46 -3079 -6136 -2712 -234 -3689 -5405 -1511 1393 -2620 -5140 -1579 1450 -2159 -4712 -538
2573 -538 2571 -2191 -4895 -84 3476 -1058 -4258 83 3061 -859 -4016 1135 4592 382 -2806
2588 -2806 697 3983 474 -1166 2752 4468 110 -1568 2960 5564 1492 -535 3584 5084 898
2603 898 -400 5296 7226 1517 -785 4025 7124 3269 1455 5474 6943 2399 1437 5842 7962
2618 7962 4159 2647 6158 6695 3840 3613 7708 8043 3723 2663 7186 8272 4808 4274 7580 7750
2634 7750 4597 4473 7329 7990 5879 5072 6681 6963 5829 6135 7114 7204 6190 5893 6948 7700 6788 5697
2652 5697 6803 7525 6200 4741 6167 8629 7621 5022 5020 8126 7555 4661 5626 8409 7386 3298
$$ packed form
2543f165j374K919K469k650k635K484K413k070j511K839J831l519k190M286K827
2558d6l033l057L424K478l455j716L894K904m013k520L561L029l609k553M174
2573e38L109m762k704M811L560m534l200M341K978l920l157N151L457m210l188
2588b806L503L286l509j640L918J716m358j678M528K604m072k027M119J500m186
2603H98j298N696J930n709k302M810L099l855j814M019J469m544r62M405K120
2618G962l803j512L511N37k855k27M095L35m320j060M523J086l464n34L306J70
2634G750l153j24K856O61k111q07J609K82j134L06R79R0j014k97J055P52r12j091
2652E697J106P22j325j459J426K462j008k599kL106n71k894R65K783j023m088
$$ plain form
2668 3298 4918 8636 7674 4100 5021 8122 5997 2571 5281 9232 5880 1491 3755 7818 5526
2683 5526 2399 4488 7230 3981 693 3596 7304 4387 1088 2977 5537 2333 -22 3800 5857
2698 5857 1808 -1799 1354 4788 2046 -902 1332 3346 293 -2159 139 2942 270 -2613 -1166
2713 -1166 349 -1596 -2870 -623 643 -2910 -4818 -1510 -347 -3396 -5029 -2006 -1149 -4823 -6744
2728 -6744 -3693 -1158 -3873 -6375 -4699 -2978 -4977 -6748 -4545 -3247 -5715 -7178 -5602 -4687 -5990
2743 -5990 -6689 -5120 -5233 -7929 -8109 -5375 -4178 -6220 -8220 -6729 -5733 -6523 -7226 -6411 -5317 -6474 -8789
2760 -8789 -7700 -5741 -5768 -7329 -7560 -6674 -7076 -7586 -6243 -4530 -6264 -8011 -7420 -5582 -5213 -7399 -6886
2777 -6886 -5192 -5903 -8009 -7226 -4601 -4911 -6945 -6809 -5198 -5508 -6601 -5332 -3826 -5121 -6809 -5512
$$ packed form
2668C298J620L718r62l574R21L101k125l426K710L951l352m389K264M063k292
2683E526l127K089K742l249l288K903L708k917l299J889K560l204k355L822K057
2698E857m049l607L153L434k742k948K234K014l053k452K298K803k672k883J447
2713a166J515j945j274K247J266l553j908L308J163l049j633L023Q57l674j921
2728f744L051K535k715k502J676J721j999j771K203J298k468j463J576R15j303
2743e990o99J569j13k696j80K734J197k042k000J491R96p90p03Q15J094j157k315
2760h789J089J959k7j561k31Q86m02n10J343J713j734j747N91J838L69k186N13
2777f886J694p11k106P83K625l10k034J36J611l10j093J269J506j295j688J297
$$ plain form
2793 -5512 -3907 -5057 -6112 -4317 -2894 -4691 -6541 -4709 -2024 -2873 -4976 -4633 -2922 -3482 -4139 -3334
2809 -3334 -1616 -2096 -3648 -3413 -2208 -1921 -2039 -1726 -1459 -2037 -2368 -1722 -121 -108 -1367 -2262 -513 708
2827 708 -508 -1374 489 1915 -49 -1449 456 2997 1221 -986 712 2247 1026 398 2403 3598
2843 3598 613 -131 3158 3971 705 692 4947 4924 261 -203 5220 6033 1740 741 5093 4787 1166
2860 1166 2140 6127 5407 1310 2221 6000 4945 1776 3757 7032 4412 1196 3658 7793 5411 1933
2876 1933 4009 6694 5012 2515 5469 7410 5157 2813 5211 6860 4857 3812 5912 7065 4687
2891 4687 3518 5895 6846 5387 4682 6082 6283 5150 4669 6080 6468 5629 5506 5490 5553 5357 6077 6496
2909 6496 5479 5177 5323 5514 5970 5927 5151 4671 5511 5901 5040 4483 5911 5857 4288 3367 5158 6333 4823
$$ packed form
2793e512J605j150j055J795J423j797j850J832K685q49k103L43J711n60o57Q05
2809c334J718m80j552K35J205K87j18L13K67n78l31O46J601J3j259q95J749J221
2827G08j216q66J863J426j964j400J905K541j776k207J698J535j221o28K005J195
2843C598k985p44L289Q13l266j3M255k3m663m64N423Q13m293r99M352l06l621
2860A166R74L987p20m097R11L779j055l169J981L275k620l216K462M135k382l478
2876A933K076K685j682k497K954J941k253k344K398J649k003j045K100J153k378
2891D687j169K377R51j459p05J400K01j133m81J411L88q39j23j6O3j96P20M19
2909F496j017l02J46J91M56m3p76m80Q40L90q61n57J428n4j569r21J791J175j510
$$ plain form
2928 4823 2760 3652 5113 3973 3313 4489 4737 2955 2768 4164 4265 2557 2118 4220 3564 1391 1559
2945 1559 3912 3759 1388 560 2541 2590 1019 556 1878 1669 403 -339 547 560 -61 -97 361 134 -1484
2964 -1484 -1320 256 93 -1648 -2219 -1099 -910 -2312 -3096 -1753 -917 -2998 -4160 -2844 -1600 -2881
2980 -2881 -4264 -3262 -2801 -4347 -4432 -2820 -3054 -5424 -5225 -3405 -3434 -5953 -5830 -3472 -4460 -6795 -6222
2997 -6222 -4300 -4362 -6637 -6444 -5351 -5450 -6984 -6353 -5236 -5961 -7169 -6595 -5349 -6433 -7527 -6004 -5076
3014 -5076 -6396 -7836 -6679 -5212 -6167 -6981 -6856 -5708 -6088 -6357 -6356 -5451 -5368 -6741 -6407 -5439 -5208 -5556 -5744
3033 -5744 -5289 -5453 -6454 -5699 -4325 -4536 -5876 -5496 -4219 -3927 -4818 -5187 -3350 -3742 -4942 -4521 -3185
3050 -3185 -2932 -3989 -3742 -2906 -3481 -3859 -2965 -1731 -2714 -3251 -1707 -1516 -2919 -2936 -1336 -662 -1958 -2476
$$ packed form
2928D823k063Q92J461j140o60J176K48j782j87J396J01j708m39K102o56k173J68
2945A559K353j53k371q28J981M9j571m63J322k09j266p42Q86J3o21l6M58k27j618
2964a484J64J576j63j741n71J120J89j402p84J343Q36k081j162J316J244j281
2980b881j383J002M61j546q5J612k34k370J99J820k9k519J23K358r88k335N73
2997f222J922o2k275J93J093r9j534O31J117p25j208N74J246j084j094J523R28
3014e076j320j440J157J467r55q14J25J148l80k69JR05Q3j373L34R68K31l48j88
3033e744M55j64j001P55J374k11j340L80J277K92q91l69J837l92j200M21J336
3050c185K53j057K47Q36n75l78Q94J234r83n37J544J91j403j7J600O74j296n18
$$ plain form
3068 -2476 -1382 -906 -1359 -872 -82 -743 -1348 -339 192 -150 -449 535 71 -644 60 1268 1394 -65
3086 -65 380 1436 1074 653 2096 2538 771 627 2493 3054 1152 1631 3353 2916 910 1525 4489 3385
3104 3385 1579 2686 4218 3376 1661 3430 5121 3379 1873 3687 5044 2840 2079 4456 5792
3119 5792 3216 2028 4693 5467 3959 3638 5084 4924 2979 3720 5712 5384 3172 4181 5529 4789
3135 4789 3463 4951 6667 5192 3363 3868 5588 5500 4239 4464 4820 4276 4376 4447 5402 5012 4102 4780
3153 4780 4866 4427 4677 5073 4940 4450 3790 4419 5151 5011 4233 3918 4551 4974 4146 3922 4611 4875 4105 3595
3173 3595 3899 3936 3994 4133 4475 3545 3009 3371 4402 3802 3013 3444 3660 3112 1894 2828 3746 3167 1914
3192 1914 1711 2398 1851 2237 2570 2501 911 1130 2166 1913 1303 1060 1636 444 -345 36 1395 757 -243
$$ packed form
3068b476J094M76m53M87P90o61o05J009N31l42k99R84m64p15P04J208J26j459
3086f5M45J056l62m21J443M42j767j44J866N61j902M79J722m37k006O15K964j104
3104C385j806J107J532q42j715J769J691j742j506J814J357k204p61K377J336
3119E792k576j188K665P74j508l21J446j60j945P41J992l28k212J009J348p40
3135D789j326J488J716j475j829N05J720q8j261K25L56n44J00P1R55l90r10O78
3153D780Q6m39K50L96j33m90o60O29P32j40p78l15O33M23q28k24O89K64p70n10
3173C595L04L7N8J39L42r30n36L62J031o00p89M31K16n48j218R34R18n79j253
3192A914k03O87n47L86L33o9j590K19J036k53o10k43N76j192p89L81J359o38j000
$$ plain form
3211 -243 -259 -337 -716 -421 234 -256 -1613 -1888 -518 -1111 -2275 -1926 -900 -1554 -3394 -2938 -1077 -1807 -3290
3230 -3290 -2766 -2155 -3784 -3941 -2872 -2293 -3964 -4384 -3017 -3396 -4977 -4810 -2712 -2872 -5310 -5445 -4083
3247 -4083 -3723 -4802 -4851 -4435 -4968 -6136 -5623 -4371 -5017 -5783 -5259 -4982 -5814 -6065 -4725 -3888 -5468 -6759
3265 -6759 -6114 -4819 -5186 -5504 -5281 -5284 -5836 -5857 -5249 -5213 -4909 -5286 -5297 -5688 -5612 -5081 -4827 -4782 -5088 -5677 -5373 -4753
3287 -4753 -4005 -4369 -5016 -4245 -4202 -4704 -4741 -3588 -3106 -3870 -4438 -4041 -3519 -3826 -3104 -2715 -2949 -3999 -2968
3306 -2968 -2270 -1666 -3032 -2675 -1813 -2420 -3062 -2135 -1131 -957 -2124 -2230 -1242 -806 -742 -581 -514 -655 -1045
3325 -1045 -183 173 -283 11 226 226 -252 27 1351 1635 1175 845 710 1433 2101 1835 1058 1548 2078 1892
3345 1892 1079 1626 2893 2902 1965 1912 2612 2950 2396 3010 3624 2759 1498 2761 3957 3434 2176 2970 4487
$$ packed form
3211b43j6p8l79K95O55m90j357k75J370n93j164L49J026o54j840M56J861p30j483
3230c290N24O11j629j57J069N79j671m20J367l79j581J67K098j60k438j35J362
3247d083L60j079m9M16n33j168N13J252o46p66N24K77q32k51J340Q37j580j291
3265f759O45J295l67l18K23ln52k1O08L6L04l77j1l91P6N31K54M5l06n89L04O20
3287d753P48l64o47P71M3n02l7J153M82p64n68L97N22l07P22L89k34j050J031
3306b968O98O04j366L57Q62o07o42R27J004J74j167j06R88M36O4J61O7j41l90
3325a045Q62L56m56K94K15%m78K79J324K84m60l30j35P23O68k66p77M90N30j86
3345A892q13N47J267Rr37n3P00L38n54O14O14q65j261J263J196n23j258P94J517
$$ plain form
3364 4487 3166 1882 3930 5075 3633 2340 3242 4663 3526 2859 4127 4622 2649 2599 4609 5238
3380 5238 3372 2911 5291 4740 3062 3004 5408 5784 3220 2546 4563 5277 3415 3734 5416 5026 3275
3397 3275 3346 4937 5382 3521 3621 5001 4224 2876 3262 5388 4890 2641 3122 5148 4524 3076 3641
3414 3641 4940 4675 2665 2998 4824 4150 2834 3183 3974 3374 2334 3479 4554 3452 2243 2859 3672
3431 3672 3360 2053 2692 3584 2567 1334 2084 2817 2390 1713 1948 2158 1708 1531 1976 2260 1556 782 972
3450 972 1295 1114 602 1204 1128 363 -268 113 866 1149 108 -421 88 -368 -541 -965 -319 -351 -1361 -1600
3470 -1600 -909 -566 -1636 -1853 -1384 -1165 -2026 -2362 -1497 -1674 -3025 -2902 -2319 -1666 -2892 -3384 -2443 -2257 -3433
3489 -3433 -3635 -3192 -2887 -3463 -4114 -3425 -3400 -4003 -4577 -3840 -3352 -4302 -4722 -4233 -4102 -4653 -4900 -4147 -4127 -4759
$$ packed form
3364D487j321j284K048J145j442j293R02J421j137o67J268M95j973n0K010O29
3380E238j866m61K380n51j678n8K404L76k564o74K017P14j862L19J682l90j751
3397C275P1J591M45j861J00J380p77j348L86K126m98k249M81K026o24j448N65
3414C641J299k65k010L33J826o74j316L49P91o00j040J145J075j102j209O16Q13
3431C672l12j307O39Q92j017j233P50P33m27o77K35K10m50j77M45K84p04p74J90
3450I72L23j81n12O02p6p65o31L81P53K83j041n29N09m56j73m24O46l2j010k39
3470a600O91L43j070k17M69K19q61l36Q65j77j351J23N83O53j226m92R41J86j176
3489c433k02M43L05n76o51O89K5o03n74P37M88r50m20M89J31n51k47P53K0o32
$$ plain form
3509 -4759 -5799 -5185 -3858 -4110 -5470 -5290 -4620 -4749 -5203 -4794 -4394 -4838 -5712 -5080 -4106 -4380 -5356 -4925 -4447
3528 -4447 -5155 -5632 -4309 -3144 -4888 -5764 -4465 -3130 -4351 -5040 -3946 -3204 -4354 -5062 -3847 -2513
3544 -2513 -3991 -4835 -3407 -2511 -3759 -4090 -2765 -2047 -3802 -3986 -2139 -1420 -3013 -3427 -1634 -1059 -2827
3561 -2827 -3311 -1373 -749 -1913 -2097 -823 -659 -1629 -1119 -235 -328 -1073 -1164 -198 -96 -673 -287 929 812
3580 812 -456 -695 900 1924 549 359 696 1318 1009 796 1455 1644 1274 663 1731 2020 2303 2171
3598 2171 2324 2174 1938 2243 2981 3289 2214 1828 2220 3085 2964 2342 3027 3771 3365 2496 2848 3793 4217
3617 4217 3062 2680 3618 3628 3287 3741 4176 4057 3123 2968 4449 4346 3105 3343 4392 4310 2589 3006 4900
3636 4900 4683 3156 2887 4218 4394 3186 3706 4745 4040 2680 3361 4985 3984 2207 3271 4962
$$ packed form
3509d759j040O14J327k52j360J80O70j29m54M09M00m44q74O32R74k74r76M31M78
3528d447p08m77J323J165j744q76J299J335j221o89J094P42j150p08J215J334
3544b513j478q44J428Q96j248l31J325P18j755j84J847P19j593m14J793N75j768
3561b827m84J938O24j164j84J274J64r70N10Q84r3p45r1R66J02n77L86J216j17
3580H12j268k39J595J024j375j90L37O22l09k13O59J89l70o11J068K89K83j32
3598B171J53j50k36L05P38L08j075l86L92Q65j21o22O85P44m06q69L52R45M24
3617D217j155l82R38J0l41M54M35j19r34j55J481j03j241K38J049q2j721M17J894
3636D900k17j527k69J331J76j208N20J039p05j360O81J624j001j777J064J691
$$ plain form
3652 4962 3743 1781 3111 5209 4287 1941 2685 4859 4031 2278 3348 4580 3241 1658 2990 4005
3668 4005 2561 1837 3756 3755 2043 1409 3450 4653 2442 1416 2446 3761 2202 1316 2649 3475 1807
3685 1807 1018 1871 2674 2450 1322 1857 1783 1398 1345 2019 2147 1315 158 792 1539 1434 66 504 1755
3704 1755 743 -716 45 1540 1071 -404 -530 -7 -89 -741 -694 208 -617 -1813 -1322 204 -533 -1794
3722 -1794 -1137 386 -1381 -2942 -1960 -432 -1406 -2928 -2214 -1461 -2413 -2958 -2323 -1727 -2521 -3340 -2852 -2253
3740 -2253 -3072 -3126 -2378 -2689 -3971 -4167 -2896 -2839 -3320 -4043 -3719 -3627 -3900 -3777 -3558 -3840 -3618 -4220 -4826 -4177
3760 -4177 -3514 -3532 -4874 -4454 -3964 -3775 -4637 -3853 -3515 -4835 -5280 -4006 -3411 -4607 -5161 -3797 -2971 -4969
3778 -4969 -5629 -4009 -2523 -4303 -5482 -3839 -2844 -4590 -4741 -2886 -2328 -4586 -4707 -3188 -2916 -4165
$$ packed form
3652D962j219j962J330K098r22k346P44K174q28j753J070J232j339j583J332J015
3668D005j444p24J919jj712o34K041J203k211j026J030J315j559q86J333Q26j668
3685A807p89Q53Q03k24j128N35p4l85n3O74J28q32j157O34P47j05j368M38J251
3704A755j012j459P61J495m69j475j26N23q2o52M7R02q25j196M91J526p37j261
3722a794O57J523j767j561R82J528r74j522P14P53r52n45O35N96p94q19M88N99
3740b253q19n4P48l11j282j96J271N7m81p23L24R2k73J23K19k82K22o02o06O49
3760d177O63j8j342M20M90J89q62P84L38j320m45J274N95j196n54J364Q26j998
3778d969o60J620J486j780j179J643R95j746j51J855N58k258j21J519K72j249
$$ plain form
3794 -4165 -3818 -2172 -2444 -4680 -4135 -1500 -1527 -3875 -4054 -1638 -1775 -3725 -3079 -889 -1390 -3331 -2734
3811 -2734 -1133 -1320 -2336 -1757 -623 -1170 -2502 -1065 241 -414 -1653 -1187 410 -277 -1159 17 1190
3828 1190 481 -682 -214 1115 983 109 619 1338 869 -51 977 2018 1602 1160 1293 2197 1757 1282
3846 1282 1686 2887 2482 1289 1599 2715 3043 2300 2403 2634 2692 2217 2967 3698 3325 2667 2766 3442 3095
3865 3095 2901 2867 3539 3378 2488 2922 4024 3973 3245 2884 3772 3936 3364 2908 3404 4163 3573 2970 3314 3618
3885 3618 3540 3147 3544 3790 3006 2853 3167 3818 3706 2783 3402 3699 3136 2361 3416 4314 3207 1877 2872
3904 2872 4053 3547 2412 3317 4134 2880 2035 3013 4143 2693 2007 2683 3239 2283 1749 2990 3608 2124
3922 2124 1367 2905 3568 2068 1220 2218 2682 1635 884 2302 2881 1342 633 2063 2174 1024 859
$$ packed form
3794d165L47J646k72k236N45K635k7k348j79K416j37j950O46K190n01j941N97
3811b734J601j87j016N79J134n47j332J437J306o55j239M66J597o87q82J176J173
3828A190p09j163M68J329j32q74N10P19m69r20J028J041m16m42J33R04m40m75
3846A282M04J201m05j193L10J116L28p43J03K31N8m75P50P31l73o58R9O76l47
3865C095j94l4O72j61q90M34J102n1p28l61Q88J64n72m56M96P59n90o03L44L04
3885C618p8l93L97K46p84j53L14O51j12r23O19K97n63p75J055Q98j107j330R95
3904B872J181n06j135R05Q17j254q45R78J130j450o86O76N56r56n34J241O18j484
3922B124p57J538O63j500q48R98M64j047p51J418N79j539p09J430J11j150j65
$$ plain form
3939 859 2099 2237 756 139 1354 1640 510 603 1544 1455 209 -193 762 1263 522 -464 161 238 -360
3958 -360 -295 -6 23 -469 -902 -3 -201 -1035 -956 -565 -329 -1117 -1645 -772 -440 -1249 -2004 -1674 -620 -1368 -1997
3979 -1997 -1790 -1546 -1820 -2144 -2113 -1167 -1358 -2358 -2317 -1965 -2265 -2537 -2213 -2027 -2601 -3267 -2989 -2493 -2518 -3052
3999 -3052 -3171 -2518 -3234 -3495 -3413 -2792 -3086 -3793 -3940 -3260 -3297 -3956 -3732 -3056 -3209 -4274 -3991 -3035 -3437 -4194
4019 -4194 -4346 -3375 -3266 -4350 -4212 -3196 -2911 -4029 -4225 -3264 -3466 -4051 -4189 -3410 -3030 -4032 -3880 -2786
4037 -2786 -2657 -4209 -3949 -2932 -2689 -3857 -3335 -2070 -2396 -4059 -3937 -2043 -2007 -3067 -3225 -1754 -1713 -3201
4055 -3201 -3173 -1403 -1024 -2800 -2486 -764 -976 -2004 -1865 -334 -849 -2265 -1902 119 -337 -1699 -1656 422
4073 422 349 -1281 -695 986 265 -1010 -377 1182 734 -656 24 1607 830 -358 791 1954 1203
$$ packed form
3939H59J240J38j481o17J215K86j130R3R41q9j246m02R55N01p41r86O25P7n98
3958c60O5K89K9m92m33Q99j98q34P9L91K36p88n28Q73L32q09p55L30J054p48o29
3979a997K07K44k74l24L1R46j91j000M1L52l00k72L24J86n74o66K78M96k5n34
3999c052j19O53p16k61Q2O21k94p07j47O80l7o59K24O76j53j065K83R56m02p57
4019d194j52R71J09j084J38J016K85j118j96R61k02n85j38P79L80j002J52J094
4037b786J29j552K60J017K43j168N22J265l26j663J22J894L6j060j58J471M1j488
4055c201K8J770L79j776L14J722k12j028J39J531n15j416L63K021m56j362M3K078
4073D22p3j630N86J681p21j275O33J559m48j390O80J583p77j188J149J163p51
$$ plain form
4090 1203 123 1315 2570 1786 411 1293 2961 2095 839 1623 3080 2278 1533 2069 3250 2566 1663
4107 1663 2282 3401 2615 2126 2941 3380 2851 1927 3219 3775 3045 2157 2780 3755 3826 2966 2937 3386 3415 2809
4127 2809 3043 3750 3638 3040 3076 3473 3668 3144 3178 3616 3353 2889 2934 3668 3664 2816 2469 3514 3729 2803 3004
4148 3004 3553 3585 2763 2421 3205 3277 2671 2367 2890 3243 2406 2001 3285 2970 1953 1875 2972 3297 2237
4167 2237 1564 2845 3476 1809 1219 1964 3157 2094 1287 2007 2303 1307 754 1793 2249 1430 744 1430
4185 1430 1774 768 880 1935 1838 135 83 1684 1545 321 -151 1166 1338 -167 -63 862 1176 -398
4203 -398 -322 852 514 -479 -480 604 277 -947 -612 365 -22 -981 -1106 283 -312 -1600 -1371 -103 -347
4222 -347 -1472 -1320 -911 -1448 -1679 -1538 -857 -1450 -2284 -1928 -1217 -1576 -1900 -2059 -1785 -2045 -2602 -2379 -1700 -1660
$$ packed form
4090A203j080J192J255p84j375Q82J668q66j256P84J457q02p45N36J181o84r03
4107A663O19J119p86m89Q15M39n29r24J292N56p30q88O23R75P1q60k9M49K9o06
4127B809K34P07j12n98L6L97J95n24L4M38k63m64M5P34mq48l47J045K15r26K01
4148C004N49L2q22l42P84P2o06l04N23L53q37m05J284l15j017p8J097L25j060
4167B237o73J281O31j667n90P45J193j063q07P20K96r96n53J039M56q19o86O86
4185A430L44j006J12J055r7j703n2J601j39j224m72J317J72j505J04R25L14j574
4203c98P6J174l38r93jJ084l27j224L35R77l87r59j25J389n95j288K29J268k44
4222c47j125J52M09n37k31J41O81n93q34L56P11l59l24j59K74k60n57K23O79M0
$$ plain form
4242 -1660 -2241 -3107 -2634 -2010 -1818 -2921 -2766 -2424 -2648 -2922 -3005 -2261 -2679 -3218 -3211 -2785 -3110 -3397 -2928 -2307
4262 -2307 -3373 -3882 -3173 -2574 -3288 -3900 -2812 -2605 -3132 -4048 -3122 -2524 -3081 -3748 -3205 -3073 -2945 -3347 -3114
4281 -3114 -2668 -3317 -3860 -2848 -2576 -2697 -3234 -3154 -2657 -3172 -3302 -2678 -2199 -2452 -3063 -2966 -2316 -2188 -2423 -2492
4301 -2492 -1969 -2340 -2868 -2464 -1469 -1615 -2688 -2287 -1304 -1582 -2367 -1774 -494 -736 -2404 -1724 -397 -555
4319 -555 -1725 -1143 150 -299 -1361 -850 142 25 -946 -359 474 -58 -646 240 1509 475 -588 481
4337 481 1604 882 106 858 1841 984 213 1221 2377 1810 921 1557 2470 1703 1688 2168 2540 2126 1721
4356 1721 2455 2618 2426 2045 2494 2772 2278 2066 2938 3464 2909 2205 2646 3060 2857 2642 2961 3200 2782 2387
4376 2387 3010 3382 3222 2737 2997 3172 2967 2501 3111 3473 2926 2547 2605 3254 3475 2833 2809 3366 2922 2815
$$ packed form
4242a660n81q66M73O24J92j103J55L42k24k74q3P44m18n39PM26l25k87M69O21
4262b307j066n09P09N99p14o12J088K07n27r16R26N98n57o67N43J32J28m02K33
4281c114M46o49n43J012K72j21n37Q0M97n15j30O24M79k53o11R7O50J28k35o9
4301b492N23l71n28M04R95j46j073M01R83k78p85N93J280k42j668O80J327j58
4319e55j170N82J293m49j062N11R92j17r71N87Q33n32n88Q86J269j034j063J069
4337D81J123p22p76P52R83q57p71J008J156n67q89O36R13p67j5M80L72m14m05
4356A721P34J63j92l81M49K78m94k12Q72N26n55p04M41M14k03k15L19K39m18l95
4376B387O23L72j60m85K60J75k05m66O10L62n47l79N8O49K21o42k4N57m44j07
$$ plain form
4396 2815 2438 3148 3242 2820 2301 2977 2871 2446 2760 2848 2549 2141 2168 2994 2366 2128 2268 2982 2719 1781 1749
4417 1749 2274 2922 1953 1293 2057 2282 1922 1347 1848 2204 1420 875 1640 2100 1452 888 1557 1670 716 121
4437 121 1453 1822 852 134 1181 1522 373 -80 1063 1341 -37 -460 828 1019 29 -482 533 396
4455 396 -919 -864 705 481 -958 -1080 211 17 -913 -676 -499 -378 -1343 -1081 -580 -538 -1228 -1193 -1018 -942
4475 -942 -1446 -948 -732 -1309 -2056 -1761 -1191 -1169 -1813 -1919 -1334 -1159 -1946 -2497 -1553 -1444 -1850 -2657 -1830 -1472
4495 -1472 -2157 -2706 -1985 -1519 -2458 -3143 -2002 -1665 -2266 -2890 -2407 -1862 -3232 -3229 -2065 -1657 -2609 -3288 -2471
4514 -2471 -1930 -2947 -3077 -2096 -2293 -3256 -3465 -2243 -2230 -3319 -3289 -2305 -2688 -3318 -3284 -2199 -2420 -3278 -3423
4533 -3423 -2203 -2342 -3451 -3196 -2497 -2621 -2864 -2563 -2051 -2441 -2750 -2384 -2676 -2224 -2539 -2089 -2206 -2572 -2020
$$ packed form
4396B815l77P10R4m22n19O76j06m25L14Q8k99m08K7Q26o28k38J40P14k63r38l2
4417A749N25O48r69o60P64K25l60n75N01L56p84n45P65M60o48n64O69J13r54n95
4437A21J332L69r70p18J047L41j149m53J143K78j378m23J288J91r90n11J015j37
4455C96j315N5J569k24j439j22J291j94r30K37J77J21r65K62N01M2o90L5J75P6
4475i42n04M98K16n77p47K95N70K2o44j06N85J75p87n51R44J09m06q07Q27L58
4495a472o85n49P21M66r39o85J141L37o01o24M83N45j370LJ164M08r52o79Q17
4514b471N41j017j30R81j97r63k09J222J3j089L0R84l83o30L4J085k21q58j45
4533c423J220j39j109K55O99j24k43L01N12l90l09L66k92M52l15M50j17l66N52
$$ plain form
4552 -2020 -1987 -1848 -1672 -2068 -1962 -1620 -1260 -1414 -2159 -1835 -981 -1124 -1886 -1735 -486 -581 -1674 -1526 -468
4571 -468 -481 -1052 -1060 60 -372 -946 -514 432 108 -637 321 961 -4 -556 229 1166 601 -312 880 1481
4591 1481 544 -144 1430 1925 1048 156 1604 2199 1161 766 1894 2391 1406 853 2137 2525 1691 1108
4609 1108 2409 2387 2152 1744 2288 2698 2021 2204 2207 2523 2564 2356 2685 3043 2295 2644 3126 3190 2613 2720 3006
4630 3006 3102 2446 2260 3463 3502 2866 2539 2971 3325 2718 2722 2964 2721 2579 2464 2441 2612 2722 2627 2708 2598 2072
4652 2072 2427 2997 2760 1930 2081 2537 2291 2023 1992 2290 2259 1904 1863 1967 1897 2182 2195 1738 1498 1570 1526 1580
4674 1580 1878 1727 1336 1248 1376 1357 873 1016 1378 1719 659 622 860 1438 741 292 670 1170 486 196
4694 196 403 814 117 51 646 841 -162 -332 306 217 -451 -529 399 70 -968 -1047 284 255 -1259 -1087
$$ packed form
4552b020L3J39J76l96J06L42L60j54p45L24Q54j43p62J51J249r5j093J48J058
4571d68j3n71qJ120m32n74M32R46l24p45R58O40r65n52P85R37n65r13J192O01
4591A481r37o88J574M95q77q92J448N95j038l95J128M97r85n53J284L88q34n83
4609A108J301k2k35m08N44M10o77J83LL16M1k08L29L58p48L49M82O4n77J07K86
4630C006R6o56j86J203L9o36l27M32L54o07MK42k43j42j15k3J71J10r5Q1j10n26
4652B072L55N70k37q30J51M56k46k68l1K98l1l55m1J04p0K85J3m57k40P2m4N4
4674A580K98j51l91q8J28j9m84J43L62L41j060l7K38N78o97m49L78N00o84k90
4694A96K07M11o97o6N95J95j003j70O38q9o68p8R28l29j038p9J331k9j514J72
$$ plain form
4714 -1087 -133 -333 -1136 -1162 -340 -474 -1302 -1257 -753 -763 -1788 -1430 -816 -920 -1767 -1286 -577 -1365 -1999 -1815
4734 -1815 -994 -1368 -2035 -1927 -991 -1297 -1943 -1800 -1505 -1685 -2127 -2004 -1355 -2026 -2551 -2253 -1568 -1860 -2511 -2112
4754 -2112 -1644 -1839 -2632 -2257 -1773 -1630 -2727 -2684 -1818 -2065 -2710 -2610 -1942 -1960 -2230 -2277 -1895 -2461 -2415 -2290 -2102
4775 -2102 -2213 -2863 -2268 -1938 -2079 -2891 -2793 -1994 -2143 -2543 -2032 -1890 -1810 -2558 -2438 -1813 -1794 -2049 -2459 -2042 -2146
4796 -2146 -1953 -1892 -1483 -1470 -2232 -1977 -1362 -1323 -1754 -1806 -1181 -1241 -1605 -1851 -1203 -965 -1489 -1649 -1072 -1056 -1289 -1544
4818 -1544 -993 -169 -899 -982 -428 -411 -773 -1055 -55 -145 -597 -924 198 688 -53 -542 74 432 225 143
4838 143 845 1003 28 246 1058 1304 1201 708 1397 902 546 883 2207 1988 1037 1073 1847 2020 1283 1658
4858 1658 2195 1969 1353 1288 2406 2425 1907 1846 2424 2514 1777 1769 3035 2646 2190 1955 2768 2802 1994 1929 3027
$$ packed form
4714a087R54k00q03k6Q22j34q28M5N04j0j025L58O14j04q47M81P09p88o34J84
4734a815Q21l74o67J08R36l06o46J43K95j80m42J23O49o71n25K98O85k92o51L99
4754b112M68j95p93L75M84J43j097M3Q66k47o45J00O68j8k70m7L82n66M6J25J88
4775b102j11o50N95L30j41q12R8P99j49m00N11J42Q0p48J20O25J9k55m10M17j04
4796b146J93O1M09J3p62K55O15L9m31n2O25o0l64k46O48K38n24j60N77J6k33k55
4818a544N51Q24p30q3N54J7l62k82J000r0m52l27J122M90p41m89O16L58k07q2
4838A43P02J58r75K18Q12K46j03m93O89m95l56L37J324k19r51L6P74J73p37L75
4858A658N37k26o16o5J118J9n18o1N78R0p37qJ266l89m56k35Q13L4q08o5J098
$$ plain form
4879 3027 2867 2000 2132 2955 3101 2018 2284 3117 2861 1779 2362 3348 3092 2040 2409 3051 2519 1957 2536
4898 2536 3201 2512 1778 2098 2861 2697 1936 1980 2346 2367 2058 1854 2710 2175 1703 2073 2186 1795 1789 1936 1798
4919 1798 1335 1138 1681 1702 1661 1139 778 1612 1539 1053 957 1354 1261 1031 587 790 998 965 540 735 706 552
4941 552 540 359 917 243 157 -31 -57 -28 -70 79 195 -490 -629 7 253 51 -593 -568 -295 -700 -1101 -744
4963 -744 -38 -644 -1123 -865 -236 -989 -1242 -693 -256 -904 -1951 -1078 -536 -924 -1629 -1585 -1027 -1470 -2016 -1101
4983 -1101 -910 -1189 -2050 -1579 -1274 -1490 -1983 -1145 -1129 -2101 -2141 -1210 -983 -1915 -2082 -1616 -1020 -1934 -2208 -1721
5003 -1721 -1161 -2045 -2631 -2086 -1438 -1974 -2166 -1724 -1701 -2358 -2197 -1947 -1710 -2283 -2295 -1744 -1565 -2626 -2288 -1738
5023 -1738 -1550 -2181 -2423 -2054 -1975 -2126 -2083 -1835 -2081 -1753 -2338 -1445 -1513 -1765 -2076 -1981 -1857 -2146 -1866 -1615 -1630
$$ packed form
4879C027j60q67J32Q23J46j083K66Q33k56j082N83R86k56j052L69O42n32n62N79
4898B536O65o89p34L20P63j64p61M4L66K1l09k04Q56n35m72L70J13l91oJ47j38
4919A798m63j97N43K1m1n22l61Q34p3m86r6L97r3k30m44K03K08l3m25J95k9j54
4941E52j2j81N58o74q6j88k6K9m2J49J16o85j39O36K46k02o44K5K73m05m01L57
4963g44P06o06m79K58O29p53k53N49M37o48j047Q73N42l88p05M4N58m43n46R15
4983a101J91k79q61M71L05k16m93Q38J6r72m0R31K27r32j67M66N96r14k74M87
5003a721N60q84n86N45O48n36j92M42K3o57J61K50K37n73j2N51J79j061L38N50
5023a738J88o31k42L69P9j51M3K48k46L28n85Q93o8k52l11R5J24k89K80K51j5
$$ plain form
5044 -1630 -2131 -2069 -1770 -1317 -1515 -1951 -1323 -1427 -1589 -1631 -1264 -956 -1272 -1523 -1232 -1404 -1204 -1371 -1052 -841
5064 -841 -1220 -1268 -715 -560 -987 -917 -401 -332 -962 -987 -396 -14 -376 -778 -731 -53 128 -182 80 148 5 91
5086 91 224 571 449 174 234 791 866 792 693 863 1172 740 805 1006 1587 888 1068 1388 1682 1259 1171 1745
5108 1745 1767 1504 1276 2031 1970 1479 1539 2258 2141 1293 1521 2508 2569 1667 1945 2768 2606 1689 2035 2727 2325
5129 2325 1801 1742 2510 2285 1989 2284 2546 2313 1953 2145 2792 2337 1880 2273 2573 2365 1814 2286 2771 2110
5149 2110 1763 2241 2433 2304 2051 2096 2371 1716 1852 2041 2195 1635 1760 2114 1933 1678 1389 1671 1860 1384
5169 1384 1382 1235 1487 1510 1507 1222 1289 1590 964 945 1561 827 660 599 774 974 839 588 706 520 482 175 540
5192 540 710 180 -28 212 414 -8 -11 170 2 -250 -489 166 -174 -507 -842 -482 -275 -682 -843 -299 -608
$$ packed form
5044a630n01O2K99M53j98m36O28j04j62m2L67L08l16k51K91j72K00j67L19K11
5064h41l79m8N53J55m27P0N16O9o30k5N91L82l62m02M7O78J81l10K62O8j43Q6
5086I1J33L47j22k75O0N57P5p4r9J70L09m32O5K01N81o99J80L20K94m23q8N74
5108A745K2k63k28P55o1m91O0P19j17q48K28R87O1r02K78Q23j62r17L46O92m02
5129B325n24n9P68k25k96K95K62k33l60J92O47m55m57L93L00k08n51M72M85o61
5149B110l47M78J92j29k53M5K75o55J36J89J54n60J25L54j81k55k89K82J89m76
5169A384kj47K52K3lk85O7L01o26j9O16p34j67o1J75K00j35k51J18j86l8l07L65
5192E40J70n30k08K40K02m22lJ81j68k52k39O55l40l33l35L60K07m07j61N44l09
$$ plain form
5213 -608 -929 -926 -214 -489 -851 -930 -735 -703 -1462 -1364 -1255 -783 -1236 -1200 -1411 -1135 -1597 -1668 -1368 -1033 -1388 -1792
5235 -1792 -1275 -1469 -1514 -1676 -1028 -1192 -2275 -2032 -1161 -1119 -1462 -1748 -1515 -1683 -2126 -2418 -1346 -1453 -2025 -2299
5255 -2299 -1694 -1274 -1991 -2078 -1706 -1446 -2161 -2404 -1423 -1398 -2479 -2198 -1409 -1407 -2043 -2329 -1557 -1145 -2197 -2327
5275 -2327 -1781 -1279 -1878 -2123 -1081 -1498 -1992 -2074 -1480 -1291 -1951 -1733 -1501 -1464 -1852 -1661 -1079 -1013 -2097 -2089 -1164
5296 -1164 -1023 -1442 -1514 -1063 -1206 -1711 -1390 -954 -928 -1026 -1198 -821 -981 -1319 -1038 -774 -566 -1224 -1071 -672 -494
5317 -494 -1099 -722 -253 -609 -786 -994 -13 -144 -304 -527 -79 167 -370 227 236 142 -31 113 202 254 150 350
5339 350 440 486 787 473 708 799 893 437 814 1182 885 1091 992 1245 1228 1081 998 1372 1546 1126 1528 1982
5361 1982 1385 1427 1640 2039 1666 1271 1748 2146 2035 1447 1995 2135 1902 1396 1897 2444 2275 1641 1656 2209
$$ packed form
5213f08l21LP12k75l62p9J95L2p59R8J09M72m53L6k11K76m62p1L00L35l55m04
5235a792N17j94m5j62O48j64j083K43Q71M2l43k86K33j68m43k92J072j07n72k74
5255b299O05M20p17q7L72K60p15k43R81K5j081K81P89Ko36k86P72M12j052j30
5275b327N46N02n99k45J042m17m94q2N94J89o60K18K32L7l88J91N82O6j084QR25
5296a164J41m19p2M51j43n05L21M36K6r8j72L77j60l38K81K64K08o58J53L99J78
5317d94o05L77M69l56j77k08R81j31j60k23M48K46n37N97Rr4j73J44Q9N2j04K00
5339C50R0M6L01l14K35R1R4m56L77L68k97K06r9K53j7j47q3L74J74m20M02M54
5361A982n97M2K13L99l73l95M77L98j11n88N48J40k33n06N01N47j69o34J5N53
$$ plain form
5381 2209 1962 1930 2139 2461 2184 1761 2530 2162 2180 1692 2157 2498 1931 1681 2412 2691 1889 1645 2000 2098 1922
5402 1922 1644 1930 2201 1769 1522 1835 2259 1866 1528 1914 1776 1403 1223 1524 2143 1548 1043 1146 1661 1127
5422 1127 1171 1039 1313 1016 714 1056 1218 813 636 1042 1034 689 365 880 966 594 141 573 578 580 8 269
5444 269 277 26 -139 194 387 93 -17 -649 -294 -378 -457 -272 -124 -651 -907 -634 -361 -621 -1242 -741 -554
5465 -554 -776 -980 -1029 -732 -1030 -1032 -1198 -953 -1286 -1182 -1053 -931 -1002 -1460 -1492 -1341 -1106 -1638 -1476 -1171 -923 -1675
5487 -1675 -1689 -1009 -1107 -1709 -1914 -1358 -1252 -1604 -1582 -1416 -1366 -1570 -2056 -1704 -1391 -1577 -1613 -1212 -1389 -2229 -1768
5508 -1768 -1146 -1672 -1831 -1930 -1134 -1510 -2286 -1756 -1127 -1383 -2086 -1841 -1291 -1487 -1918 -1701 -1229 -1605 -2002 -1976
5528 -1976 -982 -1069 -1796 -1424 -989 -1101 -2006 -1324 -947 -1272 -2070 -1479 -703 -1172 -1680 -1314 -872 -1137 -1530 -1240
$$ packed form
5381B209k47l2K09L22k77m23P69l68J8m88M65L41n67k50P31K79q02k44L55R8j76
5402A922k78K86K71m32k47L13M24l93l38L86j38l73j80L01O19n95n05J03N15n34
5422A127M4j32K74k97l02L42J62m05j77M06ql45l24N15Q6l72m53M32NKn72K61
5444B69Qk51j65L33J93k94j10o32L55q4p9J85J48n27k56K73K73k60o21N01J87
5465e54k22k04m9K97k98kj66K45l33J04J29J22p1m58l2J51K35n32J62L05K48p52
5487a675j4O80r8o02k05N56J06l52K2J66N0k04m86L52L13j86l6M01j77q40M61
5508a768O22n26j59r9P96l76p76N30O29k56p03K45N50j96m31K17M72l76l97K6
5528a976R94q7p27L72M35j12r05O82L77l25p98N91P76m69n08L66M42k65l93K90
$$ plain form
5548 -1240 -792 -897 -1337 -1179 -533 -777 -1476 -773 -444 -919 -1399 -795 -130 -614 -796 -868 -236 -773 -970 -609
5568 -609 -280 -218 -792 -274 -174 -229 -624 -210 73 74 -647 90 544 325 -255 -52 423 473 -139 121 654 751
5590 751 266 170 1022 786 459 620 821 656 482 518 1169 1256 926 775 1009 1019 932 1056 1730 1314 806 1080
5612 1080 1389 1655 1485 1241 1433 1730 1595 1504 1788 1722 1766 1618 1642 1886 1598 1284 1968 2411 1616 1655 1842
5633 1842 2152 1560 1492 1930 2189 1686 1628 2002 2190 1711 1610 1903 2254 1685 1295 1885 2129 1458 1473 1757 1989
5654 1989 1418 1522 2139 1922 1559 1210 1807 1913 1349 1281 1654 1489 1375 1375 1421 1635 1154 937 1472 1499 680
5675 680 702 1646 1170 693 560 1124 1062 396 412 822 1165 320 255 674 444 336 136 292 442 -266 -11
5696 -11 352 126 -282 -171 54 17 -566 -296 -361 -257 -423 -767 -431 -438 -919 -878 -846 -574 -829 -700 -687 -723 -671
$$ packed form
5548a240M48j05m40J58O46k44o99P03L29m75m80O04O65m84j82p2O32n37j97L61
5568f09L29O2n74N18J00n5l95M14K83Jp21P37M54k19n80K03M75N0o12K60N33R7
5590G51m85r6Q52k36l27J61K01j65j74L6O51Q7l30j51K34J0q7J24O74m16n08K74
5612A080L09K66j70k44J92K97j35r1K84o6M4j48K4K44k88l14O84M43p95L9J87
5633A842L10n92o8M38K59n03n8L74J88m79j01K93L51n69l90N90K44o71J5K84K32
5654A989n71J04O17k17l63l49N97J06n64o8L73j65j14%M6K14m81k17N35K7q19
5675F80K2R44m76m77j33N64o2o66J6M10L43q45o5M19k30j08k00J56J50p08K55
5696a1L63k26m08J11K25l7n83K70o5J04j66l44L36pm81M1L2K72k55J29J3l6N2
$$ plain form
5719 -671 -920 -775 -940 -1034 -1276 -923 -953 -1075 -1522 -1111 -1033 -1197 -1475 -1133 -976 -1598 -1669 -1396 -1090 -1482 -1623
5740 -1623 -1712 -1379 -1494 -1538 -1517 -1237 -1704 -1740 -1530 -1559 -1689 -1712 -1318 -1582 -1736 -1840 -1678 -1213 -1489 -1757 -1769 -1470
5762 -1470 -1445 -1769 -1748 -1414 -1499 -1665 -1549 -1267 -1420 -1603 -1168 -1220 -1294 -1638 -1340 -761 -1176 -1466 -1162 -881 -1364
5783 -1364 -1427 -1494 -820 -999 -1531 -1147 -695 -970 -1355 -1105 -663 -1067 -1380 -859 -602 -699 -1545 -1040 -658 -952 -937
5804 -937 -653 -310 -923 -1035 -869 -297 -566 -870 -624 -382 -522 -850 -544 -121 -257 -617 -568 -256 -52 -225
5824 -225 -6 145 -280 -597 -140 329 110 -120 -46 315 139 -127 162 756 497 127 402 685 734 251 822
5845 822 468 546 264 637 878 828 694 878 1294 958 838 999 1271 924 1133 1046 1193 1245 812 1154 1381
5866 1381 1423 1262 1421 1206 1350 1440 1423 1344 1483 1655 1627 1431 1572 1520 1556 1696 1523 1395 1473 1414 1724 1529 1605
$$ packed form
5719f71k49J45j65r4k42L53l0j22m47M11P8j64k78L42J57o22p1K73L06l92j41
5740a623q9L33j15m4K1K80m67l6K10k9j30k3L94k64j54j04J62M65k76k68j2K99
5762a470K5l24K1L34q5j66J16K82j53j83M35n2p4l44K98N79m15k90L04K81m83
5783a364o3o7O74j79n32L84M52k75l85K50M42m04l13N21K57r7q46N05L82k94J5
5804i37K84L43o13j12J66N72k69l04K46K42j40l28L06M23j36l60M9L12K04j73
5824b25K19J51m25l17M57M69k19k30P4L61j76k66K89N94k59l70K75K83M9m83N71
5845H22l54P8k82L73K41n0j34J84M16l36j20J61K72l47K09q7J47N2m33L42K27
5866A381M2j61J59k15J44R0j7p9J39J72k8j96J41n2L6J40j73j28P8n9L10j95P6
$$ plain form
5889 1605 1695 1953 1351 1122 1804 1791 1826 1229 1757 1843 1507 1276 2043 2227 1288 1407 1986 1898 1112 867 1656
5910 1656 1864 988 1164 1632 1736 959 737 1326 1727 882 897 1508 1042 560 919 1320 985 258 615 1290
5930 1290 1263 247 502 955 980 409 302 691 434 509 290 435 151 -174 -33 -140 410 -297 -199 145 -41
5951 -41 -539 -393 -108 -34 -1034 -630 100 -612 -854 -900 -298 -791 -799 -761 -843 -561 -1296 -896 -461 -648 -1172 -1257
5973 -1257 -556 -770 -1345 -1050 -687 -929 -1289 -1485 -958 -920 -1378 -1356 -1359 -911 -1600 -1317 -1331 -1423 -1600 -1639 -1255 -1203
5995 -1203 -1643 -1469 -1185 -1274 -1750 -1443 -1070 -1288 -1702 -1702 -1455 -1269 -1423 -1475 -1327 -1185 -1690 -1221 -1366 -1394 -1371 -1454
6017 -1454 -1080 -1191 -1380 -1106 -1467 -1010 -1076 -1539 -1133 -953 -1135 -1845 -1151 -909 -771 -1457 -959 -683 -1314 -1252
6037 -1252 -1037 -1122 -1009 -1226 -775 -344 -801 -981 -889 -499 -760 -880 -666 -212 -738 -891 -75 -206 -717 -979
$$ packed form
5889A605R0K58o02k29O82j3L5n97N28Q6l36k31P67J84r39J19N79q8p86k45P89
5910A656K08q76J76M68J04p77k22N89M01q45J5O11m66m82L59M01l35p27L57O75
5930A290k7j016K55M53K5n71j07L89k57P5k19J45k84l25J41j07N50p07R8L44j86
5951d1m98J46K85P4j000M04P30p12k42m6O02m93qL8q2K82p35M00M35j87n24q5
5973a257P01k14n75K95L63k42l60j96N27L8m58K2lM48o89K83j4r2j77l9L84N2
5995a203m40J74K84q9m76L07L73k18m14%K47J86j54n2J48J42n05M69j45k8K3q3
6017a454L74j11j89K74l61M57o6m63M06J80j82p10O94K42J38o86M98K76o31O2
6037a252K15q5J13k17M51M31m57j80R2L90k61j20K14M54n26j53Q16j31n11k62
$$ plain form
6057 -979 -381 0 -460 -778 -267 56 -467 -480 -282 -129 -390 -481 -131 29 -500 -306 -21 249 -452 21 175
6078 175 502 257 24 251 349 -108 -27 266 219 278 57 615 810 477 306 360 692 528 888 532 946 528
6100 528 579 779 1070 542 456 916 1213 680 505 888 1043 973 835 1030 1196 941 832 992 1173 1182 795 1540
6122 1540 1237 1030 1016 1314 1698 1528 1058 1353 1776 1337 1434 1109 1534 1257 1260 1204 1142 1797 1355 1614 1742 1350
6144 1350 1502 1578 1609 1368 1293 1539 1537 1762 1285 844 1265 1427 818 1261 1356 1245 844 1003 1501 1399 975 1281
6166 1281 1629 1249 776 840 1453 1122 815 844 969 872 540 551 1082 682 611 515 1269 793 111 471 861 434
6188 434 6 285 513 654 289 251 426 259 -555 12 216 128 -392 -46 197 -272 -565 -14 -149 -118 -731
6209 -731 -371 -195 -325 -732 -605 -440 -507 -967 -739 -172 -736 -1172 -852 -654 -909 -1097 -1314 -812 -661 -954
$$ packed form
6057i79N98L81m60l18N11L23n23j3J98J53k61r1L50J60n29J94K85K70p01M73J54
6078A75L27k45k33K27R8m57Q1K93m7N9k21N58J95l33j71N4L32j64L60l56M14m18
6100E28N1K00K91n28q6M60K97n33j75L83J55p0j38J95J66k55j09J60J81Rl87P45
6122A540l03k07j4K98L84j70m70K95M23m39R7l25M25k77Ln6o2O55m42K59J28l92
6144A350J52P6L1k41p5K46kK25m77m41M21J62o09M43R5j11m01J59M98j02m24L06
6166A281L48l80m73O4O13l31l07K9J25r7l32J1N31m00p1r6P54m76o82L60L90m27
6188D34m28K79K28J41l65l8J75j67q14N67K04q8n20L46K43m69k93N51j35L1o13
6209g31L60J76j30m07J27J65o7m60K28N67n64m36L20J98k55j88k17N02J51k93
$$ plain form
6229 -954 -1147 -1039 -1316 -1344 -1319 -1237 -1158 -1230 -1302 -1216 -1384 -1520 -996 -1071 -1196 -1336 -1270 -1014 -1120 -1598 -1463 -1151 -1197
6252 -1197 -1541 -1322 -1115 -1115 -1624 -1115 -1142 -1261 -1226 -1298 -791 -1342 -1290 -1009 -1057 -1118 -1291 -1306 -959 -898 -1434 -1245 -781
6275 -781 -681 -1001 -1209 -729 -959 -889 -1189 -963 -731 -1223 -784 -1032 -1016 -1052 -837 -617 -635 -1054 -948 -543 -540 -727
6297 -727 -905 -467 -297 -745 -502 -497 -150 -422 -723 -393 -309 -179 -555 -130 -43 -468 -554 -13 5 -280 -133 147
6319 147 -257 -50 -293 117 256 -33 -87 379 171 -14 123 64 362 32 171 635 358 196 71 549 312
6340 312 410 497 969 956 616 179 462 925 356 555 741 882 474 734 802 766 674 698 939 964 538 916 1145
6363 1145 1105 838 974 1277 1146 871 532 1295 1291 948 908 1388 1117 1058 928 1195 995 1170 968 1093 1071 838
6385 838 1007 1624 1286 1075 1214 1529 1296 995 1084 1573 1339 945 1237 1346 1267 828 1078 1267 1332 1032 974
$$ packed form
6229i54j93J08k77k8K5Q2P9p2p2Q6j68j36N24p5j25j40O6K56j06m78J35L12m6
6252a197l44K19K07%n09N09k7j19L5p2N07n51N2K81m8o1j73j5L47O1n36J89M64
6275g81J00l20k08M80k30P0l00K26K32m92M39k48J6l6K15K20j8m19J06M05Lj87
6297g27j78M38J70m48K43NL47k72l01L30Q4J30l76M25Q7m25q6N41J8k85J47K80
6319A47m04K07k43M10J39k89n4M66k08j85J37n9K98l30J39M64k77j62j25M78k37
6340C12R8Q7M72j3l40m37K83M63n69J99J86J41m08K60O8l6r2K4K41K5m26L78K29
6363A145m0k67J36L03j31k75l39P63ml43m0M80k71n9j30K67k00J75k02J25k2k33
6385H38J69O17l38k11J39L15k33l01Q9M89k34l94K92J09p9m39K50J89O5l00n8
$$ plain form
6406 974 812 1399 1129 695 1256 994 970 612 830 1210 1045 1095 864 1147 891 768 843 760 636 518 581 596
6428 596 541 659 586 833 753 261 752 515 398 -150 359 377 591 172 288 494 214 -313 74 456 -49
6449 -49 23 -118 297 -184 -210 -449 160 -179 -549 -177 -200 -540 -432 -328 -349 -556 -826 -511 -605 -558 -802 -582
6471 -582 -469 -596 -893 -745 -758 -1081 -1422 -759 -815 -1014 -981 -793 -1052 -1199 -1309 -1136 -777 -1376 -1583 -1110 -687
6492 -687 -1057 -1226 -1212 -1164 -1144 -1489 -1206 -1140 -944 -1202 -1165 -1110 -1340 -1248 -1161 -1122 -1207 -1410 -1134 -1188 -1363 -1142 -995 -950
6516 -950 -1245 -1387 -1192 -834 -885 -1302 -1165 -926 -1188 -1215 -1082 -987 -810 -931 -1362 -1013 -722 -853 -708 -730 -1023
6537 -1023 -769 -695 -791 -637 -727 -582 -806 -731 -655 -346 -517 -310 -607 -456 -112 -434 -546 -561 -227 -456 -157 -229
6559 -229 55 -47 -284 -344 46 -2 -66 38 378 425 -315 236 179 210 121 -81 464 259 281 197 426 421 440 130
$$ packed form
6406I74j62N87k70m34N61k62k4l58K18L80j65N0k31K83k56j23P5q3j24j18O3J5
6428E96n5J18p3K47q0m92M91k37j17n48N09J8K14m19J16K06k80n27L87L82n05
6449d9P2j41M15m81k6k39O09l39l70L72k3l40J08J04k1k07k70L15r4M7k44K20
6471e82J13j27k97J48j3l23l41O63n6j99L3J88k59j47j10J73L59n99k07M73M23
6492f87l70j69J4M8K0l45K83O6J96k58L7N5k30R2Q7L9q5k03K76n4j75K21J47M5
6516i50k95j42J95L58n1m17J37K39k62k7J33R5J77j21m31L49K91j31J45k2k93
6537a023K54P4r6J54r0J45k24P5P6L09j71K07k97J51L44l22j12j5L34k29K99p2
6559b29K84j02k37o0L90m8o4J04L40M7p40N51n7L1q9k02N45k05K2q4K29nJ9l10
$$ plain form
6583 130 461 526 167 185 500 669 205 119 557 713 285 713 334 606 129 391 591 1003 480 473 1095 839
6605 839 848 577 841 712 693 570 1132 900 605 845 821 823 1048 1147 1121 869 653 554 1271 885 542 930 815
6628 815 1058 959 896 890 1104 1149 1048 1067 1158 803 1251 1094 999 760 754 1262 924 882 963 923 837 1078 1251 1002 1092
6653 1092 998 884 1113 1095 1155 988 1172 766 474 641 947 1209 747 450 600 724 755 706 707 530 446 343
6675 343 369 860 277 470 589 566 525 451 488 510 361 349 483 655 473 253 349 260 -20 -197 -116 330 -228
6698 -228 148 182 1 -78 -187 -219 -39 -127 -419 -331 -234 -284 -770 -195 -304 -685 -793 -95 -225 -528 -957 -604
6720 -604 -653 -723 -668 -409 -976 -987 -1155 -447 -551 -979 -717 -567 -666 -1039 -1267 -868 -735 -1254 -963 -851 -1328 -1032
6742 -1032 -1096 -975 -1222 -1320 -1306 -860 -909 -1014 -1399 -907 -1103 -1227 -946 -1093 -1158 -1251 -1034 -797 -863 -763 -1041 -831
$$ packed form
6583A30L31O5l59J8L15J69m64q6M38J56m28M28l79K72m77K62K00M12n23pO22k56
6605H39Rk71K64j29j9j23N62k32k95K40k4KK25R9k6k52k16r9P17l86l43L88j15
6628H15K43r9o3oK14M5j01J9R1l55M48j57r5k39oN08l38m2Q1m0q6K41J73k49R0
6653A092r4j14K29j8O0j67J84m06k92J67L06K62m62k97J50J24L1m9Jj77q4j03
6675C43K6M91n83J93J19k3m1p4L7K2j49j2J34J72j82k20R6q9k80j77Q1M46n58
6698b28L76L4j81p9j09l2J80q8k92Q8R7n0m86N75j09l81j08O98j30l03m29L53
6720f04m9p0N5K59n67j1j68P08j04m28K62J50r9l73k28L99J33n19K91J12m77K96
6742a032o4J21k47r8J4M46m9j05l85M92j96j24K81j47o5r3K17K37o6J00k78K10
$$ plain form
6764 -831 -1339 -1130 -1070 -1037 -674 -976 -1122 -1169 -765 -971 -846 -453 -699 -926 -721 -961 -726 -766 -964 -770 -492
6785 -492 -645 -702 -840 -511 -484 -562 -493 -639 -259 -501 -565 -163 -415 -639 -302 -303 -588 -328 -167 71 -163 -338
6807 -338 -498 79 -352 120 -179 -141 -135 -362 116 -39 -18 271 9 -40 263 141 99 301 406 -112 421 463
6829 463 255 147 224 292 427 300 575 741 365 151 234 435 697 294 355 900 859 360 514 748 721 203
6851 203 590 882 634 464 492 1012 475 425 868 629 710 621 615 1080 733 638 640 1173 871 522 903 851 885 827
6875 827 867 1112 918 658 615 1127 620 784 674 1218 725 824 769 1267 1036 655 711 969 1077 521 799 629
6897 629 639 764 1032 975 788 834 572 820 655 499 809 825 602 458 834 777 644 474 866 766 776 353
6919 353 574 804 735 851 381 547 673 482 275 704 456 379 374 443 571 297 431 167 596 86 277 75
$$ packed form
6764h31n08K09O0L3L63l02j46m7M04k06J25L93k46k27K05k40K35m0j98J94K78
6785d92j53n7j38L29K7p8O9j46L80k42o4M02k52k24L37jk85K60J61K38k34j75
6807c38j60N77m31M72k99L8Ok27M78j55K1K89k62m9L03j22m2K02J05n18N33M2
6829D63k08j08P7O8J35j27K75J66l76k14Q3K01K62m03O1N45m1m99J54K34k7n18
6851B03L87K92k48j70K8N20n37n0M43k39Q1q9oM65l47r5KN33l02l49L81n2L4n8
6875H27M0K45j94k60m3N12n07J64j10N44m93R9n5M98k31l81N6K58J08n56K78j70
6897F29J0J25K68n7j87M6k62K48j65j56L10J6k23j44L76n7j33j70L92j00J0m23
6919C53K21K30o9J16m70J66J26j91k07M29k48p7nO9J28k74J34k64M29n10J91k02
$$ plain form
6941 75 203 529 -73 164 177 -182 59 215 -62 -160 -434 -39 -186 -286 -235 -66 -224 -599 -385 -132 -223 -503
6963 -503 -681 -188 -302 -294 -165 -341 -634 -575 -765 -535 -440 -758 -588 -433 -631 -487 -855 -555 -681 -812 -850 -710
6985 -710 -854 -1084 -874 -731 -1042 -877 -1086 -741 -886 -1004 -1117 -739 -927 -912 -881 -1163 -1190 -1265 -1084 -891 -942 -1162
7007 -1162 -987 -691 -835 -996 -809 -581 -865 -1069 -782 -813 -1053 -1099 -733 -668 -1145 -793 -921 -710 -814 -664 -764
7028 -764 -679 -795 -841 -811 -581 -573 -798 -831 -587 -378 -528 -478 -497 -464 -649 -167 -281 -186 -500 -485 -239 -373 -464 -349
7052 -349 -277 -228 -244 -132 -326 178 -283 127 -44 -74 -124 -160 100 285 51 41 173 -52 76 88 221 198 275
7075 275 -121 227 321 222 356 545 621 99 81 693 757 134 454 541 440 570 588 414 734 374 584 564 866
7098 866 750 662 630 806 599 534 833 609 781 338 635 747 386 597 911 803 644 687 463 879 664
$$ packed form
6941G5J28L26o02K37J3l59K41J56k77r8k74L95j47j00N1J69j58l75K14K53r1k80
6963e03j78M93j14QJ29j76k93N9j90K30R5l18J70J55j98J44l68L00j26j31l8J40
6985g10j44k30K10J43l11J65k09L45j45j18j13L78j88J5L1k82k7p5J81J93n1k20
7007a162J75K96j44j61J87K28k84k04K87l1k40m6L66O5m77L52j28K11j04J50j00
7028g64Q5j16m6L0K30Qk25l3K44K09j50N0j9L3j85M82j14R5l14J5K46j34r1J15
7052c49P2M9j6J12j94N04m61M10j71l0n0l6K60J85k34j0J32k25J28J2J33k3P7
7075B75l96L48R4r9J34J89P6n22j8O12O4o23L20Q7j01J30J8j74L20l60K10k0L02
7098H66j16q8l2J76k07o5K99k24J72m43K97J12l61K11L14j08j59M3k24M16k15
$$ plain form
7119 664 678 748 675 388 778 1226 940 675 513 842 1019 760 573 757 738 483 589 1047 640 556 554 886
7141 886 777 425 526 566 691 699 481 1010 984 480 748 953 640 540 643 668 606 526 801 1106 798 621
7163 621 683 902 452 531 574 631 655 184 378 570 428 381 296 399 442 299 417 377 601 132 409 177 433
7186 433 286 -59 294 -99 335 174 -90 175 -48 -14 256 -6 -296 -138 -97 -163 -18 -181 74 -252 -326
7207 -326 -242 -315 -302 -329 -331 -388 -277 -91 -354 -265 -31 -669 -552 -775 -535 -275 -417 -510 -568 -761 -578 -639 -575 -670
7231 -670 -768 -815 -744 -668 -819 -951 -699 -829 -836 -889 -819 -909 -942 -921 -714 -554 -925 -834 -578 -811 -998 -955 -743 -677 -983
7256 -983 -1088 -941 -773 -837 -922 -861 -1077 -877 -867 -755 -1051 -949 -666 -925 -969 -711 -659 -756 -916 -747 -782 -673 -627
7279 -627 -687 -940 -241 -670 -703 -661 -471 -497 -756 -443 -437 -270 -372 -656 -517 -398 -512 -418 -256 -507 -694 -354
$$ packed form
7119F64J4P0p3k87L90M48k86k65j62L29J77k59j87J84j9k55J06M58m07q4kL32
7141H86j09l52J01M0J25Qk18N29k6n04K68K05l13j00J03K5o2q0K75L05l08j77
7163F21O2K19m50P9M3N7K4m71J94J92j42m7q5J03M3j43J18m0K24m69K77k32K56
7186D33j47l45L53l93M34j61k64K65k23L4K70k62k90J58M1o6J45j63K55l26p4
7207c26Q4p3J3k7kn7J11J86k63Q9K34o38J17k23K40K60j42r3n8j93J83o1O4r5
7231f70r8m7P1P6j51j32K52j30pn3P0r0l3K1K07J60l71R1K56k33j87M3K12O6l06
7256i83j05J47J68o4q5O1k16K00J0J12k96J02K83k59m4K58N2r7j60J69l5J09M6
7279f27o0k53O99m29l3M2J90k6k59L13OJ67j02k84J39J19j14R4J62k51j87L40
$$ plain form
7301 -354 -178 -261 -299 -61 97 -19 -151 76 -61 -118 -120 -208 123 -210 -6 43 419 -88 270 84 248 210 28
7324 28 307 378 315 216 257 669 313 281 568 541 418 326 478 274 511 299 630 568 500 426 763 658 604 403
7348 403 421 702 770 371 629 1038 600 540 417 759 743 261 662 560 585 843 844 711 963 540 813 889 654
7371 654 821 673 756 895 744 854 920 756 740 1026 909 272 469 472 680 778 707 656 645 747 500 624 818
7394 818 760 521 677 545 627 435 571 597 422 362 552 364 468 562 597 547 744 323 384 601 366 77 394
7417 394 522 353 31 225 308 204 201 286 455 506 108 409 352 416 130 353 123 80 322 -192 267 131 86
7440 86 271 347 238 225 145 305 54 -130 130 -89 -350 -184 128 -362 -224 -342 -315 -209 -274 -373 -362 -196 -267
7463 -267 -397 -215 -39 -518 -513 -813 -521 -230 -573 -681 -494 -345 -648 -473 -307 -344 -424 -732 -334 -478 -747
$$ packed form
7301c54J76q3l8K38J58j16j32K27j37n7kq8L31l33K04M9L76n07L58j86J64l8j82
7324B8K79P1o3r9M1M12l56l2K87k7j23r2J52k04K37k12L31o2o8p4L37j05n4k01
7348D03J8K81O8l99K58M09m38o0j23L42j6m82M01j02K5K58Jj33K52m23K73P6k35
7371F54J67j48Q3J39j51J10O6j64j6K86j17o37J97LK08R8p1n1j1J02k47J24J94
7394H18n8k39J56j32Q2j92J36K6j75o0J90j88J04R4L5n0J97m21O1K17k35k89L17
7417C94J28j69l22J94Q3j04lQ5J69N1l98L01n7O4k86K23k30m3K42n14M59j36m5
7440H6J85P6j09j3q0J60k51j84K60k19k61J66L12m90J38j18K7J06o5r9J1J66p1
7463b67j30J82J76m79Nl00K92K91l43j08J87J49l03J75J66l7q0l08L98j44k69
$$ plain form
7484 -747 -561 -707 -546 -919 -838 -544 -632 -1142 -856 -584 -884 -609 -892 -845 -862 -627 -681 -905 -436 -811 -958 -841
7506 -841 -792 -786 -722 -755 -589 -806 -869 -714 -724 -598 -757 -540 -883 -787 -515 -438 -424 -685 -380 -466 -382 -821 -696 -309
7530 -309 -308 -595 -586 -684 -454 -510 -623 -527 -47 -432 -844 -243 -115 -442 -293 -277 -195 -559 -619 -205 -307 -301 -106 -54
7554 -54 -191 -148 -349 -198 -163 -48 -253 -123 -19 147 -101 87 -68 -107 144 512 240 335 130 410 230 208
7576 208 179 294 656 660 292 290 392 500 212 475 706 314 537 468 585 421 883 166 703 630 500 567 649
7599 649 494 266 717 730 93 910 448 503 518 540 723 790 801 629 940 1013 927 348 811 574 652 659 655 721 746
7624 746 688 517 438 600 239 667 675 467 550 587 887 661 527 536 606 392 645 161 444 322 429 310 453
7647 453 544 522 491 820 481 94 592 830 436 316 446 478 61 146 349 525 179 163 389 204 258 13
$$ packed form
7484g47J86j46J61l73Q1K94q8n10K86K72l00K75k83M7j7K35n4k24M69l75j47J17
7506h41M9OO4l3J66k17o3J55j0J26j59K17l43R6K72P7J4k61L05q6Q4m39J25L87
7530c09Jk87Rr8K30n6j13R6M80l85m12O01J28l27J49J6Q2l64o0M14j02OJ95N2
7554e4j37M3k01J51L5J15k05J30J04J66k48J88j55l9K51L68k72R5k05K80j80k2
7576B08k9J15L62Ml68kJ02J08k88K63K31l92K23o9J17j64M62p17N37p3j30O7Q2
7599F49j55k28M51J3o37Q17m62N5J5K2J83O7J1j72L11P3q6n79M63k37P8PmO6K5
7624G46n8j71p9J62l61M28Qk08Q3L7L00k26j34RP0k14K53m84K83j22J07j19J43
7647D53R1k2l1L29l39l87M98K38l94j20J30L2m17Q5K03J76l46j6K26j85N4k45
$$ plain form
7669 13 -182 203 222 121 270 274 244 182 163 233 489 115 32 292 155 77 113 -20 153 -75 -99 152 -37 29
7693 29 35 -85 51 -175 -136 -20 -588 -287 -115 67 -197 -262 -511 -89 -137 -263 -183 -59 -135 -368 -314 -377 -457 -528
7717 -528 -332 -330 -249 -488 -591 -134 -282 -499 -242 -333 -748 -487 -557 -635 -274 -422 -523 -651 -535 -666 -327 -622
7739 -622 -427 -348 -623 -505 -606 -727 -703 -726 -468 -469 -708 -554 -488 -641 -834 -868 -531 -788 -803 -498 -830 -812 -569
7762 -569 -417 -558 -720 -763 -500 -311 -660 -481 -553 -688 -501 -664 -368 -756 -506 -404 -693 -436 -777 -601 -266
7783 -266 -424 -630 -641 -371 -501 -506 -345 -539 -127 -356 -563 -351 132 -252 -248 -50 -82 -363 -485 125 -95 -77
7805 -77 -108 329 -110 -140 -232 96 -14 -116 268 189 167 138 111 245 255 223 164 201 3 182 112 643 396 181
7829 181 333 522 257 376 620 570 594 376 238 717 605 516 359 520 299 428 725 645 489 683 676 824
$$ packed form
7669A3j95L85J9j01J49Ml0o2j9P0K56l74q3K60j37p8L6j33J73k28k4K51j89O6
7693B9Oj20J36k26L9J16n68L01J72J82k64o5k49M22m8j26Q0J24p6k33N4o3q0p1
7717e28J96KQ1k39j03M57j48k17K57r1m15K61p0p8L61j48j01j28J16j31L39k95
7739f22J95P9k75J18j01j21K4k3K58jk39J54O6j53j93l4L37k57j5L05l32J8K43
7762e69J52j41j62m3K63J89l49J79p2j35J87j63K96l88K50J02k89K57l41J76L35
7783b66j58k06j1K70j30nJ61j94M12k29k07K12M83l84MJ98l2k81j22O10k20J8
7805g7l1M37m39l0r2L28j10j02L84p9k2k9k7J34J0l2n9L7j98J79p0N31k47k15
7829A81J52J89k65J19K44n0K4k18j38M79j12q9j57J61k21J29K97q0j56J94pJ48
$$ plain form
7851 824 532 443 444 783 521 358 443 843 656 577 587 541 707 777 611 515 575 585 522 543 547 936 595 644 722 389
7877 389 694 545 808 250 363 681 659 591 549 655 729 491 683 597 245 248 614 605 628 712 607 720 393 635
7901 635 339 435 517 608 633 499 483 322 198 624 558 418 165 124 202 220 78 325 431 -16 156 420 339
7924 339 8 308 377 139 288 -152 151 -65 250 -4 202 -211 -216 -157 15 61 -287 -33 119 35 -216 185
7946 185 125 -85 -350 -81 -85 -147 -319 -23 10 -51 -376 -384 -142 -42 -502 -304 -239 -76 -337 -210 -172 -285 -553
7969 -553 -391 -337 -269 -301 -704 -149 -426 -448 -383 -440 -342 -735 -800 -168 -385 -474 -224 -371 -480 -811 -377 -441 -574
7992 -574 -399 -542 -326 -475 -649 -477 -258 -272 -497 -574 -282 -611 -517 -627 -713 -729 -689 -536 -602 -765 -426 -555
8014 -555 -680 -298 -454 -687 -526 -557 -803 -266 -563 -409 -287 -644 -320 -482 -405 -548 -350 -554 -510 -557 -362
$$ packed form
7851H24k92q9JL39k62j63Q5M00j87p9J0m6J66P0j66r6O0J0o3K1ML89l41M9P8l33
7877C89L05j49K63n58J13L18k2o8m2J06P4k38J92q6l52LL66rK3Q4j05J13l27K42
7901F35k96R6Q2R1K5j34j6j61j24M26o6j40k53m1P8J8j42K47J06m47J72K64q1
7924C39l31L00O9k38J49m40L03k16L15k54K06m13nN9J72M6l48K54J52q4k51M01
7946A85o0k10k65K69mo2j72K96L3o1l25qK42J00m60J98O5J63k61J27L8j13k68
7969e53J62N4O8l2m03N55k77k2O5n7R8l93o5O32k17q9K50j47j09l31M34o4j33
7992e74J75j43K16j49j74J72K19j4k25p7K92l29R4j10q6j6M0J53o6j63L39j29
8014e55j25L82j56k33J61l1k46N37k97J54J22l57L24j62P7j43J98k04M4m7J95
$$ plain form
8035 -362 -500 -681 -357 -261 -262 -295 -456 -502 -22 -151 -376 -380 -149 -277 -253 -294 -32 -367 -308 -50 -1 -121 -19 -126
8059 -126 -397 -198 86 109 -20 -18 -94 91 25 -47 94 23 236 275 -74 123 116 229 148 401 352 396 252 505
8083 505 583 408 267 443 377 322 176 539 166 526 495 524 697 500 364 490 504 631 316 439 759 701
8105 701 562 167 471 418 371 522 484 423 475 429 355 433 527 242 704 639 241 447 414 530 587 693 517 273
8129 273 738 674 583 487 636 418 525 343 264 696 602 673 459 345 754 219 262 663 390 335 177 441 258
8152 258 394 381 116 489 375 278 191 249 293 -44 324 16 46 69 232 171 93 231 161 325 206 34 77 348
8176 348 -132 303 17 467 291 -142 -125 52 106 35 -288 49 -177 124 -35
$$ packed form
8035c62j38j81L24R6jl3j61m6M80j29k25mK31j28K4m1K62l35N9K58M9j20J02j07
8059a26k71J99K84K3j29Kp6J85o6p2J41p1K13L9l49J97pJ13q1K53m9M4j44K53
8083E05P8j75j41J76o6n5j46L63l73L60l1K9J73j97j36J26J4J27l15J23L20n8
8105G01j39l95L04n3m7J51l8o1N2m6p4P8R4k85M62o5l98K06l3J16N7J06j76k44
8129B73M65o4r1r6J49k18J07j82p9M32r4P1k14j14M09n35M3M01k73n5j58K64j83
8152B58J36j3k65L73j14r7q7N8M4l37L68l08L0K3J63o1p8J38p0J64j19j72M3K71
8176C48m80M35k86M50j76m33J7J77N4p1l23L37k26L01j59
8191c5
$$ Imaginary data points
##PAGE= N=2
##DATA TABLE= (X++(I..I)), XYDATA
$$ plain form
0 0 0 0 0 -8 16 -8 16 -24 32 -32 40 -56 72 -88 104 -128 154 -181 213 -252 297 -343 396 -456 527 -600 683
27 683 -777 880 -992 1115 -1253 1406 -1572 1753 -1952 2170 -2407 2672 -2960 3278 -3628 4018
43 4018 -4449 4930 -5469 6084 -6780 7585 -8522 9635 -10978 12636 -14739 17518 -21364
56 -21364 27058 -36361 54160 -100255 457467 849467 -600730 -550530 575353 633193 -443440
67 -443440 -412057 474023 468082 -318880 -228981 403867 310799 -220146 -55899 337146 126890
78 126890 -217302 45456 331204 79683 -179537 54939 258118 72167 -86433 60820
88 60820 162400 63681 -3372 46515 64075 55741 63813 44864 29712 87151 94035 -2756 -9071
101 -9071 112599 94091 -57966 -17814 160966 100391 -89271 3720 204281 71089 -155252
$$ packed form
0@%%%qK4k4K4m0N6o4P2r6J28j60J92k32K82l35L94m65N49o40P39q52R83j127J283
27F83j460J657j872K107k368K659k978L325l705M122m577N079n632O238o906P646
43D018q467R379j0399J1553j2864J4365j6107J8157k0613K3614k7375L2257l8882
56b1364M8422o3419R0521j54415N57722L92000j450197N0200J125883N7840j076633
67d43440L1383Q86080n941p86962Q9899O32848r3068n30945J64247L93045k10256
78A26890l44192K62758K85748k51521k59220K34476K03179j85951j58600J47253
88F0820J01580r8719o7053M9887J7560q334Q072j8949j5152N7439O884r6791o315
101i071J21670j8508j52057M0152J78780o0575j89662R2991K00561j33192k26341
$$ plain form
112 -155252 -2520 233744 64602 -168968 10896 218221 5458 -176764 84645 264995
122 264995 -32253 -219620 92889 276949 -48848 -234849 86907 262916 -59531 -234353
132 -234353 80835 262861 -25777 -211880 31350 196232 -12878 -151958 29578 143014
142 143014 -20303 -115806 27599 100771 -33677 -93521 29937 73695 -55161 -102779 24780
153 24780 85849 -33946 -110780 -8228 78835 -9258 -107808 -37175 62420 -7933 -122687
164 -122687 -64959 57610 12284 -100726 -48946 58080 -14645 -132282 -47785 76410 -23735
175 -23735 -165345 -62371 91292 -8551 -164368 -60728 99454 -7678 -176488 -76066
185 -76066 92406 -65 -162719 -75589 73915 -12749 -146859 -54224 68287 -29228 -145985
$$ packed form
112a55252J52732K36264j69142k33570J79864K07325k12763j82222K61409J80350
122B64995k97248j87367L12509J84060l25797j86001L21756J76009l22447j74822
132b34353L15188J82026k88638j86103K43230J64882k09110j39080J81536J13436
142A43014j63317r5503J43405P3172j34448n9844J23458M3758j28856m7618J27559
153B4780O1069j19795p6834J02552Q7063q8093r8550P0633R9595p0353j14754
164a22687N7728J22569m5326j13010N1780J07026p2725j17637Q4497J24195j00145
175b3735j41610J02974J53663r9843j55817J03640J60182j07132j68810J00422
185g6066J68472r2471j62654Q7130J49504q6664j34110R2635J22511r7515j16757
$$ plain form
196 -145985 -50599 54750 -37873 -130872 -34639 56526 -34988 -127086 -45106 47819 -21411 -115730
208 -115730 -67260 17629 -19031 -93869 -58536 17823 -9757 -86495 -65580 10195 -4188 -79545
220 -79545 -69449 3743 -11909 -94871 -77544 22521 15549 -92415 -95025 15401 21447 -88174
232 -88174 -92212 18350 17414 -96804 -92414 22969 15836 -97119 -83841 30046 11075 -101456
244 -101456 -74025 45409 17283 -107592 -81513 46789 28024 -96031 -78106 45654 30960
255 30960 -92982 -84787 34648 36357 -66580 -64964 32548 34980 -50988 -49554 30422 25702 -51423
268 -51423 -44802 32181 28237 -42428 -32621 44229 34926 -45761 -35982 55876 57036 -35886 -44547
281 -44547 48526 63897 -28258 -46339 49706 77038 -16017 -48526 46000 86736 -978 -43058
$$ packed form
196a45985R5386J05349r2623r2999R6233R1165r1514r2098Q1980R2925o9230r4319
208a15730M8470Q4889l6660p4838L5333P6359k7580p6738K0915P5775j4383p5357
220g9545J0096P3192j5652q2962J7327J00065o972j07964k610J10426O046j09621
232h8174m038J10562r36j14218M390J15383p133j12955J3278J13887j8971j12531
244a01456K7431J19434k8126j24875K6079J28302j8765j24055J7925J23760j4694
255C0960j23942Q195J19435J709j02937J616R7512K432q5968J434P9976m720p7125
268e1423O621P6983l944p0665R807P6850r303q0687R779R1858J160r2922q661
281d4547R3073J5371r2155j8081R6045K7332r3055l2509R4526M0736q7714m2080
$$ plain form
293 -43058 41318 82671 -299 -36294 53500 91358 -499 -39734 51526 88765 -512 -29520
305 -29520 64205 89544 -5327 -24170 75387 93146 -5349 -18810 78299 84629 -15604 -18148
317 -18148 85779 90477 -12275 -17369 84166 93780 3068 -2510 82020 83089 931 -1963 72833
330 72833 76463 11933 11907 70167 67903 13610 17130 70954 70735 17872 12372 62230 72427 24324
344 24324 10018 55509 71958 23237 2283 53823 81317 26514 -9053 45635 85844 29831
356 29831 -16316 41861 92170 29837 -29944 28025 87729 27641 -34586 22331 82326 25951
368 25951 -28646 29819 79115 15739 -35832 22609 64360 3360 -34755 27771 59885 -6348
380 -6348 -40399 24379 58012 -4478 -39292 16511 45316 -11472 -40402 14657 42079 -14823
$$ packed form
293d3058Q4376M1353q2970l5995Q9794L7858r1857l9235R1260L7239q9277k9008
305b9520R3725K5339r4871j8843R9557J7759r8495j3461R7109O330j00233k544
317a8148J03927M698j02752n094J01535R614r0712n578Q4530J069q2158k894P4796
330G2833L630o4530k6N8260k264n4293L520N3824k19n2863n500M9858J0197m8103
344B4324j4306M5491J6449m8721k0954N1540K7494n4803l5567N4688M0209n6013
356B9831m6147N8177N0309o2333n9781N7969N9704o0088o2227N6917N9995n6375
368B5951n4597N8465M9296o3376n1571N8441M1751o1000l8115O2526L2114o6233
380f348l4051O4778L3633o2490l4814N5803K8805n6788k8930N5059K7422n6902
$$ plain form
392 -14823 -47649 3496 37443 -10162 -45762 -2241 31577 -13051 -51548 -6556 38364 -5078
404 -5078 -58022 -22341 31051 -3402 -59421 -27126 29547 -4062 -63590 -30302 31359 318
416 318 -61935 -31805 26613 -8997 -68520 -30825 30855 -10944 -77828 -35842 32682 -9121
428 -9121 -79029 -35878 37063 -5602 -83957 -47094 31411 -98 -76585 -52076 16985 -7568
440 -7568 -71509 -46557 14763 -9265 -68254 -46427 6386 -15442 -62493 -35709 8206 -26344
452 -26344 -76249 -39465 17246 -16459 -77651 -48556 11987 -15249 -75899 -48079 18702 -6247
464 -6247 -77378 -58578 12798 215 -69026 -59875 5935 -3685 -67771 -55359 12041 2835 -64256
477 -64256 -56370 9442 1554 -60785 -50603 12560 1671 -62782 -53448 10351 4352 -52814 -43493
$$ packed form
392a4823l2826N1145L3947m7605l5600M3521L3818m4628l8497M4992M4920m3442
404e078n2944L5681N3392l4453n6019L2295N6673l3609n9528L3288O1661l1041
416C18o2253L0130N8418l5610n9523L7695O1680m1799o6884M1986O8524m1803
428i121o9908M3151P2941m2665p8355L6863P8505l1509p6487K4509O9061k4553
440g568o3941K4952O1320k4028n8989K1827N2813k1828m7051K6784M3915l4550
452b6344m9905L6784N6711l3705o1192K9095O0543k7236o0650K7820O6781k4949
464f247p1131J8800P1376j2583o9241R151O5810r620o4086J2412O7400r206o7091
477f4256P886O5812p888o2339J0182O3163j0889o4453R334O3799n999n7166R321
$$ plain form
490 -43493 11954 53 -53226 -37097 18927 2782 -54215 -39134 17759 3820 -50861 -34773
502 -34773 22194 6678 -52878 -40529 23325 21123 -37608 -39390 13307 16412 -31613 -32602 15903
515 15903 17848 -30562 -34257 13240 20462 -22672 -27319 18116 22234 -25696 -28972 25381 34230
528 34230 -21810 -36470 18204 36413 -15052 -30565 26294 46861 -10902 -35888 19697 51240
540 51240 1762 -25326 23572 49340 -1725 -27797 27166 59931 8595 -25488 22374 58361
552 58361 15224 -15920 30857 64564 17772 -20959 24070 67585 31751 -8204 22956 57001
564 57001 25705 -2772 33801 64600 28026 -1679 36560 64643 23930 -1790 44094 70689
576 70689 19322 -12132 41920 80130 29318 -10819 35384 74133 29525 -7986 36191 73304
$$ packed form
490d3493N5447j1901n3279J6129N6024j6145n6997J5081N6893j3939n4681J6088
502c4773N6967j5516n9556J2349O3854k202n8731j782N2697L105m8025r89M8505
515A5903J945m8410l695M7497P222m3134m647M5435M118m7930l276N4353Q849
528C4230n6040j4660N4674J8209n1465j5513N6859K0567n7763k4986N5585L1543
540E1240m9478k7088M8898K5768n1065k6072N4963L2765n1336l4083M7862L5987
552E8361m3137l1144M6777L3707m6792l8731M5029M3515l5834l9955L1160L4045
564E7001l1296k8477L6573L0799l6574k9705L8239K8083m0713k5720M5884K6595
576G0689n1367l1454N4052L8210n0812m0137M6203L8749m4608l7511M4177L7113
$$ plain form
588 73304 31854 -3600 31751 59934 25203 4236 41283 56676 13910 -954 44230 60131
600 60131 15728 -1230 39545 51742 8973 -2197 41619 53717 9278 -7809 30516 48460
612 48460 15339 -394 28360 41466 10731 -5610 22846 42541 17562 -6829 10460 33506
624 33506 18891 -4843 6559 31477 20448 -9866 -3790 28571 26762 -6136 -7609 21993 19716
637 19716 -15003 -10993 26382 22001 -20348 -17548 23711 16583 -27161 -14484 33620 14855 -44104
650 -44104 -27392 35134 20606 -43967 -32355 29249 13927 -49782 -33950 29949 15040 -49004
662 -49004 -37899 18955 6779 -42450 -27601 14068 -9100 -50974 -26520 13486 -10758 -47520
674 -47520 -23638 8052 -18575 -48502 -20600 8333 -19609 -49953 -26567 1248 -19511 -44390
$$ packed form
588G3304m1450l5454L5351K8183l4731k0967L7047J5393m2766j4864M5184J5901
600F0131m4403j6958M0775J2197m2769j1170M3816J2098m4439j7087L8325J7944
612D8460l3121j5733K8754J3106l0735j6341K8456J9695k4979k4391J7289K3046
624C3506j4615k3734J1402K4918j1029l0314O076L2361j809l2898j473K9602k277
637A9716l4719M010L7375m381m2349K800M1259p128m3744J2677M8104j8765n8959
650d4104J6712O2526j4528o4573J1612O1604j5322o3709J5832O3899j4909o4044
662d9004J1105N6854j2176m9229J4849M1669k3168m1874K4454M0006k4244l6762
674d7520K3882L1690k6627k9927K7902K8933k7942l0344K3386K7815k0759k4879
$$ plain form
686 -44390 -25266 -1692 -20768 -46694 -30004 -937 -12019 -39880 -33783 -7029 -12763 -40296
698 -40296 -35711 -3969 -5549 -41356 -45924 -11465 -2639 -32515 -37689 -7713 -5792 -39801 -40140 -1721
712 -1721 -1602 -40840 -40789 -2392 -5437 -44315 -35015 8778 -3060 -51818 -41453 9325 2607 -45438
726 -45438 -38741 6005 -2968 -46091 -36154 6288 -2225 -40984 -33484 803 -6560 -36263 -25673
739 -25673 2590 -9319 -36374 -24858 2309 -7366 -31596 -23212 -683 -9555 -31612 -22264 3078
752 3078 -1081 -25277 -24086 -1990 -1235 -20652 -19320 2152 2082 -22743 -24617 2683 10261 -14714
766 -14714 -22720 2331 11548 -12644 -20730 7520 18274 -9764 -23509 3741 20050 -2338 -15815
779 -15815 6273 18579 -2447 -12370 11317 22318 882 -8967 11620 20498 3123 -1016 18819
$$ packed form
686d4390J9124K3574j9076k5926J6690K9067j1082k7861O097K6754n734k7533
698d0296M585L1742j580l5807m568L4459Q826k9876n174K9976J921l4009l39L8419
712a721J19l9238N1L8397l045l8878R300M3793j1838m8758J0365N0778o718m8045
726d5438O697M4746q973m3123R937M2442q513l8759P500L4287p363k9703J0590
739b5673K8263j1909k7055J1516K7167r675k4230Q384K2529q872k2057R348K5342
752C078m159k4196J191K2096P55j9417J332K1472p0k4825j874K7300P578k4975
766a4714q006K5051R217k4192q086K8250J0754k8038j3745K7250J6309k2388j3477
779a5815K2088J2306k1026r923K3687J1001k1436r849K0587Q878j7375m139J9835
$$ plain form
792 18819 20635 -1894 -4164 21921 28833 3882 -3690 21910 31665 7085 -4247 21420 38026
805 38026 14456 -4029 15325 34871 18203 747 17996 35978 20370 2310 17643 36118
817 36118 23684 8227 20151 32542 18314 8079 26429 38476 18250 5651 26633 40188
829 40188 19950 8156 30478 41372 16456 4625 30029 45187 22904 6973 24555 38822
841 38822 23326 12566 28508 38501 21597 8859 23766 38622 27672 13873 21848 32218
853 32218 23599 13386 22344 32222 23041 11474 19281 30368 22999 11819 19012 29064 19431 6703
867 6703 15242 28716 17701 1695 12373 29318 17625 -1662 8417 28424 18469 -4982 -168
880 -168 20859 17702 -1682 -1132 14111 13265 -1494 -2628 9808 9900 -2445 -5560 2672 3843 -3775
$$ packed form
792A8819J816k2529k270K6085O912k4951p572K5600R755k4580j1332K5667J6606
805C8026k3570j8485J9354J9546j6668j7456J7249J7982j5608j8060J5333J8475
817C6118j2434j5457J1924J2391j4228j0235J8350J2047k0226j2599K0982J3555
829D0188k0238j1794K2322J0894k4916j1831K5404J5158k2283j5931J7582J4267
841C8822j5496j0760J5942R993j6904j2738J4907J4856j0950j3799P975J0370
853C2218q619j0213Q958R878r181j1567P807J1087p369j1180P193J0052r633j2728
867F703Q539J3474j1015j6006J0678J6945j1693j9287J0079K0007r955k3451M814
880a68K1027l157j9384N50J5243q46j4759j134J2436R2j2345l115Q232J171p618
$$ plain form
895 -3775 -3364 5598 2667 -11835 -13451 2186 6259 -9566 -17496 -3477 3689 -12111 -19274 -1500
909 -1500 6798 -14703 -27364 -6753 4711 -15352 -25737 -4875 1380 -23746 -28908 -459 4254
922 4254 -26098 -31320 -1835 1568 -28915 -31350 -1701 17 -30306 -32913 -5159 -3544 -26778
935 -26778 -26478 -5844 -11163 -31837 -24218 -4645 -13592 -31992 -22560 -5585 -17266 -33309 -21331
948 -21331 -4872 -15337 -32545 -26094 -11417 -13695 -24374 -23863 -15617 -14894 -22388 -24367 -17594 -14150
962 -14150 -20085 -24923 -21072 -16715 -19225 -20765 -15901 -13868 -21043 -24162 -15351 -9827 -19278 -26460 -17159
977 -17159 -8712 -18605 -25795 -11748 -2050 -17027 -29509 -14893 -1437 -13964 -24433 -11522 -2310
990 -2310 -16730 -25072 -7376 4013 -12218 -25522 -11694 891 -10365 -20065 -6880 3263 -9102
$$ packed form
895c775M11Q962k931j4502j616J5637M073j5825p930J4019P166j5800p163J7774
909a500Q298k1501j2661K0611J1464k0063j0385K0862O255k5126n162K8449M713
922D254l0352n222K9485L403l0483k435K9649J718l0323k607K7754J615k3234
935b6778L00K0634n319k0674P619J9573q947j8400R432J6975j1681j6043J1978
948b1331J6459j0465j7208O451J4677k278j0679N11Q246P23p494j979O773L444
962a4150n935m838L851M357k510j540M864K033p175l119Q811N524r451p182R301
977a7159Q447r893p190J4047R698j4977j2482J4616J3456j2527j0469J2911R212
990b310j4420q342J7696J1389j6231j3304J3828J2585j1256r700J3185J0143j2365
$$ plain form
1003 -9102 -19898 -7646 3282 -5109 -13642 -6549 -2585 -10301 -10878 403 2713 -7801 -10720 -312
1017 -312 3203 -6057 -9741 1095 7208 -3295 -12998 -3875 10170 6187 -6785 -5545 7148 7606
1031 7606 -4926 -5249 8727 12323 -34 -5980 5572 11908 3608 1659 11282 10623 -2277 147
1045 147 17573 17339 -214 709 18742 16842 -551 5037 25857 20284 -1985 1785 24020 22968
1059 22968 4826 8467 25045 19838 3661 11761 30272 22474 4802 11789 27517 20690 7660
1072 7660 17340 30763 20952 7915 17022 29609 22426 12765 19151 26080 18350 12492 21549 28289
1086 28289 21211 14924 20102 25312 19011 14291 21434 28276 20857 10628 15397 27069 26351 15539
1100 15539 13571 21418 22532 13724 11772 22005 26313 15338 7551 15778 23924 17291 10960 17304
$$ packed form
1003i102j0796J2252J0928q391q533P093L964p716n77J1281K310j0514k919J0408
1017c12L515r260l684J0836O113j0503r703R123J4045l983j2972J240J2693M58
1031G606j2532l23J3976L596j2357n946J1552O336q300j949R623o59j2900K424
1045A47J7426k34j7553R23J8033j900j7393N588K0820n573k2269L770K2235j052
1059B2968j8142L641J6578n207j6177Q100J8511p798j7672O987J5728o827j3030
1072G660R680J3423r811j3037R107J2587p183r661O386O929p730n858R057O740
1086B8289p078o287N178N210o301m720P143O842p419j0229M769J1672p18j0812
1100A5539j968P847J114q808j952J0233M308j0975p787Q227Q146o633o331O344
$$ plain form
1114 17304 20128 9913 5459 17166 22392 10644 5096 14961 18743 6838 3573 16434 20077
1127 20077 5332 -2230 10485 17286 6300 83 10405 13970 1064 -3485 9196 13477 1926
1140 1926 -4111 3860 7007 -1341 -2916 6007 7044 -3904 -8992 -1440 4458 -1377 -7123 -3866 -950
1155 -950 -6950 -10311 -3222 1737 -6877 -14379 -8533 -2946 -9624 -14648 -6565 -1818 -13884 -22033 -9386
$$ packed form
1114A7304K824j0215m454J1707N226j1748n548R865L782j1905l265J2861L643
1127B0077j4745p562J2715O801j0986o217J0322L565j2906m549J2681M281j1551
1140A926o037P971L147q348j575Q923J037j0948n088P552N898n835n746L257K916
1155i50o000l361P089M959q614p502N846N587o678n024Q083M747j2066q149J2647
$$ [...]
8191A1
##END NTUPLES=NMR FID
##END=
