##TITLE=1H_ANob-EA-part
 CDCl3, 8 sc, 
 22.11.2019
##JCAMPDX= 6.0         $$ Bruker NMR JCAMP-DX V2.0
##DATA TYPE= NMR FID
##DATA CLASS= NTUPLES
##ORIGIN= UXNMR, Bruker Analytische Messtechnik GmbH
##OWNER= root
$$ XWIN-NMR		Version 3.5
$$ Fri Nov 22 13:53:48 2019 Russian Standard Time (UT+4h)  she@DPX200
##.OBSERVE FREQUENCY= 200.1315
##.OBSERVE NUCLEUS= ^1H
##.DELAY= (6, 6)
##.ACQUISITION MODE= SIMULTANEOUS
##.ACQUISITION SCHEME= undefined
##.AVERAGES= 8
##.DIGITISER RES= 18
##SPECTROMETER/DATA SYSTEM= spect
##.PULSE SEQUENCE= zg30
##.SOLVENT NAME= CDCl3
##.SHIFT REFERENCE= (INTERNAL, CDCl3, 0, 15.7039)
##AUDIT TRAIL= $$ (NUMBER, WHEN, WHO, WHERE, WHAT)
$$ ##TITLE= Audit trail, XWIN-NMR		Version 3.5
$$ ##JCAMPDX= 5.01
$$ ##ORIGIN= Bruker BioSpin GmbH
$$ ##OWNER= she
$$ F:/spectra/data/she/nmr/H-F/1/audita.txt
$$ ##AUDIT TRAIL=  $$ (NUMBER, WHEN, WHO, WHERE, WHAT)
(   1,<2019-11-22 13:52:50.87 +0400>,<she>,<DPX200>,
      <created by zg, POWCHK disabled, PULCHK disabled
       configuration hash MD5:
       00 E9 B6 7A A2 85 ED C7 34 08 36 98 17 FE 4E 26
       data hash MD5: 16K
       29 7A F0 08 BA 4F 96 4F 82 CC 5B 84 87 0C C2 F0>)
$$ ##END=
$$ 
$$ hash MD5
$$ 62 52 2C 9C 5C 78 CB BB 35 67 8F 1A 09 F1 88 3F
##$RELAX= 
##$RELAX= 
##$RELAX= 
##$RELAX= 
##$RELAX= 
##$RELAX= 
$$ Bruker specific parameters
$$ --------------------------
##$DU= <F:/spectra>
##$EXPNO= 1
##$NAME= <H-F>
##$PROCNO= 1
##$TYPE= <nmr>
##$USER= <she>
##$AMP= (0..31)
100 100 100 100 100 100 100 100 100 100 100 100 100 100 100 100 100 100 
100 100 100 100 100 100 100 100 100 100 100 100 100 100 
##$AQSEQ= 0
##$AQ_mod= 1
##$AUNM= <au_zg>
##$AUTOPOS= <>
##$BF1= 200.13
##$BF2= 200.13
##$BF3= 200.13
##$BF4= 200.13
##$BF5= 200.13
##$BF6= 200.13
##$BF7= 200.13
##$BF8= 200.13
##$BYTORDA= 1
##$CFDGTYP= 0
##$CFRGTYP= 5
##$CHEMSTR= <none>
##$CNST= (0..31)
1 1 145 1 1 1 1 1 1 1 1 1 1 1 1 1 1 1 1 1 1 1 1 1 1 1 1 1 1 1 1 1 
##$CPDPRG= <>
##$CPDPRG1= <>
##$CPDPRG2= <>
##$CPDPRG3= <>
##$CPDPRG4= <mlev>
##$CPDPRG5= <mlev>
##$CPDPRG6= <mlev>
##$CPDPRG7= <mlev>
##$CPDPRG8= <mlev>
##$CPDPRGB= <>
##$CPDPRGT= <>
##$D= (0..31)
0 1.2 0 0 0 0 0 0 0 0.06 0 0.03 0 0 0 0 0.0002 0 0 0 0 0 0 0 0 0 0 0 0 
0 0 0 
##$DATE= 1574416370
##$DBL= (0..7)
120 120 120 120 120 120 120 120 
##$DBP= (0..7)
150 150 150 150 150 150 150 150 
##$DBP07= 0
##$DBPNAM0= <>
##$DBPNAM1= <>
##$DBPNAM2= <>
##$DBPNAM3= <>
##$DBPNAM4= <>
##$DBPNAM5= <>
##$DBPNAM6= <>
##$DBPNAM7= <>
##$DBPOAL= (0..7)
0.5 0.5 0.5 0.5 0.5 0.5 0.5 0.5 
##$DBPOFFS= (0..7)
0 0 0 0 0 0 0 0 
##$DE= 6
##$DECBNUC= <off>
##$DECIM= 24
##$DECNUC= <off>
##$DECSTAT= 4
##$DIGMOD= 1
##$DIGTYP= 9
##$DL= (0..7)
0 120 120 120 120 120 120 120 
##$DP= (0..7)
150 150 150 150 150 150 150 150 
##$DP07= 0
##$DPNAME0= <>
##$DPNAME1= <>
##$DPNAME2= <>
##$DPNAME3= <>
##$DPNAME4= <>
##$DPNAME5= <>
##$DPNAME6= <>
##$DPNAME7= <>
##$DPOAL= (0..7)
0.5 0.5 0.5 0.5 0.5 0.5 0.5 0.5 
##$DPOFFS= (0..7)
0 0 0 0 0 0 0 0 
##$DQDMODE= 0
##$DR= 18
##$DS= 0
##$DSLIST= <SSSSSSSSSSSSSSS>
$$ [...]
##$SUBNAM2= <"">
##$SUBNAM3= <"">
##$SUBNAM4= <"">
##$SUBNAM5= <"">
##$SUBNAM6= <"">
##$SUBNAM7= <"">
##$SUBNAM8= <"">
##$SUBNAM9= <"">
##$SW= 24.9337058887773
##$SWIBOX= (0..15)
0 0 2 0 0 0 0 0 0 0 0 0 0 0 0 0 
##$SW_h= 4990.01996007984
##$TD= 16384
##$TD0= 1
##$TE= 0
##$TE2= 300
##$TE3= 300
##$TEG= 300
##$TL= (0..7)
0 120 120 120 120 120 120 120 
##$TP= (0..7)
150 150 150 150 150 150 150 150 
##$TP07= 0
##$TPNAME0= <>
##$TPNAME1= <>
##$TPNAME2= <>
##$TPNAME3= <>
##$TPNAME4= <>
##$TPNAME5= <>
##$TPNAME6= <>
##$TPNAME7= <>
##$TPOAL= (0..7)
0.5 0.5 0.5 0.5 0.5 0.5 0.5 0.5 
##$TPOFFS= (0..7)
0 0 0 0 0 0 0 0 
##$TUNHIN= 0
##$TUNHOUT= 0
##$TUNXOUT= 0
##$USERA1= <user>
##$USERA2= <user>
##$USERA3= <user>
##$USERA4= <user>
##$USERA5= <user>
##$V9= 5
##$VALIST= <valist>
##$VCLIST= <CCCCCCCCCCCCCCC>
##$VD= 0
##$VDLIST= <DDDDDDDDDDDDDDD>
##$VPLIST= <PPPPPPPPPPPPPPP>
##$VTLIST= <TTTTTTTTTTTTTTT>
##$WBST= 1024
##$WBSW= 4
##$XGAIN= (0..3)
0 0 0 0 
##$XL= 0
##$YL= 0
##$YMAX_a= 657106
##$YMIN_a= -411521
##$ZGOPTNS= <>
##$ZL1= 120
##$ZL2= 120
##$ZL3= 120
##$ZL4= 120
##$ABSF1= 10
##$ABSF2= 0
##$ABSG= 5
##$ABSL= 3
##$ALPHA= 0
##$AQORDER= 0
##$ASSFAC= 0
##$ASSFACI= 0
##$ASSFACX= 0
##$ASSWID= 0
##$AUNMP= <proc_1d>
##$AZFE= 0.1
##$AZFW= 0.1
##$BCFW= 1
##$BC_mod= 2
##$BYTORDP= 1
##$COROFFS= 0
##$CY= 11.3945322036743
##$DATMOD= 1
##$DC= 2
##$DFILT= <>
##$DTYPP= 0
##$F1P= 16.9975609425685
##$F2P= -3.02152046262296
##$FCOR= 0.5
##$FTSIZE= 0
##$FT_mod= 4
##$GAMMA= 1
##$GB= 0.15
##$INTBC= 1
##$INTSCL= 1
##$ISEN= 128
##$LB= 0.24
##$LEV0= 0
##$LPBIN= 0
##$MAXI= 10000
##$MC2= 0
##$MEAN= 0
##$ME_mod= 0
##$MI= 1.114404
##$NCOEF= 0
##$NC_proc= 0
##$NLEV= 6
##$NOISF1= 3.799351
##$NOISF2= 2.8
##$NSP= 1
##$NTH_PI= 0
##$NZP= 0
##$OFFSET= 15.70392
##$PC= 1
##$PHC0= -9794.955
##$PHC1= 23.40086
##$PH_mod= 1
##$PKNL= yes
##$PPARMOD= 0
##$PSCAL= 0
##$PSIGN= 0
##$REVERSE= no
##$SF= 200.130013532006
##$SI= 16384
##$SIGF1= 3
##$SIGF2= 2
##$SINO= 400
##$SIOLD= 16384
##$SREGLST= <1H.CDCl3>
##$SSB= 0
##$STSI= 0
##$STSR= 0
##$SW_p= 3612.71676300578
##$SYMM= 0
##$S_DEV= 0
##$TDeff= 0
##$TDoff= 0
##$TI= <>
##$TILT= no
##$TM1= 0
##$TM2= 0
##$TOPLEV= 0
##$USERP1= <user>
##$USERP2= <user>
##$USERP3= <user>
##$USERP4= <user>
##$USERP5= <user>
##$WDW= 1
##$XDIM= 8192
##$YMAX_p= 0
##$YMIN_p= 0
$$ End of Bruker specific parameters
$$ ---------------------------------
##NTUPLES= NMR FID
##VAR_NAME=  TIME,          FID/REAL,        FID/IMAG
##SYMBOL=    X,             R,               I
##VAR_TYPE=  INDEPENDENT,   DEPENDENT,       DEPENDENT
##VAR_FORM=  AFFN,          ASDF,            ASDF
##VAR_DIM=   8192,          8192,            8192
##UNITS=     SECONDS,       ARBITRARY UNITS, ARBITRARY UNITS
##FACTOR=    0.0002004,     1,               1
##FIRST=     0,             0,               0
##LAST=      1.6414764,     0,               0
##MIN=       0,             -411521,         0
##MAX=       1.6414764,     657106,          0
$$ Real data points
##PAGE= N=1
##DATA TABLE= (X++(R..R)), XYDATA
0@%%%%qJ6j4J4k4L2l3M1n6P2q8J08j32J59j90K24k62L07l60M16m79N52o33P21
$$ 0 0 0 0 0 -8 8 -6 8 -16 16 -17 24 -32 40 -48 60 -72 87 -103 121 -141 166 -194 222 -257 295 -338 383
28C83q18R27j047J179j325J486j663J856k067K298k551K831l139L477l849M262
$$ 383 -435 492 -555 624 -701 785 -878 978 -1089 1209 -1342 1489 -1650 1827 -2022 2240
44B240m720N229n799O446p185Q031r014J0176j1576J3296j5470J8324k2259K8068
$$ 2240 -2480 2749 -3050 3396 -3789 4242 -4772 5404 -6172 7124 -8346 9978 -12281 15787
58A5787l7609N6747j55602M69222K38535p11194j99733M22994J83214m06907j37118
$$ 15787 -21822 34925 -120677 348545 587080 -124114 -323847 99147 282361 -124546 -261664
69b61664L12329J85232k12648j32415O8194L7659m4631O9336O0173q3253q2008
$$ -261664 50665 235897 23249 -109166 -40972 -3313 -47944 21392 81565 -1688 -83696
80h3696Q8131N9827q9948n8984J11299P8761q6624j02904M0320Q5691L719n3168
$$ -83696 4435 64262 -25686 -84670 26629 105390 18766 -84138 -43818 41873 45592 -7576
92g576p932M2020J7677n6314n7890L3614Q2056o826p9046n652P4441J2626n8563
$$ -7576 -15508 26512 44189 -12125 -70015 -36401 45655 38829 -40217 -45869 28572 41198 -17365
105a7365j558N1875j1721n0362J9147M2159l0608k8457N3064K3903p6714l0517
$$ -17365 -18923 32952 21231 -29131 -9984 32175 1567 -26890 26174 50077 -26637 -57154
117e7154Q6316L1683r6848l1567J07984M0044j07209m1640J05829M2271j00869
$$ -57154 29162 60845 -36003 -67570 40414 80458 -26751 -68391 37438 79709 -21160
128b1160m3237R0996L9541q0800l4324O7544K4926n6017j2906M5287m380m5998
$$ -21160 -64397 26599 66140 -14660 -48984 18560 43486 -12531 -25437 19850 15470 -30528
140c0528J4728M7457j8815m4872K5879M8718k8075n3912J9846N1272j5961n0664
$$ -30528 -15800 31657 12842 -32030 -6151 42567 14492 -39420 -19574 31698 15737 -34927
152c4927J2065N6672M274n5827k9332L1983L5607q824k3312M110J8413q043k3535
$$ -34927 -22862 33810 38084 -17743 -47075 -15092 20515 11691 -11621 -7511 10902 2859 -20676
165b0676J119K4662R005j3228q790j345n513O015K4941O463k8803j4252K5426
$$ -20676 -19557 5105 14110 882 -7908 -9253 -14766 -8751 16190 22653 -6150 -20402 5024
178E024R348l4486j0318M7417K3486m6817l6068L4210K9746l1946k3245M0650
$$ 5024 14372 -20114 -30432 16985 40471 -6346 -42414 -8204 21542 -10404 -33649 7001
190G001L1730l6686l8165K1161L0148j2949j6920J7370J3111j9712j4639J4662
$$ 7001 38731 2045 -36120 -14959 15189 2240 -14680 2690 15801 -3911 -18550 -3888
202c888J3313m038K556Q425j4516k5700N878K8320j2k4937J129K8596J153l4495
$$ -3888 9425 5387 7943 16368 1852 -23848 -17970 10350 10338 -14599 -13470 15126 16279 -18216
216a8216q218L9264K4380k9099k9841J9136K7066j8002l0084J6019L7885l497
$$ -18216 -26434 12830 37210 8111 -21730 -2594 24472 6470 -23614 -7595 30290 26793
228B6793l6805j1640K2989J5279p275q413P35M66r1m671r889Q49K4961J9744k2840
$$ 26793 -10012 -21652 1337 16616 9341 928 1663 2129 2038 -2633 -12522 -11673 13288 33032 10192
243A0192l5398J0677M0880Q94m0141r069L7612J4827l6548k7119K7580L6540j1093
$$ 10192 -25206 -14529 26351 27245 -12896 -21965 15647 30474 -6074 -33193 -5613 30927 19834
256A9834l6370o647K6841J5884j4227j8165P241K2682L833k5282k1961J2222L1196
$$ 19834 -16536 -23183 3658 19542 5315 -12850 -5609 17073 20906 -4376 -26337 -14115 17081
269A7081N297k6783j6966J8424K2233j4155k9246P162L7743Q118l9562k5657K9775
$$ 17081 22378 -4405 -21371 -2947 19286 5131 -24115 -16953 20790 28908 -10654 -36311 -6536
282f536L8104j3242l8731m93L0731N579k7869r539K5532J8621j8215k6207M33
$$ -6536 31568 18326 -20405 -20898 9833 15412 -12457 -21996 3536 22157 3942 -22265 -21832
295b1832K2346J4108r440j7721o00J8053Q414j8144j6416J6942K3933j1846l1689
$$ -21832 514 14622 5182 -12539 -13139 4914 13328 -4816 -21232 -4290 19643 7797 -23892
308b3892J693L3866J0844k6232j5294J6160J4163j2799j5811O842J6465M033j1353
$$ -23892 -22199 11667 22511 -3721 -19015 -2855 11308 -1491 -17302 -10460 6005 10038 -1315
321a315j1549Q95J4184J0880q179j5200K875J6109l92j7603j929K0988Q151k1495
$$ -1315 -12864 -11969 2215 13095 4916 -10284 -7409 8700 8308 -9295 -11224 9764 17915 -3580
335c580j8239J4174K4683j604k0505o097J4187Q320j2094j2784P201J5581j141
$$ -3580 -21819 -7645 17038 15434 -5071 -11168 3019 11339 -755 -13539 -6338 9243 8102
348H102j5225k956J4697J0050p915j0844K212R150L546n269o981j685O755N413
$$ 8102 -7123 -10079 4618 14668 6753 -4091 -1879 7271 10817 5548 -1433 -3118 3637 9050
362I050o629j0621L550J2932r10j4344q35J7938P200j6765j2833R687J2948m988
$$ 9050 2421 -8200 -4650 8282 7372 -6972 -7807 10131 17331 566 -12267 -2580 10368 5380
376E380r959L166R285N03o953l249L359M269J091m934o351j53P039K405o472m392
$$ 5380 -4579 -1413 7872 8375 1422 -1827 1532 5801 6892 1958 -4393 -4546 2493 4898 -1574 -5966
392e966O721O882o487j0381M154J3908K217j1310o141O604L866p735m253R144
$$ -5966 755 7637 1150 -9231 -5077 8831 11048 -262 -6403 201 4067 -3668 -7921 1223
406A223P934p004j1702J175R679L101l447j640j153l800n76L973L345r67P85N24
$$ 1223 9157 2153 -9549 -8374 1305 4406 959 -681 -1834 -5634 -6210 -2237 1108 141 926 1450
422A450p657p130P523J2971j999j3046n77J0505p23j1861P04J5902N064j5437
$$ 1450 -6207 -13337 -5814 7157 5158 -7888 -8465 2040 1317 -10544 -9840 6062 11126 -4311
436d311j0678R673J1662l917p471L637P449n069j1658j043J0847R156k225r044
$$ -4311 -14989 -5316 6346 2429 -5042 -1405 6044 975 -10683 -11726 -879 8277 6052 -2992
450b992o046J530N926L912j707j246K789N19q164n658J1109J6591k347k0295q240
$$ -2992 -9038 -7508 -1582 2330 623 -623 2166 2685 -5479 -11137 -28 16563 14216 -6079 -14319
465a4319J4466J0692q959q812J0064Q530j3483j6004Q681K1445K769j5876p006
$$ -14319 147 10839 1880 -6932 3132 11662 -1821 -17825 -9144 12301 15070 -806 -7812
478g812Q080N811l994k861M693L957k683o118n318J966J1160Q498o480j3529n30
$$ -7812 268 6079 2085 -776 3917 7874 5191 -927 -6245 -4279 6881 15379 8899 -4630 -5160
493e160J1836N94j3350j051J7195N928j9792j6142J4381K1260l325j6087j20J1756
$$ -5160 6676 7270 -6080 -7131 10064 15992 -3800 -19942 -5561 15699 12374 -3713 -3833 7923
507G923j293j2084o13J3911O376r581j2269k356P034R082K095n867n991K427M756
$$ 7923 6630 -5454 -6067 7844 14220 4639 -7630 -9986 -2952 6130 8225 2358 -3633 -1206 3550
522C550n298q170O121J5057k161j9469o219J7328J2797j1906j2795R943J3123
$$ 3550 -1748 -9918 -3797 11260 9099 -10370 -16589 739 13536 1630 -11165 -1222 11901
535A1901q671j7254M650J8437K504j6060p119Q139M725n495j162P031L062n817
$$ 11901 3230 -14024 -9374 9063 11567 -4493 -11612 -3473 1252 -4243 -5405 1626 4688 -1129
549a129m542J199J524J283N186j03r948n995J0341J1611p500j1747O075J0988
$$ -1129 -5671 -4472 -2948 -1665 3521 3418 -6530 -12525 -2184 9427 1927 -9820 -3745 7243
563G243q084j4190R350K0405n468k2079j182J8531M781j3567l225J1312P27j1274
$$ 7243 -841 -15031 -5681 14724 9256 -12823 -14005 4526 9307 -4260 -7485 3827 4554 -6720
577f720j104J0381K630n920j419R30m530n5J0836N531j0735p097R162O390j1066
$$ -6720 -7824 2557 5187 -733 -2152 -1222 -5752 -5807 5029 10560 -175 -7272 1890 8280 -2786
592b786o979J3593J2312j1155j5097M752J3207j596r042J772P670k517j0127k177
$$ -2786 -9765 3828 16140 4985 -10112 -5360 7847 6251 -2791 -1019 6651 4134 -5993 -8170
606h170R098O752j800m320j650q48j711K904O134J391m371k482J577l050n863
$$ -8170 928 7680 5880 1560 -90 -938 -2649 255 6389 7780 3409 927 2504 -546 -6409
621f409N323J2078k896j5236m69J5058J55j6568R94K1140K056k3235o713K0461
$$ -6409 -1086 10992 8096 -7140 -7609 7449 7604 -8964 -7970 13170 15226 -8009 -14722 5739
635E739O823j7161m684J9122N513j9135q681J3862O576q013J029Q791o941j3977
$$ 5739 12562 -4599 -9283 9839 15352 -3783 -12464 1398 7974 -39 990 9781 2840 -11137
649a1137N069J1904n689q874J1230J0808j5003j7216J2890K0563p031j8754M888
$$ -11137 -6068 5836 147 -8727 2503 13311 -1692 -18908 -6018 14545 7514 -11240 -6352
662f352J6603n125j8750l41J9255P117j1252r526M214N171k810m243L712P375
$$ -6352 10251 5126 -13624 -13965 5290 12407 1155 -8371 -4157 1014 -1796 -6039 -2327 5048
676E048O95o583q030l734N643J1462N844q515j1021K724J0246l826j1511Q064
$$ 5048 5743 -840 -8870 -12604 -6961 4501 10345 1830 -9191 -6467 3779 -47 -11558 -3494
690c494K0836l407k9343q370K6076J5423j8399j3151J7276J2409j9530j7092J4751
$$ -3494 17342 13935 -15408 -23778 2298 17721 -678 -13829 3447 15856 -3674 -20766 -6015
703f015J9358n646j2950K829L703o968j341Q836K119n736M532N794j1726j4944
$$ -6015 13343 7697 -5253 -2424 1279 -5689 -7030 1806 3925 -1811 2721 8515 -3211 -18155
717a8155J3373K3773o947k3581L010K1510m325k5151L062K9281P230k6095j5016
$$ -18155 -4782 18991 12044 -11537 -8527 12983 8658 -16493 -13431 15850 23080 -3015 -18031
730a8031J6393J3247j0800j0236J0278J2565n524j3492l831O180P403N238r58
$$ -18031 -1638 11609 809 -9427 851 13416 7892 -5600 -9431 -3251 4152 9390 8432
743H432q132n532N358N407p464n723J4114J6325j4155k8731J713K9672R132k3603
$$ 8432 300 -5232 126 5533 -1931 -7654 6460 22785 8630 -20101 -18388 11284 20416 -3187
757c187j0696K0000R603k3179j6002K1381K4582r146k2789p47J2696J208o744
$$ -3187 -13883 6117 15720 -7459 -23461 -2080 22502 13356 -9433 -10180 2516 3724 -3020
770c020J798O126K72k027l707p094k446J2353J3697q573j8227K188J5832k614
$$ -3020 -1222 4904 5176 3149 -558 -7652 -10098 2255 15952 7379 -10848 -8660 7172 4558
784D558j7409K357K4212M987k5475j5750J7068J8716p980j3490P299J1540q560
$$ 4558 -12851 -10494 13718 18705 -6770 -22520 -5452 13264 5284 -8206 -907 10633 2073
797B073j5098L537J4882L050p713l378j58k769J290O478r47p116L756J1032o448
$$ 2073 -13025 -9488 5394 8444 731 -2647 -2805 -5574 -4284 2194 1247 -5869 -2113 8919 2471
812B471j8984L336K2945M224k2429p003K0113Q788k0944j1141K0026J7375j3245
$$ 2471 -16513 -13177 9768 13992 -8437 -15440 4673 13461 -7483 -18624 1402 18777 5532
825E532j7785M841J1797k277p914L203O044j24k713j888m261j261Q210Q122o240
$$ 5532 -12253 -7412 4385 2108 -5806 -2603 3441 3317 604 -1284 -5545 -6806 1404 9526 3286
840C286j0659L416J1449l800j4673K191K1013N603k0886j5457J3236J8405n308
$$ 3286 -7373 -3957 7492 3692 -10981 -8790 12223 17826 -3060 -18517 -5281 13124 7816
853G816j5480M888J5244n443k0477j365K0458J0438j0619j0869J085K991l4J045
$$ 7816 -7664 -2776 12468 7025 -13452 -14817 5641 16079 5460 -5409 -4324 -1333 -1367 -322
867c22K748J18J491J337n977j1020N474J9188L458k0192q561J5926Q618j6422
$$ -322 2426 2544 4035 5372 -605 -11625 -6151 13037 16495 -3697 -12258 3668 12286 -4136
881d136r505J8854J5803j5018k1399M707J7501J102r947J65P601o61q449l874
$$ -4136 -13641 5213 21016 5998 -15401 -10694 6807 7909 -2038 -1873 5728 5067 -3382 -7256
895g256L575P059O055k538j1681n487J0189J0847o698j1534N041J2955n032j8069
$$ -7256 -3681 3378 9433 6895 -4786 -10273 -84 10763 4065 -7469 -2428 10527 5495 -12574
909a2574j29K0340Q296j6787j4508J0764J5271o335j5412K102J6888L084j5316
$$ -12574 -12703 7637 15933 -854 -15362 -4598 10673 4338 -11074 -8972 7916 11000 -4316
922d316p571J0341R731n204r621J003P919L108n221o297P58P780M612o695j0881
$$ -4316 -11887 -1546 8185 2981 -6640 -5637 2282 5390 169 -6128 -5370 2410 7022 327 -10554
937a0554L068J4800J822j7076p053J6688J2732j3299j6840Q823J8052l860j7699
$$ -10554 -7486 7314 9136 -7940 -14993 1695 14427 1128 -15712 -6889 11163 7303 -10396
950a0396L88J7190M992j4217j0414O824J1872J251p796n650L200O713p99p969
$$ -10396 -10008 7182 12174 -2043 -12457 -5633 6239 7490 -306 -5956 -2756 3957 3158 -4811
964d811k081J0106O515j0277j2911O307J6720J450j6045o370J2804R547r385j1828
$$ -4811 -6892 3214 9729 -548 -13459 -7152 9568 11018 -5027 -11397 1407 10954 1569 -10259
978a0259O396J4629j507j5367m551J2479R524p865j1509K512J1186K278r573o774
$$ -10259 -3863 10766 9259 -6108 -10659 1820 11344 3479 -8030 -5518 5668 7946 -1627 -8401
992h401O190J0220n36j1597m932R363J0158n248j3085J425J4665K642j4627p744
$$ -8401 -2211 8009 7473 -4124 -9056 307 10465 5217 -7868 -6443 8222 10864 -3763 -11507
1006a1507J2994J2265p458j5252J459J4039L934j0614p839N719R429j658r267
$$ -11507 1487 13752 6294 -8958 -7499 6540 10474 -140 -7979 -2260 7169 5511 -3756
1019c756k500Q548O476n623j0995O90J2298M857r958r652N769J2031j197j1534
$$ -3756 -6256 2292 8768 3145 -7850 -7160 5138 9995 37 -9615 -3846 8185 6988 -4546
1033d546k976J0864O507r233j0490M975J2628J67j2376m940R319P943o674r683
$$ -4546 -7522 3342 9849 616 -9874 -4899 7729 7896 -4480 -9420 -101 7842 1168 -8515
1047h515K826J0674K065r111o735M934R803n10q781l184P334O336o251r447L707
$$ -8515 -5689 4985 7050 -2061 -8796 -3862 5941 5431 -3350 -6534 800 7136 885 -8562 -4855
1062d855J1924J006j2855p074R619J0896m424j0646M14Q984J784q206m537O392
$$ -4855 7069 8075 -4780 -11854 -2235 8661 4237 -6409 -5995 2989 4773 -3433 -7970 -1578
1076a578Q633k535j0189l236R428P870n574j0179J377J0246J753r537n019Q795
$$ -1578 7055 4520 -5669 -8905 523 8393 2819 -7360 -5983 4263 6016 -3521 -8540 255
1090B55Q408o306j0928J672J0645K976q973n624O551P842l419r303o56R383M663
$$ 255 8663 2357 -8571 -6899 3746 6722 -2251 -7875 -1324 6518 3099 -6204 -6860 2523 7186
1105G186o350p552L405Q418P67p519l026O787M750n017q110K050R350K880q274
$$ 7186 836 -6716 -3311 5107 5874 -1645 -4671 2116 6866 1849 -6261 -4211 5139 8019 -255
1120b55o924N036Q460j484r429j508R787M608q246q026O064J0279k071j0521j804
$$ -255 -7179 -2143 6317 4833 -4596 -6104 3683 8291 45 -7981 -1917 8362 6291 -4230 -6034
1135f034R229N312o689p415L441Q066P8q695m127O487P197l617q449J085Q861
$$ -6034 3195 8507 1818 -5597 -2156 5910 5988 -2707 -6834 -347 6850 3233 -5216 -4131 4730
1150D730K153q626n845O717R485l288j0809n61J0461M362q522o405N752P355l433
$$ 4730 6883 -1743 -7588 -871 8614 5326 -5483 -6044 4417 8779 257 -6148 -396 6959 3526
1165C526q715l4Q503L930o497o980L001P446Q03p100l612N087O529k951q505n82
$$ 3526 -5189 -5223 3280 7210 713 -6267 -3266 4180 4983 -2117 -5729 -642 5887 2936 -5569 -6151
1181f151Q454L900p289o828N565R377k805j0547j172J0654N255q549r298L989
$$ -6151 2303 6203 -1086 -7914 -2349 7028 4223 -6324 -7496 3158 8413 -136 -9434 -5445
1195e445J0235R14r623k939P990N355p335q877M331J0423J454r317n363N762P248
$$ -5445 4790 5704 -3919 -6858 1132 6487 -848 -9725 -5394 5029 6483 -2834 -8197 -2435 4813
1210D813j738o198j308N609L875m837p153J940R882L196r459p908O423R904m241
$$ 4813 3075 -3123 -4431 1178 5053 216 -6937 -4997 4885 8081 -1378 -9286 -2863 7041 2800
1225B800j0224J875J1303J284j1540n206Q869Q349l638q216k69N769L387m072
$$ 2800 -7424 -5549 5754 7038 -4502 -9708 -839 7510 3872 -4344 -4613 1156 4543 471
1239D71l949K069N390L32o392m316N137Q966j731r982k709Q486N476o001p069
$$ 471 -3478 -1409 3981 4313 -2079 -6395 -1258 7708 5977 -4005 -6714 1772 7248 1247 -5822
1254e822L506Q271j532r471j003R767N527p764q814L891R760L21p108k593N200
$$ -5822 -2316 5955 4423 -5048 -6051 3716 9243 1479 -7335 -3444 6316 6637 -471 -3064 2136
1269B136K511m444l561K460N204R03m402m526j57N631M094m418n983L394O914
$$ 2136 4647 203 -3358 -898 4306 5209 807 -3719 -3876 1755 5849 1431 -4552 -1158 5756
1284E756k822r702J263J2968L433j1937p908P689P597m809o580N016O953m194
$$ 5756 2934 -6768 -5505 7463 10896 -1041 -8949 -1260 6337 1528 -5052 -36 6917 2723
1298B723q606j50O091M189m94k732m025j580L148L672j626k422L524L526o162
$$ 2723 -5883 -6033 58 4247 3753 1021 -3004 -4584 -1436 2236 610 -1812 1712 5238 -924
1313i24q096M024J1646Q52j0779l740P651L150p931l576R374P069o945r126K222
$$ -924 -9020 -4996 6650 7502 -3277 -7017 634 3784 -4147 -7723 1651 8720 1775 -7351 -5129
1328e129O855m77l698J479L358k387m610J90K843J239J701J440k731n505P15O501
$$ -5129 1726 1249 -2449 -970 2388 1 -4609 -4419 -1576 -337 1364 2804 73 -5432 -4717 1784
1344A784J222n456J05O390j5q566k757Q832N631o998o819N466O070m918p045L632
$$ 1784 3006 -2450 -2345 4045 4030 -4536 -7293 1539 7170 172 -6647 -1181 4889 -29 -7074 -3442
1360c442Q179j131o694R38M489p17m614J322N292N57l326j507M22k030K91N151
$$ -3442 4737 3606 -3088 -2150 2339 1622 -2992 -1670 3622 4179 853 -654 -232 -2262 -1971 3180
1376C180K248n554l202M325J732p246r16J0767N054j0990p973Q097Q281o809p416
$$ 3180 5428 -126 -3328 997 2729 -4517 -5433 5334 10388 -602 -8575 -478 7803 994 -6422
1391f422Q422Q800p261j1500L068R163j94l908J696K474m308m133K972L053r07
$$ -6422 2000 10800 3539 -7961 -4893 4270 4076 168 1864 4338 30 -4103 -1131 1922 1015
1406A015J603L714m467r170Q77J0949L644q134l821O310K079q912n107J0562J0236
$$ 1015 2618 6332 1865 -7305 -6428 4521 8165 31 -3790 2520 4599 -4313 -9420 1142 11378
1421A1378n543j1785k4Q817P50o541j44Q466J736q820o005M048N268k23o88J125
$$ 11378 5835 -5950 -5974 2843 3593 -2948 -3092 5374 7110 -1710 -7715 -3667 1601 1378 690 1815
1437A815j890l927J159K825j653o64O765L189j0628q553Q897J1684n490j1102
$$ 1815 -75 -4002 -2843 -18 -1671 -2335 4430 7619 -3009 -11562 -2665 9019 3529 -7573
1451g573N310J0586p151j2991M175J4209l31j1109mO810j203n999K103N648o85
$$ -7573 -2263 8323 1172 -11819 -7644 6565 6234 -4875 -4879 1931 728 -5271 -3168 2480 1795
1466A795k017K055j646o749M73R875K400q100l060P219J294j0086k621J2441Q342
$$ 1795 -222 1833 187 -6562 -6089 3786 6186 -1914 -4974 2245 3539 -6547 -9168 3273 11615
1481A1615q897j1736L124R051l90n942J999O461o35q644l709N850N440n83k251
$$ 11615 2718 -9018 -5894 3157 2767 -3175 -1176 5285 4650 -3994 -7703 -1853 3587 3004 753
1496G53m03m50k392J128L043r3j058L209K030p162p050O527J0802l527r874K063
$$ 753 350 -100 -2492 -1364 1679 1586 528 3737 5767 -1395 -8445 -1918 8884 5357 -4517 -2454
1512b454Q779m120j1244L616J4202Q25j2655l616Q751J596o246R48P621m11o592
$$ -2454 6325 2205 -9039 -5423 8779 9604 -3051 -6667 2084 3680 -2566 -1618 6003 5592 -1000
1527a000p70K658j517r27N149K048o727m010O011L379o218l402Q594N361q174
$$ -1000 -1770 888 -629 -1556 3593 5641 -1086 -5096 915 4294 -1924 -5326 3268 8629 455
1542D55q150M984Q420k897o369L193O667k801q239n05P194L236m178l168J689
$$ 455 -7695 -2711 5709 2812 -3557 -364 6303 3502 -4737 -5242 1952 5188 1010 -2158 -469
1557d69J385k361j092K505J733l60o50o57k612p02L657K706l054l729L459M184
$$ -469 916 -1445 -2537 -32 1701 1341 691 34 -2578 -3280 377 3083 29 -3700 -241 3943
1573C943n609o081N321R287j946r934j7P193j36o726P29P860K125p792n017L573
$$ 3943 -1666 -7747 -2426 6861 4915 -5019 -5036 2157 2021 -4705 -3976 3884 6009 -1783 -6800 -3227
1589c227M436j14r93kj651j053P90N44p33J946L946j039o544k356O350N024m572
$$ -3227 1209 1095 102 100 -1551 -2604 -1814 -1270 -2003 -57 3889 2850 -3694 -6050 300 5324 752
1606G52n425L695N788l689p466J459R201J948q241l910N857L953m330m492M342
$$ 752 -4673 -978 4810 1121 -6345 -4886 4315 6263 -1978 -5888 -31 3922 -408 -4900 -558
1621e58N256k145m671j557L340K550Q96j909k966K05L958O76m812k269O559M399
$$ -558 4698 2553 -2118 -3675 -335 2215 3111 1202 -1764 -1559 2399 3075 -1737 -4006 2553 6952
1637F952n855p425M489Q024k328p999J81P965J770o668m708M598N792q94n213
$$ 6952 1097 -6328 -1839 6185 3857 -4142 -3961 4004 5774 -894 -5602 -1004 4788 3894 -1319
1652a319j276L656L264l109m623J873O092J505o610m586L825O625j107o512j602
$$ -1319 -2595 1061 4325 1216 -3407 -1534 4558 6063 -547 -5133 -1308 5317 4210 -2302 -3904
1667c904N180L263m060n469K270P335N39p268l884O722N523l802p362K068P588
$$ -3904 1276 4539 479 -4990 -2720 4615 5154 -2114 -5998 724 6247 2445 -4917 -2849 4739
1682D739m5o722k998M757M425k091m781p79L566L077k856m921P73O537K225p229
$$ 4739 4694 -2028 -5026 -269 4156 2065 -2716 -3495 71 3148 292 -4629 -3856 2681 4906 -2323
1698b323n761O076Q102k916q793K42Q073K026p023l451N031M697k615n805l99
$$ -2323 -8084 -2008 6094 3178 -5615 -5373 2700 4726 -2297 -5748 -717 3980 1365 -4440 -4839
1713d839N631L694l399o295N39O997K407o572m075N293N638l838p098K044P599
$$ -4839 792 4486 1087 -5208 -4669 2328 4735 -1837 -5912 -619 5019 1181 -5917 -3873 3726
1728C726Q35n639l439L036M575p97m310j686M253L724l095o510J306P807K109
$$ 3726 4561 -1078 -4517 -1481 3094 2297 -2013 -3699 554 4278 1183 -5327 -4021 3786 5895
1743E895p133m878N027N091k986n090J770O053on772l301M346O085k27o333k555
$$ 5895 -1238 -6116 -1089 4002 1016 -4074 -2304 3749 3743 -2029 -5330 -984 5101 4874 -1459 -4014
1759d014M295L926k641m521K274N683j413p017j082O336M800m089n346j07M566
$$ -4014 281 4207 1566 -2955 -681 5002 3589 -3428 -4510 1826 6626 2537 -2809 -2916 1650
1774A650K057l833k354K814M495j470o070j613O277M505m498n640K140N926j404
$$ 1650 3707 -126 -2480 334 4829 3359 -2711 -4324 1953 6458 1960 -3680 -1540 4386 2982
1789B982n595j80N561K568m867m655J171N411J291l558k941J758L708j367m769
$$ 2982 -2613 -2793 2768 5336 469 -4186 -3015 2396 3687 129 -2812 -1054 2654 1287 -3482
1804c482L48O269J999n762n250L213P214p71n447j293M233J987m202l515L367
$$ -3482 -3134 3135 5134 -628 -5878 -2665 4549 3778 -1669 -2962 1271 3258 -944 -4459 -1092
1819a092N093l78o261l063M122N345j651n300N4N028J352n358l024M603N343j542
$$ -1092 4001 3623 -2638 -5701 -1579 3766 2115 -3185 -3131 1897 3249 -2109 -5133 -530 4813 3271
1835C271p144o98M972L324l368m508K386M927j139o070j821O366M763l719o582
$$ 3271 -3873 -4571 401 3725 357 -4151 -1765 3162 2023 -4047 -5868 498 5261 1542 -5040
1850e040L00O216J451m035k926L677L945l038n037M06O106L142m825n870K176
$$ -5040 -4740 1476 2927 -1108 -4034 -357 3588 550 -4487 -4081 2025 5167 342 -5528 -3352
1865c352O732L13n713k181N215L542m093n252K263O483O78n680l536L622N333
$$ -3352 3380 3693 -2020 -4201 1014 4556 463 -4789 -2526 3957 4635 -1045 -4581 -959 4374
1880D374j925n450j086O374L096m699n790K810P131J46p409k167O417M450n060
$$ 4374 2449 -3001 -4087 2287 5383 684 -5106 -2296 4835 4981 -2428 -4595 1822 6272 1212
1895A212o173K817P232n1p352k965N642M771k880n853L90N148K545m530l973L123
$$ 1212 -4961 -2144 5088 5037 -2315 -5280 362 5133 2253 -3600 -3210 1938 4483 -47 -4020 -897
1911h97N202j21n701k383M862M784k977o809M95O765K817o203n362M437O535k310
$$ -897 4305 4184 -1517 -3900 962 5746 2769 -4040 -3545 3220 6037 -166 -5528 -1091 5444 3134
1927C134p336k57P658K211o379m663M333O176j526o178r46M884L025l104m005
$$ 3134 -4202 -4459 3199 5410 -969 -5632 -1299 4877 3351 -2827 -3773 1111 4136 1032 -2973
1942b973k04N307K099m434m509K255O411l55p145j750O510M515o461o770M348
$$ -2973 -3177 2130 4229 -205 -4714 -2459 3952 3597 -3548 -5298 1212 5727 -734 -7504 -3156
1957c156Q222r12p914j614O669L023n021l584L073M137q60l869j290K144L136
$$ -3156 5066 4154 -3760 -5374 1295 4318 -703 -4287 -1214 2923 2063 -1806 -3096 -952 2184
1972B184o6l763k656L835M695k292p100K83P268K235o704l648O141M799n081o273
$$ 2184 2118 -1645 -4301 -466 4229 1937 -5163 -4880 2388 4623 -2081 -5729 412 5211 130 -6143
1988f143L367Q189o22p735k615N292M348k973l599J640L278q82l799j267L237
$$ -6143 -2776 5413 4791 -2944 -5559 -267 4081 1108 -2491 -851 2427 1545 -2254 -3521 -284
2003b84L427j99l756k808J928L779M96m049r95M740K789o115n932M846R000j563
$$ -284 3143 2944 -812 -3620 -1692 2087 2583 -1466 -2461 2279 5068 -1047 -6979 -2133 6867 5304
2019E304q434j104P112J384o824j566P596L894o211n677J823L824J251o54j62
$$ 5304 -3130 -4234 2878 4262 -2562 -4128 3468 7362 1151 -4526 -2703 1121 2372 1718 1556
2034A556j388r88J223J0k338N98O046J291q197n181P244P085m986o282M620O514
$$ 1556 168 -820 403 413 -1925 -1327 4719 6010 -2187 -7368 -124 6961 1975 -4307 313 6827
2050F827m590q966J769Q980K071o442k873L225J955l235j318K095L173J57k931
$$ 6827 2237 -6729 -4960 4020 6091 -351 -3224 1 1956 -1279 -2597 -502 2671 2828 -103
2065a03k511o51K786L532k93l702j193L059J200m164k067N018N497m425q264J365
$$ -103 -2614 -3265 -479 3053 2760 -942 -2135 924 2124 -2040 -4107 911 6408 1983 -6281 -4916
2081d916Q449O33q326m94P940K184q172m983O600N628l649l988K664K184j963
$$ -4916 3533 4166 -4160 -4654 3286 5470 -2702 -7685 -1085 4543 894 -3094 -430 1754 -209
2096b09k138J342N56O24K352p9n077l903N933N534m688n927M883O300n122q621
$$ -209 -2347 -1005 -449 175 2527 2448 -2629 -6532 -599 4935 247 -5680 -797 5503 381 -8240
2112h240L835J0613j67r531j952O929J958o017j990N786L451l320l979Q2J955
$$ -8240 -4405 6208 6041 -3490 -5442 1487 3445 -2572 -4562 1224 4675 1355 -2624 -2542 -587
2127e87R41N22M33j438p81J126N46k919j082N173M136n056o889K243P856p13o838
$$ -587 354 876 1309 -129 -910 216 762 -2157 -3239 1934 6070 1014 -5875 -3632 4224 3511 -3327
2144c327N34P643P44q954l475P580N314m910m349L368L314l169l445J794L606
$$ -3327 -2793 4850 5594 -3360 -6835 745 6059 1149 -3200 168 3482 313 -3132 -1338 2268
2159B268J33n41o73k635k007L231M304k645l587K489L956m473o823M235R684j97
$$ 2268 2401 1860 1187 -1448 -3455 -224 4080 1435 -2152 337 4293 -180 -7003 -2768 6916 6719
2175F719r423k492O544K483n906j724O574M194o304n557K130M326K17j050N75
$$ 6719 -2704 -5196 1348 3831 -2075 -3799 2775 6969 665 -4892 -2762 1564 1781 731 1306
2190A306k8k298q80J051L47l37K942L209m468o724J650P770M01n898k63O415r41
$$ 1306 1278 -1020 -1900 -849 -502 -839 2103 5312 844 -5880 -4230 3540 3941 -1957 -2220 4195 3254
2207C254q692j978R196N818o102n574K179L226k878j896L652L388j991l329q25
$$ 3254 -5438 -7416 1780 7598 1496 -4078 -1899 1327 -1551 -3447 205 3593 1602 -1727 -2552
2222b552K43M63L140K365k679l833J344K693j980k605L360N047k136p343r12O263
$$ -2552 -2309 -1846 1294 3659 980 -2853 -1509 1184 -796 -3401 -41 5006 2870 -4473 -5385 878
2238H78K397l801k166L878J892m369l743L574N064p87l946p84K210J9j423N74
$$ 878 3275 -526 -2692 1186 3078 -1291 -5034 -1460 3604 2817 -1129 -1913 297 316 -1107 -533
2254e33J750o71j219J012l52k014Q43L719l75m760K4N183P90o391j995P088L044
$$ -533 1217 546 -673 339 -13 -2027 -1184 2535 2160 -2600 -2576 2607 3397 -2994 -4989 2099 5143
2271E143n986l682N135L878m602m265M319M499k852l848J384K117q36p06J470
$$ 5143 -843 -4525 610 4488 -114 -4379 -60 4439 1587 -2261 -877 1240 404 -302 1168
2286A168l97j056N63J181k033j752L300K888k615m160J349L895n14l572N74L870
$$ 1168 771 -285 278 1459 -574 -2326 974 3862 1247 -2913 -1564 2331 1817 -1755 -1181 2689
2302B689Q29m703k509L021L821r68l056j20K403m5l125k29L519J871k815k416
$$ 2689 3518 -1185 -3694 -673 3148 2180 -876 -996 1407 1362 -1763 -1992 1527 3398 583 -1833
2318a833J77J378N45O94L34j343n32R63m73j813O14L981R55n109k728M380L262
$$ -1833 -1656 -278 267 961 1295 -48 -580 383 -90 -1903 -1289 2692 3647 -1462 -4190 190 3452
2335C452k923m082L505M066l546m911K315M387l44l063j60J203j01n47K7N83R4
$$ 3452 529 -3553 -48 4018 472 -4439 -2124 2263 1919 -1144 -1304 -101 -202 -749 -722 -139 -45
2352d5J160J71k783j692L357K693k256l300R00L555l36l663j43L024J328k905
$$ -45 1115 1286 -1497 -3189 168 2861 605 -2695 -1795 1760 1424 -2239 -2382 642 1970 -935
2368i35k428K376K860r48l525Q0K733K281k515k501J282K521k49k083l70J724
$$ -935 -3363 -987 1873 925 -2600 -2520 213 2494 -21 -2522 -1240 1281 1032 -1051 -1421 303
2384C03J206j426j196m81J967J750j238k799M3K608J558l212j681L031K771k593
$$ 303 1509 83 -1113 -1594 373 2123 885 -1914 -1871 737 2295 -917 -2598 433 3204 611
2400F11l807J757M105n31l499l42K737J114k172j721J457J909K61j735j604N28
$$ 611 -3196 -1439 2666 2135 -1364 -1706 1031 2145 -27 -1748 -291 1618 1879 144 -1460 -932
2416i32K022O54k108q01J717J447j563k743J723L292k42k996j450K215K106r15
$$ -932 1090 1744 -364 -1165 552 1999 436 -2307 -584 2708 2466 -530 -1980 235 2341 1426
2432A426k122K39J760O06k176j434K128K047j024k894j28K694R83j817k030J388
$$ 1426 -696 -457 1303 1909 -267 -1701 427 2474 1450 -1444 -1572 1122 2105 288 -1742 -354
2448c54K291m11k711m50J592J766r94k262K09K206L73j676j339J858K082j839
$$ -354 1937 1526 -1185 -1635 -43 1723 729 -1533 -1324 882 1255 -421 -1760 98 2180 341
2464C41k757P10K676J219j945k464J144J794m6k084O1J739O14j765j739J359K341
$$ 341 -2416 -1706 970 2189 244 -2220 -1076 718 672 -1412 -1351 388 1002 -763 -2502 -1143 1198
2481A198L01k585j238J722J910r06j697j61K343L65j908j437J149K653p36k612
$$ 1198 1499 -1086 -2324 -602 1308 402 -1295 -1456 887 1252 -656 -2093 -944 1709 973 -1639
2497a639q66K623K074k318k375J307K690m07k707n70K049K385k367j754R87K376
$$ -1639 -2505 118 2192 -126 -2501 -1194 1496 1089 -1618 -2188 -139 2246 -121 -1875 -888 1488
2513A488j67k368j282K754J822j516k391qK619J341k364j975J706K311j160k138
$$ 1488 1321 -1047 -2329 425 2247 731 -1660 -1668 951 2292 -72 -2047 -341 1970 810 -1328
2529a328J73J965J186j747k394J865K547k87k329j566K285K204j285k644K47K597
$$ -1328 -1155 810 1996 249 -2145 -280 2267 1980 -349 -1915 370 2574 1289 -1355 -1108 1489
2545A489Q39k715j423K039K314j255k870j21L067J192k098k690J211K948j00k818
$$ 1489 2328 -387 -1810 229 2543 1288 -1582 -1703 1364 2556 458 -2232 -1021 1927 1827 -991
2561i91j002K822J717k171k301J061L047J93k941j492K119K487j301l094j08K606
$$ -991 -1993 829 2546 375 -1926 -865 2182 2375 -566 -2058 61 2548 1247 -1847 -1955 651
2577F51J799k054k621R36K913J48l011j264K877K306k303l187R52M203K80l908
$$ 651 2450 396 -2225 -1289 1624 1772 -1239 -2503 374 2680 377 -2810 -1858 2345 2625 -1283
2593a283j584K507K972j720l246O41K634O19k394j264J462K517p68l102m22K449
$$ -1283 -2867 -360 2612 892 -2354 -1713 921 1540 -854 -2118 -656 1861 1093 -2009 -2431 18
2609A8K366j648l460K40L478J364l225j860K279L296j854m243N05M785P59l525
$$ 18 2384 736 -2724 -2484 994 2358 -867 -2727 -448 2848 994 -3249 -2744 2041 2800 -725
2625g25k927L211K822j752k782L75L016P40k636j831J481J849P22j755j944J571
$$ -725 -3652 -441 2381 629 -2153 -1778 1238 1978 -658 -2489 -1008 841 1563 -192 -2136 -565
2641e65K187n10k877r8L549J833l594l606K011M519j94m181r07L450J585l633
$$ -565 1622 1112 -1765 -1863 1686 3519 -75 -3681 -1670 2849 2655 -1526 -2433 1017 2602 -1031
2657a031k153K979L184j353l597l71L199R62j108j660M27J794M04j124k125N65
$$ -1031 -3184 -205 2979 1626 -1971 -2342 857 1819 711 -949 -522 1272 1676 552 -1573 -1008
2673a008K646Q25k643k550K799L047j571m959J683N268r5n508j822N174K475l603
$$ -1008 1638 2463 -180 -2730 69 3116 1545 -3414 -1731 3537 3442 -2066 -3888 1286 3761 158
2689A58k741K530K912j409l521M77K630R93j563q49o59O51J683Q6k402l24K747
$$ 158 -2583 -53 2859 1450 -2071 -1594 1036 2029 466 -383 -1042 -391 1292 1378 -1024 -1348 1399
2706A399J728l084l748K544M528j236m571K50M714L37n212j971M998L708l114
$$ 1399 3127 43 -3705 -1161 3367 2131 -2440 -2190 2524 2861 -2351 -4322 676 4384 1270
2721A270l990P94L033k52k005J91J946L99j674j200j165J909K343N57k703k550
$$ 1270 -2720 -1926 1107 855 -1150 -959 987 1386 -288 -1488 -2653 -744 1599 2156 -547 -3097
2737c097K087K518j742k812K433M728j857o360q28O291L169m682k936L477K309
$$ -3097 -1010 1508 -234 -3046 -613 4115 2258 -4102 -4930 1361 4530 -152 -3088 389 2698
2752B698l591l888L006N042o74m079j093J391N01M15N37M7p40M84K63j997j043
$$ 2698 -893 -4781 -1775 3267 2593 -1486 -2579 -1188 -687 -272 265 312 -428 56 319 -1678 -2721
2769b721K478M673j974o146L13N367J121n620p07O002K038n872m364M580M802
$$ -2721 -243 4430 2456 -3690 -3377 1990 3111 -2509 -3216 2786 4824 -1048 -5412 -832 3970
2784C970k474m330J935L381j266l088J6K343R07L5p46j548j064K424K248k081
$$ 3970 1496 -2834 -899 2482 1216 -1872 -1856 487 1394 1429 683 -865 -1929 495 2743 662
2800F62l081K650L739k205n639J167O146R17n782k396N186L011m571m279L660
$$ 662 -2419 231 3970 1765 -3874 -2707 3439 4356 -1426 -3822 1364 4375 -196 -4475 -815
2815h15M690j589l781l01K794N53k091RJ554J146p17j535j426p28K678L183j514
$$ -815 3875 2286 -1495 -1796 998 1551 -540 -531 1023 2169 1452 -83 -1509 -2237 441 3624 2110
2832B110m299o3L942K29m846k49O398K594p314m900N054N751l100m704K865M918
$$ 2110 -2189 -2252 1690 1919 -2927 -3176 3222 5816 -1498 -6398 -1344 4407 1307 -3397 -532 4386
2848D386l215n244J205M459J005j877o88n03j680O96K431j94j696J390K425l136
$$ 4386 1171 -4073 -2868 1591 2596 719 31 -472 -2152 -1456 975 781 -915 475 2900 -236
2864b36n000J848P333R88o526k972M693K445m270k522M981M111l365n454K99M532
$$ -236 -5236 -3388 3945 4933 -1593 -4565 128 2573 -1697 -4219 762 4873 1508 -3946 -3647 885
2880H85J273k379p82J518N86j797j487M65J338K028R1j618k955O11L222O20l088
$$ 885 2158 -221 -1003 515 1101 -696 -2183 -1718 -380 1648 1739 121 -2834 -2223 999 1619 -1469
2897a469k37M052Q15n474l120N070N804l431n885K117M674j451n012J591N181
$$ -1469 -1706 2346 3161 -2313 -5433 -363 5441 2010 -3875 -1758 2916 1465 -3547 -1956 3225
2912C225q8m140j634K790K62n48P16L11j245k53J766o96k800R79M807K36n431
$$ 3225 3137 -1003 -2637 153 415 -133 583 894 -351 -604 1162 466 -2334 -1355 3452 3688 -1743
2929a743j903M970K158m586k071M512L357m073m863K514M611k26l811N6K354J70
$$ -1743 -3646 1324 3482 -1104 -3175 1337 4694 621 -4242 -1728 2883 2657 -1154 -1098 1256 1426
2945A426k219p64J257J550J39r01r40o96J448J172n73k151P88K740l5l876j637
$$ 1426 -793 -1557 -300 1250 1389 488 -452 -1148 300 1472 899 -1252 -464 2276 2241 -1635 -3272
2962c272L986L260l136m064K151M060j504m505Q31M989O40m867j778L408J332
$$ -3272 714 3974 838 -3226 -1075 2985 1481 -3024 -2193 2796 3436 -1431 -3209 199 1531
2977A531j496j221J219P21n93p57J53p33Q58J735Q9l496j92L452O66l632j576
$$ 1531 35 -1186 33 754 161 -596 -443 -1176 -318 1417 1506 -1990 -2182 1270 1936 -1696 -3272
2994c272M008K734l362m272K283M424r30l632N80K952l7l230j062K462K284j038
$$ -3272 736 3470 108 -4164 -1881 2543 1613 -2019 -1439 1513 1476 -1754 -2816 -354 1930 892
3010H92j604r18P21R96r7m01n18J219P91j106k488K65L645J006l169k441K739
$$ 892 -712 -1630 -909 87 -10 -411 -929 290 1081 -25 -2513 -2248 1397 2403 -766 -3207 -468
3027d68K395j903k792J805L991p84m114q89L208K067k256j817J249J437m96j933
$$ -468 1927 24 -2768 -963 3028 2244 -1870 -2759 449 2516 260 -1557 -308 1129 633 -1300
3043a300R7J553J186k59j801j223R27K467k67k400j16K478O17k565j873K401L050
$$ -1300 -1203 350 1536 1277 -524 -1747 -820 1647 1380 -1020 -1136 1342 1959 -606 -2479 -78 2972
3060B972j476l239K39L324Q12l377j128K292K179j704k392M03K148O20j387j066
$$ 2972 1496 -1743 -1504 1820 2632 -745 -1873 419 2598 894 -1498 -1095 1053 1673 286 -780
3076g80Q43J195Jj460q26J229J566l81k650m04K619J718k352k572J889K633j251
$$ -780 63 1258 1259 -201 -1027 202 1768 1387 -1263 -1667 952 2670 318 -2254 -365 2268 1017
3093A017k611M79K631M25k550j468J969J685n36k076n52J769J130p57j577k77
$$ 1017 -1594 -1115 1516 1941 -609 -2077 -108 1577 1041 -1035 -1587 182 1312 555 -1022 -1299
3109a299J765R50j477j836J476J973p86k308l26K156J263j558k036J042J837j31
$$ -1299 466 1416 -61 -1897 -421 1552 766 -1542 -1868 288 1551 -7 -2043 -1001 836 705
3125G05j948m27J528J725j326k471M56K681M26k202j025J821J355j010j779N86
$$ 705 -1243 -1670 -142 1583 257 -2214 -1758 923 1349 -853 -1878 -57 1298 288 -1491 -905
3141i05J767J75j548j035O88J484P22j841j333J654J016m49k078P54K663l21l061
$$ -905 862 1037 -511 -1546 -858 626 1348 -493 -1826 -172 844 395 -1683 -929 1734 1413 -1648
3158a648k68J679J858q92j523K78J074j07p10m74P52J190l02j846n65J874J333
$$ -1648 -1916 -237 1621 729 -794 -516 558 451 -259 -733 19 1209 907 -939 -1504 370 1703
3175A703j239j647J87K093j37j496k51J593P59r86j500L12J571M02q21j246N99
$$ 1703 464 -1183 -996 1097 960 -536 -787 806 1565 579 -921 -609 962 1364 543 -703 -104
3192a04J361l40j794j47K289J097k244k036J209J896m3j370K2J017J04j110o99
$$ -104 1257 917 -877 -1024 1265 2362 118 -1918 -709 1187 1144 -226 -204 813 917 -193 -892
3209h92P10J261P62j721j719J036J978n26j138j20J432l00j555r53K184J315r70
$$ -892 -182 1079 1841 120 -1599 -563 1415 889 -249 -369 1063 763 -792 -1745 439 1754 784
3226G84j860j25J359O76p18r67P79P74k90j514m38J504J461q22j902K44J654J35
$$ 784 -1076 -1201 158 834 116 -851 -72 702 412 -1102 -1540 -36 1425 603 -1299 -1055 599 734
3244G34j083q35J410J110j040j912J56K237P17j701j305M27J624l32r98l80J716
$$ 734 -349 -1184 226 1336 296 -1616 -1460 777 1494 -207 -1512 -1085 539 207 -791 -1171 545
3261E45O10j873r90J024J827n27j248p08J112O92n25p49L79Q36P72j573j533J178
$$ 545 1155 -718 -1708 -684 1143 616 -632 -1340 -228 464 -61 -810 -431 405 1177 -396 -1929 -751
3279g51J964o0k153m19J446Q97j144j196J519J754j012j882O3R84J096q33q77
$$ -751 1213 1153 -1000 -1419 27 924 -220 -1416 103 1857 845 -1037 -974 10 1106 273 -604
3296f04K28P03L88j483l42J167J215j21j733m51J021J298p02j446N62J565k15
$$ -604 -376 327 715 -768 -1110 57 1272 1151 -582 -1033 -12 1286 584 -862 -300 1265 1050
3313A050k077k09K258J372j894k066Q39J937r5j763J55J691k06j100q44N60J090
$$ 1050 -1027 -1236 1022 2394 500 -1566 -727 1210 1115 -648 -493 1198 992 -108 -952 -392 698
3330F98K20o00o24j33N18Q69j058o58J022J548q08k354l1K752O42k253j322J768
$$ 698 918 318 -306 -439 79 948 -110 -768 254 1802 994 -1360 -1391 1361 2003 -250 -1572 196
3348A96J598k067j569J444K023m95k044m3J353K21q35k8j08M42K12j88o11n46
$$ 196 1794 -273 -1842 -398 1625 1130 -914 -957 396 617 -218 -246 -354 88 300 112 -499 -1045
3366a045J048Q48n86j699N79K408q75k519L57K241J381k667j877K057J913j474
$$ -1045 3 851 265 -1434 -855 1553 678 -1841 -1484 757 2138 -529 -2406 -349 1564 90
3382I0j813J123K061r46k076J41J509P11r66p94K78N45r9J78n59o4N54J109m41
$$ 90 -1723 -600 1461 515 -1561 -1420 89 800 -166 -960 -682 -137 -236 -58 -617 -681 -127 982 541
3401E41j882l2K159K80k088n84K173J447l014j693K238K674j214k416J83K385
$$ 541 -1341 -1373 786 1066 -1022 -1606 567 2014 -1000 -2693 -455 2219 1005 -1411 -1228 1157
3417A157p02k004N43K403K21j982m80N16K63N43M03j91j338O4J564k84k169J30
$$ 1157 455 -1549 -1006 1397 1618 -364 -844 -328 -65 478 881 690 -648 -584 980 696 -1473 -1343
3435a343L184O49l631j300K661K054k620j296K128K397k161l345J120L346l8j926
$$ -1343 1841 2490 -1141 -2441 220 2274 -346 -1642 486 2883 722 -2623 -1503 1843 1805 -121
3451a21o85J570m21j022L72J182J33j74l9j266j058R16J965J00k181o20K193N04
$$ -121 -806 764 343 -679 -307 875 1008 834 795 -471 -1529 -613 1352 1452 -729 -1349 844 1348
3469A348k163j254L211K096k240l562J047L192k36l082N29L309o14l143q19K518
$$ 1348 -815 -2069 1142 3238 998 -2564 -1517 1675 1439 -1643 -1114 2195 1581 -1562 -2381 137
3485A37J242r81m79L80n08o73R28M01p17k20K009Q2l161j182L309K100k971k242
$$ 137 1379 398 -81 299 -209 -882 46 447 -270 -490 1519 1601 -1560 -2742 567 2667 -304 -2546
3503b546K460K849k830l203J875L752p13l668N46K326l35j991j83K021Q09j041
$$ -2546 -86 2763 -67 -3270 -1395 2357 1644 -2024 -1478 848 513 -1478 -1661 360 1169 128
3519A28m40o09K8M71J316N9j975m54J927K03k557o7L060K195l569k680J759L203
$$ 128 -312 -921 -893 -422 894 953 -1022 -1476 451 654 -1903 -1970 1090 3285 -284 -2964 -1205 1998
3537A998j265k859J077L237l66m234m32L172J535j689p48J072j37j195l17J401
$$ 1998 733 -2126 -1049 2188 1822 -2412 -2844 328 1863 174 -574 498 361 -834 -1151 250
3553B50L80j69O53o86k104m61L004J893k176k398J906K070k082k995K718L997
$$ 250 630 461 1114 428 -1676 -2137 867 2760 584 -1814 92 2162 80 -2915 -197 3800
3569C800j440m185k10L133M94k387m20K558O70k381j073R43J119k7L55j24j037
$$ 3800 2360 -1825 -2035 1098 1592 -795 -1215 1343 2013 -368 -1441 -498 621 594 949 825 -212
3586b12r04J374M53j187p16K837O98l003k254K371L407j372l203O59K950o32l189
$$ -212 -1116 258 711 -476 -1192 1645 2343 -660 -2914 -543 2864 1492 -1711 -1052 1898 1266 -1923
3603a923K82L376J048l093j589J975J079j121n73L51N30j8n05J0o67O1J780K52
$$ -1923 -1641 1735 2783 -310 -1899 76 1155 34 -539 -188 342 324 -181 -171 -838 -777 1003 1255
3621A255j631j277K139J145k100j907K151K905j506l425N86K857L8k851m84L146
$$ 1255 -376 -1653 486 1631 -469 -2376 -225 2680 1174 -2251 -1665 1192 1230 -1621 -2105 1041
3637A041Q07k308k167J970J665p40o31j78P25l99j5k27l20M93J202L57k389j306
$$ 1041 1848 -460 -2627 -657 1008 268 -363 -541 184 -215 -230 -457 -777 -284 918 1275 -1114 -2420
3655b420J724K454j038k583J625K209j400k975M62L875P50l621j051J807J371
$$ -2420 -696 1758 720 -1863 -238 1971 571 -2404 -1942 1933 2683 -938 -1989 -182 1189
3670A189j530r63J669J124j014j081m48M75N75J164l45j435l39J536O87j805n19
$$ 1189 -341 -1304 365 1489 475 -606 -1054 -579 -4 1160 815 -620 -959 577 1264 -541 -1060
3687a060K035J757k164k758J085K720m47k235j65K176M54k263j118J914K055p56
$$ -1060 975 2732 568 -2190 -1105 1615 1168 -1067 -1232 944 1398 -865 -1983 -69 1986 1230
3703A230k079r3J217P70j077j93M79L70mo06p63N18J546N64j761j535J108J888
$$ 1230 -849 -942 275 1045 -32 -225 254 624 620 14 -749 -231 1315 1879 118 -1417 -309 1579
3721A579p48k526O53K682M36l127j048L080J348k116j597J159J742p53j514k40
$$ 1579 831 -1695 -1042 1640 2076 -1051 -2099 981 2329 213 -1384 -225 1517 764 -750 -990
3737i90J307O56q24o22l14O65R91l18j337m06J884R53k027j885K030J915j055
$$ -990 317 973 149 -473 -787 -122 869 551 -786 -1192 692 1645 -382 -2267 -237 1678 623
3754F23k120M65K156K59k368j017J766J723j024j676j93J663N51r50r19O38J515
$$ 623 -1497 -1032 1124 1383 -985 -2002 -236 1487 463 -1213 -1406 257 808 -142 -1061 -423 1092
3771A092o29j593j69J552O55n55j362l54J433R23j179j030O46J725l74k189n9
$$ 1092 463 -1130 -1299 253 908 353 -1009 -1363 70 993 -186 -1216 -570 1155 781 -1408 -1467
3788a467J916J260j814j817J545J768o04k013k88J918O66p90j464O54J121L00
$$ -1467 449 1709 -105 -1922 -377 1391 787 -1226 -1514 404 1070 280 -1184 -530 591 891
3804H91j054j020R61J382J9j844l74J510J198j453j533P38J920j86j891l99J701
$$ 891 -163 -1183 -222 1160 1179 -665 -1039 471 1669 216 -1317 -579 1341 1155 -736 -1135 566
3821E66P77r33j624N37J681K0j318r14J233R15n43j172k88J966N07j427r42J146
$$ 566 1343 410 -1214 -677 1004 1024 -294 -1208 25 940 397 -775 -1063 903 1410 -17 -959 187
3839A87J205n15j564k61J385O98q45j090K34J959j33j611r33J415J416o23j796
$$ 187 1392 877 -687 -948 437 1135 290 -800 -566 1393 1260 -351 -1284 131 1547 924 -872
3856h72J25J437M33j538p09J187J207m46j655k39J538Q43j207j277N43J525j29
$$ -872 -747 690 1123 -415 -1124 63 1270 824 -831 -1070 468 1311 104 -1173 -630 895 766
3873G66j266m56J082J132r43j583M91J541K03j274q30O49J465m02j397l46J404
$$ 766 -500 -956 126 1258 315 -1268 -777 764 967 -307 -1137 -488 977 575 -822 -1168 236
3890B36O63r09j201O36J539m24j499r9J348O32q82j466N43J641M57j324j014N27
$$ 236 899 -10 -1211 -575 964 540 -959 -1058 290 922 40 -1426 -883 758 1215 -109 -1123 -596
3908e96J546r5j419k09J280N86j582q17R77J529m76j654l14J113R62p67r07N47
$$ -596 950 855 -564 -773 507 1093 -489 -1306 -329 1200 724 -930 -1244 -131 831 64 -843 -296
3926b96R01n8j276l94J153J105k83j572m33J595N01j320n10P66R36j10j669J16
$$ -296 605 547 -729 -1123 30 1135 852 -720 -1153 442 943 -377 -887 -121 815 705 -964 -848
3944h48J062J346j171j477L75J176K94j270j87J332O70j063j215pJ759K95r29
$$ -848 214 1560 389 -1088 -713 463 757 -513 -700 632 1302 239 -976 -983 776 1071 142
3961A42r50L21J059J78r66k68P42P39q61r78j4K298q8j349r43R79J179p24j562
$$ 142 -808 -487 572 750 -216 -484 258 997 136 -842 -856 1442 1354 5 -938 41 1220 496 -1066
3980a066N74J671l8j397q74R89J172n05j080K05O04N66r77p11L03J627q1j346
$$ -1066 -492 1179 1141 -256 -1130 -141 1031 526 -554 -349 255 821 -156 -867 -564 1063 982 -364
3998c64q07Q38J225l26q86k62J302J43j507p21J129J589q02j690L1J648K54j096
$$ -364 -1171 -333 892 566 -320 -582 720 863 -644 -1365 -236 1353 551 -1139 -1108 540 794 -302
4016c02l10N28P11n70q03K4Q17L97J76j595k53R37R34p42o54K47J119p6j566o49
$$ -302 -612 -84 627 57 -746 -722 95 492 668 -927 -1180 -243 691 -51 -705 -458 661 585 -981 -1630
4036a630J614J089j218j334R20J399m37j386p7J597M16j504o51O88J157k87n27
$$ -1630 -16 1073 -145 -1479 -559 840 403 -983 -1060 537 953 -551 -1202 -514 643 356 -171
4053a71o08O15L57m3m77j66L26P54o48q09J47J461M11j794r13J551J255n15j869
$$ -171 -779 -164 193 150 -327 -493 -167 587 -61 -870 -723 738 1149 -645 -1558 -7 1248 733 -1136
4072a136O50J678l96j782N4J729O14j354j088R76P52n79k23M6M80j90N4k08n40
$$ -1136 -486 1192 796 -986 -932 797 1411 57 -1031 -55 697 118 -105 -59 421 231 285 77 -463
4091d63M84O76k8j167o06J351J340j184j479J312J384j441j972R26K103J8j783
$$ -463 21 697 669 -498 -1104 247 1587 403 -1076 236 1620 179 -1793 -867 1236 1254 -529
4108e29n7J000J40j060K55M12R69r78q67N81K8NN22K00n77p65R56P7k97r96J534
$$ -529 -586 414 554 -506 -251 161 1130 152 -715 -134 -106 -101 421 621 44 -721 235 312 15 -981 553
4129E53Q96j558j510Q38J892o51j662O53J787o40j816k81J801Q60j484n56Q05
$$ 553 1449 -109 -1619 -781 1111 460 -1202 -549 1238 598 -1218 -1499 302 1162 -322 -878 -73
4146g3N07j127L8P15L19k83l8Q3o49o53J101Q50r89j048J161J130j238j639J130
$$ -73 434 -693 -655 60 379 96 58 141 -508 -1161 -60 790 -199 -1247 -86 1044 -194 -1833 -703
4165g03K109j83k486j55K254L0j980k78K299K39j645p84R22P50l87j29P44k37
$$ -703 1406 1223 -1263 -1418 836 866 -1114 -1392 907 1146 -499 -1283 -361 389 2 -127 617 380
4183C80j251L6J224l42m72P40Q05j100j669J160K061q98j625L96J924n07k215
$$ 380 -871 -835 389 47 -425 315 1120 20 -1649 -489 1572 674 -951 -555 1369 862 -1353
4200a353j98K745j18j208o51J297N47j419l26R27J215j132m95k8J43l28N55O08
$$ -1353 -1551 1194 1076 -132 -783 514 1061 -358 -684 243 1458 326 -169 -197 -54 -382 173 781
4218G81j31j291M44J074o71r94M75K302p68k463k14K517K21k131NK260L22k192
$$ 781 650 -641 -197 877 206 -788 -313 1989 1221 -1242 -1456 1061 1282 -849 -844 1416 1738 -454
4236d54r19J345J165q84q26J027M95j458m67J112P02j217N54P00p05j515J038
$$ -454 -1373 -28 1137 253 -573 454 949 -509 -976 136 838 -379 175 875 170 -1345 -307
4253c07J753o40j627N54J406m87k594P92K672J27k167r68J794R69j818q79J722
$$ -307 1446 806 -821 -267 1139 652 -1942 -1150 1522 1649 -518 -1486 308 1277 -541 -1420 302
4270C02Q61o52j636rJ183j04k83M90K43o21m2J94j52m43O56J338j141j529RJ961
$$ 302 1163 511 -1125 -1134 49 -55 -338 152 395 -226 -268 -74 -226 -669 -13 1325 184 -1345 -1336 625
4290F25K83j686M2J504O66k526q96K091J552j544j516J212R47o55j496J040J573
$$ 625 908 -778 -736 768 1434 -1092 -1988 103 1655 111 -1405 -193 754 99 -1397 -357 1216
4307A216r84n89N43k67n70L98J161n60r14K23J128q57j594Q72K225l4k276m61
$$ 1216 232 -357 186 -81 -651 -253 908 348 -566 -343 785 -72 -1666 -794 1431 1397 -879 -1340
4325a340J927O57j936l57J856Q65k061p36Q71R21j14r87K68P60j12o94J50r9K99
$$ -1340 587 1244 -692 -1049 807 1672 -389 -1125 -254 667 553 -434 -166 594 482 -212 -62 -161 138
4344A38J52O61q68o97J22J313l32q56L2J502m7k101n25K315J200j652j445R45
$$ 138 290 951 83 -614 -492 821 489 -367 -335 1167 1120 -981 -1506 809 2009 357 -1088 -143
4362a43J293q42j394J263R69n08j469K8J164m1m62N72Q1m41j75J39p4q50N00J550
$$ -143 1150 308 -1086 177 1146 638 -831 -803 361 320 -142 430 511 70 -105 34 -40 -890 -390 1160
4382A160m27j756j46J746O44j713j37J277N91j797j042J487J536q78j529L47Q80
$$ 1160 733 -1023 -1169 577 1221 -492 -629 648 1239 -558 -1600 -113 1423 545 -984 -637 243
4399B43L4o31N9K41K66k72n47J98K84J96P18j027q41P02J204l38j563L61J103
$$ 243 277 -354 -295 -54 212 -60 -607 -409 -125 71 789 -238 -1079 -377 827 489 -1074 -713 390
4418C90Q24j811o87J139J064j191j116N81J508j59j155m39J491p4n69m99M44M40
$$ 390 1214 -597 -1284 -145 919 -272 -1388 -807 701 542 -613 -1052 439 365 -204 -703 -259 181
4436A81L8q1m70r6N36M71p36q61N71J296n37j275j46J765K94j191r66Q96J363
$$ 181 219 138 -332 -428 108 579 -157 -1018 -447 849 312 -963 -1109 656 950 -241 -1207 -311 1052
4455A052n39j042k9J148J13j281r8J003O12o85p75K25N07L45J03j124J82O04J54
$$ 1052 513 -529 -558 590 703 -578 -676 327 939 254 -521 -296 211 556 659 -465 -283 321 475
4474D75n37o09K92J258n5j102o46J139P89p98j270J143J016m39j175O2R20O17
$$ 475 -62 -671 -379 879 824 -278 -924 215 1004 206 -1064 79 1095 656 -519 -457 463 1080
4492A080p12q66N37L38Q8p69n6M87P96j48j417j0R50N38l78j361N66J291l95j216
$$ 1080 368 -498 39 377 465 -304 -360 127 923 775 -642 -652 298 836 458 -903 -337 954 559 -657
4512f57j00J208O17r46j301N46J214Q3j325k86R20P60p40p79L22Q41K01o83p18
$$ -657 -757 451 1068 122 -1179 -633 581 664 -661 -947 -27 733 -7 -786 -464 377 578 -105 -823
4531h23Q66N02l49p16l91J174L04o39p23L92Q10J22j033o90J027J035p77j198
$$ -823 43 545 196 -520 -911 263 567 -72 -795 -403 407 529 -504 -1194 -167 868 91 -1107
4549a107M74J153R4r66n75J213N64p24j132L21R31K52n06p48K19R48oj011O9P21
$$ -1107 -633 520 614 -352 -927 286 850 126 -1006 -685 246 498 -8 -756 -537 411 405 -606 -537 184
4569A84N87p65q15K43J589o47p46l39N64Q62o33o45J97Q58K69o71q05P74M20K21
$$ 184 771 6 -809 -566 1023 376 -370 -709 -145 717 84 -561 -364 494 763 92 -713 61 481 702
4589G02j240k55J004N26o21q41M00J245k61q11m51O62R16p11p14r4J138n4p05
$$ 702 -538 -793 211 737 116 -725 -325 920 659 -152 -603 59 975 264 -450 -544 594 540 -165
4608a65q14Q16J187m20j078o74J508O46p92o94K76P97j94q49q1Q48M39k03j064
$$ -165 -979 -163 1024 604 -474 -1148 360 1006 214 -480 -204 593 399 -450 -531 317 756 553 -511
4627e11K69P26M12r37q61O17J167m37j144J00Q99O77j157m56N41N31M5j049J7
$$ -511 -242 484 896 -41 -902 -285 882 445 -699 -599 300 977 -180 -636 -95 436 481 -568 -551
4646e51N90Q01q13p63J47R34M9p75n30N76J085n59r51K73N00P25j164l92M10J011
$$ -551 39 840 27 -736 -589 345 394 -381 -911 -335 750 191 -760 -487 13 738 -426 -818 -408 603
4666F03J22j325k07O82R79p32q22k41J539J37j042o60J049M30l06r28R4J088K29
$$ 603 725 -600 -807 -125 854 122 -700 -941 598 735 -307 -967 82 512 206 -722 -628 460 689
4685F89j147k44M42Q30Nr30n58O22P38l21q25K02P45N23j319n47Q79J090q7j499
$$ 689 -458 -702 -260 570 575 -355 -913 -291 447 126 -699 -497 248 771 -548 -1095 -216 874 787 -712
4705g12JR84N57j103o72N66J266o83j138K95Q61N79o48p78M91O43J5o66l63L25
$$ -712 -711 273 830 -273 -945 -379 887 204 -934 -639 222 801 153 -625 -134 509 524 -142 -505 -180
4725a80R21k8r81n90R70Q62j079o23K15J232J2j612j50J575O70j222p30O56Q31
$$ -180 741 713 -268 -858 112 974 -105 -728 -513 719 731 -881 -1031 544 1214 -8 -738 -82 749
4744G49j71j158L77M73N71q69j64MN18J16k26o35k3R09L84j044o36J026R47o45
$$ 749 578 -580 -203 270 841 -28 -192 -188 330 446 220 -415 -438 471 855 -189 -825 201 1148 503
4764E03j548L70J521l51r39m74J465N06j250q17P00J122n89p56Q1N89L16o49k70
$$ 503 -1045 -675 846 495 -444 -918 547 1053 -197 -1014 -314 808 219 -537 -456 133 449 -200 -470
4783d70J14P7O87k80l29l32K64P94m62j208J074O38k76j447N9J844N2j220m33
$$ -470 -356 -279 408 128 -201 -533 -269 525 63 -1145 -71 567 291 -1156 -1097 747 799 -421 -854
4802h54R91R73j455j134J070J384n59r67K20K04p3J75K79m88j47M91O17j272j4
$$ -854 137 1110 -345 -1479 -409 975 416 -551 -331 -127 -200 -25 254 -234 -381 110 727 -545 -559
4821e59O32Q42l83j484L33J173k14j204L6J571L24j492q92J271R58n42j120P50
$$ -559 73 915 532 -952 -619 554 340 -864 -828 743 1067 -425 -1317 -46 912 370 -750 0
4839@P98p95n48J91P01k3pr5m07o51Q71M56r4r77M35J327q99j135K55J641Kj188
$$ 0 798 3 -545 -354 347 324 317 222 -185 -836 35 491 397 -580 -145 1182 283 -852 -597 1044 1046 -142
4861a42j063J566Q13j442q06J320J051p79j330M57O97J26o70M72L8l76n9J68j16
$$ -142 -1205 361 1174 -268 -1074 246 1297 518 -812 -355 342 468 -202 270 308 -68 -127 41 -75
4880g5o78R69R40o62j245K96J401Q4j942K52J600J19j954p45J723J250j339r23
$$ -75 -753 216 1156 494 -751 -455 946 1030 -912 -660 940 1059 -895 -1640 83 1333 -6 -929
4898i29R46Q51p57j230R26J211k63q74K1j69m21O94N46j25o78l16Q70p6j236M69
$$ -929 17 868 111 -1119 -193 1018 755 -119 -98 -267 -688 6 552 427 -251 -567 303 227 -1009 -540
4918e40J430L18j878n18J359M81j158o45J399J282j400j329Q82P67J67j060N2
$$ -540 890 1208 -670 -1188 171 652 -506 -1151 248 1530 130 -1199 -317 450 617 -443 -391
4935c91O78m70l24K18L42j74L03M29n00j041L79J050J8j181M5J040N58j616p68
$$ -391 287 -183 -507 -289 53 -121 182 611 111 -930 -551 499 517 -664 -619 421 979 -637 -1405
4954a405J670J160j163j445J300Q53q77j013R24J045k58j466L91N17k49j78J77
$$ -1405 265 1425 262 -1183 117 970 93 -920 4 1049 791 -675 -284 233 -16 -194 -17
4971a7L80l83k51N47j93p18N44Q04K9j018o27J297L27r54m98J228P99j255j213
$$ -17 363 -20 -271 276 83 -635 -91 713 742 -276 -903 394 721 -233 -731 497 1296 41 -1172
4990a172J105Q00k50q49K88R37o58q59K79J368l60p79P4L10o48J57M08M00m34
$$ -1172 -67 733 483 -366 -78 859 201 -658 -379 989 629 -150 -76 234 -414 -257 151 551 117
5009A17l62O77l3j113K16J054N51j182j082J057J040q86q26N64J439p87j251L7
$$ 117 -245 432 399 -714 -498 556 1107 -75 -1157 -100 940 54 -772 -208 1231 444 -807 -770
5027g70J208j97l64qK40Q0m23R6L71k32O5L73k35o67m34P89Q54j012m89J006M80
$$ -770 438 241 -123 -131 109 189 -234 -138 233 1 66 439 204 -463 -897 -108 746 -266 -755 251 731
5048G31j027r86R67J285p13j229N75O26R6r24m9J320j41j045J93M48j81k02L65
$$ 731 -296 -1282 -315 970 257 -972 -397 229 325 -599 -648 672 531 -514 -321 127 -54 -256 109
5067A09o6l06L53j00M6l59p4P72N5p62o09J018M79r06o77R61R38p79q65N88Q82
$$ 109 43 -263 90 -10 36 -323 -397 375 430 -332 -941 77 556 -350 -1027 -66 872 93 -772 -184 698
5088F98j76q59k8R97j72o93j67M46L45k64j96L4PJ8L29p8l10k32Q47k5o11m13
$$ 698 522 -337 -365 632 460 -233 -400 46 391 127 -69 -35 -28 -10 319 241 -69 -301 546 521 -90 -503
5110e03O56N15m90p72M11Q98k95j079M79J066k25j233j51Q20M03p0l48J67K75
$$ -503 153 668 178 -594 -183 715 420 -659 -180 886 661 -572 -723 97 500 430 82 249 524
5129E24k64k63m0K86k01N39j14n81k79N61N59q38m10Q59L89n83k87J35O93k09
$$ 524 260 -3 -43 243 42 581 467 -114 -393 168 727 -111 -521 338 727 144 -143 -8 685 476
5149D76q45p6O90J79j007K50J82O86l94l92j01L55Q7j34k09J16N09j23k10n33
$$ 476 -369 -445 245 424 -583 -333 -151 535 141 -251 -352 3 90 -44 -253 -137 372 249 39 -494
5169d94L85N52j56m70m11M49P50r46k59O8J016Q8j235k02R51K20m24l22K43N55
$$ -494 -109 443 287 -183 -594 -145 605 -341 -600 -532 484 572 -663 -865 86 306 -118 -440 -197 358
5189C58j94o12l3N09P5r9q0j60O9O09n84J05m07M21j96k03k78Q07J73j09o02J5
$$ 358 164 -448 -481 28 103 4 -76 -236 -167 442 -142 -37 -444 -23 -219 -422 -700 107 280 171 -431 -416
5211d16O60R7n46m15N45K13l06j39J01J84L71n41k32M49K23O4n74j65M88L08m23
$$ -416 244 341 -205 -620 -75 138 -168 -307 -206 -22 349 -192 -424 25 248 312 -262 -427 61 369 -54
5232e4m58J78N95pl70l18L11P76l75n14j17O96l23l7l70N07M30k94o02M1O18M44
$$ -54 -512 -334 261 254 -116 -434 -123 653 278 -236 -353 343 20 -17 -387 120 550 256 -346 -305 313 757
5254G57n24n24J17O01m5p65K74j25O37l03l86n1N32K41o28m63P35K91j50l4m13
$$ 757 233 -291 -174 427 382 -383 -109 -234 403 100 -286 -337 195 436 -192 -655 80 371 221 187 -226
5275b26N24J90n24r6K03M38n06M8l18J29P77o10j58n3K51L21o67p0L27J61m6n34
$$ -226 298 488 -36 -132 71 509 3 51 -267 -138 639 29 -129 -182 69 390 -277 -347 -20 141 95 -439
5297d39M9M43K7m2m10J38K78K82p43K9L24M19m98l72Q1P85k33n46k39N15M13m08
$$ -439 -390 53 80 38 -372 -234 44 326 -417 -388 -64 355 -143 -515 -434 351 118 -428 -667 -152 261 -147
5319a47j39J40K96J22l66p05L50M86L09p51l2M23J89o29l37N51L75L94r49m18
$$ -147 -286 -146 150 272 -94 -799 -449 37 346 -405 -437 -14 175 -454 -791 -240 135 529 -420 -838
5339h38R14L30m00n53K68P72k02o31j59P88o1k40l10K38J30L17m85j55r0N97K68
$$ -838 76 406 6 -547 -279 493 291 -340 -499 289 228 -12 -322 -84 46 363 -122 -277 -367 230 498
5360D98m83o17N74K72n0o31K96O51j22m08l17O67J69j73p66KN97M10n38k73J05
$$ 498 15 -602 -28 244 194 -437 -141 510 388 -20 -337 330 499 326 -440 -438 159 569 31 -242 -137
5381a37O72k16j82o1J13K04k87j14J8L7M47l79j21M6M27m47m30j22Q30M42o08
$$ -137 535 319 137 76 189 393 106 -8 10 47 494 115 -6 40 467 20 -410 -532 298 740 132
5402A32o25M39P33m46k55l32M94Q6l17m13N79M10k57m31j26J07M35j19k86k10
$$ 132 -493 -54 679 233 -22 -354 140 226 -91 -504 75 485 228 -203 -329 -222 213 94 -192 -402
5422d02K79M54m49m89L21Q24m86l41l24P48K64m88m92O10M90m29q39K20R03k29
$$ -402 -123 331 -118 -607 -286 538 52 -289 -613 135 399 -89 -581 29 519 90 -749 -529 374 145
5442A45k30m38L97R4L00n24JK47K09J68q19K36L28L72j81p37pQ44ll97m64O17
$$ 145 -85 -523 -126 -32 268 -256 -255 -8 201 369 -450 -214 114 486 305 -432 -439 405 402 5 -459 158
5464A58L29o96o73P39N67j01l58k91M86K57o59j25K75J19M21m18j98k9K07L76
$$ 158 487 -209 -882 -143 424 323 -35 -326 160 417 -242 -367 -92 27 448 30 -168 -197 10 386
5484C86n08j95J21N60k25n50j26O88L76n59o83O44Q26p20o53L46P58k1j046L65
$$ 386 -122 -317 -196 364 139 -411 -537 151 527 -32 -715 -71 755 35 -618 -272 486 465 -581 -216
5504b16M01l6k89j49L02MK5Q0k81k41L24L45K31j071L19Q14k2p74l30J134M87
$$ -216 185 149 -140 -289 13 17 42 122 -159 -400 -76 269 500 -571 -252 562 540 -234 -564 570 1057
5525A057p68r29M41J070n98o31P7Q05J28j189L2J006k01j68m24R8J16L35m05L93
$$ 1057 289 -640 -199 871 273 -358 -281 524 652 -537 -505 501 300 132 -292 -194 -78 257 -148 245
5545B45k98k78N38K42r51j10R37K53m25p48R96K78j143m86Q83J016p50p47J83
$$ 245 -53 -331 207 449 -502 -612 325 578 153 -595 401 679 -464 -950 -67 949 199 -548 -365
5564c65Q06j33j016L06N43K48n90m51O8N95m1N18m3j093J94Q84l0o96l28J135
$$ -365 441 308 -708 -402 141 389 -201 -652 -584 11 -30 488 445 -648 -454 430 400 -296 -624 511
5584E11J59j106o48J235O51m80j268Q61N56l54j069L87Q55L0p46J23K78R6k03
$$ 511 670 -436 -1084 151 802 322 -946 -85 471 117 -952 -565 290 320 -426 -303 -25 71 -132
5603a32j66N76n90K78R6j62j9n12J200J1q39n47J009O97j130p44J218Q65q14j042
$$ -132 -298 278 -312 -34 62 -100 -119 -631 569 580 -259 -806 203 900 -230 -974 244 1109 295 -747
5623g47R8J227p4j017q9J244k10o15k38N38K73n97K63K29m66J10J95M28r52J40
$$ -747 -649 578 504 -513 -602 642 432 -183 -421 117 390 -207 56 285 -181 -71 124 552 -400 -260
5643b60J049j47q41q71J098R22p44p21K02J292n10j371J08J665l2j318p2R80k21
$$ -260 789 642 -199 -1070 28 950 206 -515 -313 979 469 -902 -794 871 839 -479 -551 429 208
5662B08n12j29O15K76l45j65j25p6j98O59L86q69k15O91j55o2o58P10Q44o92r93
$$ 208 -304 -433 182 458 113 -52 -177 -253 -451 208 594 -275 -490 201 46 -16 -674 36 880 188 -805
5683h05L41J198n20o95j62J084p8p43o65J114L74n35O5J54k34j03q8L22Ol44J37
$$ -805 -464 734 214 -481 -643 441 363 -380 -1045 69 443 -92 -27 127 -107 -210 -298 24 30 -314 -177
5704a77K81m71l02R15M81m85j077N20P24k46r14M58R87n6j119l29J176l6l25n29
$$ -177 104 -367 -669 246 727 242 -835 -315 409 163 -751 -293 694 638 -481 -810 366 330 5 -524
5724e24N69M04o52k87K32L85k81L64j95j33j90M30o0k80r5K52N10m82p03O46P10
$$ -524 45 449 -203 -490 -258 127 -154 210 15 -118 -308 122 62 -218 -313 -61 449 -33 -736 -90 620
5745F20j06j110J53J016k4p87j81R72P4p20k64J14P25k08o05M09J25l11J72J83
$$ 620 514 -596 -443 573 549 -238 -419 553 627 -93 -357 -243 482 274 -331 78 203 -108 64 247
5765B47k70nj03N71m86l40N16N29n44o59K37Q47k19r05K0Q07R8o43m1P19K14o41
$$ 247 -23 -28 -131 440 -46 -386 130 659 115 -544 -307 540 321 -584 -564 243 341 -302 -343 376 590 -51
5787e1j04P2N38l60n0k8l48k7N30q3k85m9L86K93l95n94M36P50m31l47p0M07J35
$$ -51 -155 -83 455 95 45 17 -331 -358 172 89 -196 -245 141 434 39 -555 -119 631 200 -147 -217 190 325
5810C25m96k80J021j34p22m23L73R09n23m16J63L26M4j95N4p4J81k01J4L3n01
$$ 325 -171 -451 570 436 -286 -709 -336 573 50 -366 -203 123 167 -28 26 -48 133 -68 -54 -21 -522
5831e22M08L08n11J08J99L95k85o51J30O98J26n86k50N52L94q45j95L63N11m53
$$ -522 -114 194 -317 -209 -10 385 100 -551 -421 277 403 -183 -433 119 513 -332 -527 -164 347 -106
5851a06j91j55N71o0j27J6o0j8L14L7m00Q9L27J63p86l5J38P89r6n86j61M25J79
$$ -106 -297 -452 119 59 -68 -52 -112 -130 184 221 -179 -90 237 400 -386 -421 -283 506 410 -176 -337 88 267
5874B67j1l26J61J90k43j34k35O04j6k73l46M74L2L57k98m19K18J76P1m51p3L78
$$ 267 256 -70 91 281 38 -96 -331 273 257 -16 -362 112 144 501 203 -216 2 178 249 -202 -275 103
5896A03P9M8l40k99P41K1l32l90N14N10n41l67j5N42m6j54l54M86K9l5m87L31
$$ 103 182 230 -110 -409 332 353 21 -369 145 655 114 -253 -268 274 228 74 -280 206 235 200 -287 44
5918D4K62m72m2k65O37N0k25j28J5j37J60L58n49L41l1L00m66m9L09P2k2l43L99
$$ 44 306 -166 -208 -473 164 214 -11 -139 -124 -261 -101 257 -292 49 18 318 -148 -197 112 184 162 -181 218
5941B18q9O9n49K7N73k10k98l39N40L44l17j3l36PO04l81l92K94L67J74k07m58
$$ 218 129 198 -351 -324 249 39 -259 -598 -58 286 -31 -44 -380 -373 231 -150 -542 -248 119 293 86 -372
5963c72K04j51O22q14J69L70K03m24k91L20M97k65j15j88K0K28m1o4r6L52q2j47
$$ -372 -168 -319 303 -511 -342 28 231 -193 -484 -164 333 68 -47 -235 -215 13 -28 -92 -188 164 82 -65
5985f5k36L63K54l84j39J21L22K90m03j04k20O81k75l55k07L96L07j64m37m74
$$ -65 -301 62 316 -68 -207 -86 236 526 123 19 -201 480 205 -150 -357 39 346 182 -255 -729
6005g29Q81l9k43q8K69J98j47O4n02M34J28l3k80J21J67l6k93k46L47J78k19k08
$$ -729 152 113 -130 -218 51 249 102 166 -336 98 226 193 -87 34 201 165 -128 -374 -27 151 -68 -276
6027b76L25M01j30j66j97J62J14k31k66m0M70l8k86J96R0k18J85j98L1L02M3j78
$$ -276 49 450 320 154 -43 119 233 2 -264 -304 166 128 -158 38 128 -90 95 -103 -72 230 273 95
6049I5m27K22M93O7l87l82L56k1L8k50p8M23p7J10p08J19N39L40p63P7K75K25
$$ 95 -332 -110 383 450 63 -319 37 16 54 -196 -274 149 72 182 -526 -407 132 472 -291 -214 61 286
6071B86k67k39K97R0l02p9J41J67ql45jK98L3J26j00j76J23N4q7l05J78R7L9J5
$$ 286 19 -220 77 167 -135 -214 -73 94 86 -259 -260 38 71 197 97 -79 44 98 11 -294 -116 -19 20 35
6095C5k52m1L97n8j63j03J99K30l17n04N51J66K22n58K54q6Q3k40LL41k02J00
$$ 35 -217 -258 139 81 -82 -185 14 244 -73 -577 -26 140 362 -196 58 -28 55 -185 -182 159 -43 57
6117E7k30k70M53M67k52l76m16O15J93j27q78P03N39m19m02J91M15L1n2l06l0
$$ 57 -173 -443 10 477 225 -151 -567 48 241 114 -764 -61 478 59 -343 -152 263 294 242 -64 -94
6138i4K20K64n01K97J48m05J70j18m02K77L73J18m25l68P82M05r55L5P7O31m34
$$ -94 126 390 -111 186 334 -71 99 -19 -421 -144 229 347 -78 -446 336 741 -214 -179 -102 529 95
6159I5o82N29O60l64l13J7K93J00k99n9J89j0j72N0P5j16O4N5M6m47K08K39K28
$$ 95 -587 -58 602 238 -75 -58 235 335 36 -23 166 156 -16 34 109 -7 57 112 158 -289 -81 158 386
6182C86o66j70M42L46l13m90M74O32j91j070M23O06q9m15O3LK39l14p3M25m29
$$ 386 -280 -450 -8 338 25 -465 9 641 450 -620 -197 409 320 -95 -32 -29 210 -104 -177 248 -181
6203a81L5o3K44j53k77K40J34k5l82Q85o3r09J14K70O19j98o35J85O48j32n56
$$ -181 -146 -209 35 -118 -395 -155 -21 -46 -428 457 394 -515 -401 -131 488 290 -345 -160 488 356 -200
6224b00N3M67o0m43k95P43l4m38N8K67k48j3n5J14j71J47N7J21n12J42K03M86
$$ -200 -147 320 260 -183 -478 265 231 -207 -149 118 -130 -143 -198 -84 -255 -108 -51 70 -442 -300 -97 389
6246C89l56k35K95L48m51o21N13M78J20o53o87J485j23p68N8M42K89o20k67J52
$$ 389 33 -202 93 441 -10 -631 -118 360 480 -173 -860 625 502 -266 -208 234 523 -97 -364 -212
6266b12M99l20L52J61k03k45j19N12o65o5L85K59k90o31N87M72j67r58M31P06
$$ -212 287 -33 319 480 277 32 -87 425 -240 -305 80 339 49 -582 5 477 310 -648 -217 489
6286D89j17o18N1O27j10o10j12O64m0l13k46K48K13l27K94L5jm20K57O44n90m09
$$ 489 372 -246 -195 432 322 -288 -400 264 224 -89 -335 -87 126 -201 93 128 127 -293 -36 608 18 -391
6308c91L25M20j51m61l8J163p24l25j04Q60k99m31l43N76L87n49m16N21qm4J75
$$ -391 -66 354 203 -258 -296 867 143 -182 -286 574 275 -156 -499 77 464 -85 -501 20 12 -32 143
6329A43l0K44n07K56m9k14j09N85M3l71o40N20O09r2r36L78M91k8p43p0M56N36
$$ 143 113 357 -150 106 57 -157 -266 319 362 -9 -649 -129 480 388 -548 -170 321 293 -450 -520 -64 472
6351D72n98n36Q05jl06m31N06M81l27k58K58p3j04q3K93J37l73k05N00k26m13
$$ 472 -126 -662 143 142 -164 -595 -89 392 65 -193 65 -8 -112 -195 98 235 -138 -343 157 -69 -482
6372d82L98O26k59r80L93N01K04n19l05R25np91k43N72N13n38j89O5M22q5o04
$$ -482 -84 542 283 -697 -304 197 401 -118 -423 502 497 -294 -537 35 548 10 -179 -114 308 223 -381
6393c81N12N4m1l05N08j24o79M80J06Q0k75k41N34J64r95K39J081M6r10l54P86
$$ -381 131 185 144 -161 347 223 -456 24 130 210 -65 -306 228 392 -603 -364 717 763 -147 -501 285
6414B85J79m97J12M2L40n70k07J43L30n3l4k99J79o8N0J50k7m48M23K83l29m73
$$ 285 464 -33 79 121 461 -109 -316 -173 157 104 70 -229 -50 -118 -68 82 55 -393 30 313 -16 -489
6436d89R8J111m23m10k08J073m06o82J95n2M10j24p57J002k12R6l67O8M41k51
$$ -489 -391 720 297 -113 -321 752 346 -336 -141 -193 217 93 -664 338 126 222 -145 -77 364 113
6456A13l36J43J15p1J6J94j44l30L11J94j55j70j28N72O9n22k70M09K67l30p58
$$ 113 -223 -80 35 -36 -20 174 30 -300 11 205 50 -120 -248 324 393 -129 -399 10 277 -53 -811
6477h11R09J91o25K4J37M58m18j21M38k02k04O2j87O26l05j21L24k04k09J25J58
$$ -811 98 289 -336 -312 -175 283 -135 -256 182 -20 -224 -162 -349 277 -28 -149 175 -29 -238 -113 45
6498D5Q9l32j32L92L20o36J21jK84j28o90M13N06j98k72J93M91l02l58j6q0O72
$$ 45 134 -198 -330 62 382 -254 -133 -134 150 22 -668 -255 251 53 -219 -26 465 163 -195 -211 -291 381
6520C81j85j30M3m4o7M40l09k26J06N51l60j02n21O56p8k36k19M99L11n72K0J37
$$ 381 196 66 109 65 -2 438 129 -97 9 560 200 98 -423 233 155 -81 -300 199 510 -62 -42 95
6542I5L07k14j85p5K19J24m35K25l6Mm3r9M7J0L64M1n91J10K94K10l76J23k94
$$ 95 402 188 3 -72 147 271 -164 61 25 29 -14 -113 -66 -56 308 349 -242 -132 162 372 -4 119 -175
6565a75O45q0o63K0K97L27l38k99k4N71on36n5K47K07P8l02J89j47Q1k25j60M6
$$ -175 470 390 -273 -253 44 371 33 -266 -290 281 275 -261 -316 -69 138 216 -86 103 -44 37 -188 -348 -302
6588c02J71J79K0k92Q4L36j76k57k5J11M70k40o91M56L70k79n1r2N51k28k72K34
$$ -302 -131 48 68 -224 -140 196 20 -237 -262 -151 319 79 -612 -156 214 -65 -116 -208 343 115 -157 77
6610G7j52K00j62j82m5K22K53r9k00k65O02j2k86m01L10K65k95k89K45L98L4j41
$$ 77 -75 125 -37 -219 -264 -42 211 112 -88 -353 249 237 -49 -450 -140 125 -170 -459 -214 184 218 77
6632G7l59L44K72k76k20J1L7K78j61k6j30L34J05k74m0J55J78l65J62k16J40K77
$$ 77 -282 62 334 58 -162 -151 -114 164 3 -23 -153 181 286 12 -28 127 305 -60 102 -114 26 303
6654C03k85k07J96M65n8k83m57O35l17q6J42K36k89o8L39k41k31M26M4j31l26
$$ 303 18 -189 7 472 414 131 -326 309 -8 -94 48 284 -5 -73 266 25 -206 220 264 133 -193
6675a93R9J21M2R9j92J14J38j29k28Q3L44k36q2J87J8j53K02n18M89j93J05m74
$$ -193 -94 27 69 168 -24 90 228 99 -129 -46 298 62 -20 167 185 32 234 -284 205 12 117 -357
6697c57LN50j31J11l64L48k71L34m36m7J08J09L4K20o60M60J73J85n10L8J97l11
$$ -357 -354 196 65 176 -188 160 -111 223 -213 -260 -152 -43 -9 211 -449 11 184 369 -141 -103 94 -217
6719b17J57l95M09L56l19k71P4M32m2l25P1j94L89j27m68K38K71m5%j53M79k70
$$ -217 -60 -455 -46 310 -9 -280 -206 226 184 -141 -70 -264 125 -2 -470 -232 39 -6 -6 -159 320 50
6741E0k28L06j41L27n02J59l69m0N12L8j69kN0m1J99k44p7M89l18k23L38r1M61
$$ 50 -178 128 -13 314 -188 -29 -398 -438 74 112 -57 -59 -9 -50 149 -95 -172 317 -1 -224 114 23 484
6764D84k95q4k29N8j85M49j50Q3K16m16q3j20K11L00J17o41K39K49j82J13q1L2
$$ 484 189 105 -124 -66 -251 198 48 131 347 -69 -152 -272 -61 239 356 -285 -46 203 21 134 53 85
6786H5j3J37m36K43K94j75M9n40N63l1r2l67K27J15J89l96l2j3M62M4j20j36K9
$$ 85 72 209 -227 16 310 135 184 -356 207 176 84 -283 -56 59 248 -148 -180 -193 269 313 193 57 86
6809H6J89j19j18j75J10L73l81k76J39N36j31l08M05n1r3j21k24J44M66l21k09
$$ 86 275 156 38 -137 -27 346 -35 -311 -172 364 233 -75 330 279 186 65 -159 -15 451 130 -79
6830g9K01K1k10r2o8K02N9J09J40m45K29J11k01J20p8K03j92k19q6K69J16r6l93
$$ -79 122 143 -67 -159 -227 -25 34 143 283 -162 67 178 -23 97 19 222 30 -189 -275 -6 110 14 -379
6853c79K21M6K82r8k68K54K54m79J07j27K09J44l55l3j8J63n6J0o2qK30L46m64
$$ -379 -158 -112 170 72 -196 58 312 -167 -60 -187 22 166 -189 -222 -240 -77 -133 -123 -185 -193 37 383 -81
6876h1O7k20L16pl13m9N36j13m32J40K13P0n7l48K05LP7k36K85k09K82j54J85
$$ -81 -14 -234 82 75 -238 -287 249 136 -296 -156 57 127 70 -278 -73 -70 7 -229 56 -153 129 -25 160
6899A60j16k48r6K34j8n3J49K66j73k95K16L25j34m58N7L09K09m12l0K42M39n97
$$ 160 44 -204 -300 -66 -84 -137 12 278 105 -190 26 351 217 -241 -184 125 334 -78 -108 134 573 -24
6921b4k53M21Q9l9j92J0m8j63J69L86n4n17K37K57l83N7O8R%r3l7K53rk62k34
$$ -24 -277 144 233 194 2 12 -36 -199 -30 356 302 -215 22 279 -104 -47 21 30 30 -63 -100 153 144 -118 -352
6946c52Q81j33o44j33O07M2m90j76N14J73j74j51l50M05k6j08L73J43l41l20N02
$$ -352 529 396 -248 -381 226 268 -222 -398 116 289 115 -36 -386 19 -7 -115 258 401 60 -260 242
6967B42q2n34K41O29k64o70J61O77m9m58J70L7P7n43k0M56L01l21l96M32M2j96
$$ 242 160 -374 -133 496 232 -438 -277 400 351 -107 63 100 177 -366 -386 70 371 50 -346 86 128 -68
6989f8l38K05N21n27J55Q7K26n12J82J07L4l85K52K86j04m41l5O15r8k48l62N84
$$ -68 -406 -201 320 -207 -52 35 261 -251 -69 38 72 -313 -61 225 121 -320 -355 260 162 -86 -448 136
7011A36R1m29k59M54K80l90m0J48o9L00m19L14K05j71l65J31K85m17L45J32k46
$$ 136 227 -202 -461 -7 273 -117 -157 -9 -78 222 -197 117 322 151 -214 -83 202 -215 130 262 16
7032A6m90K83K21J33n75L18M94M7p33Q7O83j27k18m40L48M55m84m03K79O26m17
$$ 16 -474 -191 30 163 -412 -94 400 447 -286 -199 484 357 139 -301 47 502 18 -385 -106 520 103
7053A03m59J50J2M76p9N8P3k74q3J50L0j82j98O42l67j87j33K93J09j14l64M13
$$ 103 -356 -206 -194 282 203 261 334 60 -23 127 157 -25 -223 419 52 -135 -268 25 134 20 -344 69
7075F9K67o14m8M24K47l15k16j22M59l12K61k47K01J45l43k0L83k68l5N2K82n33
$$ 69 336 -278 -326 98 345 30 -186 -308 151 -161 100 -147 54 199 -144 -164 219 -49 -84 -32 250 -283
7097b83L0O63m04l2j04R0K73k33n62N26M92l34l10J28K63j53m05M71N4j95k78
$$ -283 -253 410 6 -26 -130 -40 233 0 -562 -36 456 122 -188 -60 203 50 -355 116 170 -25 -303
7118c03K85j72j24M43l48M64m80N6K45k33K87m20L41J91k39j97L82PJ1o01L98
$$ -303 -18 -190 -314 129 -219 245 -235 -179 66 -167 120 -300 41 232 -7 -204 178 185 196 -405 -7
7139gK8k6k4m0K08j14j14k13M18J29m17J63j82M17m92Q8J83q2K53Q7k57l04k0
$$ -7 21 -5 -29 -69 139 25 -89 -302 116 245 -172 -9 -191 226 -266 -178 5 -77 176 263 6 -298 -318
7162c18L15M21k36k84L07p2l65j73N47J74n34k91M47O43m61j88k8L01o7p7j45
$$ -318 -3 418 182 -102 205 133 -232 -405 142 316 -218 -509 -62 581 120 -68 -96 205 138 61 -84
7183h4L25j14j7r3J21j02j77K38K55k93J5j38M43l74o4k4O15l73o02N36L73j79
$$ -84 241 127 110 17 138 36 -141 97 352 59 74 -64 379 5 -59 -83 532 159 -443 93 466 287
7205B87l71O8J48j5j14J6rP2k7P7P7k34L8J33m88L82l02P39j34p23J86J79J73
$$ 287 -84 -16 132 117 3 19 10 82 55 132 209 -25 13 146 -342 40 -262 477 343 -380 -194 -15 158
7228A58j95j25K72j81ML2j54M4L25j37k51N51j95k35o1K61l0n7J96m49K06j8L17
$$ 158 -37 -162 110 -71 -67 -35 -189 -145 180 43 -208 343 148 -87 -148 113 83 26 222 -227 -21 -39 278
7251B78m13j24L29j31Q0l09J90O5mj15j17K08n8L3l70N35k65K73n66L81J70M15
$$ 278 -135 -259 70 -61 19 -290 -100 -35 -39 -154 -271 -63 -121 -88 -458 77 -188 85 -481 -100 70 485
7273D85l87l58J70L19k07j49J21J03j49J94p2Nq8P4Pj24k42J88J62J4k44P9K24
$$ 485 98 -260 -90 229 22 -127 -6 97 -52 142 70 75 -13 61 68 -56 -298 -110 52 66 -178 -99 125
7296A25j63N7L3M8J57o7l12K28r5L31n08j72K03L52N4m37K35J23K58o44j33J80
$$ 125 -38 19 52 100 257 190 -122 106 11 342 -166 -338 -135 217 271 -166 69 192 450 -194 -327 -147
7318a47K03p9m68K30M87r5K22o15m4M27j97N1k48L62k01K8j23J73p9L43m92M3
$$ -147 56 -23 -491 -261 226 131 353 -262 -306 121 -76 -25 -273 89 -112 -84 -207 -34 -113 230 -262 -219
7340b19L32K0j00P1l28L51O5J25n27l22O97P7k48j57K06n4l3k99K45J05J73l56
$$ -219 113 133 33 104 -224 127 192 317 -210 -532 165 242 -6 -163 43 -11 -44 -343 -98 7 180 -176
7362a76K24L6K58k41o6j04m2J15n2j49K49M10l67k51K64M8k62M4p8P6K72P6m37
$$ -176 48 84 342 101 35 -69 -111 4 -48 -197 52 462 95 -156 108 156 -106 -62 -140 -64 208 284 -153
7385a53j47L62j24J82l69M4K73N2j30r4K7J95J33n55M16k37N81l82j48Q0o5L04
$$ -153 -300 62 -62 120 -249 -205 68 120 -10 -104 -77 118 251 -304 112 -125 456 74 -74 6 -59 245
7407B45n09K77P6j21K14j83j59J05M8L9j6q2N9O9P6k26K33M5k55k59K02R3K58
$$ 245 -264 13 89 -32 182 -1 -160 -55 -7 32 16 -66 -7 62 138 -88 145 190 -65 -324 -122 -29 229
7430B29n26K87L45k3k53k50J01J11K6o0j42R6K90J07n32P7L04L5k23j14L61m08
$$ 229 -297 -10 335 312 59 -191 -90 21 47 -13 -155 -59 231 338 -194 -117 187 222 -1 -115 246 -162
7452a62N07n03q9L42M41o92MJ11J30k6m65L39K81j10Mn6J84Rp5j52J61l25K96
$$ -162 345 -158 -247 95 536 -156 -152 -41 89 63 -402 -63 218 108 112 56 240 249 174 22 183 -142 154
7475A54N2l15K05J26j25o19K97j28M04L56k89m72J96L32l95n5K05RK89j73k78
$$ 154 206 -109 96 222 97 -522 -225 -353 51 407 118 -354 -158 174 -221 -276 -71 -62 227 54 -224
7496b24L97k34j85K2K8K38k19K79N7J6k6k03K05k24K1K21m1m65K28R7J4l39L54
$$ -224 173 -61 -246 -224 -196 42 -177 102 159 175 149 -54 151 -73 -52 169 128 -337 -109 -12 2 -337 17
7519A7J45q2M9n21L12M62k75k12J07p2J60M3j73K11l71L73j30k05L0J39K89l40
$$ 17 162 80 129 -392 -80 382 107 -105 2 -70 90 133 -40 171 -200 173 43 -162 -132 7 296 -44
7541d4J6j06M38m07J36m00J90K74k85K2M93Ql45k79K97L32k51NQ2m35J5M9J12
$$ -44 -28 -134 304 -103 33 -367 -177 97 -188 -166 327 335 -10 -289 8 340 89 94 176 -259 -244 -195 -83
7564h3J12m65M05J97j60K58m01J77J5j23OK02jJ4l01L19j28n3k36L20L80m61m93
$$ -83 29 -436 -31 166 6 264 -137 40 55 -68 -62 140 139 153 -148 171 43 -10 -246 74 454 -7 -500
7587e00M25M46l32J08r7J67r9k12Q5r2k2K30P5l58J40k56M87p2k69J38K23O0m11
$$ -500 -75 371 39 147 50 217 118 -94 -9 -101 -123 107 182 -176 -36 -292 195 123 -146 -8 215 275 -136
7610a36q9K98J83k81l22J23J56l7j50J89Q4k79M0m5N72o2l43K8J90k92j4J39J75
$$ -136 -225 73 256 -25 -347 -224 -68 -105 -255 -66 18 -261 -221 -266 306 244 -99 -71 119 -173 -187 -48 127
7633A27k47o0p8M77n57J89Q2K43l62j13R4K74j08l23N57J58m33k99K03K23L6j58
$$ 127 -120 -180 -258 219 -338 -149 -67 176 -186 -299 -205 69 -39 -362 195 353 -80 -379 -176 47 83 -75
7655g5J91k1o0j9K41k43j7m7K06P2k48j19M69m36L5J01k53N75n35q5M71j98k15
$$ -75 116 95 35 16 257 14 -3 -50 156 228 -20 -139 330 -106 -71 30 -223 352 -183 -268 203 5 -210
7678b10o9J48n2K22l03N59j35j89n7L6j50L28k20J0l0L6PN4O6m36J29M21m4j44
$$ -210 -279 -131 -183 39 -264 295 160 -29 -86 -50 -200 128 -92 -82 -112 -76 -69 -15 51 -385 -256 165 121 -23
7702b3j01M93M3o58m13P66K31k89k03k44N23j70K8r7J77J59k59q2L21l63J32J39
$$ -23 -124 369 412 -246 -659 107 338 49 -154 -398 125 -45 -17 -114 63 222 -37 -119 202 -161 -29 110
7724A10l91J39k89M92K15j87o4n8M13l65k05L60K12l79k60K67J61k38j8O8M21
$$ 110 -281 -142 -431 61 276 89 25 -33 380 15 -190 170 382 3 -257 10 171 -67 -85 -17 404
7745D04p2l13O7L4n6n02M55L65j14o21M16No4M7N0J04j84r4PK85j79k50r6L70
$$ 404 332 19 86 120 64 -438 17 382 268 -353 63 68 4 51 101 205 21 -73 -66 219 40 -210 -306 64
7769F4M7o05L24J95K0k39M1O47m37l09L15k50M00l50k94N45j61L42j64O5m54N1
$$ 64 111 -494 -170 25 45 -194 -153 494 57 -252 63 -187 213 -137 -431 114 -47 295 131 196 -258 -207
7791b07K52O6j08j87O6K21R7l49K40l0K8q5l07K77q4r2K89No5k81R9L12p1k43
$$ -207 45 111 3 -184 -118 103 200 -149 91 61 89 4 -303 -26 -110 -202 87 92 27 -254 -155 157 86 -157
7815a57J92J85j30n1K06Q3j90j99Q1M95l68j39l8J45J28l36j1L70j24k80L32j01
$$ -157 35 220 90 39 245 328 138 -61 20 515 147 8 -30 115 243 -93 -104 266 142 -138 194 93
7837I3j02j16J45M5n5k26K60j30J49k78P4L77l06r4P6K91j49m81M61m3l5r5K26
$$ 93 -9 -125 20 65 10 -216 44 -86 63 -215 -141 236 -70 -164 -88 203 54 -427 34 -9 -44 -139 87
7860H7J07k59K3o2J18J57m23K5K34j9j4j47M57k63K1k51M90m32p3L66j22K52k15
$$ 87 194 -65 -42 -104 14 171 -252 -227 7 -12 -26 -173 284 21 42 -209 281 -151 -224 142 20 272 57
7883E7k63k07K73J63m4mPk3m7ON75o23k08K32J22l62K47J45j74J27k3J7P2k46
$$ 57 -206 -413 -140 23 -21 -25 -18 -41 -88 -82 493 -130 -338 -106 16 -346 -99 46 -128 -1 -24 -7 65 -181
7907a81o6M44j93N9P1k73m1L76m65O5J27J19k88M53j78k33J80K09m84M54k21J81
$$ -181 -247 197 4 63 134 -139 -180 196 -269 -204 -77 42 -246 207 29 -204 -24 185 -299 155 -66 115
7929A15j28N9k56M38j85K04m27R4L7J18p5k43J44J40M5l08L66k46J30K08k87j93
$$ 115 -13 46 -210 228 43 247 -180 -86 -49 69 -6 -249 -105 35 80 -228 138 -108 22 230 -57 -250
7951b50K67K49l7n66L66M3Q5o5j87L16K1J47o25J52J55j43r2J02L58k26J34k57
$$ -250 17 266 229 -337 29 72 157 92 -95 221 242 389 -236 -84 71 -72 -164 -62 296 70 204 -53
7973e3J02j68J23J09N0j30L01l38J62r6l94O33P3m66K33k21L69l54R3j72K74k35
$$ -53 49 -119 4 113 163 33 334 -4 158 62 -332 301 374 -92 141 -80 289 -65 28 -144 130 -105
7995a05k73O67k53M3n3k33J68Q5k17J14o8J00J73l4N0j73j53M9L1K14j23J13j30
$$ -105 -378 289 36 79 26 -207 -39 46 -171 -57 -125 -25 148 114 164 -9 -162 -113 -82 132 9 122 -8
8018h%Oj37O7K71m50M10j60J62p1R4o2j22N1k9J65j46k0k12O2J33l9LJ36j85j57
$$ -8 -8 -2 -139 -72 199 -251 159 -1 161 90 184 122 0 51 22 187 41 21 -191 -129 4 -35 -32 104 -81 -238
8044b38J17N3L8o7j31L21k00J42Oj17J39k01J35PJ46j20M5N9o9k17J58J56j50
$$ -238 -121 -68 -30 -97 -228 93 -107 35 41 -76 63 -138 -3 4 150 30 75 134 65 -152 6 162 12
8067A2J36k64J88R6l80K08k44K03J70l95L21j22J76k4K79l69n0J84m28L76K7q4
$$ 12 148 -116 72 168 -212 -4 -248 -45 125 -270 51 -71 105 81 360 -9 -59 125 -303 73 100 16
8089A6P3j25J35j98P5Lj19N0l0K39k21Q7n3J91j97J70K2p4j91L00k03O4J51j39
$$ 16 89 -36 99 -99 -24 -21 -140 -90 -120 119 -102 -15 -68 123 -74 96 118 44 -147 153 -50 14 165 26
8113B6M3l5j78O4Q3m6L82l40r1R5j63J73L1k07J88k06P1n4J72j32J06j36J65J53
$$ 26 69 34 -144 -80 3 -43 339 -1 -92 3 -160 13 44 -163 25 -181 -110 -164 8 -124 -18 -154 11 164
8137A64j58J79l56J67o9j10J24J64P0l21P1m8J57r9j66R6J18k2J8l6J74m5j13
$$ 164 6 185 -171 -4 -73 -183 -59 105 175 -146 -75 -123 34 -65 -231 -135 -17 -39 -21 -57 117 72 -41
8160d1L77l92n3J01j2j27J85p7K70k63R2K5N0k19K04m4P1j01l71J28K04P6o5R
$$ -41 336 -56 -109 -8 -20 -147 38 -39 231 -32 60 85 135 -84 120 76 147 46 -325 -197 7 83 18 27
8184B7N6q1j05l3L46k93M5
$$ 27 83 2 -103 -136 210 -83 -38
8191c8
$$ Imaginary data points
##PAGE= N=2
##DATA TABLE= (X++(I..I)), XYDATA
0@%%%qJ6j6J6k4M0m8N6p2Q8j10J37j66K01k38K80l31L90m57N29o09P02q05R18
$$ 0 0 0 0 -8 8 -8 8 -16 24 -24 32 -40 48 -62 75 -91 110 -128 152 -179 211 -246 283 -326 376 -429 489
27D89j043J185j342J510j699J907k134K383k654K954l283L644m039M473m954N486
$$ 489 -554 631 -711 799 -900 1007 -1127 1256 -1398 1556 -1727 1917 -2122 2351 -2603 2883
43B883o075O729p461Q285r226J0304j1548J3011j4762J6900j9577K3044k7737
$$ 2883 -3192 3537 -3924 4361 -4865 5439 -6109 6902 -7860 9040 -10537 12507 -15230
56a5230L4484m5069O4170j09265L97579L30437q89429j79198M93887K27042m39522
$$ -15230 19254 -25815 38355 -70910 326669 657106 -232323 -411521 82366 309408 -130114
67a30114j27966L48003J83155k84705j60468J20223J02959n1546L1296L8944p7069
$$ -130114 -258080 89923 273078 -11627 -172095 -51872 51087 -459 30837 69781 -7288
78g288p9495R4154O5886q4042n9982J08665O3610j03370j00098O7549R8634j2209
$$ -7288 -86783 7371 73257 -10785 -70767 37898 101508 -1862 -101960 -34411 64223 52014
90E2014p3130j0356M1153J2104n0899l6900M7141P6722j5960q0547k714P6218
$$ 52014 -21116 -31472 9681 21785 -29114 -66014 -18873 57849 41889 -38658 -41372 34846
102C4846J1748o5028r460N1412p651n0142J7661M7166k6074l6019M1825K5472
$$ 34846 46594 -18434 -27894 23518 15867 -34275 -16614 30552 4478 -31541 10284 35756
114C5756o7066k9213Q2707L3991q9630l0723J02450L5552j06834m0480J05022
$$ 35756 -31310 -60523 22184 56175 -33455 -64178 38272 73824 -33010 -73490 31532
125C1532L9673j04457m1763R6562M0391q7644l7182P6462L0683o2652k0697N0682
$$ 31532 71205 -33252 -75015 21547 61938 -25706 -62888 13574 44257 -18395 -39092 11590
137A1590N542m3482R649M6399j5519m4457K2726M3867k9130n1119K5907N2951
$$ 11590 17132 -26350 -16701 29698 14179 -30278 -7552 36315 7185 -43934 -18027 34924
149C4924j8726n0520J5867N4830o738n9805j7733M7460L6724j8464l1616M438
$$ 34924 16198 -34322 -18455 36375 29637 -30168 -47901 -441 36283 17819 -13797 -9359
161i359K0360n846k1397M901K6191O358j9855j1282M752L215P452J6480j907l0180
$$ -9359 11001 5155 -16242 -11341 14850 21208 1353 -9929 -5177 -1962 5490 21970 20063 -10117
175a0117j2209K7368J2571k9810q587M1533J7074m9461l2088M0159L5209k9258
$$ -10117 -22326 5042 17613 -12197 -20784 20749 37823 -11638 -43726 -3567 31642 2384
187B384k5143L5466K5899m0165l6028K8736L5221j5928k1863J5134J3111k0060
$$ 2384 -22759 12707 38606 -1559 -37587 -8851 26370 10442 -11421 3713 16824 -3236
199c236j3733J8780J5757r776p473L150j0704j6759J1202K8336j381k4427Q28
$$ -3236 -16969 1811 17568 7792 319 3469 -7235 -23994 -12792 15544 14163 -10264 -9436
212i436K5984j068l0965k428L8393J5772l6764k8702K3794K8063j8852k7872J8081
$$ -9436 16548 15480 -15485 -17913 20480 36252 -512 -29214 -5420 22643 3791 -24081 -6000
225f000L4656j1112l9939n279L1403J5583j4555j3408J993L948n47j710l127N005
$$ -6000 28656 17544 -22395 -27674 3729 19312 4757 -8651 -6658 -2710 -3257 -4967 -8094 -3089
239c089J9262Q516k6483k9666J7171L9296m543m1518o286L8636J2185l7187k0846
$$ -3089 16173 24689 -1794 -31460 -14289 25007 20464 -21054 -27340 11296 23481 -13706 -34552
252c4552L3057L3246j9521l7359Q51L2521J3193j9607j7112R686J9617l134k4829
$$ -34552 -1495 31751 12230 -25129 -24278 8243 21436 1829 -15283 -5597 14020 10886 -13943
265a3943j3394K0366K8390k349k9357j2779K1913J9931j5518k4741J1007L3578
$$ -13943 -27337 -6971 21419 19070 -10287 -23066 -1153 18778 3260 -21481 -10474 23104
277B3104o45l9463j6807L5505L2689k1651l9456N105L4748L504k8643o863K7345
$$ 23104 22459 -17004 -33811 1694 34383 12732 -26724 -21619 13129 16633 -12010 -18873 8472
290H472J3291k2660k3843J0891K6654P625j5965j6604L981J7923M008j8514j1978
$$ 8472 21763 -897 -24740 -13849 12805 20430 4465 -12139 -8158 9765 13773 -4741 -16719
303a6719J8271K0193j5007k8251P654L4347M448l1183j4713K0672J4904j3818
$$ -16719 1552 21745 6738 -21513 -13859 20488 24936 -6247 -20960 -288 14616 798
315G98j4867J0670J7000j148j4668p906O354J4340N659j2350j4301N318J5840
$$ 798 -14069 -3399 13601 12453 -2215 -10121 -3767 10573 16232 3882 -10419 -5101 10739
328A0739j414j6838j041J9469M788k2567j3216J9098K2104p405k3576m112J7227
$$ 10739 9325 -7513 -8554 10915 15703 -6864 -20080 -982 21122 13717 -9859 -13971 3256
341C256P134j2677j0460R767J5539l832j5053p25J5171O855j2085j0990M258R955
$$ 3256 10390 -2287 -12747 -2980 12559 8727 -6326 -7051 8120 14975 2890 -8100 -3842 6113
355F113J09p931n707J370O899L206o615p433N298J2002j523j3149K34J6419L207
$$ 6113 6222 -1709 -7416 -6046 853 4059 -2556 -9989 -4691 7311 5788 -7361 -7127 9292 12499
370A2499j8151j0764J3585J3663o744j1343M309R371j894q420j926M749L662j556
$$ 12499 -5652 -16416 -2831 10832 4088 -7255 -2946 6425 4531 -3889 -5815 -1066 2596 1040
384A040n141m320K708P256K050o704l129O808N464o837q242O223J2375j119j3562
$$ 1040 -4101 -8421 -5713 1543 3593 -3111 -6240 568 6032 -805 -9047 -2824 9551 8432 -5130
399e130n213Q427N525o855l365Q549O432q500j0370M246J1135K077o867l029K86
$$ -5130 -10343 -1916 3609 -3246 -6611 1938 8370 -130 -10500 -6254 4881 6958 91 -2938 -2652
414b652j261Q08M941K371k526j721l61m709k921Q566J0827m632j4051J09J1736
$$ -2652 -3913 -3105 1836 4207 1681 -40 -401 -5110 -8031 535 11362 6730 -7321 -7212 4524
429D524L38j0444J339J4234J343j6580p705J2841J1875o364r716L240O525n378
$$ 4524 4862 -5582 -4243 9991 11334 -5246 -12951 -110 11765 5401 -4315 -1075 5450 72
443G2r213K912J2342N340p245j0309k184N889O813K368l429k770J298j20m884
$$ 72 -9141 -6229 6113 11453 4208 -6101 -8285 -2396 4417 6785 3356 586 1884 1764 -3120
458c120j795J0315J0973q411j9956l012J7295J0554j1253j0068Q360P934j1371
$$ -3120 -4915 5400 16373 7962 -11994 -15006 2289 12843 1590 -8478 -118 7816 -3555
471c555j1668J2075K0899k903j9399o526J1616P289n564l799L823K515m428n321
$$ -3555 -15223 -3148 17751 14848 -4551 -11077 539 7828 2264 -1535 2288 4803 375 -4946
485d946q68N279R006L214j0098j2650K458J2736J387j1998k39J4754K826j9016
$$ -4946 -5814 -535 8471 11685 1587 -11063 -8605 4131 5518 -6480 -6719 8035 10861 -8155
499h155j0699J8223K0167q339j9807O82J2972p07j1822J473J2973K931j3241j0655
$$ -8155 -18854 -631 19536 11197 -8610 -7928 5044 4337 -7485 -6012 6961 9892 -3349 -14004
513a4004M340J1180O720j921p968n718L519N086l220n186O296J1215m986j7802
$$ -14004 -9664 1516 8236 6315 -1653 -7371 -3852 1234 -1986 -7172 -876 10339 5353 -12449
527a2449j358J9420J0279j4829j3164J0481J2368r633j5442P467J8380j474j8081
$$ -12449 -13807 5613 15892 1063 -12101 -1620 10748 1115 -14327 -6860 11520 10046 -8035
540h035n812J2244P020n988k664O787J760p468m470L489L925M63J685j294p925
$$ -8035 -13847 -1603 5417 -571 -3235 3552 5312 -2156 -6626 -3137 788 1251 2936 1642 -6283
555f283k806J1157R188q992j1888O062J1577p295j1992R945J6912q012k1460J532
$$ -6283 -9089 2068 11256 2264 -9624 -3562 8015 720 -11272 -1327 15585 7573 -13887 -12355
569a2355K0869L922j6052m409J2046J694j0683o22J1280K328q761k807L577o66
$$ -12355 8514 12436 -3616 -8025 4021 5715 -4968 -5590 5690 8018 -743 -3550 27 -639
583f39m3Q408K500j1291p133R719O754r825o183J2595R256j2756j4560P657J4609
$$ -639 -682 7726 10226 -1065 -8198 1521 8275 -1550 -7733 4862 14118 1362 -13198 -5541 9068
598I068k532j0820J204P535k178r077J018J0657M947n354o450p39J631L26K917
$$ 9068 6536 -4284 -3080 4455 2277 -6800 -5782 4875 9822 4468 -1982 -2721 -1090 -764 2153
613B153M555j183o566l467K907p1l091N069Q969m710j4104R62J5218P92j5138
$$ 2153 6708 5525 -1041 -4508 -1601 -1672 -4763 306 9275 4565 -9539 -8577 6641 7433 -7705
628g705O42J8666K33k2859m470K2088P543j8921n612J8133M061j9719p323J6898
$$ -7705 -7063 11603 11836 -11023 -15493 6595 14138 -4783 -10395 7738 11799 -7920 -15243 1655
642A655Q029j0205l437P078m634j1565O289J3424m078j0247Q106R387j3758j3655
$$ 1655 9684 -521 -3958 3120 -1514 -13079 -6790 6634 2556 -7691 415 9802 -3956 -17611
656a7611J4345J9951r926k0485N658J7166n153j7735L531J9766L971j5926r033
$$ -17611 -3266 16685 6759 -13726 -8068 9098 3945 -13790 -10259 9507 13478 -2448 -11481
669a1481O888P167k332m185M130N136k429p858m936K416Q415Q918K17j1074r390
$$ -11481 -4593 2574 242 -3943 187 5323 2894 -4964 -9900 -7484 931 9849 10066 -1008 -10398
684a0398M901J0832k180r278N818J5732p372k5886k320K8555J3660k2363j4630
$$ -10398 -5497 5335 3155 -6123 -305 15427 8055 -17831 -20151 8404 22064 -299 -14929
697a4929J7184J2031j8623j4671J8195J9150j0221j6712L376P553m195j821R482
$$ -14929 2255 14286 -4337 -19008 -813 18337 8116 -8596 -5220 2333 -1862 -3683 5799
710E799J987p416J66N197r124r512J4285J9752j0362k4885M401K2259l927k2443
$$ 5799 7786 370 536 5733 -3391 -12903 1382 21134 10772 -14113 -9712 12547 8620 -13823
724a3823M806K7456J540k8936j2255K1548J5053j2353j1526J0425J1010q447j4264
$$ -13823 -9017 18439 19979 -8957 -21212 336 15389 3036 -8490 1935 12945 4498 -9766
737i766R71J0826P073j04n368p725l410O659O355n429n106J0552J0031j5928k3364
$$ -9766 -8795 2031 9104 9000 3632 -4093 -7503 -844 5511 82 -5024 5528 15559 -369 -23733
752b3733Q391L0938M766k7085j0918K1175R400k1032j1796K3354K1579j6459k5110
$$ -23733 -15342 15596 20362 -6723 -17641 3534 12934 -8098 -19894 3460 25039 8580 -16530
765a6530L343J7332K247q811O68O229j497n427k859j814J469J1058Q020j1509
$$ -16530 -13187 4145 6392 -2419 -1751 4478 2981 -2446 -5305 -7119 -5650 5408 13428 1919
779A919j6946M409J7245j300j6384L364K0909L15k5719j0664K2146J8640j1956
$$ 1919 -15027 -10618 6627 5327 -11057 -7693 13216 13531 -12188 -22852 -706 17934 5978
792E978j6329O779J1211q500j3573O989J6108N28j2170m208K958O89J603N045
$$ 5978 -10351 -3572 7639 -861 -14434 -7445 8663 9191 -2979 -7187 -4229 -3540 -1937 3108
806C108o84o490K339Q040n615j4936N884K2036P59k3006o254K1188Q122k0235
$$ 3108 2424 -4066 -1727 6313 698 -14238 -8354 13682 14441 -8565 -14819 6369 14491 -5744
820e744r410K0700J4590j7102j8599Q309J5049k904r013K976O524j790m955j187
$$ -5744 -15154 5546 20136 3034 -15565 -7256 7793 4889 -4124 -1148 5376 3586 -1369 -2556
834b556m75O44P127N303p894j0096M519J1484l475j2557L987J7655J154k2279
$$ -2556 -3031 -2387 4740 10043 2149 -7947 -3428 8056 4581 -7976 -3989 13666 14820 -7459
848g459j1088J7669J8553r110j7257M379J4420n858j7788L152K1656O660j6413
$$ -7459 -18547 -878 17675 8565 -8692 -4313 10107 4249 -13539 -10387 11269 17929 1516
861A516j2190N050P495L26l49K490j112j504M1m346n824O860J6221j945k0462
$$ 1516 -10674 -5624 1871 2197 1848 4338 3226 1722 1763 -2583 -8407 -1547 14674 12729 -7733
876g733p240J7936Q935j5312q672J7388J2350j8012j9285R730K0130l36j3250
$$ -7733 -14973 2963 11898 -3414 -12086 5302 17652 -360 -19645 -9915 10215 9879 -3371
889c371q58P510j329p510j731P083O247J038n851r809j673J1749Q976q843j1550
$$ -3371 -4229 3281 1952 -5558 -7289 -206 6041 7079 1228 -8581 -10254 1495 10471 1628 -9922
904i922N547J1560n278j5517L581J9465M342j9535j1505J4131J5169q467j5397
$$ -9922 -4375 7185 1907 -13610 -10029 9436 13778 -5757 -17262 -3131 12038 3571 -11826
917a1826M391J6673Q5j6279n813J2569R553p471j0253L353R419L98o959m461L303
$$ -11826 -7435 9238 9323 -6956 -12769 -200 9353 1882 -8371 -5018 4401 4799 -2160 -6621 -3318
932c318O689K270p160q405N296J3583j128j6278m264J7464J0359j5633j5066J1645
$$ -3318 3371 5641 -1519 -9924 -4628 8955 7827 -8451 -12715 4749 15108 -525 -15591 -3946
946c946J7961o334j7844K036J7468K522j6444q194J1327J1437k067j0669l986
$$ -3946 14015 7681 -10163 -8127 9341 11863 -4581 -12775 -1448 9989 7922 -2747 -6733
959f733N260O908k198p153m07R239M223j0824r694R531J5084k341j6456m633J4112
$$ -6733 -1473 5435 3237 -3916 -4323 4916 9139 -1685 -11379 -1848 13236 10895 -5561 -10194 3918
974C918Q582j1027j0791P976J3210m063j5708j782J4082P657j0492j0774N119
$$ 3918 12500 1473 -9318 -1342 11868 7805 -7903 -9685 4397 12054 1562 -9212 -4093
987d093J1758j22j0623m512Q125Q970l781j1058k408J0541Q377p464j2103L442
$$ -4093 7665 7543 -3080 -7592 533 9503 5722 -5336 -7744 2797 11174 3710 -8393 -4951
1001d951J3894P31j5303n117J3835J0300j0691j4513M810J4667J281j2907o051
$$ -4951 8943 9674 -5629 -10746 3089 13389 2698 -11815 -7005 7662 8943 -3964 -10015
1014a0015Q472Q461l360r209m59Q706M222p290q827L316J1892K384j1465p690
$$ -10015 -1543 6918 3558 -5651 -6110 2596 6818 -472 -9299 -5983 5909 8293 -3172 -10862
1028a0862Q252J1133l808j2161r36J1128M961j0613q662P453J1958k536j2807
$$ -10862 -2610 8523 4715 -7446 -8382 2746 7707 -2906 -11568 -4115 7843 5307 -7500
1041g500k469J0923O814q100q614M637J0385k56j0208m536P304Q346k320r072
$$ -7500 -9969 954 7768 -332 -8946 -4309 6076 5820 -4388 -8924 -1620 6726 4406 -4666
1055d666j912Q101M611o926p621N035J0711j387j2869m048J1783R487p141j1029
$$ -4666 -6578 1523 6134 -792 -8413 -3378 7333 5946 -6923 -10971 812 10299 3158 -7871
1069g871K438R462Q44q315k966Q079O170m721r500M2R800N829p122r400K998J0619
$$ -7871 -5433 4029 4873 -3442 -6408 1671 7841 3120 -6380 -6338 3462 9291 2169 -7231 -4233 6386
1085F386o8r568l574R574O564p819r940M259J1232P79r923m154P789O822n102
$$ 6386 6318 -3250 -6824 2750 9314 1495 -8445 -4186 7046 7825 -2098 -6252 1537 8359 3257
1100C257q528J715Q899L023p318o270M433Q467j925q183k038P175L738o096o488
$$ 3257 -5271 -3556 5343 8366 1048 -5222 -789 7678 5753 -2430 -4468 2707 6445 349 -6139
1115f139L872Q505N42q917n122O330Q266l176r100J3R309L158q912o376P197R370
$$ -6139 -2267 6238 6780 -2137 -7259 -929 7337 4161 -4939 -4926 4383 7541 -1371 -7747 -550 8820
1131H820l831j1234o5J0119L573q531o682N567P710k016q856k020Q107N819n119
$$ 8820 4989 -6245 -6310 3809 7382 -1149 -7831 -2264 5446 3430 -5426 -7446 661 6480 1361
1146A361p690K021Q615R48r370m158Q461Q293n890j0447J643J0700K042r233n315
$$ 1361 -6329 -4308 4307 5255 -4115 -8273 188 8481 2591 -7856 -6213 4487 6529 -2704 -8019
1161h019O574O729m532p707J106R271K140p927n452M541P215n81p642k291O353
$$ -8019 -1445 5284 752 -6955 -5849 3422 5562 -2365 -7817 -3276 3939 3358 -4284 -6575 -222
1176b22N637m849p733J594R207K381q188n087O412Q020m273r933P76J0554L454
$$ -222 5415 566 -7167 -5573 3634 6015 -2173 -7260 -848 7172 2899 -7034 -6258 4296 7750
1191G750r784p662O635J0369k014r688k134Q930M214p965o882O755R831j296j0537
$$ 7750 -2034 -9696 -3061 7308 5294 -4394 -6528 2402 6616 -1349 -8231 -1476 8355 7059 -3478
1206c478l271P775O452l337p225K28N676K239n151n499L679Q747K82j0170n667
$$ -3478 -6749 1026 7478 4141 -3084 -2856 2820 5059 -92 -5591 -1912 6835 7117 -3053 -8720
1221h720Q122R105m783j0103K683J0874k49j1593l316J0516P285o339q475J504
$$ -8720 -598 8507 3724 -6379 -3696 7178 6929 -4664 -7980 2536 9821 3482 -4993 -3489
1235c489P309J232m593l550K863M618q94o530k033O453O567l788r818l71R288
$$ -3489 3820 5052 459 -3091 -228 4390 3496 -3034 -5067 1386 7953 4165 -5653 -6024 3264
1250C264M443p632o609N194P757k995q266L83R305L566r449p272N804R711j669
$$ 3264 7707 75 -6534 -1340 6417 3422 -4844 -4461 4844 8410 -1039 -8311 -2507 7204 5535
1265E535q967j735O055K432n170l178L959M531j150n124k613J907N893K172n198
$$ 5535 -3432 -5167 888 3320 -1850 -5028 -1069 3462 2312 -2812 -5425 -3518 2375 4547 -651
1280f51m663L635O471l276q037K314J1687O94j3118o230R575Q259n769p163N008
$$ -651 -5314 -1679 4792 1516 -6521 -4207 7480 8174 -4944 -11174 -1599 6660 891 -6272 -1264
1295a264O467m942p904K229Q244K603l800m030k152P53L787L244j842l046K201
$$ -1264 5203 261 -7643 -5414 2830 5433 1633 -2397 -4549 -3796 -9 3235 1393 -1653 548
1310E48K062n428n165N706J0651k096j1636k978R135L629o920k635Q661M930q578
$$ 548 2610 -2818 -7983 -2277 8374 6278 -5358 -8336 799 4428 -2492 -5127 3534 8464 -114
1325a14q585M607Q182n59n101N10L274k114m001J340M631J166l89m83k635l729
$$ -114 -8699 -4092 4090 3531 -1570 -1060 2214 100 -3901 -2561 2070 3236 2847 2364 -271 -4000
1341d000J796O733M70n804r03N342o0p788j079Q932M129p787o683O212O396n511
$$ -4000 -2204 4529 4999 -805 -1708 3634 3574 -4214 -5293 3639 7768 -19 -6702 -490 5906 395
1357C95o177M884Q256k544p764O14N355o53m350J562M967o55m921j416J726l85
$$ 395 -5782 -898 7358 4814 -2950 -2336 3019 2366 -1984 -422 4545 3890 -1031 -2447 -721 -1106
1373a106P85L729O96n626k940N112J978n052p66R211K861j1621o931R476Q786
$$ -1106 -321 3408 4104 -1522 -4462 650 2628 -2424 -3190 6021 8882 -2739 -9670 -194 8592
1388H592p319p764P465P647q239j0594N341J1141j095o614N43K653l835k894L985
$$ 8592 1273 -6491 974 8621 382 -10212 -4871 6270 5175 -1439 -896 1757 -2078 -4972 -987
1403i87L997j299j170J543l779o761L357J0738J801r533m049O286K667p470k388
$$ -987 3010 1711 541 2084 -1695 -8456 -5099 5639 7440 -2093 -6142 144 2811 -4659 -7047
1418g047J0301P551q586j1727K351J0382R73p280k92P452m7q846m537P522O548
$$ -7047 3254 10805 2219 -9508 -7157 3225 4198 -3082 -3374 4078 4031 -4815 -9352 -1830 4718
1433D718k039l197M05j379k384J853M006q34j791M222J006r230n998J0178J1019
$$ 4718 2679 -518 -113 -1492 -3876 -2023 1983 1149 -642 3580 4586 -4644 -10642 -464 10555
1448A0555p103j1530M805J0225o283j1373O160J4465k434j2704n81Q489L3o433
$$ 10555 3452 -8078 -3273 6952 669 -10704 -4544 9921 7487 -5217 -5798 2691 2724 -3709
1462c709K160O166j478m321J110r3m335J697Q799J450r736l135P233K077q286
$$ -3709 -1549 4617 3139 -1182 -72 -165 -4500 -2803 5996 7446 -2290 -5425 1808 3885 -4401
1477d401j204J1772N649j1565j0795N899J0857j059p152J128N838j778q165j425
$$ -4401 -5605 6167 11816 251 -10544 -4645 6212 5153 -1999 -871 4967 3189 -4976 -6401
1491f401P830N494k907m522l15J45n91J519L101n77k030J132M39n447m065P321
$$ -6401 1429 6923 4016 -506 -821 -676 -1267 252 3353 2776 746 1878 2317 -3130 -7195 126
1507A26Q948m551j1194K007R740l174j0053N083J3407k382j3601k495J0628K792
$$ 126 9074 4523 -6671 -4664 5076 1902 -8151 -3068 10339 7957 -5644 -8139 2489 5281
1521E281o696l86O281p81p600o29M670M69j806L121J270o266l132O441L632n723
$$ 5281 -1415 -1801 4480 3699 -3901 -4530 140 609 -1197 1924 3194 -3072 -6204 237 3869 -1854
1537a854k809P427M067q861p029O990Q715l820p300K450O245l131p586J380Q169
$$ -1854 -4663 2764 6831 -2030 -9059 -2069 6646 2826 -4474 -2024 4221 1090 -6496 -5116 3053
1552C053K164n774l956K888K080j762n62K131J967j788j725m47m74j11L439J916
$$ 3053 5217 -557 -4513 -1625 455 -1307 -1869 262 2229 441 -1284 -1731 -2205 -2316 1123 3039
1568C039l396l615L454L574m622m735N947P834l750j0074N97Q378P38o683N49
$$ 3039 -357 -3972 -518 3056 -1566 -6301 -354 7480 3730 -6344 -5747 2631 3369 -3314 -2765
1583b765P732j29q532l278N785N412j566k942n73l73j40J082J352m90O02K267
$$ -2765 4967 4838 -3694 -6972 -1187 4225 2659 -283 -856 -1229 -1369 -287 1065 575 1177 3444
1599C444j452n781n24O787L843n403n575M152N580l703o734K945Q519K54r267
$$ 3444 1992 -3789 -4313 2474 6317 914 -4661 -509 5071 1368 -5366 -2421 6098 6352 -2915
1614b915l018P033M303n004m106M504M758l186n651L28M299K329j042k297k747
$$ -2915 -5933 1100 5403 399 -3707 797 5555 2369 -3282 -2954 1345 3674 2632 335 -2412
1629b412J282L624J09m306j678O339K760o323o107N017P736l066p831Q98Q339
$$ -2412 -1130 2494 2603 -1703 -3381 2958 5718 -605 -6712 -1695 6041 2975 -4856 -3958 4381
1644D381P37p591l065N980N201k192n926q37M512K184l354l608K065N195L15o780
$$ 4381 5118 -2473 -5538 442 5643 3451 -2475 -3312 1200 3384 30 -3578 -1513 3682 3997 -2783
1660b783l661N592O046k572o588j047O210K675m753m302L360O531p32p658j828
$$ -2783 -6444 -852 5194 2622 -3966 -5013 1197 3872 -881 -5183 -1823 4708 3976 -3682 -5510
1675e510O565N039n555o556L163O836p52p527j302N898L894l369n092Q96M065
$$ -5510 1055 6094 539 -6017 -2854 3982 3230 -4297 -5599 299 4193 824 -4268 -3372 693
1690F93K342l739l634J846N690P81o715m155P083P051m973q273J225Q611P69p468
$$ 693 3035 -704 -4338 -2492 3198 3979 -2736 -6891 192 7243 2270 -6003 -4778 3833 4602 -2866
$$ [...]
8191a38
##END NTUPLES=NMR FID
##END=
