##TITLE=1H_ABT-OOH(fad)-f10-13-mat
 CDCl3
 8 sc, 
 27.4.2024
##JCAMPDX= 6.0         $$ Bruker NMR JCAMP-DX V2.0
##DATA TYPE= NMR FID
##DATA CLASS= NTUPLES
##ORIGIN= UXNMR, Bruker Analytische Messtechnik GmbH
##OWNER= root
$$ XWIN-NMR		Version 3.5
$$ Sat Apr 27 14:02:33 2024 Russian Standard Time (UT+4h)  she@DPX200
##.OBSERVE FREQUENCY= 200.1309
##.OBSERVE NUCLEUS= ^1H
##.DELAY= (6, 6)
##.ACQUISITION MODE= SIMULTANEOUS
##.ACQUISITION SCHEME= undefined
##.AVERAGES= 8
##.DIGITISER RES= 18
##SPECTROMETER/DATA SYSTEM= spect
##.PULSE SEQUENCE= zg30
##.SOLVENT NAME= CDCl3
##.SHIFT REFERENCE= (INTERNAL, CDCl3, 0, 15.7039)
##AUDIT TRAIL= $$ (NUMBER, WHEN, WHO, WHERE, WHAT)
$$ ##TITLE= Audit trail, XWIN-NMR		Version 3.5
$$ ##JCAMPDX= 5.01
$$ ##ORIGIN= Bruker BioSpin GmbH
$$ ##OWNER= she
$$ F:/spectra/data/she/nmr/H-F/1/audita.txt
$$ ##AUDIT TRAIL=  $$ (NUMBER, WHEN, WHO, WHERE, WHAT)
(   1,<2024-04-27 14:01:09.95 +0400>,<she>,<DPX200>,
      <created by zg, POWCHK disabled, PULCHK disabled
       configuration hash MD5:
       00 E9 B6 7A A2 85 ED C7 34 08 36 98 17 FE 4E 26
       data hash MD5: 16K
       E7 A5 98 19 4F AB A0 7F 4D D6 5C DC F8 44 9A 23>)
$$ ##END=
$$ 
$$ hash MD5
$$ 1C 45 A2 49 50 84 BA 64 D6 FE 81 1E CF B4 42 57
##$RELAX= 
##$RELAX= 
##$RELAX= 
##$RELAX= 
##$RELAX= 
##$RELAX= 
$$ Bruker specific parameters
$$ --------------------------
##$DU= <F:/spectra>
##$EXPNO= 1
##$NAME= <H-F>
##$PROCNO= 1
##$TYPE= <nmr>
##$USER= <she>
##$AMP= (0..31)
100 100 100 100 100 100 100 100 100 100 100 100 100 100 100 100 100 100 
100 100 100 100 100 100 100 100 100 100 100 100 100 100 
##$AQSEQ= 0
##$AQ_mod= 1
##$AUNM= <au_zg>
##$AUTOPOS= <>
##$BF1= 200.13
##$BF2= 200.13
##$BF3= 200.13
##$BF4= 200.13
##$BF5= 200.13
##$BF6= 200.13
##$BF7= 200.13
##$BF8= 200.13
##$BYTORDA= 1
##$CFDGTYP= 0
##$CFRGTYP= 5
##$CHEMSTR= <none>
##$CNST= (0..31)
1 1 145 1 1 1 1 1 1 1 1 1 1 1 1 1 1 1 1 1 1 1 1 1 1 1 1 1 1 1 1 1 
##$CPDPRG= <>
##$CPDPRG1= <>
##$CPDPRG2= <>
##$CPDPRG3= <>
##$CPDPRG4= <mlev>
##$CPDPRG5= <mlev>
##$CPDPRG6= <mlev>
##$CPDPRG7= <mlev>
##$CPDPRG8= <mlev>
##$CPDPRGB= <>
##$CPDPRGT= <>
##$D= (0..31)
0 1.2 0 0 0 0 0 0 0 0.06 0 0.03 0 0 0 0 0.0002 0 0 0 0 0 0 0 0 0 0 0 0 
0 0 0 
##$DATE= 1714212069
##$DBL= (0..7)
120 120 120 120 120 120 120 120 
##$DBP= (0..7)
150 150 150 150 150 150 150 150 
##$DBP07= 0
##$DBPNAM0= <>
##$DBPNAM1= <>
##$DBPNAM2= <>
##$DBPNAM3= <>
##$DBPNAM4= <>
##$DBPNAM5= <>
##$DBPNAM6= <>
##$DBPNAM7= <>
##$DBPOAL= (0..7)
0.5 0.5 0.5 0.5 0.5 0.5 0.5 0.5 
##$DBPOFFS= (0..7)
0 0 0 0 0 0 0 0 
##$DE= 6
##$DECBNUC= <off>
##$DECIM= 32
##$DECNUC= <off>
##$DECSTAT= 4
##$DIGMOD= 1
##$DIGTYP= 9
##$DL= (0..7)
0 120 120 120 120 120 120 120 
##$DP= (0..7)
150 150 150 150 150 150 150 150 
##$DP07= 0
##$DPNAME0= <>
##$DPNAME1= <>
##$DPNAME2= <>
##$DPNAME3= <>
##$DPNAME4= <>
##$DPNAME5= <>
##$DPNAME6= <>
##$DPNAME7= <>
##$DPOAL= (0..7)
0.5 0.5 0.5 0.5 0.5 0.5 0.5 0.5 
##$DPOFFS= (0..7)
0 0 0 0 0 0 0 0 
##$DQDMODE= 0
##$DR= 18
##$DS= 0
$$ [...]
##$SUBNAM2= <"">
##$SUBNAM3= <"">
##$SUBNAM4= <"">
##$SUBNAM5= <"">
##$SUBNAM6= <"">
##$SUBNAM7= <"">
##$SUBNAM8= <"">
##$SUBNAM9= <"">
##$SW= 18.0517689322627
##$SWIBOX= (0..15)
0 0 2 0 0 0 0 0 0 0 0 0 0 0 0 0 
##$SW_h= 3612.71676300578
##$TD= 16384
##$TD0= 1
##$TE= 0
##$TE2= 300
##$TE3= 300
##$TEG= 300
##$TL= (0..7)
0 120 120 120 120 120 120 120 
##$TP= (0..7)
150 150 150 150 150 150 150 150 
##$TP07= 0
##$TPNAME0= <>
##$TPNAME1= <>
##$TPNAME2= <>
##$TPNAME3= <>
##$TPNAME4= <>
##$TPNAME5= <>
##$TPNAME6= <>
##$TPNAME7= <>
##$TPOAL= (0..7)
0.5 0.5 0.5 0.5 0.5 0.5 0.5 0.5 
##$TPOFFS= (0..7)
0 0 0 0 0 0 0 0 
##$TUNHIN= 0
##$TUNHOUT= 0
##$TUNXOUT= 0
##$USERA1= <user>
##$USERA2= <user>
##$USERA3= <user>
##$USERA4= <user>
##$USERA5= <user>
##$V9= 5
##$VALIST= <valist>
##$VCLIST= <CCCCCCCCCCCCCCC>
##$VD= 0
##$VDLIST= <DDDDDDDDDDDDDDD>
##$VPLIST= <PPPPPPPPPPPPPPP>
##$VTLIST= <TTTTTTTTTTTTTTT>
##$WBST= 1024
##$WBSW= 4
##$XGAIN= (0..3)
0 0 0 0 
##$XL= 0
##$YL= 0
##$YMAX_a= 47729
##$YMIN_a= -82100
##$ZGOPTNS= <>
##$ZL1= 120
##$ZL2= 120
##$ZL3= 120
##$ZL4= 120
##$ABSF1= 10
##$ABSF2= 0
##$ABSG= 5
##$ABSL= 3
##$ALPHA= 0
##$AQORDER= 0
##$ASSFAC= 0
##$ASSFACI= 0
##$ASSFACX= 0
##$ASSWID= 0
##$AUNMP= <proc_1d>
##$AZFE= 0.1
##$AZFW= 0.1
##$BCFW= 1
##$BC_mod= 2
##$BYTORDP= 1
##$COROFFS= 0
##$CY= 11.3945322036743
##$DATMOD= 1
##$DC= 2
##$DFILT= <>
##$DTYPP= 0
##$F1P= 15.6554695791079
##$F2P= 12.8336369535428
##$FCOR= 0.5
##$FTSIZE= 0
##$FT_mod= 4
##$GAMMA= 1
##$GB= 0.15
##$INTBC= 1
##$INTSCL= 1
##$ISEN= 128
##$LB= 0.24
##$LEV0= 0
##$LPBIN= 0
##$MAXI= 10000
##$MC2= 0
##$MEAN= 0
##$ME_mod= 0
##$MI= 1.114404
##$NCOEF= 0
##$NC_proc= 0
##$NLEV= 6
##$NOISF1= 3.799351
##$NOISF2= 2.8
##$NSP= 1
##$NTH_PI= 0
##$NZP= 0
##$OFFSET= 15.70392
##$PC= 1
##$PHC0= -25306.14
##$PHC1= 15.58731
##$PH_mod= 1
##$PKNL= yes
##$PPARMOD= 0
##$PSCAL= 0
##$PSIGN= 0
##$REVERSE= no
##$SF= 200.130013532006
##$SI= 16384
##$SIGF1= 3
##$SIGF2= 2
##$SINO= 400
##$SIOLD= 16384
##$SREGLST= <1H.CDCl3>
##$SSB= 0
##$STSI= 0
##$STSR= 0
##$SW_p= 3612.71676300578
##$SYMM= 0
##$S_DEV= 0
##$TDeff= 0
##$TDoff= 0
##$TI= <>
##$TILT= no
##$TM1= 0
##$TM2= 0
##$TOPLEV= 0
##$USERP1= <user>
##$USERP2= <user>
##$USERP3= <user>
##$USERP4= <user>
##$USERP5= <user>
##$WDW= 1
##$XDIM= 8192
##$YMAX_p= 0
##$YMIN_p= 0
$$ End of Bruker specific parameters
$$ ---------------------------------
##NTUPLES= NMR FID
##VAR_NAME=  TIME,          FID/REAL,        FID/IMAG
##SYMBOL=    X,             R,               I
##VAR_TYPE=  INDEPENDENT,   DEPENDENT,       DEPENDENT
##VAR_FORM=  AFFN,          ASDF,            ASDF
##VAR_DIM=   8192,          8192,            8192
##UNITS=     SECONDS,       ARBITRARY UNITS, ARBITRARY UNITS
##FACTOR=    0.0002768,     1,               1
##FIRST=     0,             0,               0
##LAST=      2.2672688,     0,               0
##MIN=       0,             -82100,          0
##MAX=       2.2672688,     47729,           0
$$ Real data points
##PAGE= N=1
##DATA TABLE= (X++(R..R)), XYDATA
0 0 0 0 0 0 0 0 0 0 0 0 0 0 0 0 0 0 0 0 0 0 0 0 0 0 0 0 0 0 2 -2 3 -5 6 -6 7 -7 6 -6 8 -8 10 -11 12 -14 14 -17 19 -21
48 -21 22 -24 25 -31 33 -37 41 -44 49 -56 64 -72 86 -99 122 -151 192 -264 396 -696 1660 -9353 -76703
71 -76703 -72023 -9763 26462 5380 -28202 -25163 3992 20794 17292 10214 7787 -781 -13256
84 -13256 -14042 -34 4950 -10488 -28649 -25859 -5505 9608 12950 17097 26787 26817 9181 -10360
98 -10360 -15748 -12194 -14238 -19613 -12922 5756 17018 9000 -2947 -626 10668 14558 8587 5062
112 5062 8365 3951 -14736 -32561 -30739 -11471 7346 14888 14874 13850 11388 7411 5946 6125 -398
127 -398 -15046 -24503 -15665 2792 9093 -2170 -12446 -4709 12518 20857 15065 8146 5766 1864
141 1864 -9092 -17778 -15847 -7890 -6471 -9676 -4730 11395 24579 22109 8559 -1304 -3893 -5235
155 -5235 -8278 -7376 -3035 -2007 -8034 -12196 -5989 5871 12265 10491 9121 12288 13174 3969 -9846
170 -9846 -17471 -17911 -15534 -11423 -1420 12401 18881 11310 -621 -2722 4389 9451 5934 -1703 -6794
185 -6794 -10177 -13211 -12651 -5713 3080 5920 4632 7096 14540 17244 8200 -5548 -12564 -11316 -8588
200 -8588 -8416 -7134 -2357 2271 3759 4999 9897 14057 10272 -265 -7265 -4840 201 -692 -7543
215 -7543 -12396 -11336 -6019 493 8715 17196 18514 11015 -381 -6097 -6404 -6944 -10341 -11228 -6916 722
231 722 4608 4307 3669 3942 3634 3869 5851 9113 7568 -2664 -15266 -19639 -13711 -4019 3447 7392
247 7392 9555 9882 7781 5017 3505 1849 -2419 -8352 -10474 -7490 -2942 -1365 -2902 -1667 2751
262 2751 7786 9746 9336 7819 3404 -2740 -8434 -8982 -6712 -6323 -8158 -7499 -503 9879 15904 14054
278 14054 7472 480 -4973 -7216 -6073 -2615 -618 -2852 -6929 -7224 -2664 3541 7636 8390 9106 8619
294 8619 6355 965 -5865 -11676 -14548 -12712 -5647 3778 10360 10074 5334 850 664 3747 4811 3471
310 3471 -621 -5985 -9720 -10209 -7525 -2228 1395 3047 4950 8362 10961 9647 4285 -3246 -8934
325 -8934 -10289 -8249 -5239 -2739 -800 493 2670 6168 8780 8315 4294 -470 -3110 -2617 -1936 -2732
341 -2732 -5755 -8792 -9093 -5317 2249 10143 13888 12414 6435 -61 -3946 -6412 -6655 -7340 -6413 -4283
357 -4283 -386 3162 4332 3875 2444 2640 4245 5839 6586 3110 -3574 -11396 -14772 -11324 -3691 3781
373 3781 7729 7846 6723 5967 5202 2305 -1156 -4259 -5853 -6079 -5526 -3413 -1146 -932 -1154 272 4445
390 4445 9335 10366 6488 360 -4196 -6442 -6457 -5894 -5875 -4842 -2822 1018 6242 10686 11155 6566 -363
407 -363 -4802 -5328 -3673 -2070 -1888 -3373 -4754 -4704 -1813 2573 6322 7537 7074 6005 5128 1408 -5148
424 -5148 -11549 -13075 -8794 -2073 3697 7641 7740 4516 451 -632 2279 5097 3996 -736 -5922 -7848
440 -7848 -7460 -5951 -2982 865 4504 6196 6650 7342 7172 3565 -3039 -8589 -8835 -4861 -2577 -2283 -2441
457 -2441 397 3723 5065 5682 5630 4706 1449 -2883 -4412 -2387 -1402 -3931 -7897 -8465 -3490 3958 8802
474 8802 10326 8888 5240 -425 -4723 -5713 -4944 -4654 -5524 -3941 111 3856 3888 1558 613 2570 5190
491 5190 5924 4541 1291 -3840 -9968 -12799 -8854 -1129 5017 6214 5144 5118 5291 3652 895 -741
507 -741 -1762 -4051 -6084 -5670 -2347 223 -530 -1875 150 5489 8539 7158 3616 712 -1906 -5324
523 -5324 -7286 -6488 -3734 -2564 -2351 194 6010 10302 8865 2550 -2209 -3025 -2086 -2055 -2120 -2452 -2925 -4649
541 -4649 -5004 -1327 4319 7028 5851 4104 4481 4590 1025 -5667 -10394 -9486 -5878 -1641 2522 6014
557 6014 6426 3681 80 -103 2828 4219 1683 -1750 -4277 -4683 -5986 -6316 -3959 1212 5278 5790
573 5790 5798 6375 6075 1459 -4535 -7199 -5838 -3219 -2502 -2325 -965 1098 2282 2319 4146 6410 5451 483
591 483 -3860 -3405 -1143 -981 -4388 -6900 -5706 -1609 3033 6232 8919 8665 4257 -1459 -4730 -4118
607 -4118 -3175 -4040 -4946 -2698 1127 3064 2190 502 1337 3053 3995 4665 4869 2117 -4183 -10453 -10957
624 -10957 -5889 585 4113 4311 4788 5239 3987 1439 -408 -231 -716 -3351 -5525 -3950 -1396 -688
640 -688 -2358 -2025 1558 5911 7010 5179 2715 403 -2781 -5342 -6095 -3733 -2281 -2896 -2745 1104
656 1104 6399 8154 5576 1665 -839 -1633 -2646 -2768 -1801 -519 -1828 -4636 -4820 -552 4294 5785
672 5785 4931 4564 4633 3009 -1515 -5980 -7522 -6354 -4740 -1371 2546 5774 5194 1397 -792 802
688 802 3283 3657 1660 -1313 -3731 -5639 -6299 -4513 -1064 2304 3552 3834 5313 6501 4966 128
704 128 -4397 -5557 -3793 -2752 -2164 -1531 -288 172 921 2156 5103 6012 3518 -644 -2212 -1628 -994
721 -994 -3081 -4819 -5028 -3248 -457 2407 5837 7566 6039 1821 -1968 -3090 -2482 -3156 -4175 -3703
737 -3703 -1055 939 1078 778 1543 2360 2629 2890 3577 3786 844 -4500 -8837 -8134 -4028 338 3101
754 3101 4553 4916 4139 2049 613 386 32 -1326 -3358 -3407 -2354 -1168 -2078 -2319 -401 2617 5120
771 5120 5565 4636 2946 -374 -3813 -5428 -4098 -2166 -1865 -2262 -1336 1940 4910 5659 4379 2190 293
788 293 -1808 -2806 -1735 -854 -1124 -2822 -4168 -2792 516 3201 4173 4402 4368 3902 1690 -2034 -4708
805 -4708 -6063 -5662 -3747 -458 3544 4870 2942 428 -587 1176 2646 2962 1519 -992 -3498 -5446
821 -5446 -5311 -3045 -235 1721 2818 4029 4780 4844 2258 -948 -3213 -4030 -3504 -2907 -1672 -696 -241
838 -241 -193 471 2236 4335 4329 2347 -154 -1424 -1407 -1893 -2526 -3762 -4035 -2944 -422 3215 5619 6205
856 6205 3818 572 -1300 -1935 -2315 -2889 -3367 -2773 -1259 -54 1085 1623 1546 1465 1863 3392 4135 2744
874 2744 -500 -4397 -6826 -6010 -3091 221 3227 3721 3763 2729 1803 793 714 -416 -1392 -2315 -2757 -2199
892 -2199 -1840 -1388 -1267 -67 1931 4290 5346 4696 1899 -1502 -3466 -3905 -3396 -2254 -1739 -1582 -89
909 -89 1446 3496 4480 3902 1831 -403 -1623 -1405 -671 -1099 -2362 -3499 -3022 -984 1105 2943 3540
926 3540 3336 3075 2396 1108 -1353 -3798 -5498 -5346 -2680 399 2812 3658 2463 956 115 589 1601
943 1601 2802 1176 -917 -3186 -4228 -4209 -2887 -939 1625 3393 4004 4370 3308 1388 -913 -3099
959 -3099 -3848 -2498 -1327 -845 -918 -1057 -791 811 2881 3869 3753 2516 -547 -1834 -2032 -1366 -1586 -2876
977 -2876 -3688 -2340 442 3169 4886 4511 2973 1025 -1022 -2203 -2292 -2340 -2609 -2308 -1223 502 1323
994 1323 1070 691 1122 2151 3327 3098 1746 -1281 -4388 -5862 -5380 -1658 1149 3507 3052 2684 2080
1011 2080 1164 619 -213 -256 -815 -1500 -2247 -2058 -1628 -1583 -1020 259 2207 4646 4487 2670 1081 -1213
1029 -1213 -2762 -3241 -3224 -1939 -971 -602 -108 1364 3129 4240 2525 603 -479 -703 -817 -1038 -1206
1046 -1206 -1878 -2242 -2776 -2070 1096 3075 4036 3429 2668 1460 442 -1795 -3861 -4698 -3370 -1294 691
1063 691 1684 2696 1775 359 13 1278 2311 1976 589 -1546 -2976 -3676 -3547 -2396 -310 2055 3323
1080 3323 3292 3215 2502 1142 -1302 -3181 -3242 -1671 -685 -414 -791 -614 152 471 1539 2829 3900 2554
1098 2554 -215 -1739 -1813 -1806 -2212 -2865 -2458 -881 1161 2591 3667 3710 2040 234 -1480 -1552 -1117 -1816
1116 -1816 -2296 -2183 -901 506 823 361 1191 2150 2462 2460 2042 1050 -930 -3996 -5606 -4165 -830 1638
1134 1638 2424 2465 2449 2036 764 -175 -210 -66 -535 -1854 -2073 -1366 -1209 -1645 -1741 91 2864 4739 3778
1153 3778 2203 273 -1504 -3067 -3317 -2336 -912 -503 -666 -702 1138 3020 3019 1939 839 159 -497 -1625
1171 -1625 -1586 -1218 -1372 -1837 -2139 -818 1654 3009 2840 2512 2195 1578 -186 -2368 -3460 -3129 -2669 -1293
1189 -1293 286 2382 2959 1496 -359 -315 1322 2483 2125 -17 -1720 -2748 -3608 -3199 -1625 781
1205 781 2309 2366 2606 2854 2241 331 -1551 -2641 -1955 -1051 -1088 -727 -542 -281 -37 434 1857 3140 2945
1224 2945 1119 -795 -1316 -1124 -1593 -2616 -2526 -1521 -6 1014 2584 3381 3682 1623 -274 -1315 -1004
1241 -1004 -806 -1450 -1870 -1630 -810 317 372 625 1735 1871 1677 1793 2064 982 -1264 -3916 -4560 -2526
1259 -2526 -319 1309 2133 2305 2324 1225 630 408 444 -284 -1096 -1512 -1502 -1363 -1493 -1650 -1126 810 2828
1278 2828 3511 3103 1989 520 -1566 -2945 -2808 -1438 -636 -433 -570 294 1341 2210 1899 1636 1305 243
1296 243 -464 -920 -1033 -1223 -1870 -2441 -1936 54 1999 2638 2091 2041 1930 1109 -415 -1662 -2404 -2652 -2575
1315 -2575 -1332 650 2190 2138 931 -135 423 1453 1277 954 21 -1278 -2774 -3493 -2864 -1086 473
1332 473 1622 2497 2711 2633 1667 -271 -1790 -1723 -1523 -1019 -575 -314 -609 -708 -365 719 2520 3108 2554
1351 2554 698 -650 -1019 -1613 -1822 -2016 -1711 -850 -346 758 2224 3165 2325 1064 10 -656 -724 -921
1369 -921 -1507 -1715 -1138 -489 -1 702 1332 1423 1410 1455 2080 1764 464 -1761 -3521 -3522 -2050 -351 1118 2059
1389 2059 2056 1380 719 291 560 334 -81 -755 -1272 -1477 -1386 -1865 -1577 -606 1192 2413 3011 2794 1256 -248
1409 -248 -1595 -1959 -1968 -1169 -866 -546 -272 241 1398 1719 2160 1581 880 241 -432 -520 -933 -1252 -1912 -1842 -1406
1430 -1406 -78 1055 2113 2603 1957 1296 313 -437 -1450 -2227 -2485 -1977 -695 615 1554 1135 748 441
1448 441 778 1067 1983 1358 -198 -1730 -2531 -2676 -2009 -927 269 1344 2330 2573 2141 1033 -66 -1455
1466 -1455 -1825 -1304 -740 -309 -622 -843 -934 -418 952 2078 2435 2128 1063 -193 -1179 -1877 -1751 -1809 -1401
1485 -1401 -731 0 927 1873 2218 1966 904 -70 -366 -1078 -769 -1278 -1623 -1332 -474 338 807 820 969 1497
1505 1497 1842 1384 1196 -127 -1568 -3132 -3191 -1951 -36 1194 2192 1887 1101 793 550 454 277 -66
1523 -66 -359 -997 -1431 -1449 -1386 -896 -411 772 2430 2864 2294 812 -675 -1594 -2045 -1695 -933 -526 -250 -248
1543 -248 125 969 1488 1863 1370 711 332 -449 -913 -1176 -1434 -1378 -1761 -970 185 1265 2018 2248 1540 1019
1563 1019 293 -544 -1705 -2067 -2019 -1130 -408 584 1047 961 318 167 606 1294 1620 1092 -426 -1577 -2563
1582 -2563 -2465 -1938 -482 738 1572 1968 1889 1584 867 -208 -1486 -1694 -946 -517 -284 -638 -1132 -459 -113
1601 -113 1250 1432 2500 1747 841 -609 -1325 -1104 -1844 -1804 -1586 -690 498 1080 1521 1971 1571 318 -138
1620 -138 -565 -350 -291 -1010 -1430 -1142 -544 160 638 665 1168 1651 1788 875 462 -305 -1111 -2652 -2495 -1505
1640 -1505 181 1080 1423 1360 1393 828 70 46 313 215 -608 -1117 -1202 -1049 -1104 -941 -260 1309 2589 2603 1806
1661 1806 429 -562 -1788 -2077 -1675 -786 -80 -165 -412 -68 825 1599 1241 884 923 384 -305 -859 -1364 -1382
1681 -1382 -1566 -1692 -894 642 2179 1693 1342 997 1044 397 -378 -1638 -1927 -1418 -1208 -449 708 1052 1048
1700 1048 310 141 779 1081 1360 644 -96 -1703 -1976 -2396 -1595 -504 1181 1715 1624 1601 1490 591 -665
1719 -665 -1022 -914 -302 -428 -609 -706 -740 -648 -268 648 1870 2469 1690 265 -1020 -903 -1261 -1121 -1147 -742
1739 -742 -88 23 648 1354 1967 1349 514 -152 -344 28 -819 -1412 -1443 -782 -258 -5 248 884 1229 1246 1190
1760 1190 993 746 -173 -1716 -2508 -2051 -760 409 1109 1061 1428 912 256 179 334 432 201 -717 -1260 -1212
1780 -1212 -1277 -954 -713 145 1509 2330 2177 1552 557 -527 -1574 -1891 -1112 -354 -76 -183 -304 136 946
1799 946 1041 1050 1174 805 488 -256 -891 -1039 -1411 -1381 -1283 -297 749 1473 1594 1509 909 757 52 -631 -1211 -1292
1821 -1292 -1224 -1043 -616 175 774 584 423 359 974 959 908 370 -441 -1559 -2239 -2146 -1042 -43 996 1191
1841 1191 1571 1713 1156 11 -632 -1019 -891 -480 -537 -268 -509 -482 -700 27 882 1781 2141 1451 -66 -488
1861 -488 -1227 -1519 -1719 -1060 -668 198 12 576 989 1326 920 227 301 -128 -247 -939 -1104 -1153 -743 -547 130
1882 130 332 1029 930 1097 1082 1264 637 -805 -1680 -2145 -1618 -1099 223 886 1138 1483 667 185 -123 415
1902 415 699 10 -746 -842 -1083 -1125 -1412 -780 550 1237 1768 1847 1351 87 -638 -1356 -1401 -627 -377 -360 -398
1923 -398 -378 505 404 974 1173 1142 815 274 -379 -812 -1011 -1163 -1243 -879 -40 663 1137 1685 1281 805 477
1944 477 -82 -493 -1099 -1351 -1148 -787 -33 625 512 431 498 475 802 1187 833 231 -731 -1456 -1453 -1926 -711
1965 -711 326 966 1304 1281 1392 596 -57 -435 -779 -764 -553 -312 -508 -592 -397 -506 -12 937 1694 1584 1069
1986 1069 101 -629 -1147 -1303 -1250 -896 -511 -7 310 850 1128 872 679 169 43 -67 -377 -954 -1138 -911
2006 -911 -668 -453 267 726 1091 1039 975 851 616 -373 -459 -1465 -1593 -1066 -679 186 957 1217 811 672 537
2027 537 306 68 221 -120 -753 -835 -1068 -935 -926 -412 297 1428 2033 1805 951 -120 -1058 -1343 -1141 -754
2047 -754 -202 -19 -101 -19 21 366 709 983 1013 631 93 -373 -718 -947 -1079 -1167 -510 273 917 1060 1370 759
2069 759 626 320 -8 -731 -1095 -1209 -1131 -679 -153 612 812 662 657 502 870 769 720 43 -849 -1636 -1756
2090 -1756 -1413 -652 129 803 1138 1506 1098 513 258 -427 -890 -391 -120 -323 -550 -899 -654 -291 224 1323
2110 1323 1818 1772 784 -131 -764 -1153 -1240 -1211 -474 -318 132 403 999 602 765 782 437 160 -348 -466 -770
2131 -770 -902 -1247 -727 -100 156 515 1000 1075 1170 732 312 -190 -803 -1310 -1785 -911 -371 461 765 848 626
2152 626 759 339 453 583 146 -250 -703 -1021 -880 -1098 -1053 -194 416 1242 1634 1423 602 2 -475 -1012
2172 -1012 -956 -686 -173 -143 -241 -501 399 558 569 817 933 295 105 -427 -994 -1048 -1073 -832 -449 24 689 1158
2194 1158 1223 888 517 249 -84 -290 -663 -854 -793 -546 -431 145 400 629 428 570 953 604 405 98
2214 98 -1025 -1201 -1258 -1189 -756 427 938 1037 965 849 571 155 -637 -998 -477 -323 -261 -689 -598 -901 -257 123
2236 123 966 1481 1481 724 -225 -547 -862 -996 -798 -513 65 194 293 530 642 250 773 404 81 67 -404
2257 -404 -755 -1296 -994 -344 -425 144 575 925 1137 736 581 507 -203 -698 -1384 -1291 -1007 -238 479 996 782
2278 782 719 415 145 189 416 190 -191 -775 -900 -727 -938 -590 -253 812 1218 1451 1134 537 -261 -973
2298 -973 -962 -868 -380 13 -349 -430 -159 404 425 741 892 932 654 -5 -522 -738 -405 -868 -808 -549 787 815
2320 815 951 829 817 583 165 -283 -275 -758 -758 -843 -449 -203 204 525 546 340 550 669 624 290 -250 -681 -1158
2343 -1158 -1034 -626 -340 441 789 852 983 931 458 -207 -321 -647 -601 -515 -312 -498 -573 -562 -393 323 996 1409
2365 1409 1028 485 -239 -754 -1254 -1172 -1026 -323 18 285 241 495 881 481 380 256 233 -92 -189 -561 -802
2386 -802 -837 -655 -337 254 613 859 964 428 433 -3 -318 -690 -1101 -882 -511 -399 -41 411 649 454 616
2407 616 261 435 587 41 -281 -437 -609 -697 -1115 -661 -48 562 1103 1232 976 450 55 -1016 -963 -794
2427 -794 -211 -247 -85 -116 -265 -106 452 720 954 1136 433 10 -593 -904 -985 -768 -478 -112 448 603 277
2448 277 490 444 222 -55 -118 -553 -511 -523 -955 -535 -253 240 469 341 766 708 408 259 131 -257 -708 -1089
2470 -1089 -1278 -830 -90 497 706 947 892 533 93 -321 -93 -279 -361 -338 -229 -369 -550 -348 -191 425 974
2491 974 1080 652 284 -310 -719 -1063 -765 -694 -235 -135 134 290 588 613 378 514 417 25 -64 -430 -650
2512 -650 -850 -713 -566 31 443 785 822 668 335 245 133 -281 -581 -781 -888 -493 -227 288 343 842 485
2533 485 476 378 324 545 152 -170 -581 -838 -1051 -546 -388 190 563 969 944 888 230 -438 -575 -855 -444 -220
2555 -220 20 68 -335 -37 153 525 644 911 508 307 -9 -593 -981 -678 -793 -478 196 488 750 693 412
2576 412 443 76 48 -125 -468 -272 -575 -336 -585 151 532 493 495 382 546 532 536 111 -325 -647 -705 -683 -378
2599 -378 -160 194 515 689 470 660 309 -276 -207 78 -137 -270 -130 -416 -563 -694 -366 410 912 1054
2619 1054 761 175 -354 -929 -1004 -998 -488 80 112 316 199 481 330 326 444 346 262 56 -252 -882 -897 -617 -461
2642 -461 168 393 688 691 571 610 274 -104 -397 -522 -634 -699 -688 -220 277 567 420 541 434 202 356 202
2664 202 246 -198 -355 -933 -776 -675 -157 -164 655 961 689 634 168 -276 -634 -465 -528 -180 -107 11 -139 -99
2686 -99 175 606 669 664 543 77 -246 -892 -849 -863 -703 -249 181 282 520 418 519 197 222 99 315 -169
2708 -169 -544 -633 -794 -257 -98 262 338 289 696 596 522 64 70 -220 -833 -682 -951 -319 -118 341 429 699
2730 699 527 298 279 191 -57 -138 -218 -320 -478 -496 -385 -116 -93 656 563 995 664 253 -210 -526 -780 -768 -288
2753 -288 -84 188 249 130 344 530 360 505 312 67 24 -344 -662 -932 -778 50 193 527 651 682 584
2774 584 146 353 -118 -314 -506 -733 -675 -288 235 20 203 522 662 265 226 305 70 85 -475 -634 -419
2795 -419 -513 -485 -182 131 515 853 660 578 -15 -210 -346 -994 -385 -131 -78 -284 -334 -122 -70 680 703 666 779
2818 779 474 -374 -663 -903 -781 -679 -393 310 327 763 544 318 416 278 -132 -92 -106 -392 -370 -671 -415 -99
2840 -99 194 143 505 670 540 348 -131 -113 -331 -627 -774 -622 -363 -162 389 702 479 408 236 254 -86 -215
2862 -215 -201 68 -344 -358 -606 -616 -272 345 508 990 1021 452 -13 -312 -776 -827 -513 -350 -166 181 212 -60
2884 -60 407 461 256 333 363 174 -165 -409 -707 -767 -781 -490 231 406 616 674 482 100 148 -136 -180 -651 -684
2907 -684 -409 -145 -240 -38 467 208 289 456 240 367 72 -523 -165 -555 -536 -468 -572 -44 38 835 651 843
2929 843 378 282 -345 -569 -433 -194 -293 21 -380 -209 -41 201 397 844 529 511 156 -389 -793 -829 -769 -634
2951 -634 -170 206 540 217 724 353 222 105 322 24 -179 -283 -691 -594 -522 -65 250 477 263 551 330
2972 330 167 78 -22 -403 -560 -692 -418 -327 -10 202 536 664 325 176 -200 -142 31 -117 -494 -416 -347 -445
2994 -445 -419 -251 140 614 739 623 618 88 -376 -501 -663 -508 -251 -99 156 -62 245 323 435 230 267 257
3016 257 140 -325 -485 -695 -686 -476 -120 -6 497 574 476 457 -5 -148 -174 -448 -505 -607 -523 -221 -163 174 -82
3039 -82 392 274 391 51 210 241 70 -329 -470 -369 -573 -154 -62 224 562 760 325 323 -183 -365 -562 -357
3061 -357 -333 126 -81 -197 -261 -117 -32 726 470 668 449 263 -54 -424 -982 -467 -380 -70 297 604 760
3082 760 247 370 303 -113 187 -97 138 -430 -505 -188 -416 -256 171 410 617 394 452 14 -71 90 -396
3103 -396 -327 -653 -357 -64 68 281 354 255 344 263 172 -69 -165 -228 -65 -173 -507 -572 -227 -62 326 570 688
3126 688 862 311 248 -197 -627 -772 -346 -79 139 101 172 185 168 308 116 314 662 98 -6 -157 -576 -687
3148 -687 -493 -131 266 545 488 382 200 -287 -154 -210 -233 -397 -135 -303 -313 -250 -128 374 246 446 198 122
3170 122 452 52 -180 -287 -472 -390 -516 -360 -7 415 359 769 564 312 -296 -431 -431 -316 -175 -110 89 -87
3192 -87 -177 -148 369 429 518 483 223 32 -431 -549 -547 -394 -157 218 607 268 438 161 442 198 236 366 56
3215 56 -233 -449 -161 -601 -217 171 342 500 249 312 425 300 -115 -158 -399 -140 -689 -269 -186 101 46 275
3237 275 528 318 381 -29 -29 -143 -166 -229 -251 -525 -464 -90 -16 143 334 683 659 -28 -98 -525 -583 -410 -465 -64
3261 -64 -25 231 -82 151 90 108 256 412 363 241 -179 -616 -424 -632 -286 -17 132 417 820 586 150 36
3283 36 -198 14 -228 -438 -376 -358 -37 14 50 466 244 455 378 235 155 71 -143 -248 -312 -222 -243 30 11 348
3307 348 491 481 632 4 -202 -26 -480 -361 -88 -50 96 -30 -286 91 378 627 214 383 330 -94 -412
3328 -412 -575 -585 -638 -57 181 311 116 283 212 137 208 210 80 -212 -267 -93 -391 -467 -455 142 221 506 465 663
3352 663 397 90 -3 -99 -442 -374 -588 -477 90 -74 346 121 259 453 404 252 -236 71 -105 -138 -304 -348
3374 -348 -106 -36 -111 260 547 728 257 190 -60 -333 -763 -619 -447 -229 133 304 164 126 269 360 320 208
3396 208 468 17 -317 -423 -638 -548 -154 -104 493 404 587 135 311 153 -109 -38 -282 -267 -536 -347 -239 -12
3418 -12 -133 370 285 396 324 340 92 -265 -66 -351 -264 -128 -99 -177 -65 444 316 506 229 119 -305 -390 -332
3441 -332 -227 -116 9 -297 46 -42 -139 321 378 546 409 429 -202 -294 -465 -123 -546 -418 206 421 286 361
3463 361 286 300 165 316 11 -124 -145 -361 -352 -369 -312 271 221 357 595 361 458 139 -191 -110 -14 -550 -286 -482
3487 -482 -3 -35 79 284 111 253 147 215 -249 -233 -532 -250 -215 -217 -287 -99 271 196 252 366 240 138 30
3510 30 -569 -393 -503 -194 -201 -73 5 358 83 254 252 396 93 105 46 -428 -465 -532 -564 -369 -157 450 651 689
3534 689 -25 72 -38 -91 -189 -157 -313 -119 -85 -60 98 201 37 340 346 416 221 -41 -150 -306 -361 -468 -241
3557 -241 -69 103 228 251 425 405 373 211 -70 -379 -321 -162 0 -331 -20 -197 -3 26 195 371 418 525
3579 525 198 -63 -412 -282 -394 -451 -211 134 485 478 394 150 146 93 306 227 -369 -122 -397 -299 -425 -167 186
3602 186 208 293 418 413 -49 80 -74 -225 -385 -184 19 159 -80 -108 43 58 378 303 103 233 -36 -179
3624 -179 -127 -399 -381 -262 -252 -136 -21 469 652 538 158 238 -185 -259 -367 -449 -93 22 -71 95 373 441 365
3647 365 268 480 379 301 119 -224 -330 -358 -388 -296 205 332 403 288 259 -26 -72 -61 -53 -260 -246 -35 -315 -81
3671 -81 213 -9 431 240 399 412 -77 38 -297 -346 -440 -266 -45 -146 223 214 326 83 385 287 22 -219
3693 -219 -188 -120 -204 -97 94 -46 -129 74 288 225 465 452 189 251 -190 -576 -610 -415 -267 53 244 452 396
3716 396 202 346 13 230 -51 -106 26 -248 -471 -295 -461 -65 117 338 520 374 370 223 -90 -196 2
3737 2 -180 -209 -351 -194 -213 160 233 265 75 249 240 34 -253 -291 -141 -267 -130 -316 -128 -67 249 351 643
3760 643 483 288 42 -249 -547 -187 -129 -84 -33 234 -67 11 248 283 219 335 196 -149 -151 -415 -330 -450 -196
3783 -196 87 48 504 536 369 316 300 -191 -84 -193 -80 -302 -35 -319 -322 -150 -37 299 194 316 406 180
3805 180 -124 -228 -268 -371 -343 -54 -73 -91 366 94 301 136 262 -25 87 -137 -298 -308 -364 -243 -139 -431
3827 -431 41 71 253 331 510 198 18 -388 -526 -294 -390 -219 106 143 437 386 134 -47 -109 -43 21 56 -31
3850 -31 9 -315 -420 -649 -269 5 389 165 376 412 -112 -183 -377 -160 -291 -169 -181 90 -257 -194 231 108
3872 108 44 406 81 121 -133 -106 -355 -350 -264 -172 67 -2 422 55 431 374 192 -148 -155 -301 -171 -196 -290 52
3896 52 -136 -93 -19 69 305 264 134 140 99 176 -136 -673 -177 -159 153 222 73 485 -97 305 -22 -63 275 -96
3920 -96 -35 -180 -254 -192 -87 -117 248 252 415 618 130 213 84 -389 62 -99 -243 -185 255 -93 237 390 169
3943 169 382 40 90 -289 -95 -113 -309 -162 -171 -137 -185 85 151 294 323 42 378 -142 37 -198 -400 -347 177
3966 177 24 358 392 164 101 188 -121 247 145 19 104 -286 -54 -274 -346 175 239 636 471 319 357 -101
3988 -101 49 -387 -239 -182 -467 56 148 -131 272 -4 396 315 466 191 170 -35 -101 -141 -121 -144 -236 80 -119
4011 -119 261 216 225 405 91 126 -366 -450 -233 -362 -341 -142 77 -14 68 -21 258 207 449 310 71 -160 -252 -286
4035 -286 -205 -221 72 58 449 531 456 200 -97 -126 -156 21 -281 -372 -46 -348 16 71 116 197 233 56 309 184
4059 184 -34 -144 -429 -173 -157 62 6 392 18 483 502 129 -147 244 -56 -96 -236 -223 -165 -333 -184 -28
4081 -28 196 284 64 440 450 211 85 -357 -406 -143 -433 -104 26 92 466 -142 162 246 86 112 -53 58
4103 58 -142 -276 -551 -492 -244 37 226 165 605 348 -42 -208 -228 -261 -137 -86 -341 -153 -317 -251 194 207 -72
4126 -72 -20 191 -57 -52 -69 -459 -229 -368 -122 -202 -96 -49 178 461 375 130 151 111 -70 -182 42 -59 -254
4149 -254 210 -140 93 -12 -39 418 67 287 316 41 -239 -355 -568 -442 -243 -113 313 198 -105 -63 107
4170 107 -299 -170 27 -93 22 -242 -187 -376 -237 -207 22 531 165 409 394 171 -551 -269 -349 -234 -139 -350
4192 -350 -13 160 92 131 341 318 405 -4 -23 -15 -100 -182 -76 -205 -62 115 144 244 175 43 15 1 -118 -201 -465
4217 -465 -303 -76 -5 147 131 253 123 337 285 -29 253 333 -64 -84 -352 -397 -335 10 105 75 268 446 9
4240 9 89 -23 -156 -112 -358 -63 -80 15 -122 -142 -25 -30 174 399 184 421 -187 -187 -375 -365 -134 -273 -182 -4
4264 -4 99 258 266 159 240 83 -42 -33 -328 -385 -101 -53 82 30 -77 126 160 168 401 157 222 155 -278 -565 -462
4289 -462 -199 176 209 215 365 386 287 -64 -174 -77 -245 3 -36 -229 -347 -8 -238 -187 139 248 529 42 207
4312 207 276 -56 -566 -276 -327 -113 -308 158 100 276 49 132 37 96 -83 154 -148 -202 -391 -171 -268 -6 42
4335 42 205 186 241 484 274 63 -36 -372 -58 -220 -330 -148 -48 33 -8 414 148 -85 144 305 135 -175
4357 -175 -56 181 -459 -7 -56 -144 389 638 347 146 283 -115 3 -55 -182 -168 -144 0 -1 -81 -149 190 148
4380 148 291 279 248 -97 -256 -344 -244 94 -77 191 -191 394 293 183 85 30 -93 269 -61 -347 -57 -216
4402 -216 -63 69 182 -130 162 206 300 161 324 77 119 109 -59 -492 -308 -22 102 226 383 420 226 -200
4424 -200 -19 -99 16 -157 -138 122 -137 -343 -68 172 20 423 -65 303 -19 -109 -32 -343 -644 -185 -342
4445 -342 -204 -413 304 47 102 160 325 172 -118 -7 -34 -135 -52 -254 -221 2 32 163 264 366 159 324
4467 324 38 -66 -157 -91 -203 -218 -2 308 174 246 -28 257 -134 367 296 233 -127 -274 -244 -263 -126 -126 -25
4490 -25 -10 117 396 203 157 -44 -167 -335 -230 -289 41 54 -44 -61 199 -91 255 228 36 113 -19 -408 -195
4513 -195 -464 -127 -202 -54 100 98 50 222 136 117 17 -165 -233 -205 -49 13 10 -126 19 155 221 156 97 256 282
4538 282 -133 -119 -464 -165 -291 -26 -245 356 260 -51 17 119 -65 47 98 -44 -224 -523 -166 -3 -316
4559 -316 -77 -19 132 178 510 230 -6 -30 -218 -475 -138 -334 -71 -9 -19 107 111 88 238 422 -73 197 44
4582 44 -402 170 -52 -21 -161 -39 -123 89 269 146 214 64 -42 190 -291 -188 -572 -160 -134 288 126 334
4604 334 484 189 110 63 -3 96 -19 -179 -208 -245 -181 54 90 234 379 266 128 -78 -255 155 -288 142 -379
4627 -379 -89 -123 -118 97 170 -41 -114 163 122 202 19 -266 -337 -331 -208 43 -146 46 128 320 136 20 120 33
4651 33 -26 -192 -167 -159 -41 -160 19 141 143 160 108 438 104 344 21 -99 -436 -407 -130 -20 -347 292 91
4674 91 143 234 83 164 -68 234 -197 -19 -21 -287 -219 -50 -365 -123 186 191 91 151 91 -32 -231 -218 -188 -454
4698 -454 9 -81 -227 -20 218 -77 93 273 246 -21 -40 -203 -166 77 18 -352 66 90 256 229 354 355 92
4721 92 197 -126 -225 -133 -388 -111 133 100 193 199 276 71 304 194 -72 23 -155 -160 -231 -322 -345 45 344 319 228
4746 228 266 263 -131 71 5 268 -78 -224 -75 73 -349 -275 106 75 178 358 183 32 -68 -317 -262 -472
4768 -472 -168 13 88 68 172 187 237 33 184 212 106 -81 -122 100 -291 -27 135 -34 -2 97 35 24 61 -41
4792 -41 17 -256 -277 -90 -385 -123 -57 76 129 251 282 287 -102 55 129 -181 17 -27 -349 -200 -106 -30 101 502
4816 502 466 55 366 -312 -100 -67 -51 -284 206 60 -30 283 122 26 8 197 -97 66 24 -283 -69 -11 -309
4839 -309 -210 -152 11 -49 64 109 17 396 169 60 -96 -223 -267 -93 -186 -217 -16 328 5 39 215 182 -84
4862 -84 163 -62 -101 23 -261 -265 -102 -72 159 118 -77 383 120 85 44 64 -66 -134 -89 164 65 -204 66 -43
4886 -43 163 419 282 97 -149 225 -77 7 -380 -110 182 -31 76 176 183 277 52 -117 -124 43 -60 -176
4908 -176 -299 -227 -224 187 62 239 57 370 111 -13 136 -106 231 -352 -420 -349 -109 9 82 254 89 245
4930 245 24 181 81 -169 -73 -186 -73 -12 -238 -327 18 21 113 38 128 204 152 -16 -464 -52 -143 -139 37 126 56
4955 56 -276 182 215 232 65 243 359 -10 206 -211 -85 9 -59 53 143 -4 15 294 179 -132 4 -312
4977 -312 -485 -57 -344 -307 115 122 198 81 96 9 78 -174 77 38 -252 -316 -310 -361 -277 59 126 293 286 217 374 -71
5003 -71 188 -83 -36 52 -161 142 -73 -120 -33 -19 378 283 588 214 -138 -99 -195 -292 -14 -8 -133 -98 308 111
5027 111 183 243 158 -43 -42 29 -128 -317 -246 -116 -14 -45 -107 30 144 135 251 344 49 -105 -86 -190 -334 -158
5051 -158 -4 -171 157 -218 187 145 -51 164 -71 146 205 -15 -129 -119 -40 -37 -86 -168 132 280 15 211 56
5074 56 -267 -207 -402 -164 -328 -164 -218 481 -63 -1 125 120 -103 210 -74 20 -199 57 -58 -155 81 -152 71
5097 71 80 -307 184 190 -171 -122 -12 -204 -124 129 -83 -126 -214 141 286 41 -94 66 126 -77 -91 -96 -195 -174 -84
5122 -84 -31 221 205 -32 266 50 -39 72 -38 233 0 -106 4 47 117 220 -129 21 286 202 182 99 -103
5145 -103 165 -105 -263 -242 -144 -20 11 170 91 373 -4 37 256 93 -276 162 -17 -166 -129 -67 -136 122 348
5168 348 -20 -50 177 213 139 54 -59 -66 -153 -314 -214 -137 216 231 76 260 117 -16 26 -83 -394 -55 -197
5191 -197 -159 -125 -259 -61 137 218 213 249 133 -232 -112 -406 -114 -111 -157 46 82 53 136 251 199 220 181 88 98 9
5217 9 -136 -139 -177 -111 3 21 103 132 276 -25 161 221 207 10 -102 15 -40 83 -316 90 240 190 48 82 180
5242 180 49 26 213 -188 -41 -109 -262 -224 -210 245 283 171 9 -35 -248 201 -94 -1 -61 -41 -81 -16 -263 224
5266 224 24 91 368 114 -7 145 47 -315 -4 -67 -186 -70 346 103 68 73 268 257 -34 -161 -77 -71 -98 -327
5290 -327 -133 -42 140 175 -102 130 515 129 51 -72 -75 -62 -161 -217 118 -58 209 343 -13 56 60 12 80 24 33
5315 33 270 -300 -106 160 -275 -196 -50 147 384 141 131 63 -100 36 -49 -51 67 166 13 48 -126 -4 235
5338 235 89 228 99 153 243 89 -8 -225 -241 -240 56 -18 268 36 -91 185 145 98 -75 5 -127 29 -117
5361 -117 -319 106 -130 57 215 104 -129 -34 82 95 263 63 -257 -116 172 194 91 264 104 120 245
5382 245 155 60 83 -165 27 -78 -154 -112 -264 -93 -74 -240 252 388 407 228 183 26 -344 -207 -126 198 197 141
5406 141 -96 -127 -33 6 -26 -31 -162 -327 27 -6 129 195 -53 -336 123 243 176 -22 -29 -20 24 29 -122 -135 -381 -258
5432 -258 -173 60 174 100 178 44 348 -158 189 -48 196 233 -27 80 -48 43 -74 170 256 -72 223 67
5454 67 41 -42 -116 -17 -81 45 -42 114 55 -79 281 157 167 110 100 -197 -207 51 -162 -284 -170 21 182 131
5478 131 244 345 49 -47 -36 -99 139 -262 -18 -193 -295 -223 -3 394 138 277 144 -15 135 277 227 -79
5500 -79 -411 -87 -97 -170 257 -42 89 108 78 34 -272 -342 -152 228 53 89 -158 1 -57 0 266 1 46 20
5524 20 13 -24 -124 -29 -418 -301 -227 -76 345 305 211 191 361 -2 24 -34 132 -84 78 28 -513 238 -64 148
5548 148 9 169 384 1 123 176 -10 -7 -206 -203 -138 99 239 4 -45 -34 142 -134 75 -105 36 107 -36
5571 -36 -177 -555 57 -130 -43 215 77 188 80 32 -31 -277 -62 -406 -174 149 116 -148 -85 -218 -110 261
5593 261 -22 363 162 -239 -186 -244 -92 -236 -43 178 157 152 168 261 97 154 206 41 -188 -9 -156 184 -17
5616 -17 9 54 -136 210 55 -48 189 89 125 120 -222 63 28 -51 -9 54 63 56 83 -55 -75 -38 -114 38 -104 104
5642 104 55 -11 -117 -119 -88 90 88 190 247 152 -36 -283 -6 -55 -73 -117 -218 -106 98 4 -69 -14 -11 -128 -323 -18
5668 -18 -1 -54 -547 -85 -109 -245 -307 113 0 223 11 198 -38 115 116 -195 175 -95 -60 5 366 -256 458
5691 458 205 -59 -35 -71 6 -125 -110 -110 58 -382 27 34 136 199 262 38 -58 9 -285 -195 -210 -183 -87 -2 313 -255
5717 -255 -89 76 215 329 -18 -81 77 -192 -149 -380 -277 125 -10 24 162 125 -86 148 179 -75 12 158
5739 158 -111 -174 -44 3 -57 151 126 108 136 27 -65 178 24 -131 -320 -106 -246 -368 -116 283 -59 415
5761 415 186 121 85 -26 -5 138 -196 -20 19 -97 9 -373 -15 309 198 134 138 95 -126 36 34 -112 -2
5784 -2 -123 118 111 -41 -154 -18 91 -217 122 -99 -157 -200 -226 -196 -238 -54 40 61 137 23 29 99 222 42 -189
5809 -189 -34 -101 -266 22 82 -18 -146 92 49 265 -87 1 52 129 -13 -317 -136 -122 -33 -102 318 237 361
5832 361 240 25 62 -156 -56 10 89 101 95 234 -340 -51 -237 118 -165 298 322 -3 -327 -313 1 -114 -263
5855 -263 -276 141 -152 85 135 209 116 57 263 -92 -244 -253 23 -285 -289 -12 108 321 65 292 68 121 10
5878 10 276 -32 -41 -265 -238 -148 -327 74 137 90 152 -168 10 110 -249 -18 -96 3 -8 -124 -63 -27 187 132 372
5903 372 155 329 137 -31 -206 53 138 -56 106 21 35 98 39 32 -66 12 200 35 -67 19 -296 -86 -24 -115
5927 -115 20 198 32 91 66 -5 97 68 250 199 19 -191 -232 -364 114 126 147 178 9 39 271 64 160 -79
5951 -79 -112 -49 105 -37 -169 264 123 -4 311 132 218 -235 -6 63 -158 -241 -68 -35 -155 31 -4 -44 125
5974 125 -21 194 189 -92 -175 -196 -189 -241 305 114 -163 -190 174 168 169 -63 259 264 99 -15 32 -70 -38 57 89 70
6000 70 50 -75 81 69 73 -73 -42 -178 -70 -137 -52 -31 34 267 -180 314 116 -61 38 36 228 45 174 -36
6024 -36 45 -30 -35 -154 -102 45 53 -20 154 -87 -140 -187 -146 -72 29 109 -13 1 140 50 107 192 -41 -27 -3 -13 -196
6051 -196 -353 -252 -30 51 -107 196 276 -212 44 60 36 -114 -174 32 -62 -171 -5 -8 313 -49 -297 333 -3
6074 -3 293 -102 -118 -81 -165 -384 36 -158 62 -60 245 -81 71 65 -208 -19 -49 50 76 18 -112 -110 139 -26
6098 -26 52 -78 257 -28 306 258 -184 -124 -206 -159 -305 269 1 -29 99 138 16 94 131 -2 -72 265 -94 277
6122 277 232 -53 264 39 -89 223 453 155 248 281 23 -59 -81 -319 -128 -117 296 132 268 212 506 15
6144 15 134 111 87 -168 -439 -119 -53 -148 -64 -99 -116 -63 49 266 99 -112 -332 213 114 -123 -124 211 -284 230
6168 230 96 56 -85 252 97 76 118 163 -221 -153 -301 -204 108 -63 186 32 346 154 52 -73 -224 17
6190 17 -173 -151 -93 -442 -282 -82 63 -13 143 66 168 103 36 73 -130 -213 37 118 -130 202 127 -114 263 203
6214 203 303 -125 108 -147 -109 221 -134 -74 27 -76 -21 82 -33 7 356 -39 65 -120 -21 -169 -177 -194 -223
6237 -223 258 -143 -35 -34 -83 1 4 1 175 99 17 -260 -189 -93 -1 249 42 124 193 -33 -159 46 -100 21 -33
6262 -33 215 -136 -81 152 164 217 385 98 -234 -69 -6 -67 -131 -82 -26 -289 -141 -242 218 -79 275 222 247 29
6286 29 -59 -134 -147 -140 -182 -182 -238 219 -18 101 172 250 269 40 358 42 -143 -309 -340 -203 -7 105 -43 407 261
6311 261 149 34 140 56 139 32 -179 0 -62 -196 1 99 105 278 229 -1 -276 79 115 66 181 -166 -27
6334 -27 -44 -334 -182 249 56 184 -96 118 -192 -12 -115 128 -90 160 200 171 34 208 371 -146 -21
6355 -21 -46 387 204 -195 -80 128 190 -143 -119 340 20 147 -136 3 20 221 77 -232 -227 18 -38 -214 -202
6378 -202 -5 -118 174 239 255 87 -29 160 58 -94 -288 148 -159 -59 126 23 45 70 163 56 115 -50
6400 -50 -130 -51 2 50 -262 -43 -241 89 13 252 189 99 -7 -82 -235 -233 -346 146 95 253 196 -16 84 138 112
6425 112 61 362 287 62 60 -173 -140 -181 84 125 -126 111 101 21 -82 -11 99 -19 -151 -167 -207 31 -38 -160
6449 -160 -231 -107 171 109 -56 -106 226 -157 -62 -118 79 -16 -111 -68 -28 48 302 -50 202 53 22 -23 -225 298
6473 298 121 -193 -175 -6 75 -196 152 384 -113 194 -114 -148 -100 -45 -161 -98 -86 -136 -163 6 60 200 -130
6496 -130 -158 -32 6 -137 -101 -71 -199 -14 -103 165 -77 -46 112 95 197 -137 -178 -31 -21 -216 -171 -96 165 -49
6520 -49 38 -140 38 100 -145 -151 203 181 60 276 47 -223 -45 -133 74 184 60 -28 76 234 -153 -24 157
6543 157 -164 -111 -58 3 -40 -22 -82 109 -150 263 87 78 148 58 -201 -48 201 -259 324 56 101 59 -24 89
6567 89 165 38 96 -78 -222 -29 -383 -413 235 -191 97 199 49 319 -266 1 -191 -119 135 -165 -62 -103
6589 -103 -48 -28 164 68 55 159 290 50 161 -90 55 62 -81 34 -151 -45 -48 242 38 139 283 213 -155
6612 -155 137 90 99 -249 -141 -193 89 218 153 195 -23 -80 32 190 152 -66 54 -57 -375 -210 95 64 6
6635 6 75 -11 -315 134 -17 -96 57 111 -97 139 134 103 -32 125 -121 196 -10 -56 380 -138 205 52 -63
6658 -63 -192 -37 52 -118 160 45 14 264 102 -2 -153 15 -62 59 -88 -42 54 46 -100 319 -85 318 159
6681 159 -152 33 -109 -177 14 53 -192 -82 147 67 60 76 9 104 -61 -278 -133 -146 -210 -249 198 20 -29 -132
6705 -132 350 275 118 182 396 86 -52 -36 -173 -158 123 164 110 -39 165 1 133 336 -2 47 -73 49
6727 49 -97 -113 -77 -140 -357 181 70 305 344 5 91 51 -213 -239 105 -82 -108 148 -56 63 -33 288 205 20
6751 20 44 -48 209 -37 8 -171 -33 -97 189 180 227 -92 18 86 -109 195 -60 132 -94 -3 137 -125 -14
6774 -14 14 55 -20 7 32 159 -50 -258 45 -286 -126 68 18 -33 288 305 176 270 -113 -85 -81 -44 -47 9 -119 -40
6800 -40 284 131 235 -202 -39 40 -141 261 225 -45 -104 -246 -189 38 139 -119 -106 -55 95 282 -115 -161 18
6823 18 -334 142 -82 -272 -71 6 -102 195 24 63 204 214 98 43 205 -192 -158 -197 6 19 -6 -104 -15 237
6847 237 161 82 -27 -6 -66 -119 -119 -2 -313 -295 -72 223 -57 13 82 433 61 124 -35 -177 -9 32 -19 162
6871 162 -33 47 -61 108 101 -92 -17 -37 196 20 246 -291 -16 -147 -24 130 33 186 160 286 -19 -105 -92
6894 -92 -112 3 -56 174 -68 -73 -163 117 22 133 83 52 87 2 -74 23 -7 26 -148 -176 173 -107 -143 24 272 -34
6920 -34 218 -89 -162 -84 88 -117 97 31 97 116 -92 125 134 227 -34 -139 -128 -60 395 -388 -57 154 17 60
6944 60 36 -261 101 0 -71 -150 296 -87 -18 -42 137 244 -8 252 241 250 -130 144 217 -93 18 -20 117 -134
6968 -134 -174 -73 29 119 -120 -50 24 101 227 177 108 -72 30 -129 -141 -244 -74 -91 182 -4 93 -98 108
6991 108 192 -71 123 -209 -36 102 68 -132 60 -102 177 -91 -64 79 165 95 -237 -197 -78 3 -133 0
7013 0 -138 -124 144 72 168 47 -131 -238 -58 -111 -118 -200 145 90 10 -199 -62 -47 224 -17 24 -26 -17 -116 165 3
7039 3 -216 61 37 -24 162 125 -190 33 87 101 37 26 112 -90 400 -22 135 34 85 -70 106 175 151 -46
7063 -46 91 -79 -92 -99 -124 102 146 -37 129 -89 28 173 62 -30 132 -214 50 -10 -236 -27 -72 -145 103
7086 103 -37 51 30 -186 236 73 -112 128 -164 -20 174 174 263 -72 -7 265 119 -117 -91 -41 -117 87 -200
7109 -200 -67 57 -174 102 14 397 12 82 -245 17 -20 -184 -172 -201 155 129 -60 68 -110 -106 263 74 97
7132 97 8 -61 -174 30 -108 37 129 -148 -177 -114 89 -60 28 38 12 -216 6 159 59 10 39 251 161 123
7156 123 27 -56 11 41 371 60 -172 -14 -136 153 119 -250 -88 -30 324 -20 214 -23 158 26 -94 -142
7178 -142 -62 52 108 -144 294 -69 -84 69 69 74 -18 -88 147 103 -248 -21 -105 -65 -137 19 215 105 -86 195
7202 195 99 -124 -197 -243 -55 -110 95 40 2 -200 -153 18 -79 -112 -21 275 218 174 -208 -143 -232 -42 -5 -47 -239
7227 -239 237 -68 -181 -146 200 -14 93 -154 -142 286 93 -131 151 103 124 -136 40 -33 -27 164 -36 -115 -31
7250 -31 -140 -43 -176 -259 -155 -140 -34 70 29 -14 70 111 117 -182 -332 32 43 -87 147 -69 -187 52 133 -194
7274 -194 126 419 -82 -295 -242 -20 -45 -200 33 -88 70 78 -115 217 144 -85 -78 -90 -480 -92 142 -77 140
7297 140 -107 158 -77 310 -42 -41 -23 -70 172 -46 63 -96 -157 -18 68 88 319 241 28 -74 36 -227 14
7320 14 1 -37 -65 -201 28 -155 9 119 178 85 43 -188 -357 103 -285 10 -164 -265 -233 -77 32 165 175
7343 175 -248 20 -40 167 -7 -73 82 8 -103 63 39 11 129 -324 46 49 -97 -141 -101 -232 -259 132 -183
7366 -183 93 -280 63 15 281 205 -138 11 -203 -272 -46 133 -49 -123 -28 35 157 -14 -35 83 -62 -167
7388 -167 -201 59 117 14 -271 179 192 238 -46 -66 -113 128 53 -45 36 -133 81 31 -239 -133 -4 -35 39 177
7412 177 -111 -162 213 -67 44 -122 -182 -74 -111 82 61 -47 235 -3 190 350 10 187 45 -131 3
7433 3 -172 -139 84 291 75 3 31 220 14 -32 78 241 -88 117 -321 -123 -145 -92 42 266 134 88 44
7456 44 141 313 19 22 -13 200 -4 -38 138 81 130 161 56 153 -109 28 77 -502 -144 74 121 88 19 -50 -237
7481 -237 -18 -195 127 217 28 -156 -135 -25 90 -318 -293 -135 -165 -448 -4 282 126 -47 87 -305 -84
7502 -84 -146 -20 45 -12 281 -98 45 -11 186 125 138 339 -100 -223 -149 -242 -215 -79 74 -97 96 -128 37
7525 37 216 72 109 -294 -7 64 -109 -64 -122 -238 -27 -154 96 52 -189 136 -18 57 -31 -70 5 -6 -77 111
7549 111 77 163 120 22 -188 30 22 -34 -72 107 -34 105 190 -80 84 -197 -28 105 -13 199 -81 -23 -83 10
7573 10 -104 -2 -66 40 -140 202 -64 18 2 -211 -45 -133 -33 -247 -75 33 64 -44 49 -135 355 235
7595 235 89 108 -126 316 81 -192 8 37 -19 -49 -106 -230 100 -121 102 191 45 -124 191 -317 -315 -185 -18
7618 -18 -240 93 59 -24 256 -63 193 219 41 -63 -89 303 -90 -64 -65 26 -136 51 -117 -131 154 160 338 -47
7642 -47 -31 -207 10 -26 34 -290 148 -157 -21 -305 -198 -199 -31 -62 -111 134 -55 129 8 130 -99 126 169
7665 169 102 -98 -130 -19 -24 -122 -18 26 -244 -138 -63 33 70 110 -172 -21 162 91 -73 4 84 409 -4 72 -122
7690 -122 -104 217 -84 190 167 -16 -151 171 31 57 -94 -59 -12 -112 -246 304 135 -50 -67 -106 366 65
7712 65 -230 -115 3 25 -318 -109 -99 162 -61 3 -316 91 183 -87 -20 -197 -72 -260 49 133 36 162 27
7735 27 111 17 -137 -10 161 294 1 196 -203 -137 95 27 58 163 -68 -103 133 -209 -46 -49 -39 3 320 104
7759 104 105 88 -68 -30 -17 -111 63 94 -168 -205 242 -211 120 -122 -309 -244 -149 4 208 162 213 163 -34 131
7783 131 -63 323 -72 -51 170 -97 46 10 -59 23 -21 -79 -75 -77 -130 57 92 -118 -98 -255 91 -19 214 132 321
7808 321 -36 -81 -201 -132 -244 -50 101 -222 -163 -33 -192 -19 -1 147 142 218 175 -51 251 -73 66 8 -19
7831 -19 67 2 191 5 162 -79 -257 -48 342 -22 21 117 235 -193 100 -119 -126 -115 221 -124 141 -67 142
7854 142 -31 242 239 -78 161 9 32 62 -244 -188 121 364 -22 -168 -105 -12 -169 -71 -46 -94 -108 -50 -67 -230
7878 -230 122 193 89 -24 -148 336 239 -107 14 -144 -161 8 257 -18 134 -72 93 93 200 -165 337 102
7900 102 47 220 133 -84 197 90 250 -17 63 -134 -34 294 20 -247 -33 -167 -65 25 -26 -51 -30 -88 36
7923 36 -30 -17 198 127 79 108 76 139 178 -210 277 -230 -44 118 209 -108 142 -2 18 -213 1 -19 86 43
7947 43 10 205 26 5 -70 -148 -72 -76 61 -229 162 97 -23 -79 -49 136 36 228 18 -52 -8 57 -194 70 61
7972 61 295 61 -29 -56 -14 -229 122 10 15 -18 -141 -142 -112 -101 4 326 36 60 71 122 -91 62 164 -9 -163
7997 -163 171 90 174 25 320 -70 55 -21 302 126 74 -33 -91 -60 -270 -22 -64 371 74 -107 -87 -13 46
8020 46 209 108 11 -14 59 -181 -51 -289 149 -143 101 -46 153 130 -1 278 -4 72 -195 -43 3 -122
8042 -122 -2 116 4 66 362 179 113 180 256 92 -80 -97 -155 -70 209 59 -173 -144 254 60 -136 158 9
8065 9 83 40 -164 -157 -80 107 -44 105 -188 -149 -36 161 -182 104 115 42 -364 6 -213 18 -249 257 138
8088 138 2 75 -11 104 4 -136 68 -79 -53 -210 -11 -96 141 327 20 71 -135 102 -113 12 59 82
8110 82 -106 -332 -103 -125 -64 104 -16 173 3 111 -120 113 -184 -101 72 -98 -184 22 88 77 126 225 -218
8133 -218 268 141 66 24 94 -152 -60 -114 241 94 158 335 -50 111 180 63 -10 -47 -42 -57 -263 54 -94 171
8157 171 -33 332 116 -50 46 54 -66 18 -393 -45 39 -23 149 -157 20 156 -111 47 -55 -92 51 -117
8179 -117 -106 -128 -131 -201 357 86 291 83 30 148 56 54
8191E4
$$ Imaginary data points
##PAGE= N=2
##DATA TABLE= (X++(I..I)), XYDATA
0 0 0 0 0 0 0 0 0 0 0 0 0 0 0 0 7 -7 7 -7 7 -9 14 -14 18 -21 24 -28 35 -38 42 -49 56 -66 75 -84 95 -108 122
37 122 -136 151 -170 189 -209 232 -258 284 -314 346 -382 421 -463 510 -561 620 -684 757 -837
56 -837 928 -1037 1160 -1305 1480 -1693 1966 -2321 2807 -3519 4665 -6822 12336 -62344 -82100
71 -82100 25975 47729 22388 -20572 -10062 11535 21385 3853 -2354 -2159 -1486 -11911 -11771 -5238
85 -5238 -2165 -13491 -15328 2828 29685 34888 21017 6062 3319 -1869 -13870 -22011 -15100 -5514
99 -5514 -5860 -10455 -1914 16681 25499 14949 2109 1152 6112 1438 -9239 -11393 -3993 -3061 -14315
114 -14315 -22914 -13016 8484 22761 22477 16124 11642 5490 -3328 -10486 -13754 -16932 -19929 -14298 4444
129 4444 21292 17937 -1454 -12161 -1028 17174 20937 9204 -3074 -8534 -13893 -21532 -21504 -8610
143 -8610 7226 12635 9807 10069 16668 17127 4121 -11026 -14632 -8757 -4701 -5921 -6853 -3912 -1695
158 -1695 -2522 426 10620 19609 16990 4996 -3522 -3587 -3112 -8662 -15324 -15088 -8320 -2282 2976 10793
174 10793 19413 19187 7563 -4983 -7175 -1888 -1088 -7226 -11516 -9300 -4208 -1759 556 4784 8616
189 8616 8171 5870 7980 11863 7649 -6700 -21142 -22759 -12934 -1944 4178 8268 11061 10530 5658
204 5658 962 2364 4839 1674 -5893 -9726 -6560 -3109 -5940 -9770 -7305 3002 12819 16724 15373
219 15373 10574 2217 -8139 -14360 -11455 -4628 -1816 -4783 -6266 -1324 6306 11039 10329 8066 5004
234 5004 129 -4307 -5185 -2917 -3155 -7426 -11911 -9662 -875 6956 10293 10158 10195 8983 4770 -1342
250 -1342 -7154 -10951 -13109 -11594 -5040 4338 9903 7283 1583 -1138 2183 6772 8259 6322 1504
265 1504 -5773 -13328 -15979 -11320 -2529 3721 6263 7732 10702 11900 8208 -108 -6263 -8330 -6796
280 -6796 -4885 -3316 -2420 -2587 -3668 -2540 2809 9713 12970 9834 3106 -2055 -4179 -4788 -6236 -8049
296 -8049 -8792 -7837 -3445 3779 11082 14267 10566 3464 -1755 -3443 -3313 -3806 -5152 -6217 -5607 -3765
312 -3765 -1359 1704 4471 5147 5571 6891 8530 7599 1295 -8028 -15152 -15472 -10137 -1352 5459 8786
328 8786 7412 5002 3512 3046 3175 1835 -962 -4235 -5808 -5237 -4977 -5367 -5350 -2805 2182 8708 12946
345 12946 13051 7455 -973 -7616 -10213 -8057 -4974 -3107 -2738 -1897 401 4395 7469 8322 5990 2682
361 2682 -225 -1814 -2413 -3002 -4922 -7326 -8471 -6215 -326 6316 9784 9223 6592 4702 2500 -670
377 -670 -5491 -9719 -10671 -7510 -2266 2718 5661 5374 3046 55 14 4117 7948 6721 284 -7000
393 -7000 -10931 -11019 -7604 -3161 1872 5930 8689 8932 7741 4912 158 -4734 -7424 -6034 -2932 -804
409 -804 -1298 -3537 -3980 -1589 3172 8272 10733 8812 3079 -2787 -5222 -4900 -4612 -6307 -7699 -5212
425 -5212 -533 5162 8138 9147 7680 3479 -897 -3138 -2738 -2462 -4290 -6325 -5646 -2237 1027 1620
441 1620 2040 3571 5676 6814 6149 4756 924 -5417 -12592 -14258 -8223 880 6914 7256 4758 3565
457 3565 3120 1690 692 1306 1182 -1139 -4728 -7047 -5332 -3539 -3366 -2623 2175 8781 11895 9298 3433
474 3433 -2128 -5835 -7097 -6218 -3591 -1601 -1855 -3002 -882 4264 8238 7235 3302 955 446 -448
490 -448 -1584 -3338 -4105 -5545 -7082 -5536 -92 6281 9155 7400 4736 3758 2218 -1974 -6043 -7797
506 -7797 -6855 -4754 -2605 1213 4522 5115 1732 -743 990 5639 7080 3748 -1851 -5719 -7683 -9120
522 -9120 -7436 -2257 3739 6430 5944 5672 6725 5597 277 -5828 -7504 -3764 -741 -840 -2575 -3228
538 -3228 -2270 -980 1899 6967 9929 7741 1220 -3811 -3848 -2736 -4389 -6931 -6610 -3074 1488 4448
554 4448 6065 7088 6026 2412 -1190 -1902 -1098 -1714 -4738 -6160 -4198 -587 381 75 1831 4463
570 4463 6046 4835 3828 3373 790 -5130 -10689 -10753 -5149 1153 4312 4854 5077 4334 2129 -133 457
587 457 2443 1730 -2228 -5276 -5091 -3045 -3000 -4461 -2583 3071 8356 9672 7057 2949 -1250 -5803
603 -5803 -7651 -5650 -1705 235 -1314 -3193 -409 3551 6312 5068 3009 1662 894 -1122 -2504
618 -2504 -2711 -3267 -5208 -6638 -3781 1884 6241 5970 4575 4084 4435 2034 -2661 -5566 -5950 -4976 -4307
635 -4307 -2061 1888 4879 3335 -751 -939 2187 6208 5809 2309 -1356 -5203 -7863 -8287 -5338 154
651 154 4258 5019 4337 4894 5693 3069 -1805 -4657 -3748 -1745 -1677 -2310 -2394 -1914 -1928 -1451 1762 6753 8541
670 8541 5469 107 -2563 -2708 -3169 -4744 -5740 -4242 -1720 748 2942 5379 6925 4774 168 -2085
686 -2085 -1190 -252 -1421 -3843 -4453 -3284 -1726 -899 662 3069 4570 4062 3206 3587 3028 -952 -6367
703 -6367 -9453 -7146 -2406 1515 2886 3645 3759 2558 999 1358 2194 2477 118 -3148 -4220 -3164
719 -3164 -2569 -3813 -3671 -441 3940 6720 7211 5687 2706 -2005 -5564 -6165 -3588 -736 -754 -1702 -1716
736 -1716 702 2751 3593 3272 3528 2559 552 -1405 -2094 -2124 -3373 -5655 -5391 -1759 2912 5210 4809
753 4809 3866 3234 2295 284 -2039 -3630 -4007 -4871 -4246 -1075 2527 3571 2022 -51 724 2881 4034
770 4034 3521 1711 -1146 -4565 -7169 -6870 -3415 429 2843 3770 4282 5092 4231 1079 -1824 -3324 -2771
787 -2771 -1879 -1464 -953 -1173 -2169 -3259 -1479 2756 6875 7318 4004 82 -2288 -3237 -4076 -3968 -3321 -2318
805 -2318 -1116 377 2468 4500 4804 2910 529 -582 -449 -736 -2200 -3335 -3489 -2681 -1759 -292 1822
822 1822 2763 3085 2841 3542 4073 2141 -1754 -5980 -7297 -5828 -2485 1131 3292 4019 2923 1083 53
839 53 1167 2228 2090 -22 -1943 -3397 -3456 -3381 -3116 -1682 615 3633 5605 5969 4306 1020 -2795
856 -2795 -4590 -4018 -1890 -856 -1348 -1750 -1001 439 2612 3549 3871 2824 1202 -259 -1216 -1359 -1694
873 -1694 -3856 -4937 -3738 -1068 2327 4147 4752 3836 2802 1152 -531 -1664 -2506 -3589 -3690 -2820
889 -2820 -551 1084 1856 1740 813 972 2198 3409 3436 1479 -1878 -5127 -5864 -4391 -2104 442 2168
906 2168 3307 3665 3574 2806 1282 -838 -2519 -3011 -1929 -634 -552 -1614 -2616 -2431 11 3448 5542
923 5542 5212 3130 140 -2184 -2883 -3297 -3234 -2978 -2298 -755 1274 2954 3766 3192 2179 787 67 -326
941 -326 -681 -1459 -2768 -3629 -2850 -1000 509 1564 2354 2729 3152 2972 2306 666 -1710 -4397 -5696 -4609
959 -4609 -1749 1466 3023 2778 2144 1099 889 973 1263 1208 39 -1799 -3219 -3091 -2461 -2265 -1761 43
977 43 3494 5825 6201 3254 -256 -2884 -3634 -3288 -1583 -559 -565 -1128 -1169 -127 2083 3245 3234 2098
995 2098 1196 429 -416 -2028 -2654 -3804 -3153 -2653 -100 1917 3739 3770 2311 1975 1066 409 -1710 -3043
1013 -3043 -3579 -2914 -1685 -425 1068 1765 1243 462 554 2581 3316 2538 703 -2553 -4053 -4632 -4276 -1620
1031 -1620 851 2785 3561 2652 2372 2374 552 -1482 -2359 -1790 -1013 -409 -1671 -1984 -2086 -1402 346 2986
1049 2986 4611 4724 2808 -484 -2768 -2585 -2467 -2860 -2601 -1574 406 1368 2371 2743 2730 1671 396
1066 396 -166 215 194 -1336 -3304 -3429 -2160 -575 255 1266 2729 3337 2634 2019 1199 82 -1708 -4299
1084 -4299 -5124 -2953 -499 984 1555 1733 1665 1330 709 756 1498 1296 -515 -2160 -2925 -2441 -1944 -2202 -1002
1103 -1002 998 3911 4803 3802 2162 -113 -2103 -3465 -3405 -1545 292 13 -1060 -1350 51 1759
1119 1759 2608 2619 2245 1907 217 -1219 -2016 -2401 -2917 -3228 -2307 234 2915 3590 2776 1364 1160 864
1137 864 -144 -1365 -1971 -2260 -2577 -2213 -711 1403 1905 1277 -29 858 2279 2752 1475 -134 -1853
1154 -1853 -3159 -4106 -3447 -1318 958 2405 2387 2267 2536 1950 147 -1573 -1787 -1012 -367 -762 -1421 -1848
1172 -1848 -1576 -1232 -82 2510 4441 4329 1670 -900 -2190 -2208 -2541 -2459 -1571 -432 158 301 1493 2474
1190 2474 2745 1636 -10 -59 223 -205 -1872 -3229 -2875 -1698 -525 522 1526 2226 2540 2091 1504
1207 1504 1852 312 -1932 -4036 -4308 -2385 -45 1269 1380 1824 1427 958 231 1303 1703 1057 -1035
1224 -1035 -2209 -2451 -2303 -2150 -1854 -694 1736 3499 3979 2897 1591 -205 -2113 -3003 -2165 -444 72
1241 72 -522 -1464 -896 625 1361 1871 2395 2157 1464 -384 -1299 -1639 -1700 -2771 -3026 -1529 998 2917 2916
1260 2916 2049 1597 1309 467 -475 -1167 -1262 -1981 -2479 -1865 -191 1227 887 490 827 1449 2415 1973 650
1279 650 -695 -2049 -3121 -3615 -2839 -521 1095 1674 1933 2483 2598 1424 -353 -1142 -1368 -797 -804 -725 -1019
1298 -1019 -1053 -1611 -1485 610 3009 4474 3421 1194 -878 -1736 -2481 -2405 -1769 -822 -117 159 1056 1650
1316 1650 2406 1817 346 231 605 607 -555 -1640 -2598 -2089 -1739 -538 1034 1998 2098 2048 1397 1692 1555
1335 1555 21 -2026 -3381 -2814 -1458 -107 1094 1524 1697 1078 686 661 1291 1203 425 -526 -1499 -2029
1353 -2029 -2122 -2029 -1730 127 1824 3168 3767 2896 1182 -962 -2521 -2417 -1150 -290 -126 -769 -999 -628
1371 -628 473 1262 1867 2575 1712 673 -505 -1244 -1668 -2139 -2629 -2147 -567 936 2016 2002 1651 1408
1389 1408 584 274 -342 -760 -1519 -2072 -2279 -1145 156 972 654 546 981 1633 2158 1813 871 -740 -2007
1408 -2007 -3037 -2832 -1703 -72 993 1916 2011 1948 1504 607 -253 -727 -913 -961 -658 -824 -1298 -1728 -1676 -298
1428 -298 1014 2504 3275 2428 968 -645 -1958 -2522 -2110 -1421 -797 -108 91 1074 1542 1800 1072 628
1446 628 555 479 310 -534 -1609 -2325 -2225 -1796 -58 955 1791 1722 1696 1489 1355 448 -610 -1586 -2193 -2104
1466 -2104 -1454 -105 876 1183 1271 723 1009 1084 971 797 178 -795 -1564 -2026 -2002 -2158 -1139 14 1431
1485 1431 2516 2942 2261 940 -601 -1870 -2101 -1593 -489 -4 -367 -515 -766 -54 1099 1671 2064 1815
1503 1815 971 -115 -1083 -1717 -2239 -2217 -1594 -270 1207 2204 1904 1325 871 512 370 127 -640 -1618 -1770
1522 -1770 -1841 -1170 -205 464 1115 948 824 971 1626 1618 512 -575 -1986 -2248 -2253 -1522 -137 1087 1799 2016
1542 2016 1802 1179 728 -280 -699 -982 -511 -342 -767 -1175 -1694 -1208 -470 1015 2570 3287 2450 751
1560 751 -1079 -1727 -1832 -1775 -1284 -713 -337 407 599 1080 1342 1270 882 399 272 -93 -440 -1478 -1984 -2030
1580 -2030 -996 83 763 1502 1722 1646 1073 577 235 -526 -1513 -2372 -2050 -1266 124 1026 777 1051 714
1599 714 495 801 1082 1041 21 -1022 -1735 -2211 -1671 -1442 -896 359 1617 2603 2479 1561 320 -762
1617 -762 -1588 -1886 -1125 -222 45 -402 -1138 -607 259 1147 1574 1682 1601 1029 -113 -1180 -1929 -2036 -1859 -1269
1637 -1269 -210 1167 1849 1596 1135 522 668 204 -248 -628 -770 -1142 -1668 -1193 -482 714 804 789 918
1656 918 1531 1538 1092 -350 -938 -1735 -2162 -1989 -1413 -31 1124 1219 1081 1308 1462 588 -78 -982 -998 -471
1676 -471 -738 -948 -1241 -1172 -938 -334 1254 2697 2830 1918 139 -1129 -1466 -1947 -1561 -1141 -527 16 365
1695 365 466 651 739 1060 621 808 692 258 -768 -1529 -2073 -1544 -508 157 964 1479 1541 1386 818 689
1715 689 502 -284 -1537 -2372 -1767 -560 -53 474 929 1175 609 181 695 1094 673 -133 -806 -1506 -1587 -1406
1735 -1406 -1244 -576 506 1744 2341 2101 1308 211 -532 -1723 -1373 -630 -124 111 -739 -882 -467 292
1753 292 794 1305 1736 1582 257 -750 -1223 -1554 -1717 -1624 -942 402 1225 1596 938 794 536 472 -74 -93
1773 -93 -591 -916 -1390 -1446 -1059 164 733 616 607 896 1584 1413 605 78 -991 -1709 -1793 -1985 -632 501
1793 501 805 967 975 1225 977 58 -288 -357 -516 -653 -792 -910 -971 -876 -592 285 1491 2645 2184 1321 -52
1814 -52 -1076 -1135 -1514 -1260 -671 -45 28 42 278 724 1072 576 718 719 644 222 -737 -1564 -1646 -1392 -918 117
1836 117 1030 1855 1686 812 705 492 141 -473 -1530 -1455 -1354 -759 -295 76 679 758 628 490 1135 1019
1856 1019 403 -24 -765 -1145 -1486 -1316 -1308 -568 750 1571 1765 1761 1303 -90 -948 -1412 -1141 -644 -112 -300
1876 -300 -767 -686 -309 200 1000 1507 1836 1178 421 -608 -1306 -1389 -1816 -1322 -792 512 968 1029 867 672
1896 672 397 208 374 225 -86 -852 -1346 -1407 -892 -31 499 661 1006 1220 1215 766 513 -134 -848 -1542 -1610
1917 -1610 -1218 -358 142 728 901 1240 960 568 266 -5 -42 -403 -622 -516 -652 -1092 -1033 -888 255 1396
1937 1396 2249 1895 940 -131 -1108 -1355 -1598 -956 -552 -225 -19 73 416 698 777 521 934 588 384 -7
1957 -7 -677 -1294 -1493 -1018 -664 226 1107 1306 1093 653 377 305 -57 -571 -964 -1255 -1121 -468 -228 461 360
1978 360 629 614 774 1240 616 205 -115 -880 -1680 -1525 -1078 -572 -21 669 1395 1344 1450 588 -122 -1066 -870
1999 -870 -824 -288 25 -166 -539 -416 -148 442 1102 1266 1372 682 260 -574 -996 -1494 -1569 -1108 -200 451 952
2020 952 1232 853 601 300 311 109 64 -276 -841 -1061 -1551 -719 -212 611 845 1086 1031 1023 356 272 -316 -1177
2042 -1177 -1242 -1314 -1016 -316 166 530 808 902 522 615 214 -151 -176 -475 -618 -583 -633 -806 -596 -428 348 1483
2064 1483 1899 1495 611 -289 -1199 -1228 -1134 -772 -343 -103 246 211 -76 494 707 751 737 679 274 -128 -1083 -1887
2086 -1887 -1563 -867 -237 690 1203 1199 1035 563 693 186 40 -782 -1130 -1172 -840 -435 15 252 371 650 804
2107 804 723 740 683 240 -117 -996 -1236 -1461 -885 -528 -83 957 1047 1761 1198 613 -158 -780 -805 -736 -334 -152
2129 -152 -134 -630 -768 67 659 1030 1254 1243 906 78 -747 -1209 -1358 -1192 -788 -211 504 995 1069 655 247
2150 247 470 369 312 -27 -468 -836 -1170 -1136 -756 167 396 819 868 1008 922 704 21 -471 -1038 -1307 -932
2171 -932 -693 -258 315 513 685 762 909 554 263 -215 -44 -167 -283 -730 -925 -919 -507 -198 535 1121 1607
2192 1607 1520 546 -222 -917 -818 -1216 -734 -446 -22 83 -49 31 317 699 585 390 780 262 -311 -827 -1549
2213 -1549 -1509 -723 -302 523 1389 1090 950 436 173 47 -2 -746 -911 -1083 -772 -407 -19 -74 261 769 834
2234 834 564 839 638 -46 -300 -1152 -1026 -827 -814 -459 -198 549 1044 1226 952 290 -176 -574 -1257 -549
2254 -549 -408 -59 -745 -773 -376 -52 537 876 1222 1121 856 -203 -834 -1488 -1240 -1043 -709 85 593 821
2274 821 628 339 425 343 286 184 74 -342 -700 -1246 -943 -533 203 527 671 1075 1142 683 392 142 -363
2295 -363 -752 -1003 -954 -757 53 301 432 555 726 583 323 120 1 -9 -332 -441 -631 -609 -769 -555 -346
2316 -346 393 1298 1559 1025 327 -270 -635 -1049 -1028 -562 -196 41 88 -127 242 614 802 681 497 495 293
2337 293 -286 -1051 -1438 -918 -508 -30 579 921 967 893 560 25 292 -46 -434 -754 -631 -656 -416 -130 37
2358 37 535 607 662 422 774 370 -95 -596 -925 -843 -796 -743 -421 221 979 1279 894 764 341 -119 -512 -635
2380 -635 -264 -35 -190 -438 -270 -410 -189 360 933 1347 1095 691 -329 -707 -1112 -1186 -1066 -632 97 284
2400 284 566 721 676 -234 379 413 167 198 -227 -510 -1205 -957 -570 18 554 724 992 655 798 152 -207
2421 -207 -501 -646 -890 -806 -121 -75 275 193 570 405 612 456 354 24 -384 -430 -431 -606 -422 -766 -751 53
2443 53 870 1125 1159 864 99 -409 -989 -917 -714 -234 -111 99 -70 -139 407 258 675 655 555 688 121 -603
2465 -603 -936 -1010 -867 -692 149 564 938 955 328 341 301 147 -64 -345 -179 -903 -494 -161 -248 131 651 565
2487 565 485 801 722 83 -76 -604 -844 -1034 -797 -563 192 337 546 912 831 623 148 -211 -367 -703 -155
2508 -155 -396 -362 -405 -703 -310 47 286 1124 1136 1027 312 -248 -514 -855 -822 -877 -367 291 407 473 509 271
2530 271 518 142 221 74 82 -226 -780 -869 -930 -366 -111 327 598 588 550 502 134 -36 -711 -960 -658 -740 -346
2553 -346 -131 207 378 746 564 638 528 224 134 -162 -550 -811 -399 -928 -741 -225 220 818 1183 1309 585
2574 585 152 -308 -1007 -886 -467 -151 -365 -28 236 233 301 407 290 813 639 565 210 -493 -1053 -1097 -778 -494
2596 -494 170 615 840 562 367 84 -139 -83 63 -375 -471 -505 -608 -505 -193 133 244 797 573 688 543
2617 543 82 -319 -606 -554 -661 -611 -282 -184 86 536 565 811 333 493 -374 -434 -560 -300 117 -310 -266 -325
2639 -325 -214 62 713 958 1014 828 372 -276 -688 -747 -1046 -807 -52 390 472 563 312 425 328 99 243 125
2661 125 67 -385 -749 -826 -852 -300 97 581 794 656 618 393 25 -401 -141 -374 -476 -420 -586 379 175 251
2683 251 302 733 517 246 152 154 99 -392 -623 -564 -582 -401 1 353 614 979 1118 384 -119 -471 -675 -607 -226
2706 -226 -390 -61 -51 -274 -148 -5 367 691 741 563 541 42 -673 -966 -1140 -663 -238 268 475 851 562
2727 562 617 6 -127 21 94 -289 -436 -503 -276 -152 -373 -100 538 670 566 627 504 125 -322 -497 -715
2748 -715 -676 -437 -186 -79 334 335 520 377 561 182 -82 -581 -507 -404 -367 -239 -479 -150 -242 250 422 853
2770 853 855 616 134 -240 -514 -742 -521 -480 -147 230 650 553 462 353 243 636 218 13 -111 -368 -782 -1106
2792 -1106 -783 -211 267 611 788 545 681 198 188 -176 -282 -414 -492 -492 -290 154 233 456 588 306 575
2813 575 312 11 140 -109 -453 -497 -632 -583 -351 -24 562 733 1080 618 321 -51 -445 -648 -254 -327 -195
2834 -195 -69 -302 55 -105 99 219 751 573 396 140 6 -597 -965 -988 -530 80 522 609 664 583 214
2855 214 53 -21 115 -46 -374 -277 -597 -329 -454 -48 206 495 623 528 417 268 30 -506 -598 -734 -807 -182
2877 -182 -273 -268 170 510 730 437 381 119 -355 -336 -147 -270 -186 -236 -550 -480 -34 307 363 664 775 614 -231
2900 -231 -520 -652 -743 -616 -473 93 287 310 493 135 75 45 172 213 320 -342 -283 -869 -969 -472 45 245
2922 245 391 713 736 503 174 -63 -457 -283 -450 -508 -447 -312 74 -149 400 493 552 673 504 315 -29 -251
2944 -251 -732 -595 -505 -462 -324 71 283 516 910 754 195 -190 -410 -574 -594 -451 -248 -252 -198 -52 89 146
2966 146 477 399 186 560 443 -302 -240 -885 -765 -496 -97 144 787 624 429 261 36 72 -167 -46 -162
2987 -162 -559 -413 -340 -398 -81 105 513 615 495 602 326 -346 -302 -426 -741 -630 -221 -400 -20 305 445
3008 445 455 581 256 227 -121 -431 -90 -308 -133 -469 -403 -273 -66 321 260 905 659 377 124 -368 -801
3029 -801 -796 -600 -119 26 12 284 200 417 126 229 307 432 -107 28 -435 -415 -506 -191 -19 -78 599 701 553
3052 553 219 97 -136 -274 -420 -395 -370 -208 -118 -175 70 182 385 669 537 463 237 -119 -412 -400 -462 -290
3074 -290 -237 -233 88 253 301 724 745 213 341 -341 -365 -348 -272 19 -328 -226 99 -79 258 372 313 467 583
3097 583 122 -4 -691 -701 -382 -243 -27 257 620 646 495 246 -14 -261 -53 221 -244 -387 -495 -196 -282
3118 -282 -108 332 357 442 744 440 115 -116 -442 -480 -496 -189 -41 -135 -115 411 498 406 456 229 286 -53 -102 47
3142 47 -444 -637 -515 -515 -209 -53 222 630 596 675 252 -147 -276 -442 -739 -359 -493 64 136 221 370 95
3164 95 52 211 218 155 229 -184 -294 -506 -982 -431 56 296 366 391 607 313 -43 -60 -201 -200 -556 -226 -86 -117
3188 -117 4 273 192 626 319 714 298 235 -53 -222 -311 -399 -319 -361 -355 -262 86 530 564 349 19 -148 -457
3211 -457 -504 -360 -363 -180 -155 -17 -133 173 202 577 586 504 297 92 -212 -450 -1025 -516 90 256 585 445 424
3234 424 46 -198 -3 10 68 -9 -59 -338 -441 -144 -75 -408 352 448 564 544 298 382 -81 -514 -295 -239 -213
3257 -213 130 -73 177 37 120 278 609 152 126 2 -235 -422 -268 -288 -514 -281 -298 137 324 319 771 302
3279 302 395 -24 -147 -329 -560 -242 -117 -133 201 354 27 217 264 477 339 8 110 -51 -459 -571 -785
3300 -785 -329 155 260 537 462 432 536 84 -270 -254 -335 -122 -303 -29 -244 -145 -23 46 459 489 325 141
3322 141 31 -565 -336 -654 -701 -27 -247 -70 81 693 388 237 260 221 -36 -221 -286 -289 -242 -299 51 -81 -29
3345 -29 122 227 179 525 365 187 286 -106 -496 -807 -672 -33 105 443 521 480 140 159 60 247 -31 -151
3367 -151 -237 -120 -583 -478 -153 -120 278 316 291 463 309 122 -355 -472 -385 -579 -149 -29 -156 241 332 216
3389 216 298 161 43 -9 -100 -159 -240 -309 -268 -149 -257 -6 345 285 400 568 520 -34 -421 -305 -678 -667 -321
3412 -321 -126 91 98 124 317 114 238 281 101 33 135 -383 -431 -575 -490 -75 64 519 446 537 517 184 -16
3435 -16 78 -69 -169 -182 -326 -9 -7 -181 66 533 415 489 -50 496 -93 6 -610 -523 -343 -281 -11 129 46
3458 46 286 561 -27 242 -299 -1 -348 -195 -544 -202 -240 2 -124 94 365 305 356 299 312 355 -129 -464
3480 -464 -454 -575 -687 -22 -107 172 301 126 383 16 120 -35 164 -212 -89 -248 -242 -332 -371 117 397 431
3502 431 726 627 -53 4 -495 -394 -291 -324 -107 -131 112 255 290 239 400 340 19 87 -50 -310 -55 -346 -344
3525 -344 139 -28 102 129 268 191 486 164 60 -119 -379 -279 -402 -459 -288 217 271 320 447 185 416 154
3547 154 130 151 52 -338 -547 -392 -571 -151 9 190 607 483 222 122 -82 -451 -271 -95 -32 -130 -257 -242
3569 -242 70 96 251 270 449 460 288 18 -467 -510 -396 -403 -135 13 109 128 359 363 296 418 70 17 -147 -465
3593 -465 -264 -264 -284 -232 -81 194 276 96 413 606 206 2 -65 -505 -664 -547 -325 244 401 315 442 123
3615 123 -104 200 418 84 -3 9 -214 -526 -200 -259 157 92 349 510 383 566 205 -99 -146 -324 -445 -277
3637 -277 -247 -207 -105 118 -48 270 338 208 368 240 -102 -164 -263 -398 -484 -182 -177 -50 243 544 492 412 272
3660 272 -151 -75 -177 -111 -481 -103 10 157 -60 180 215 -50 284 54 297 77 -9 -319 -588 -679 -578 -271
3682 -271 192 370 626 427 21 210 114 -240 -268 -307 -298 -6 -502 -201 -239 -116 389 423 365 276 340 195 -301
3705 -301 -275 -354 -1 -214 -44 273 169 381 314 400 366 272 -298 -65 -412 -468 17 -260 -245 23 -133 128 134
3728 134 118 167 376 -55 -204 -100 -504 -368 -198 92 142 438 293 -69 -48 20 164 -83 -32 -20 -365 -326 -429
3751 -429 -257 -59 259 187 435 455 392 -172 -45 -177 -231 -543 -286 -113 241 -131 -230 -85 214 316 233 176
3773 176 -6 -180 -382 -232 -226 -323 -108 -93 80 162 533 311 245 204 8 -165 -210 -282 -419 -218 -74 118 101
3796 101 139 -154 389 341 10 169 86 -312 -283 -414 -537 -340 -7 373 352 368 570 204 116 -229 -195 149 -242
3819 -242 -263 -161 -148 -59 26 119 222 593 289 355 62 -235 -232 -264 -524 -436 144 12 -147 264 241 314 145 340
3843 340 182 -13 -165 58 -413 -425 -118 167 -161 259 321 221 14 244 113 222 -118 -704 -597 -249 -371
3864 -371 -273 132 220 309 192 120 -6 86 62 312 142 -77 104 -406 -147 22 149 638 330 272 367 79 -13
3887 -13 -312 -523 -221 195 -102 -108 23 136 139 167 315 480 66 58 11 -371 -320 -305 -463 -252 70 172 176 181 253
3912 253 101 -32 -61 6 -321 -273 -245 -243 -67 83 131 63 206 258 292 168 133 147 -125 -338 -423 -583 -312 -50
3936 -50 -26 296 548 39 64 153 -449 -148 -222 -152 -49 -77 -141 -315 -89 -77 54 490 407 75 94 -328 -458 -245
3960 -245 -164 -269 -130 23 222 21 106 255 184 265 260 -361 -192 69 -246 -15 -204 -176 -47 315 472 513 284
3983 284 461 70 107 -203 -202 -526 -331 -362 115 152 -64 554 167 -23 -35 128 132 100 -76 -139 -235 50 -205 256
4007 256 60 95 639 541 455 -22 -109 -306 -378 -200 -216 -322 -104 216 188 117 302 212 493 113 153 -110 -176 -295
4031 -295 -552 -245 -232 322 110 -7 339 234 124 162 65 -443 -191 -410 -96 -132 -66 152 171 300 201 59
4053 59 267 161 49 -81 -194 -303 -54 -423 -96 161 54 285 410 372 54 -110 -242 -416 -187 -320 81
4074 81 116 -110 -17 82 210 75 288 330 95 -186 75 -397 -507 -332 -196 -128 25 70 52 86 16 246 214 134
4098 134 0 -191 -26 -304 -166 -78 55 78 18 195 409 224 -13 73 -138 25 120 -254 -294 -34 171 139
4120 139 379 166 36 2 -29 174 72 -41 -76 -257 -228 -348 91 -40 265 219 508 366 299 -260 -246 -129
4142 -129 -383 -282 -56 -172 90 268 -21 -15 280 280 352 98 186 -180 -324 -561 -496 -339 -181 -55 162 84 121
4165 121 246 285 138 -106 29 -163 69 -115 -176 61 141 -36 161 226 246 499 213 255 -94 75 -274 -320
4187 -320 -210 -107 -21 46 494 388 -65 54 -28 307 -207 -45 -295 -274 -406 -230 -137 -91 -133 -127 413 442 204
4210 204 -62 -190 -274 -352 -283 -179 -48 71 42 205 110 324 132 157 308 211 -164 -214 -448 -371 -42 -349 223
4233 223 79 237 432 379 29 197 -30 -330 -217 -378 -471 -100 -95 170 95 306 165 -111 19 57 153 -245
4255 -245 -148 0 -330 -245 -259 -76 602 649 257 368 275 59 -185 -277 -4 -123 -76 -64 -144 48 184 148 344
4278 344 166 307 342 -30 -86 -106 -237 -83 -286 249 208 133 287 27 342 -15 -43 110 -154 -239 -34 -38 207
4301 207 -199 76 324 -352 189 292 303 248 -32 -59 -201 -297 -351 -213 -157 -51 246 195 434 294 -188 -55
4323 -55 -56 -29 -222 -537 -369 -209 -88 -263 -136 35 419 287 223 -135 78 -52 -262 -403 -377 -168 -160 -198 138
4346 138 125 -65 168 351 82 115 -66 -218 -185 -167 -236 -129 10 167 88 201 56 70 256 -113 -234 -64
4368 -64 -411 -205 -159 -175 -99 177 140 71 10 9 94 -12 -79 17 -154 -223 -178 -161 -277 139 308 553 550 306 175 149
4394 149 -56 -159 -97 -5 -217 -61 115 85 -190 233 111 235 146 -117 -150 -254 -285 -520 -88 -102 176 225 238
4417 238 485 422 238 401 107 260 -103 -300 -239 -338 -167 -81 112 112 198 -11 434 -64 22 196 34 -248 -175
4440 -175 -478 -262 -138 -12 163 254 164 186 34 149 -187 -61 -37 -199 -92 -229 -108 -135 32 252 327 263
4462 263 408 199 23 -235 -347 -356 -248 -21 -308 26 43 141 40 129 280 -101 -75 300 -314 -436 -356 -253
4484 -253 -89 -155 -72 242 235 0 -54 179 -175 -174 -19 -181 -57 -201 -130 19 194 369 -25 34 194 139 82 68
4508 68 177 -136 -299 -383 -206 -110 120 342 128 584 6 -132 84 -35 -166 -107 -183 115 -267 -100 93 -214
4530 -214 78 76 507 234 416 90 -77 -616 -364 -278 -33 143 -31 251 263 242 73 73 -90 -236 -216 -169 -145
4553 -145 -8 -218 237 236 19 139 334 364 114 149 -13 -76 -266 -138 -35 -494 164 215 421 49 330 355
4575 355 -9 16 21 -237 -110 -200 -436 -91 -152 -305 9 183 64 377 161 -23 -29 -116 -213 -239 -65 158 131 20
4599 20 225 131 123 124 142 342 -100 -139 -298 78 -280 -419 -57 -215 245 148 318 9 112 23 -23 -42 -169 -301
4623 -301 -309 -201 -147 -143 -23 99 145 -38 216 -50 -52 -13 -268 -284 -315 -442 -169 -59 97 318 410 220 286 267 -57
4648 -57 140 -156 -398 -300 2 -190 -120 233 -19 -145 329 423 402 195 -285 36 -457 -238 79 113 -47 150
4670 150 142 -14 506 82 92 -24 -80 -18 -263 -198 -264 -171 47 111 -90 167 272 274 43 16 117 -285 -301 54
4694 54 -258 66 108 7 183 174 -8 -19 -43 -207 -100 -227 -125 -226 -92 -133 -279 -129 247 393 -135 359
4716 359 318 -261 -36 -309 -164 -409 -260 102 -49 -7 283 -188 -1 362 228 195 415 163 -70 -373 -385
4737 -385 -19 -49 -193 381 202 200 185 67 102 -9 -34 -108 -262 -29 92 -11 1 346 453 -112 152 79 151
4760 151 -154 -173 -94 -164 -256 -607 -130 -95 113 225 383 405 78 -43 -130 -261 -391 -181 74 3 24 -188 -41
4783 -41 192 -8 324 224 135 84 277 -223 -525 -329 -166 -28 162 -9 -28 16 194 170 -17 -71 139 -144
4805 -144 -158 -106 -143 -542 -112 61 7 456 177 516 240 164 -151 22 -185 -341 -217 -253 -139 -32 378 468
4827 468 253 264 328 -74 119 -87 -83 -296 -39 -24 -42 7 -123 76 420 264 -235 -47 -145 -210 -190 -162 80 65
4851 65 -186 203 30 -116 24 123 243 25 -47 78 -262 -188 -208 -312 -88 -57 149 161 245 313 84 198 50
4874 50 -152 0 -129 -63 -38 34 170 88 -35 278 217 -127 -38 -163 -73 -39 -273 -92 -280 -234 -126 212 258 159
4898 159 434 -87 -89 -170 -70 -428 -106 105 -23 -194 -262 19 47 563 79 -82 146 274 -33 -353 -471 -119
4920 -119 -73 -157 -14 123 256 -4 232 -120 -42 126 -275 237 -89 -160 -140 -302 -131 -60 163 209 283 -48 167
4943 167 -234 -354 15 -27 -198 -50 -259 -46 164 252 176 -63 41 318 -204 -334 -280 72 64 -232 31 57
4965 57 113 133 314 234 212 230 -58 -248 -370 -195 -184 3 259 -102 195 95 169 278 95 259 104 -164 171
4988 171 -84 -362 12 -234 298 6 164 131 311 110 -46 -119 -28 171 -222 -288 -75 -17 -35 350 219 206
5010 206 71 -236 102 -33 80 221 -168 -166 -222 -180 -121 55 107 181 381 31 208 -317 -66 76 13 101 -165
5033 -165 -169 -214 172 -38 63 37 71 483 165 52 -536 99 -256 -261 -173 -35 -322 -48 78 -195 0 -169 -141
5056 -141 -77 101 19 -80 46 -128 -302 -404 89 104 96 331 194 217 162 89 -209 -67 -174 -160 -284 -115 220
5079 220 321 340 270 182 85 174 85 -60 -29 -72 -234 -328 -236 34 396 242 132 621 54 -31 -34 -109 -94 -204 112
5104 112 -121 42 210 25 103 265 309 227 24 205 -18 -95 -52 -311 49 -38 -88 320 277 257 323 78 29 15
5128 15 56 52 -235 -92 -334 96 34 35 38 271 361 -78 -72 -23 -55 -248 -101 -182 -371 -282 37 248 142 257 456
5153 456 100 240 -33 -22 2 -5 70 167 -300 -251 -174 124 45 105 373 153 -116 -446 -295 -389 -50 -55 -126 -20 78
5178 78 210 -89 1 154 -165 105 -247 -19 -226 -137 -64 -117 -83 -48 264 114 311 -33 24 191 -157 -134 -429
5201 -429 -268 -303 -382 113 156 129 210 163 3 -244 36 -288 -11 91 -129 -68 -360 153 -72 80 122 220 316
5224 316 -102 -176 -191 -235 -26 -168 -76 -15 -59 5 101 90 8 236 233 322 27 -9 10 -243 -135 79 155 460 325
5249 325 170 -147 153 -13 25 -7 -135 -136 -158 -13 36 -203 -133 73 114 -124 -31 23 71 93 -153 -291 -20 -238
5273 -238 -231 -196 -85 71 -64 131 212 103 -245 104 -92 -9 -25 -69 -159 127 -239 -62 47 226 325 307 -11
5296 -11 -187 223 -242 -312 -111 96 -5 -44 -195 198 -28 228 -156 -2 -145 81 -142 -345 -128 -318 -60
5317 -60 43 -17 13 217 304 103 29 -88 220 -120 -228 -290 -298 117 -5 100 84 264 77 214 116 -63 -279
5340 -279 116 -177 -16 -20 -349 -50 -33 133 140 21 72 327 -5 -271 48 -214 -170 135 114 -7 -167 -143 75
5363 75 257 25 46 96 101 103 -225 -133 -409 56 354 133 98 161 21 371 108 -35 -307 -51 -8 -45 -131 207
5387 207 -122 -175 168 300 -18 285 134 115 53 76 -74 72 -144 -148 -228 19 -4 40 210 70 36 46 -106 -39
5411 -39 -9 -155 -69 -38 -167 -131 -41 70 288 29 390 211 92 -96 -36 -279 -33 4 55 -76 171 166 -68 129
5435 129 -96 187 -104 56 -168 -54 -26 -117 -62 7 209 -19 203 215 83 114 -200 -88 -2 -191 -73 -244
5457 -244 -135 154 5 168 102 312 216 -63 158 -125 -9 -12 -383 -142 -39 31 -6 131 289 172 -46 -8
5479 -8 82 25 -62 -29 -162 -209 118 54 285 -183 38 243 198 122 275 8 -17 -157 -60 -133 -275 175 64 93 58
5504 58 152 223 -126 -258 -1 63 77 -76 -146 -168 -226 -51 138 134 108 123 134 17 -82 -29 -77 -35 -72 -244 192 -88
5530 -88 70 261 35 110 93 -61 -14 -328 -154 -412 -2 -216 -145 137 -213 -47 140 13 341 -47 97 -273
5552 -273 -396 45 159 -226 16 -76 35 351 300 34 155 -16 152 49 -59 -192 -328 -218 -280 3 197
5573 197 -14 173 406 241 -206 84 28 -95 88 -189 -200 12 -67 -7 191 329 228 161 154 -47 301 -33
5595 -33 -105 -180 -174 -75 -23 121 196 -11 195 -42 41 32 -34 -153 1 -58 2 97 99 -76 -77 105 54 27 59 -126 318
5622 318 31 -166 -169 -229 11 101 45 79 214 201 477 176 259 -95 102 -57 -63 -90 -289 -34 184 76 102 287
5646 287 168 296 -34 71 -56 -260 -170 -165 -27 50 167 572 64 255 -64 55 -179 -103 -11 -250 -26 -262
5668 -262 -1 -19 -72 20 -51 301 14 250 -6 -204 -130 -379 125 -126 75 -108 30 140 238 195 165 231 -31
5691 -31 -62 180 99 -147 -122 -203 -147 196 127 -26 -13 193 -22 19 122 -145 -45 -163 -129 -61 -258 -185 94 223
5715 223 -26 141 92 245 257 -199 -396 26 -137 -38 -213 -20 -12 165 334 224 83 -145 -46 61 -307 90
5737 90 -114 -120 -133 291 -24 31 -39 99 214 155 271 -143 -90 -96 -244 -212 -29 -19 -22 376 345 -101 -148 101 -37
5762 -37 168 66 -193 -222 -1 -141 -308 124 444 122 50 403 13 51 17 -39 -97 -97 -89 -149 263 223 -65 424
5786 424 302 -132 -100 -140 -248 -180 12 -90 11 -387 -200 387 256 152 255 556 -124 -29 -99 -247 -300 9
5808 9 111 161 86 -62 -68 303 -257 235 -15 163 -91 42 -376 -534 -353 23 116 -78 52 62 187 157 135
5831 135 155 -98 43 -268 -97 -141 -122 133 240 311 115 156 -16 129 410 250 208 -89 -181 3 -257 -15
5853 -15 -77 -6 -49 247 111 -100 -37 -24 -142 -57 83 -52 42 93 -134 164 75 104 380 362 -153 96 -81 -70
5877 -70 -46 -296 -89 60 132 58 -121 -31 178 133 155 81 238 -82 -159 140 -190 -149 -213 190 -93 157 -26 -196
5901 -196 67 97 81 -46 -50 -140 -195 2 -242 -56 172 161 117 225 150 64 -32 -10 -311 -33 -146 -76 -62 7 89
5926 89 13 308 -17 432 130 -33 -194 -77 -337 -68 9 -151 -135 -222 165 -193 51 99 316 -289 117 131
5948 131 -306 -257 -344 -191 104 76 166 210 -44 136 67 -158 -163 -82 43 -286 -156 131 67 203 -67 208 -28
5971 -28 -231 -127 -103 -90 -33 13 19 -173 -335 -5 -55 57 206 -101 -120 -159 13 -286 127 24 -96 -190 70 -118
5995 -118 -98 -111 2 287 35 -63 -48 43 -116 -220 -215 35 -13 320 81 52 57 -1 -119 -109 4 -279 104 -37
6019 -37 -144 62 -43 -22 272 -165 47 148 52 -71 167 -68 -215 190 -377 -175 -285 -276 -63 14 293 89
6041 89 -26 -206 -19 -76 -32 43 -243 -412 105 115 -71 -36 14 137 103 66 98 -155 -182 -154 -122 79 -41 -68 133
6066 133 194 59 160 8 161 124 116 -23 39 -111 -117 -194 -9 166 227 226 43 -60 32 96 13 -131 -195 -103 -364
6091 -364 -132 -58 -105 207 156 61 191 219 123 194 -251 112 -308 -257 -203 12 19 104 -21 90 -154 174 248 34
6115 34 -267 -134 15 10 -42 -136 -196 -41 14 193 71 296 163 -126 -122 -8 23 -170 -67 -165 222 -12 224 83
6139 83 98 45 106 63 15 49 -298 -183 -144 36 6 -4 4 25 127 208 1 64 -80 171 50 -61 -41 -128 103 -3
6165 -3 -11 72 97 81 -29 -5 38 -91 -68 47 141 -174 -233 -75 -97 233 168 210 -103 -71 124 -21 -45 268 55 51
6191 51 220 -71 87 2 311 -149 27 138 -190 135 -247 -222 -364 -205 -73 -25 106 153 176 -27 63 -78
6213 -78 -103 -111 4 376 -295 75 -42 46 203 -76 112 253 261 402 70 13 2 -76 -118 -258 -119 -68 -156 -131 45
6238 45 29 -57 58 92 -184 -390 -102 -289 95 -254 29 101 25 387 55 379 -6 156 -109 -243 -292 -373 -16
6261 -16 125 -8 139 117 -33 98 -66 -101 30 135 88 249 -17 60 -99 -176 106 -35 104 -70 91 487
6283 487 -185 -12 -132 -145 54 -13 -84 20 -102 144 -54 -7 -40 273 351 136 107 132 201 -159 60 -204 241
6306 241 78 167 -27 171 -271 -41 -270 -104 -13 -40 -199 -190 -181 -114 -118 41 183 195 -104 45 -93 -61 -191 -420
6330 -420 -161 -89 -162 170 197 157 222 31 94 -11 -188 -5 23 -315 137 -116 100 269 -34 241 246 118 79
6353 79 61 41 -212 -271 73 49 -117 -165 72 100 -54 273 287 272 -142 -144 -450 -143 -288 188 -50 -88 156 -242
6377 -242 -77 30 294 85 -203 12 36 -119 -45 -192 66 -212 18 8 -131 34 75 35 -119 -73 70 -17
6399 -17 27 -40 -247 11 -135 -55 3 7 18 223 18 168 -209 19 -156 -76 128 -132 -89 105 65 77 314 -6
6423 -6 94 64 20 55 -214 52 -103 214 -89 -45 -50 196 71 285 127 -210 38 -119 -215 -166 -13 35 49 119
6447 119 -83 49 219 258 309 -86 25 59 -199 -156 194 67 115 98 127 40 99 57 57 167 -288 -173 99 -130
6471 -130 13 -116 -6 109 57 295 169 160 -48 -162 -188 119 148 -237 -326 18 -93 -38 25 43 49 17 -24 -108 -28
6496 -28 203 -275 -165 -52 -96 -123 119 23 -54 -14 -36 234 70 207 29 -44 69 22 -228 176 226 103 -12
6519 -12 142 -175 77 -70 -98 32 -32 -302 -98 -17 199 66 36 -60 58 358 76 48 -332 -96 1 100 -14
6542 -14 -91 -240 189 128 339 15 120 -92 -7 111 -79 -223 -249 -88 46 -89 -1 140 149 -39 327 68 129
6565 129 375 50 -14 -70 -351 -85 -62 71 258 -20 22 -175 375 194 196 247 258 -109 -173 -213 -188 29 -201 188
6589 188 87 -122 -120 74 -85 66 -78 -133 -108 -308 -78 -111 73 -82 77 -165 -143 -60 -57 11 31 -84 -106 -289
6613 -289 -70 72 265 190 142 188 248 -211 -16 -65 -44 129 -164 -13 -108 -143 107 -127 189 -91 7 352 64
6636 64 180 -32 -54 -235 -443 -64 239 -98 304 249 -178 245 -146 79 -148 -94 61 -39 78 -57 -121 -29
6658 -29 132 59 29 166 12 -31 76 -54 -196 -81 -6 -94 331 150 238 105 152 -15 -51 197 -53 45 -363
6681 -363 -28 -187 -162 50 -315 128 234 157 -105 64 215 85 -5 -410 -146 -250 -159 122 -139 -12 143
6702 143 -87 -99 -26 -41 179 -92 -258 -11 -111 -16 -386 -42 211 397 149 -99 -130 170 -132 -56 -181 -75
6724 -75 -34 -133 -172 -64 49 -22 28 41 228 228 149 -235 -73 -46 13 -170 45 93 -49 113 189 74 142 212 -157
6749 -157 -42 -36 -221 -229 23 -19 19 61 -21 -53 -47 -168 -109 6 50 -175 -226 -35 -220 -236 71 -257 41 -123 -127 111
6775 111 -131 52 150 -33 127 9 -125 72 -229 -81 -177 308 -18 19 132 125 61 48 -238 390 -149 -67 21
6798 21 -213 70 77 152 -7 136 34 116 -49 -8 69 0 -29 -107 -95 41 64 -185 170 112 82 -152 11 -122 -25
6823 -25 24 54 166 98 -22 147 -9 -141 -176 35 141 75 -128 -114 12 -24 43 -9 82 107 248 32 85 79 2
6848 2 142 56 54 67 -9 -148 193 -123 42 295 -154 267 -6 155 110 -9 -192 -198 344 -116 -195 -94 -50 -49 -35
6873 -35 118 -147 138 47 123 7 -24 -26 -77 -158 246 -154 -100 -37 211 12 -58 -337 56 129 -31 94 2 -11 58
6898 58 -39 50 5 -34 122 -4 -70 51 260 -103 115 -192 186 18 8 55 -44 26 -129 34 -252 -51 -119 -228
6922 -228 49 -111 -209 -6 -72 -61 181 186 195 196 30 -51 -52 37 56 -154 179 89 -81 -77 -45 90 133 -52 237 -40
6948 -40 44 -34 -97 -141 136 -110 -204 -57 242 175 337 244 233 69 -136 -218 135 -44 -9 -221 145 224 19 172
6972 172 148 -109 84 -28 1 -4 -123 -351 13 -4 141 26 204 0 43 46 128 13 -48 -55 -98 120 9 237
6996 237 -16 -78 21 -134 70 -88 -159 211 -230 -276 291 -117 148 -26 5 -27 -35 119 243 208 98 -156 100
7019 100 -170 -347 0 -48 84 108 293 -29 -213 6 -5 -37 98 221 -223 -244 -212 -125 151 16 101 66 -50
7042 -50 214 205 -161 -144 -64 -7 -262 -163 -137 -81 -216 44 189 171 41 -18 138 -154 -84 166 10 -46 46 -138 -94
7067 -94 114 211 66 119 -22 9 -81 9 -179 -213 76 -34 -124 26 127 12 217 15 271 -91 -13 -106 -139 -39
7091 -39 -157 117 93 28 34 -57 141 145 -108 146 79 96 6 -36 0 9 -23 37 97 32 3 35 101 -55 -93 38 103 -172
7119 -172 -314 -132 -11 2 17 -142 -149 74 21 -3 -74 129 18 7 71 29 -132 -99 137 -30 50 230 149 -25
7143 -25 -168 14 8 -115 16 159 -106 -24 -10 147 -40 100 -148 -107 211 4 -15 -46 -231 64 -70 -52 85
7166 85 -41 -106 46 131 78 -151 -12 -151 107 244 -110 131 -27 -264 124 237 93 -86 97 -18 -142
7187 -142 -147 -316 -270 -175 -237 18 -93 110 252 172 73 125 63 -9 0 -101 -303 -156 187 -55 90 -2 178 17
7211 17 -159 -33 312 -63 -215 88 -23 47 -113 69 -88 -20 36 13 65 -146 -95 -13 -38 -213 14 -81 -37 111
7235 111 -7 -19 -2 170 -137 104 131 -131 17 -18 -250 145 -290 -229 -143 154 -156 219 7 49 -251 22
7257 22 -157 -122 43 -172 21 75 125 -239 -227 -133 -165 -94 4 -173 -233 -12 -18 -21 159 320 85 72 215 124 -31
7282 -31 256 -78 60 -31 -156 -250 -161 -42 -45 89 161 155 78 116 -176 46 1 25 208 -138 23 -234 112 -74
7306 -74 -204 -269 -112 -157 -184 200 368 226 200 165 -188 -170 -114 -19 104 -61 149 87 -75 43 155 124 9 -30
7330 -30 -217 257 -221 96 124 6 111 32 226 -83 -22 -24 75 -360 -116 -76 -178 -148 -120 141 -20 241 -48
7353 -48 -125 51 131 -53 -41 11 34 -143 42 -160 -30 -144 -47 14 -185 248 162 -341 -35 -306 -118 171 104
7376 104 68 25 97 106 5 -149 102 65 249 38 40 -15 -325 -37 75 -46 83 201 9 -38 243 147 32 -208
7400 -208 -73 177 -165 -18 -62 107 152 -263 39 163 -25 59 33 366 -81 -71 -76 -154 -207 188 -17 69 214
7423 214 232 66 67 -314 -310 -25 46 9 -173 -154 -85 -90 -8 264 58 -21 -39 -45 -158 -97 -263 -84 -164 -140 205 -108
7449 -108 6 371 56 30 -235 176 50 -268 280 150 -126 54 8 73 132 -72 -120 -10 -96 -90 103 19 29
7472 29 -86 61 32 -119 -128 175 88 -115 -63 -209 168 12 1 -50 -162 125 -96 6 7 194 2 233 22
7495 22 61 116 41 169 44 -64 -236 -84 256 19 -29 -7 -131 -176 -254 -41 154 15 -160 66 63 -50 -8 58
7519 58 -102 35 37 193 -9 118 -100 -13 106 -155 -26 29 -14 112 180 85 72 296 -23 121 -56 -182 -130
7542 -130 -92 -249 18 47 59 86 72 81 -19 -55 119 30 -123 154 45 -62 147 152 15 -62 -206 -36 -58 -185
7566 -185 149 -219 -304 -95 -249 151 -62 125 57 115 24 -161 23 235 70 -101 199 141 294 106 -62 -55
7588 -55 252 -77 45 6 31 78 -67 324 29 97 -47 -5 -43 -65 -168 18 -166 -44 -358 17 -86 -23 -333
7611 -333 -116 99 188 -114 -70 -74 173 -49 -167 183 50 -85 -245 -43 6 -55 -161 -161 194 93 135 167 -27
7634 -27 212 -44 139 45 -90 -116 -56 -291 -128 -175 66 59 144 -33 308 194 219 89 -126 -76 -216 -247 -152 -26
7658 -26 -168 206 -20 187 -62 347 12 41 196 -3 -147 -89 118 -24 81 -57 106 -176 454 -110 -123
7679 -123 -72 -53 50 62 -52 103 -205 -54 242 219 -222 -51 4 -4 -116 -99 -206 -170 185 -157 132 -32 38
7702 38 224 127 -150 98 73 -20 189 -26 -228 -152 -51 238 -20 5 144 -69 -32 6 96 -48 205 88 -113
7725 -113 -116 210 61 223 -4 1 -342 -40 0 -60 -149 142 158 -76 -172 7 -184 -216 -45 144 128 -23 162 76
7749 76 172 11 -197 22 11 13 134 -57 188 142 -18 93 276 14 -25 16 78 12 47 43 -46 86 -156 135 -56
7774 -56 144 76 86 -111 21 -50 -313 -140 -301 190 -18 -28 -56 -179 111 2 -102 108 58 100 104 33 79 -15
7798 -15 157 62 -141 70 174 -305 147 -26 11 16 65 352 -166 -73 -430 -61 -16 -15 46 218 137 102 86 43 -272
7823 -272 -264 5 -363 -128 -35 -41 136 -50 -14 -58 -145 -69 49 -55 -3 98 -30 -87 7 225 18 207 -58 4
7847 4 -19 -40 16 -108 -42 103 -22 -47 126 -82 262 156 -130 -234 98 80 64 -152 33 167 -131 11 -8
7870 -8 -48 -38 54 22 96 39 109 216 16 70 235 -79 -23 143 142 -228 71 283 -67 72 -55 206 -180 -28
7894 -28 -48 20 72 -223 106 244 -114 -119 -3 48 -8 -105 -170 -82 -253 139 39 -40 -6 -62 -55 -16 88 -129 -21 149
7920 149 201 -243 41 32 -154 -146 223 -12 79 80 -235 305 63 103 72 108 -47 -105 -99 107 -183 -53 -86 174 -65
7945 -65 146 245 -200 -241 -36 -100 -19 -259 -176 177 -87 -57 -191 103 110 68 34 -98 -214 179 128 -62 150 31
7969 31 0 -10 -119 211 99 96 43 97 -51 80 -8 0 -59 215 -59 -135 130 -90 -25 182 -156 -170 200 -38 -168
7994 -168 -168 -40 105 -224 -141 6 -53 -89 -93 3 77 135 203 -369 -56 10 418 -166 -120 161 140 216 118 -6 134
8019 134 -56 -165 -36 -193 -123 -237 -201 26 97 -127 -44 -1 -74 189 -259 -11 -305 -215 -338 -235 -131 129
8041 129 -44 204 -88 -10 45 -134 142 -98 -85 -10 74 9 -122 -102 2 203 13 -75 -197 -132 84 -24 -42
8064 -42 -135 -218 -22 -257 -74 237 -77 -37 -114 114 -194 -229 93 -188 -72 -110 -111 -7 -317 -4 245 21 135
8087 135 213 41 157 164 55 89 17 114 -309 84 156 -18 -3 -112 -35 26 179 94 -48 -229 -2 195 10 -211
8111 -211 71 -3 -169 -168 -17 38 -71 50 37 -89 -123 54 91 80 244 379 -121 47 85 205 -315 -78 40
8134 40 185 -166 81 -65 -160 25 43 -51 -56 184 -99 -100 -92 -101 -138 46 -268 82 -59 -55 -105 25 195 83 -67
8159 -67 -50 214 217 32 -63 -185 -20 13 26 51 99 153 86 15 136 53 -54 -202 -121 81 -93 -89 -44 79 -366 138
8185 138 184 176 167 253 -49 125
8191A25
##END NTUPLES=NMR FID
##END=
