##TITLE=1H_ABT-OOH(bad)-f3-6-rech2
 CDCl3
 8 sc, 
 27.4.2024
##JCAMPDX= 6.0         $$ Bruker NMR JCAMP-DX V2.0
##DATA TYPE= NMR FID
##DATA CLASS= NTUPLES
##ORIGIN= UXNMR, Bruker Analytische Messtechnik GmbH
##OWNER= root
$$ XWIN-NMR		Version 3.5
$$ Sat Apr 27 14:07:46 2024 Russian Standard Time (UT+4h)  she@DPX200
##.OBSERVE FREQUENCY= 200.1309
##.OBSERVE NUCLEUS= ^1H
##.DELAY= (6, 6)
##.ACQUISITION MODE= SIMULTANEOUS
##.ACQUISITION SCHEME= undefined
##.AVERAGES= 8
##.DIGITISER RES= 18
##SPECTROMETER/DATA SYSTEM= spect
##.PULSE SEQUENCE= zg30
##.SOLVENT NAME= CDCl3
##.SHIFT REFERENCE= (INTERNAL, CDCl3, 0, 15.7039)
##AUDIT TRAIL= $$ (NUMBER, WHEN, WHO, WHERE, WHAT)
$$ ##TITLE= Audit trail, XWIN-NMR		Version 3.5
$$ ##JCAMPDX= 5.01
$$ ##ORIGIN= Bruker BioSpin GmbH
$$ ##OWNER= she
$$ F:/spectra/data/she/nmr/H-F/1/audita.txt
$$ ##AUDIT TRAIL=  $$ (NUMBER, WHEN, WHO, WHERE, WHAT)
(   1,<2024-04-27 14:06:20.85 +0400>,<she>,<DPX200>,
      <created by zg, POWCHK disabled, PULCHK disabled
       configuration hash MD5:
       00 E9 B6 7A A2 85 ED C7 34 08 36 98 17 FE 4E 26
       data hash MD5: 16K
       44 B0 76 89 4B 8F 91 F1 77 78 6F C0 AB 76 C5 9C>)
$$ ##END=
$$ 
$$ hash MD5
$$ 83 1D 42 43 74 C1 6B 7C 1A F6 E3 20 B4 83 1E 61
##$RELAX= 
##$RELAX= 
##$RELAX= 
##$RELAX= 
##$RELAX= 
##$RELAX= 
$$ Bruker specific parameters
$$ --------------------------
##$DU= <F:/spectra>
##$EXPNO= 1
##$NAME= <H-F>
##$PROCNO= 1
##$TYPE= <nmr>
##$USER= <she>
##$AMP= (0..31)
100 100 100 100 100 100 100 100 100 100 100 100 100 100 100 100 100 100 
100 100 100 100 100 100 100 100 100 100 100 100 100 100 
##$AQSEQ= 0
##$AQ_mod= 1
##$AUNM= <au_zg>
##$AUTOPOS= <>
##$BF1= 200.13
##$BF2= 200.13
##$BF3= 200.13
##$BF4= 200.13
##$BF5= 200.13
##$BF6= 200.13
##$BF7= 200.13
##$BF8= 200.13
##$BYTORDA= 1
##$CFDGTYP= 0
##$CFRGTYP= 5
##$CHEMSTR= <none>
##$CNST= (0..31)
1 1 145 1 1 1 1 1 1 1 1 1 1 1 1 1 1 1 1 1 1 1 1 1 1 1 1 1 1 1 1 1 
##$CPDPRG= <>
##$CPDPRG1= <>
##$CPDPRG2= <>
##$CPDPRG3= <>
##$CPDPRG4= <mlev>
##$CPDPRG5= <mlev>
##$CPDPRG6= <mlev>
##$CPDPRG7= <mlev>
##$CPDPRG8= <mlev>
##$CPDPRGB= <>
##$CPDPRGT= <>
##$D= (0..31)
0 1.2 0 0 0 0 0 0 0 0.06 0 0.03 0 0 0 0 0.0002 0 0 0 0 0 0 0 0 0 0 0 0 
0 0 0 
##$DATE= 1714212380
##$DBL= (0..7)
120 120 120 120 120 120 120 120 
##$DBP= (0..7)
150 150 150 150 150 150 150 150 
##$DBP07= 0
##$DBPNAM0= <>
##$DBPNAM1= <>
##$DBPNAM2= <>
##$DBPNAM3= <>
##$DBPNAM4= <>
##$DBPNAM5= <>
##$DBPNAM6= <>
##$DBPNAM7= <>
##$DBPOAL= (0..7)
0.5 0.5 0.5 0.5 0.5 0.5 0.5 0.5 
##$DBPOFFS= (0..7)
0 0 0 0 0 0 0 0 
##$DE= 6
##$DECBNUC= <off>
##$DECIM= 32
##$DECNUC= <off>
##$DECSTAT= 4
##$DIGMOD= 1
##$DIGTYP= 9
##$DL= (0..7)
0 120 120 120 120 120 120 120 
##$DP= (0..7)
150 150 150 150 150 150 150 150 
##$DP07= 0
##$DPNAME0= <>
##$DPNAME1= <>
##$DPNAME2= <>
##$DPNAME3= <>
##$DPNAME4= <>
##$DPNAME5= <>
##$DPNAME6= <>
##$DPNAME7= <>
##$DPOAL= (0..7)
0.5 0.5 0.5 0.5 0.5 0.5 0.5 0.5 
##$DPOFFS= (0..7)
0 0 0 0 0 0 0 0 
##$DQDMODE= 0
##$DR= 18
##$DS= 0
$$ [...]
##$SUBNAM2= <"">
##$SUBNAM3= <"">
##$SUBNAM4= <"">
##$SUBNAM5= <"">
##$SUBNAM6= <"">
##$SUBNAM7= <"">
##$SUBNAM8= <"">
##$SUBNAM9= <"">
##$SW= 18.0517689322627
##$SWIBOX= (0..15)
0 0 2 0 0 0 0 0 0 0 0 0 0 0 0 0 
##$SW_h= 3612.71676300578
##$TD= 16384
##$TD0= 1
##$TE= 0
##$TE2= 300
##$TE3= 300
##$TEG= 300
##$TL= (0..7)
0 120 120 120 120 120 120 120 
##$TP= (0..7)
150 150 150 150 150 150 150 150 
##$TP07= 0
##$TPNAME0= <>
##$TPNAME1= <>
##$TPNAME2= <>
##$TPNAME3= <>
##$TPNAME4= <>
##$TPNAME5= <>
##$TPNAME6= <>
##$TPNAME7= <>
##$TPOAL= (0..7)
0.5 0.5 0.5 0.5 0.5 0.5 0.5 0.5 
##$TPOFFS= (0..7)
0 0 0 0 0 0 0 0 
##$TUNHIN= 0
##$TUNHOUT= 0
##$TUNXOUT= 0
##$USERA1= <user>
##$USERA2= <user>
##$USERA3= <user>
##$USERA4= <user>
##$USERA5= <user>
##$V9= 5
##$VALIST= <valist>
##$VCLIST= <CCCCCCCCCCCCCCC>
##$VD= 0
##$VDLIST= <DDDDDDDDDDDDDDD>
##$VPLIST= <PPPPPPPPPPPPPPP>
##$VTLIST= <TTTTTTTTTTTTTTT>
##$WBST= 1024
##$WBSW= 4
##$XGAIN= (0..3)
0 0 0 0 
##$XL= 0
##$YL= 0
##$YMAX_a= 127744
##$YMIN_a= -176252
##$ZGOPTNS= <>
##$ZL1= 120
##$ZL2= 120
##$ZL3= 120
##$ZL4= 120
##$ABSF1= 10
##$ABSF2= 0
##$ABSG= 5
##$ABSL= 3
##$ALPHA= 0
##$AQORDER= 0
##$ASSFAC= 0
##$ASSFACI= 0
##$ASSFACX= 0
##$ASSWID= 0
##$AUNMP= <proc_1d>
##$AZFE= 0.1
##$AZFW= 0.1
##$BCFW= 1
##$BC_mod= 2
##$BYTORDP= 1
##$COROFFS= 0
##$CY= 11.3945322036743
##$DATMOD= 1
##$DC= 2
##$DFILT= <>
##$DTYPP= 0
##$F1P= 15.6554695791079
##$F2P= 12.8336369535428
##$FCOR= 0.5
##$FTSIZE= 0
##$FT_mod= 4
##$GAMMA= 1
##$GB= 0.15
##$INTBC= 1
##$INTSCL= 1
##$ISEN= 128
##$LB= 0.24
##$LEV0= 0
##$LPBIN= 0
##$MAXI= 10000
##$MC2= 0
##$MEAN= 0
##$ME_mod= 0
##$MI= 1.114404
##$NCOEF= 0
##$NC_proc= 0
##$NLEV= 6
##$NOISF1= 3.799351
##$NOISF2= 2.8
##$NSP= 1
##$NTH_PI= 0
##$NZP= 0
##$OFFSET= 15.70392
##$PC= 1
##$PHC0= -25306.47
##$PHC1= 17.78731
##$PH_mod= 1
##$PKNL= yes
##$PPARMOD= 0
##$PSCAL= 0
##$PSIGN= 0
##$REVERSE= no
##$SF= 200.130013532006
##$SI= 16384
##$SIGF1= 3
##$SIGF2= 2
##$SINO= 400
##$SIOLD= 16384
##$SREGLST= <1H.CDCl3>
##$SSB= 0
##$STSI= 0
##$STSR= 0
##$SW_p= 3612.71676300578
##$SYMM= 0
##$S_DEV= 0
##$TDeff= 0
##$TDoff= 0
##$TI= <>
##$TILT= no
##$TM1= 0
##$TM2= 0
##$TOPLEV= 0
##$USERP1= <user>
##$USERP2= <user>
##$USERP3= <user>
##$USERP4= <user>
##$USERP5= <user>
##$WDW= 1
##$XDIM= 8192
##$YMAX_p= 0
##$YMIN_p= 0
$$ End of Bruker specific parameters
$$ ---------------------------------
##NTUPLES= NMR FID
##VAR_NAME=  TIME,          FID/REAL,        FID/IMAG
##SYMBOL=    X,             R,               I
##VAR_TYPE=  INDEPENDENT,   DEPENDENT,       DEPENDENT
##VAR_FORM=  AFFN,          ASDF,            ASDF
##VAR_DIM=   8192,          8192,            8192
##UNITS=     SECONDS,       ARBITRARY UNITS, ARBITRARY UNITS
##FACTOR=    0.0002768,     1,               1
##FIRST=     0,             0,               0
##LAST=      2.2672688,     0,               0
##MIN=       0,             -176252,         0
##MAX=       2.2672688,     127744,          0
$$ Real data points
##PAGE= N=1
##DATA TABLE= (X++(R..R)), XYDATA
0 0 0 0 0 0 0 0 0 0 0 0 0 0 0 0 0 0 0 0 0 0 0 0 0 0 1 -3 4 -7 7 -8 8 -8 8 -10 11 -12 15 -15 17 -20 20 -25 26 -29 33 -37
46 -37 37 -44 46 -52 57 -62 69 -78 85 -97 106 -121 136 -159 184 -218 265 -330 431 -595 902 -1608
68 -1608 3903 -25271 -176252 -144109 32120 120813 38795 -75231 -77089 1141 45066 29050
80 29050 13290 19844 9472 -25910 -39163 -8482 19720 3824 -29612 -30980 -3135 10877 1901
93 1901 3833 25590 32203 4013 -22968 -14254 6873 -1630 -28300 -27730 5793 26740 9939 -13172
107 -13172 -5096 18715 20199 416 -4807 12466 14682 -17042 -47425 -36113 3816 26831 18166
120 18166 3201 385 2696 2745 6469 16100 13296 -10223 -32098 -23827 4522 14065 -5496 -19647
134 -19647 -3114 23889 27294 9432 -1315 2278 17 -14022 -19770 -4376 11123 1670 -21234
147 -21234 -22247 6424 31344 26162 5024 -3992 480 -403 -10036 -11281 -1706 1969 -8588 -16183
161 -16183 -6033 13119 18918 8669 542 5840 11501 4712 -7634 -12533 -12219 -14274 -13363 -512
175 -512 17527 19458 2450 -12062 -5325 13013 19472 8356 -4789 -10228 -12744 -17850 -15163 497
189 497 15668 13118 -371 -3543 7813 15991 7534 -7142 -11935 -5090 -620 -4515 -8780 -7586
203 -7586 -4129 -2065 4452 16986 23578 12873 -6896 -15341 -7610 2692 2680 -4212 -7893 -6468 -4990
218 -4990 -3031 4878 16530 18952 7097 -6291 -6861 421 653 -8368 -15300 -10136 -222 5114 4550
233 4550 3780 4692 4125 2079 4144 9321 8361 -3919 -18134 -20765 -9530 3062 8817 7999 4862
248 4862 2178 614 2608 7072 8811 3190 -7197 -12961 -9436 -3414 -2772 -4096 -1013 6575 11529
263 11529 11171 6847 2042 -2815 -7205 -7828 -3663 948 45 -7383 -12295 -6690 5872 16059 17107
278 17107 10349 1694 -5132 -7468 -6057 -2507 -1773 -4314 -6949 -5219 127 5335 7121 6066 4785
293 4785 4489 3550 1733 -2197 -8044 -13589 -13323 -4898 6290 11543 7808 90 -2728 1116 7208 9240
309 9240 5178 -2020 -9432 -13911 -12440 -5025 2745 6642 5011 2982 2927 5246 5955 3050 -1484 -4914
325 -4914 -4890 -3737 -2703 -3622 -5484 -4984 -44 8331 13934 12350 4167 -4654 -8678 -6591 -1937 347
341 347 -1660 -5037 -7560 -5379 201 7235 11720 10517 5452 -110 -3399 -3778 -3942 -5470 -7749 -6736
357 -6736 -2162 3429 5646 4274 1734 1232 3673 6026 5566 1668 -5142 -11458 -13644 -8305 1304 7839
373 7839 8138 3637 621 1785 4550 5566 3483 -506 -4997 -8058 -8436 -5708 -1715 1126 1428 2361
389 2361 6580 9977 8340 1835 -5541 -7370 -4746 -1201 -421 -2135 -5252 -6448 -3979 2692 10202
404 10202 13283 8888 72 -6070 -6588 -3841 -1631 -1478 -3084 -4265 -3003 945 4654 6460 5051
419 5051 3223 3406 3849 1901 -3200 -9258 -11070 -7728 -2246 3208 6924 6394 2070 -1895 -664 5107
435 5107 8453 4856 -3446 -9634 -10027 -6895 -2981 99 4106 6282 4882 2129 2254 4411 3714 -1162
451 -1162 -5787 -5704 -2231 -1368 -3696 -5807 -3020 2871 7563 9503 8713 5032 -1922 -7960 -7934 -2166 2430
468 2430 448 -5183 -7463 -3639 2639 6498 7655 7400 5171 114 -4193 -4658 -3160 -3499 -6155 -5735
484 -5735 -460 5028 6109 2543 -29 1312 4149 5538 3907 44 -5167 -10424 -11360 -5720 2796
499 2796 7066 4913 1550 1060 2012 3152 3550 3432 1219 -3767 -8021 -7843 -3270 1001 1167 -195 2309
516 2309 7203 8070 4126 -1016 -3199 -3314 -3611 -3151 -1277 -542 -3117 -5964 -4464 4021 11910 11307 4011
533 4011 -2174 -3806 -3057 -3234 -2639 -1721 -1614 -3491 -3538 345 5392 6104 3345 997 2552 4772 1927
550 1927 -4833 -8754 -7848 -4329 -1098 2313 5753 5667 2023 -1241 28 4533 5966 1830 -4255 -6839
566 -6839 -6278 -5331 -3966 182 4772 6119 3351 1688 3179 4365 1890 -2455 -4438 -3224 -1667 -2623
582 -2623 -3876 -2790 -596 1604 4245 7664 9148 4394 -3898 -8300 -4857 655 2034 -1571 -5171
597 -5171 -4742 -1385 1394 4024 7113 7277 3940 -1966 -4179 -2331 -1986 -4304 -6023 -3334 1489 3907
613 3907 3325 1893 1366 1676 2139 3227 4183 1843 -4904 -10931 -9515 -1974 4346 4554 2511 1852 2679
630 2679 1919 76 1063 2890 1316 -3582 -7497 -5890 -1265 702 -841 -229 3410 6916 6299 2585
646 2585 -497 -2690 -3776 -3658 -1791 527 -516 -4285 -5898 -1741 5267 8735 6561 2907 -146
661 -146 -2766 -4848 -4491 -1332 945 -885 -3487 -3197 869 4618 4639 2314 2068 2935 2407 -600 -4450
678 -4450 -5827 -5907 -4682 -963 3843 5676 3330 -873 -1790 1510 4607 4921 1589 -2510 -5518 -6694
694 -6694 -5488 -1515 3213 4301 2780 1244 2686 4099 2408 -1058 -2977 -2550 -1922 -1960 -2575 -2692 -1612
711 -1612 -901 642 4767 8328 6970 774 -5010 -5502 -2012 206 -476 -2161 -2825 -2551 -1386 619
727 619 3973 6491 5543 1489 -1847 -2231 -1935 -3020 -4137 -3594 -1401 826 2493 2753 2701 1439 521
744 521 1311 3022 3760 124 -5675 -8651 -6184 -930 2763 3823 3284 1852 469 395 1330 2434 1823
761 1823 -1075 -4168 -4966 -3422 -1503 -874 -355 1644 3839 4515 4278 2761 -166 -3313 -4418 -2511
777 -2511 295 747 -1558 -4229 -3336 179 4233 6462 5745 3260 -205 -3917 -4521 -2333 -34 -651
793 -651 -2424 -2563 -779 2064 3187 2385 1935 2550 3055 1192 -889 -2989 -4564 -5616 -3716 125 3850
810 3850 4469 1719 -573 -447 1623 3336 3194 761 -2739 -5373 -5724 -3464 99 2190 2644 2042 2697
827 2697 2857 2417 921 -573 -2035 -2315 -2344 -1962 -1622 -1741 -1953 -1023 1653 4871 6193 4484 256 -3267
845 -3267 -3938 -2511 -546 278 -1063 -2628 -3039 -901 2253 4338 4280 2505 707 -289 -1018 -2551 -3815
862 -3815 -3459 -2637 -969 833 2359 2809 1903 489 80 2094 3319 2559 -1118 -5042 -6204 -4407 -889
879 -889 2257 3641 2868 1539 478 624 1608 1980 1073 -1433 -3451 -3957 -2449 -1612 -538 493 1453
896 1453 2946 3983 3985 2360 -1380 -3234 -2930 -1421 -96 -248 -1665 -3146 -2098 269 3847 5846
912 5846 4740 1738 -1697 -2881 -2413 -1655 -1389 -1509 -1951 -1414 273 1906 2530 1888 1392 1599 1848 1319
930 1319 -543 -3718 -5272 -4614 -2158 1186 3062 3122 2010 268 -143 656 2060 2560 597 -2134 -4446
947 -4446 -4459 -2598 -223 1488 2190 2402 1938 1991 1981 719 -1150 -1905 -1796 -1177 -971 -1346 -1820 -1582 -14
966 -14 2354 3944 4978 3317 100 -3175 -3707 -2311 10 503 -1355 -2472 -2258 40 2464 3438 3380
983 3380 1973 939 -266 -1341 -2346 -2866 -3299 -2190 -49 1739 2060 1409 615 644 1297 1677 1928 1256
1001 1256 -1260 -4169 -5744 -3783 -134 2575 2900 1909 1620 1170 1224 807 568 449 -673 -1916 -2877
1018 -2877 -2537 -1539 -624 422 1698 3131 3633 2513 283 -1128 -1678 -2158 -1535 -776 -98 -1221 -2386
1035 -2386 -2128 771 3755 4643 3364 742 -812 -1852 -1952 -1871 -1228 -550 -824 -1044 -225 1490 2335 2088
1053 2088 1515 1563 1617 301 -1798 -3678 -3734 -2784 -1168 784 2421 3007 1187 -358 278 1487 2161 1573
1071 1573 -388 -2435 -3304 -3444 -2184 130 2082 2817 2016 1490 1843 1826 566 -1079 -2076 -1363 -603 -1441
1089 -1441 -1971 -1801 -433 460 1876 3137 4245 3041 -385 -3333 -2936 -1115 455 -435 -1491 -1509 -571
1106 -571 196 1488 2728 3385 2267 218 -1198 -1564 -1382 -2388 -2817 -1975 389 1211 1294 1263 1184 1118 950
1125 950 1398 1553 1055 -1033 -3924 -4728 -2315 424 2161 1952 1825 1375 1030 753 756 960 89 -1486 -2323
1144 -2323 -1979 -1381 -905 -651 58 1928 3485 3323 2036 206 -967 -2154 -2357 -1218 339 195 -1136
1161 -1136 -2607 -1354 1498 3521 3546 2537 1008 -420 -2183 -2936 -1695 -294 21 -1092 -913 535
1177 535 1879 1871 934 1097 1845 1638 45 -1871 -2486 -2809 -2580 -1903 882 3263 3033 669 -804 -13
1195 -13 1542 2373 1008 -973 -2011 -2932 -2917 -1687 497 2331 1929 1075 1516 1985 1515 -89 -1157 -1522
1213 -1522 -715 -857 -1141 -1346 -772 -443 349 1648 3290 3904 1800 -1155 -2586 -2194 -1006 -663 -613 -821
1231 -821 -934 -1023 -93 1621 3114 2733 1197 -430 -785 -877 -1689 -2815 -1950 -472 736 1110 1063 1212 1306
1250 1306 495 118 1270 1935 766 -1951 -4110 -3412 -1080 719 1588 1922 2008 928 348 342 1095 1010 -239
1269 -239 -1818 -2242 -1525 -1262 -1167 -903 704 2257 2636 1975 1168 543 -849 -2284 -2295 -726 446 -205
1287 -205 -1772 -1848 -296 1843 2817 2893 2127 661 -1202 -2150 -1626 -825 -772 -963 -1082 -54 1049 1330 1310
1306 1310 1120 1250 924 352 -40 -983 -1909 -3253 -2785 -773 1551 2712 1791 404 -171 542 1353 947
1324 947 591 -574 -1867 -2823 -2327 -905 484 1330 1448 1598 1744 1618 283 -530 -1135 -1111 -849 -981 -861
1343 -861 -843 -1036 -1145 142 2561 3798 2780 477 -1372 -1748 -1425 -1396 -811 -116 -212 -884 -871 465 1924
1362 1924 3042 1894 612 -97 -227 -1081 -1802 -2382 -1491 -496 680 980 1177 1159 455 513 646 1561 1414
1381 1414 -34 -2013 -3126 -2764 -1299 108 1521 2020 1259 569 256 584 834 386 -612 -1416 -1663 -1227
1399 -1227 -923 -1135 -512 751 2045 2325 2288 1117 -178 -1348 -1384 -1152 -478 -157 -654 -1385 -1021 -476 777
1418 777 2483 3007 1918 124 -1519 -1683 -1269 -825 -805 -671 -524 54 149 840 1108 1492 1449 1010 490 -41
1438 -41 -1258 -2225 -2736 -1800 -282 1593 1857 1090 387 -24 300 854 1343 329 -1046 -2001 -2547 -1721 -629
1457 -629 492 1102 1541 1661 1159 1345 446 -427 -1029 -1013 -754 -893 -504 -966 -1020 -423 878 1975 2598 1972
1477 1972 697 -634 -1654 -1635 -899 -198 -41 -667 -929 -394 316 1710 2163 1798 1083 -490 -879 -1136
1495 -1136 -1515 -1668 -1760 -1067 593 1718 1052 490 436 386 867 1175 964 -243 -1651 -2324 -2500 -1116 657
1514 657 1789 1615 1091 631 234 278 180 97 -357 -1124 -1596 -1270 -751 -504 -171 570 1687 2454 1980 993
1534 993 -502 -1320 -1407 -1106 -462 -167 -428 -844 -1141 -322 1172 2072 2196 1372 159 -851 -1575 -1502 -934
1553 -934 -242 -276 -468 -321 479 1016 949 907 863 1193 697 -368 -1583 -2063 -1841 -1224 -150 1219 1879 1548
1573 1548 91 -425 187 1329 1296 233 -988 -1906 -1902 -1580 -710 524 1488 1630 1014 828 461 485 -456
1592 -456 -1255 -988 -659 -239 -605 -1162 -764 -152 925 1755 2307 2065 304 -1010 -1756 -1005 -287 -328 -489
1611 -489 -567 -402 -401 421 1180 2155 1346 495 -592 -908 -818 -1233 -1593 -1438 -181 770 989 672 504 663 182
1632 182 611 994 891 -293 -2029 -2612 -1761 -273 548 941 1392 1393 975 139 -86 281 440 -329 -1464
1651 -1464 -1416 -878 -549 -679 -447 461 1749 2245 1110 207 -610 -866 -1096 -1275 -372 14 -357 -959 -1098
1670 -1098 48 1589 2236 1462 659 -36 -806 -1420 -1131 -836 -425 -612 -401 307 885 1055 553 474 705
1689 705 1330 730 -743 -1539 -1771 -1824 -1191 73 1414 1710 652 70 -122 443 1132 453 -8 -628 -1215
1708 -1215 -1779 -1642 -439 705 1320 1239 1052 1012 1117 51 -831 -686 -322 -321 -575 -637 -593 -414 -225 565 1802
1729 1802 2395 1575 -163 -1330 -1178 -995 -307 -397 -224 -169 -135 -388 197 1186 1975 1462 379 -126 -505 -655
1749 -655 -1578 -1539 -620 317 591 473 746 410 197 634 560 1028 745 -652 -2052 -2183 -1453 -78 822 1010
1769 1010 1083 1221 359 275 -33 401 222 -303 -1127 -1220 -662 -676 -615 -157 810 1621 1756 642 293 -783 -1072
1790 -1072 -1255 -278 144 -111 -495 -993 -510 312 1026 1399 1760 945 0 -1266 -1508 -866 -441 -244 -515
1809 -515 134 402 468 463 719 605 1220 500 106 -892 -1624 -1488 -1547 -656 277 1354 1228 506 168 389 545
1830 545 627 454 82 -667 -1471 -1719 -1185 -123 591 738 878 1157 1138 498 -190 -702 -580 -248 -415 -813
1850 -813 -745 -476 -383 -64 950 1690 1992 892 -157 -732 -962 -920 -875 -235 -61 -484 -511 -273 464 938 1162
1871 1162 1030 571 -213 -436 -1053 -1186 -1007 -527 -165 482 400 466 469 507 272 773 972 248 -805 -1367 -1447
1892 -1447 -1117 -371 528 1183 1254 1001 76 275 232 419 -170 -505 -790 -896 -756 -837 -267 238 1042 1344 1499
1913 1499 666 189 -355 -928 -751 -311 -126 -252 -564 -804 -422 389 1031 1356 1494 778 9 -959 -1126 -848
1933 -848 -723 -504 -526 -17 243 343 430 472 722 884 612 -86 -472 -1141 -1423 -1192 -472 729 985 840 629
1954 629 235 84 298 484 496 -67 -568 -1198 -1352 -562 -147 433 969 781 959 961 329 -123 -463 -552 -432
1975 -432 -376 -290 -625 -767 -549 51 898 1435 1516 687 -48 -663 -1039 -761 -350 -118 -379 -320 -129 -63 650 937
1997 937 796 760 430 125 -841 -1063 -1339 -887 -418 1 330 921 448 345 -15 523 686 610 278 -950
2017 -950 -1344 -1635 -1039 -144 458 851 728 602 448 113 -61 17 -5 -371 -895 -1060 -671 -534 -125 149 842
2038 842 1191 1298 888 241 -573 -780 -539 -566 -22 -238 -475 -522 -136 316 1117 1497 1176 618 -274 -795 -906
2059 -906 -489 -388 -254 -368 161 140 366 717 406 201 568 429 160 -699 -1159 -1264 -1034 -270 271 627
2079 627 890 637 48 -70 360 386 287 -132 -740 -1235 -954 -774 -240 636 851 978 672 705 413 -170 -831
2100 -831 -457 -134 -152 -285 -461 -460 -251 254 1038 1329 1310 852 -9 -854 -1069 -591 -130 -293 -533 -109 78
2121 78 53 268 831 1016 605 157 -299 -558 -644 -1080 -928 -408 587 148 794 371 306 201 419 661 731 94
2143 94 -823 -1288 -1586 -582 -8 697 833 496 762 493 83 -78 -138 -145 -463 -542 -843 -942 -471 -296 483 893
2165 893 1333 1065 596 -185 -677 -896 -843 -190 137 -219 -473 -222 -153 532 1026 1137 825 196 -338 -621 -768
2186 -768 -624 -316 -228 -168 128 303 541 371 385 345 675 291 -101 -913 -1278 -1063 -713 241 632 954 488
2207 488 394 -14 289 192 95 80 -48 -672 -934 -842 -727 361 455 627 706 650 682 293 -342 -301 -333 -193 -289 -340
2231 -340 -478 -587 -119 329 801 1266 977 523 -140 -899 -702 -566 -409 -457 -196 -368 91 100 476 581 934
2252 934 553 296 -61 -721 -638 -968 -542 -218 235 486 743 395 105 135 119 329 492 -49 -830 -1050 -1135
2273 -1135 -643 10 608 929 914 444 143 153 -160 376 -276 -480 -674 -318 -451 -359 -232 441 1137 956 861
2294 861 601 -290 -731 -863 -520 -192 67 -332 -672 -355 118 382 777 865 842 149 -685 -926 -846 -663 -147
2315 -147 -386 104 298 572 501 316 333 441 434 175 -283 -294 -924 -882 -1010 -124 583 770 834 13 43 301 359
2338 359 20 283 -191 -648 -915 -806 -411 171 545 579 702 660 591 -53 -406 -213 -274 -110 -312 -208 -547
2359 -547 -263 -78 420 774 1231 626 11 -201 -774 -408 -537 -222 81 -214 -304 -130 246 738 630 473
2379 473 461 32 -139 -568 -862 -433 -383 -202 197 555 555 613 271 116 482 512 230 -325 -849 -1045 -693 -386
2401 -386 -58 505 808 613 403 154 244 354 -94 -161 -768 -196 -428 -378 -263 88 680 744 740 499 330 -211
2423 -211 -219 -656 -446 -458 -142 -235 -275 -272 42 493 688 1028 533 6 -525 -651 -710 -382 -353 -408 173 455 296
2446 296 385 240 408 397 434 -89 -184 -522 -818 -794 -514 247 700 595 454 338 88 156 330 119 188 -196
2468 -196 -785 -710 -552 -371 -152 280 903 757 584 285 90 -344 -648 -118 -306 -14 -118 -278 -216 -304 422
2489 422 1019 809 666 -211 -226 -421 -694 -478 73 -142 50 -260 102 267 634 830 451 181 69 -312
2509 -312 -499 -894 -871 -293 106 524 545 400 122 446 141 373 346 323 -539 -622 -705 -665 -494 237 469 714
2531 714 474 361 28 -60 -138 -388 -93 -548 -251 -695 -524 -30 67 255 645 737 947 300 -470 -373 -554 -280
2553 -280 10 -147 -191 -472 -131 -79 584 517 463 389 -17 3 -519 -622 -581 -244 -266 345 260 226 111 386 265
2576 265 333 320 89 -272 -628 -743 -486 -250 56 712 629 541 76 324 115 54 -114 -77 -493 -453 -430 -49 -441
2599 -441 58 490 612 818 377 31 -230 -420 -270 -234 -88 -3 -288 -354 -384 154 234 765 951 472 -176 -351
2621 -351 -639 -491 -388 -120 -6 -88 -25 -24 280 429 612 386 109 86 -76 -488 -643 -509 -205 -28 288 627
2643 627 535 332 211 159 233 349 214 -279 -602 -793 -693 -397 415 366 653 585 426 -23 198 -166 59 -155
2665 -155 -301 -582 -317 -287 -305 211 272 874 561 401 -235 -431 -382 -707 -437 -105 44 -134 -234 -171 327 553
2687 553 373 627 341 182 -325 -653 -543 -230 -359 -7 214 92 194 379 234 347 320 377 51 -100 -499
2708 -499 -623 -680 -367 50 586 471 346 -13 218 -38 -74 217 -254 -244 -496 -572 -269 -169 363 561 481 589
2730 589 310 183 -346 -311 -98 -292 -24 -113 -102 -166 -258 -2 400 997 705 242 -23 -411 -413 -450 -268 -38 44
2753 44 -1 -98 -168 271 340 417 420 421 -275 -356 -524 -457 -361 -230 238 346 239 427 248 -140 14 181 130 180 -131
2778 -131 -513 -655 -536 -195 219 548 534 311 165 140 -198 80 -293 -155 -362 -260 -279 -333 -270 250 534 828
2800 828 553 252 -70 -442 -422 -631 -61 -19 -303 -80 -103 -158 76 405 751 330 320 -120 -731 -383 -513 -139
2822 -139 -453 -101 209 211 406 443 26 225 256 36 44 -359 -506 -819 -674 -96 374 355 525 398 332 75 -181
2845 -181 181 162 89 -322 -485 -694 -356 -249 -79 633 569 401 368 142 -238 -416 -60 -339 -89 -270 -139
2866 -139 -306 -264 26 554 529 731 247 -321 -330 -372 -625 -116 -244 128 14 -6 147 335 421 246 84 264
2888 264 44 -171 -549 -531 -321 -266 96 305 344 626 161 -71 223 180 398 -69 -493 -487 -535 -576 -216 184 484
2911 484 624 371 284 268 -236 -113 -498 -137 -352 -311 -306 -372 -278 667 298 412 343 493 -114 -286 -751 -433 -112
2934 -112 -84 -251 -155 -57 283 227 273 489 338 340 -124 -396 -571 -515 -253 173 -100 461 143 193 -79 215 371
2957 371 196 227 83 -167 -605 -585 -367 226 266 322 580 337 6 54 276 -61 -34 -358 -287 -663 -573 -313 -100
2980 -100 130 476 637 400 297 -4 -359 -380 -213 -211 -57 -224 -32 -381 121 140 509 674 287 324 -134 -211
3002 -211 -391 -61 -289 -231 -127 151 -129 208 172 371 235 292 246 -154 -394 -485 -435 -359 -249 302 234 424 533
3025 533 163 -70 -22 182 -65 -204 -233 -297 -415 -22 73 441 578 472 341 347 209 -118 -170 -119 -189 -34 -74
3048 -74 -297 -139 -69 -47 363 553 584 346 26 -500 -266 -122 -209 -181 -292 196 -3 -24 202 448 284 189 77
3071 77 -184 -280 -183 -343 -441 -185 57 601 67 341 189 -87 477 67 302 17 -322 -334 -399 -35 -78 176
3093 176 229 436 336 532 -203 258 14 2 -52 -613 -323 -417 -181 31 81 408 346 206 263 -31 -277 -287 -383
3116 -383 -176 -250 -53 -3 -220 66 113 416 604 504 12 -53 -516 -372 -227 -252 157 -176 -139 -16 -66 -16 414
3139 414 162 234 110 -23 -157 -431 -226 -169 56 197 282 302 -6 240 -111 15 51 102 4 -480 -549 -334 111
3162 111 281 146 372 329 176 19 -62 -4 -275 -179 -321 -270 -115 -56 -368 -123 270 433 401 440 133 -49 -338
3185 -338 -544 -478 -129 -93 -46 -24 -145 -13 287 471 548 214 59 -303 -443 -482 -361 -93 5 -39 389 237 105
3208 105 -26 178 262 -16 -27 -269 -210 -269 -265 -168 -5 314 338 466 326 100 177 79 -399 136 9 -187 -326
3231 -326 -286 -369 77 132 440 383 247 53 -110 53 -241 -96 146 -47 -252 78 -289 67 437 302 549
3252 549 430 188 -366 -557 -225 -544 -293 -265 168 152 147 352 55 384 187 171 94 -133 -506 -316 -646 -335
3274 -335 -555 375 178 324 194 -136 37 365 205 158 68 -354 -546 0 -98 -112 265 471 214 214 230 -80
3296 -80 52 -153 5 -112 -171 -411 -200 -364 105 198 354 449 404 5 -99 -474 -377 -233 -88 -234 168 7
3318 7 18 146 41 162 442 375 23 -48 -117 -51 -373 -332 -128 66 303 189 17 142 -281 127 547 198 -29
3341 -29 -267 -409 -407 -23 206 219 230 439 25 125 -38 -258 21 -336 -197 -389 -176 -298 -152 -24 134 162
3363 162 584 107 139 54 -331 -212 -168 -228 -81 51 -21 -62 193 187 127 493 153 26 -382 -242 -375 -53 103
3386 103 224 172 51 285 -14 56 58 289 -10 -60 -108 -179 -285 -327 -426 -220 204 184 317 167 248 -54 -69 -91
3410 -91 -97 -331 28 -271 -249 1 53 162 565 107 218 244 68 -298 -55 -67 -184 29 -286 -150 87 92 187
3433 187 499 365 160 17 -377 -345 -264 -97 -263 13 76 -40 27 -42 71 124 513 191 -155 -311 -271 -221 -148
3456 -148 -201 264 203 186 84 310 133 119 112 58 56 -132 -237 -399 -386 -513 238 85 127 127 -75 299 -85 -122 0
3481 0 -33 63 -198 -210 -256 -57 -26 234 463 433 40 23 -81 -194 -359 -86 -18 -277 46 -357 49 -205 339
3504 339 479 255 440 80 -203 -240 -524 -335 130 75 236 149 49 249 -23 39 107 369 42 -209 29 -394
3526 -394 -190 -73 -1 361 191 241 98 9 287 180 64 -255 127 -499 -89 -290 203 28 423 420 24 158
3548 158 -107 -28 -153 -11 68 -204 68 -10 -203 -54 76 46 298 282 86 11 -188 -207 -70 -53 -88 -97 57 -339
3572 -339 -203 324 8 111 273 -59 116 -290 -535 -490 -376 16 180 24 365 -91 112 6 80 172 -9
3593 -9 112 25 -200 -260 -280 -207 34 292 137 -74 46 146 1 136 -94 -24 -101 -155 -369 -64 -192 -2 198
3616 198 427 367 239 129 -188 -215 -243 -253 -365 -96 93 -101 -159 256 198 433 358 24 -79 -179 -343 -425 -304
3639 -304 59 116 38 450 85 35 90 159 -2 155 -70 -360 -293 -301 -117 -260 -211 182 389 173 107 137 252 6
3663 6 161 -53 26 -1 0 -270 -95 111 123 218 255 129 66 -252 -194 -168 -137 -357 14 -299 -39 -189 -2 289
3687 289 141 367 250 99 -144 -407 -45 -97 -319 141 -14 143 27 114 35 164 496 135 14 -420 -403
3708 -403 -333 -291 -238 189 295 569 141 295 42 26 60 33 -3 -84 -204 -630 -248 -35 -1 208 238 174 231 -134
3732 -134 19 -265 122 -50 -254 42 -369 -147 280 23 372 751 72 392 87 -201 -282 -50 -185 -106 -54
3753 -54 -141 -75 -273 17 401 372 255 277 62 -306 -245 -307 -146 41 -271 165 411 -104 66 181 239 250 12
3776 12 -83 -215 -241 -269 -191 -18 -62 197 393 167 15 0 32 33 254 -328 -100 -294 -208 -268 52 215 165 255 85
3801 85 298 -96 -78 -205 -51 -357 2 -57 -359 -403 -209 142 95 404 176 35 66 -53 -160 -260 -40 -59
3823 -59 -66 77 -235 108 7 172 109 591 324 -157 -125 -372 -1 -175 131 55 27 262 247 284 85 313 10
3846 10 -111 -43 -259 -186 -326 -222 57 139 508 332 246 116 -111 90 -45 -115 -35 -70 -91 -77 -137 135 -59 274
3870 274 134 386 177 -40 -53 -268 -106 -98 -361 -45 181 -20 -42 13 427 249 228 104 -231 -194 -105 -324 -134
3893 -134 -8 88 163 89 101 78 -69 136 234 39 107 -126 -617 -118 -182 -32 80 214 395 223 -39 -212 348
3916 348 163 -22 -79 -30 -171 -281 -19 -43 118 -208 248 386 195 182 -188 -265 -46 -5 -248 -165 -76 -219 141
3939 141 -18 279 242 466 6 -99 -350 -230 -228 -135 296 22 238 -94 146 96 176 126 96 309 194 -447 -173
3962 -173 -216 -222 -219 45 237 94 86 54 -130 -215 64 76 -201 -78 -151 -121 -396 -177 127 280 335 120 -20 155
3986 155 37 -55 -145 -262 -309 -227 84 -133 -67 -160 494 118 184 -166 -126 -278 -181 -398 -96 -196 -225 -99 -5 -353
4010 -353 7 370 128 166 122 -145 -78 -235 -159 143 -102 107 15 85 93 50 46 51 86 205 54 -268 -461 -256 -271
4035 -271 -46 -130 -71 25 62 117 -56 -63 159 -323 -162 -12 -431 -248 -203 -19 158 164 423 177 -93 196 -202
4058 -202 -414 2 -284 -41 -163 118 320 121 265 60 576 358 -164 -18 -358 -382 -365 37 196 -2 -107
4079 -107 216 -42 -122 222 476 49 -137 -329 -147 -219 -353 -85 -29 -116 105 190 163 27 2 103 -238 85
4101 85 -139 -92 -102 -138 -51 8 70 178 416 -135 -123 -157 53 71 -26 95 -178 -76 13 59 -125 -59 11 297 161
4126 161 -152 -162 -233 -209 -147 -34 18 -195 -176 -18 -11 -15 291 291 396 -159 99 -189 -208 -291 -251 168 236 153 196 137
4152 137 -19 -153 -39 269 198 132 126 -320 -485 -74 85 258 53 82 12 12 -57 150 -150 -43 -23 -406 -119
4175 -119 -216 -151 0 107 445 153 309 274 -337 -174 -166 -60 -19 23 -27 -156 -108 -8 99 387 400 380 55 -66
4199 -66 -224 -151 -150 -111 101 -115 155 51 165 24 151 174 -124 -115 -155 -234 -318 27 -417 74 163 158 338 153 196
4224 196 -27 149 -199 138 42 -23 -82 -231 155 53 374 136 -56 201 309 -197 -93 9 82 -189 -61
4245 -61 -79 30 -259 83 136 375 243 71 47 -39 16 -123 54 -4 48 45 11 -177 -84 188 41 -30 217 -35
4269 -35 -144 -153 -46 -80 56 -32 -94 63 15 -26 121 -17 149 180 122 -198 9 -333 -219 -97 205 164 86 402
4293 402 335 34 32 -20 -228 -199 -61 -147 -300 -76 -420 -21 183 379 8 -12 114 195 5 -59 -196 -187 21 -140
4317 -140 84 -36 -140 71 407 104 395 52 50 -146 -286 25 30 -31 70 17 127 10 58 -96 218 -54
4339 -54 -206 -105 -326 -276 -332 -57 21 197 112 177 115 48 30 103 264 -234 171 -69 -194 -97 -310 62 -9 170
4363 170 215 -1 191 -6 72 -29 159 176 -17 -214 -55 -411 209 -65 314 211 168 42 -230 -254 -63 100
4385 100 -226 4 95 10 -92 -54 110 140 226 382 -135 -210 -305 -295 -187 118 -2 292 196 221 -122 136 -92
4408 -92 35 30 -19 147 -198 -52 -277 -206 47 72 359 87 194 -20 -268 -9 125 232 141 -92 -34 -196 -81
4431 -81 61 47 132 277 -159 154 -3 -108 -227 40 -212 -106 -117 -190 31 -27 103 166 17 -38 -18 -140 -212
4454 -212 -324 -65 -124 -22 -196 76 94 -126 396 80 0 77 63 -75 245 -210 -279 -28 -73 138 41 -66 71
4477 71 40 -8 245 313 49 -307 -297 -120 -388 6 -8 127 158 264 186 -20 -5 -5 -133 -107 -259 83 -2 -48 62
4502 62 -143 260 137 -64 48 24 -244 -38 -139 -21 8 -27 -106 -42 -150 201 451 280 186 233 163 -175 169
4525 169 -127 -99 -8 111 -16 93 160 30 -61 42 154 -98 18 -86 -159 -256 -233 -117 91 9 229 164 -77
4548 -77 146 -53 -51 -6 -7 -81 -178 -190 -195 -85 -33 65 84 111 90 -47 45 -134 -166 -53 -94 -24 128 28 68 15 -22 375
4576 375 36 261 -199 -116 -191 -216 -232 178 -8 107 -33 96 101 14 463 -117 167 -132 18 -385 -169 -333
4598 -333 165 -115 210 245 194 328 -172 -84 20 -171 195 -21 -259 94 -70 256 -116 104 157 4 15 -162
4620 -162 64 -76 -53 -145 -106 64 -244 5 2 -135 -100 258 36 189 183 -200 -230 55 -140 75 126 7 -119
4643 -119 -69 172 230 271 161 108 -283 -146 -34 -374 -219 183 100 186 83 30 -11 150 50 -103 392 -36 -132
4666 -132 -147 -152 -123 50 -161 245 423 254 -71 199 -79 -79 -90 61 -73 -261 -130 134 -207 127 37 90 103
4689 103 -52 123 -155 -169 -112 -256 135 -258 135 -27 -63 -61 228 -150 191 58 27 73 -70 -413 139 53 290
4712 290 -95 36 -140 -50 5 -74 81 -158 -77 66 -81 -115 -168 -1 47 168 173 132 12 211 24 103 -30 94
4736 94 77 -242 -168 -141 -1 193 231 126 351 6 20 49 18 -26 3 102 -72 -204 -122 -11 13 26 154 185 315
4761 315 -151 -81 -138 -293 63 -4 119 238 40 363 94 103 259 -45 -44 -70 -33 -325 -147 114 -156 -98 -8 -33
4785 -33 36 185 168 121 -101 158 -180 -141 -205 -21 22 56 56 -131 -41 147 111 44 22 -44 81 -189 -77 -435 -222
4810 -222 -141 100 47 265 27 332 306 175 161 -29 -361 65 58 -5 -226 32 161 70 91 335 274 94 -181
4833 -181 -115 -151 -126 -32 38 -62 133 147 204 -14 -28 175 84 130 -215 -290 -131 -282 -78 63 -13 268 164 -161
4857 -161 81 58 -189 -8 165 -25 156 -126 -35 -22 183 126 245 100 238 -69 122 -120 -10 -103 53 -30
4879 -30 -184 11 -270 -146 -132 246 -22 316 148 -22 -203 -194 -318 -234 40 212 280 92 45 -113 29 243
4901 243 79 -99 -131 -138 -204 -294 -137 -93 -232 -36 -144 79 -260 160 -19 -63 109 57 -176 -278 56 -173 137
4924 137 -150 -87 105 227 61 -82 -75 95 -159 -148 -67 -209 -202 -134 145 -25 23 221 298 36 -26 -69 33 -108
4948 -108 -75 -42 148 196 46 -40 123 399 -11 -11 -165 -258 -231 -378 98 -111 -12 2 -76 168 10 179 142 -154
4972 -154 135 141 -50 -240 -461 38 -287 -99 239 125 126 87 153 138 132 118 67 -109 -321 -24 6 -34 -28 166 438
4997 438 188 239 -25 -106 -122 -93 -234 -175 -108 -37 -275 -57 -2 233 70 271 168 370 154 49 -111 -71 -28
5020 -28 -71 193 21 62 -144 294 140 -50 39 209 20 -76 -37 -107 -25 23 -118 -74 271 -22 183 -18 -198
5043 -198 -17 -12 -382 -159 -102 -334 -35 -11 96 136 466 151 -114 147 -172 -131 9 -42 -244 140 -120 -52 14
5066 14 -48 22 -161 323 5 -343 -216 58 -128 286 16 151 136 -329 -119 202 229 11 86 99 -143 -150 -65
5089 -65 339 -189 41 132 223 179 -189 122 -58 -58 191 -86 -140 -164 -80 -300 62 296 98 6 139 -2 176
5112 176 6 182 -130 -116 201 101 -148 -253 -69 55 256 0 78 91 123 -41 33 -85 7 -63 -141 117 147
5135 147 -225 -122 151 263 23 190 205 -54 -3 125 -305 -122 -51 120 130 226 187 27 163 -95 156 12
5157 12 -31 -7 25 -148 -205 -3 -105 121 83 35 121 4 49 101 169 -3 -383 -227 -116 15 229 173 291 326
5181 326 139 22 106 147 102 46 -107 -73 62 1 -181 55 -40 284 154 228 30 -92 -227 107 -160 -80 -72 113
5205 113 -119 255 -15 133 -72 162 114 198 -95 81 -168 -207 -88 122 -210 161 -117 160 -112 89 -94
5226 -94 201 52 -112 163 -164 6 -257 -34 -210 204 86 -28 77 -151 30 -118 -7 178 -194 -68
5246 -68 32 -101 294 7 243 58 226 -87 -207 209 -119 -203 -8 39 73 -152 61 11 73 164 -45 175
5268 175 96 -31 -22 -331 40 -213 -207 136 92 18 -104 333 28 164 207 -102 67 34 -195 -424 45 196 111
5291 111 166 -27 -147 -83 -228 235 163 31 -64 -138 -156 -245 187 -219 135 213 8 216 -7 -161 6 144 -250
5314 -250 -275 -212 -30 91 -62 139 277 186 183 287 211 182 -36 -129 -76 347 -151 317 -23 -56 100 129 175 127
5338 127 312 303 -150 -83 -204 -144 -273 95 133 -83 -12 20 78 48 73 142 -134 -90 -229 -139 146 -116 60 118 147
5363 147 -40 -2 219 -49 -51 -19 122 -263 -145 -95 -71 -65 61 330 81 207 266 -322 -220 110 -420 39 75
5386 75 128 228 -224 6 69 -127 34 247 -17 144 -76 -137 -347 -78 177 32 -126 -156 -181 221 209 57
5408 57 -38 -5 35 57 -140 -181 103 -69 1 90 186 -122 20 73 36 -37 -30 -251 351 -63 9 20 -58 14 352 271
5434 271 173 -48 -120 164 -29 -43 76 20 -479 72 44 -231 9 -152 -40 201 159 -112 52 -235 -69 -83
5456 -83 -146 350 14 -70 -127 229 158 60 23 -18 76 -65 -136 -16 -273 1 -142 -24 -23 152 148 145 99 103 -144 89
5482 89 -118 -96 -131 -178 -4 -22 286 0 167 55 -186 -132 -89 -27 -190 -111 -270 -31 -260 -319 261 283 134 120
5506 120 -199 -233 -157 -60 -92 -110 -38 254 181 -35 -308 26 231 69 104 122 -98 -60 -408 2 -133 204 -22
5529 -22 -33 169 127 41 145 -63 26 28 132 -59 64 -153 -126 -41 148 28 216 12 299 -161 -14 109 8
5552 8 -59 -95 -223 -50 -75 14 250 -31 167 115 -64 132 -8 -34 36 -72 -58 -96 -364 -294 -1 180 156 -88
5576 -88 253 336 186 27 -427 -154 39 140 -257 45 -192 -60 209 56 174 59 -39 104 -71 -352 -294
5597 -294 -261 -35 92 159 -114 29 63 19 7 -44 109 108 -61 117 -326 61 -253 44 155 -113 109 12 51
5620 51 -145 280 -29 149 193 25 52 -53 142 136 133 217 -16 6 74 -174 63 -5 120 -8 6 -150 118 58
5644 58 223 14 6 110 -45 23 63 -99 71 177 -46 -204 -212 -20 224 -67 117 185 165 20 -132 -44 128
5667 128 -2 -29 -192 118 84 224 56 192 55 133 -128 -101 -54 -104 -55 -311 311 -225 -42 101 5 -3 59 159
5691 159 161 51 28 -5 15 73 235 -112 25 113 288 149 -176 80 -122 -63 110 9 36 25 131 103 89 -246
5715 -246 -23 149 134 -54 2 65 59 54 -334 -54 56 -100 268 90 104 58 68 195 -64 -146 -98 229 -43 -147
5739 -147 -270 25 2 -143 110 -99 -108 -133 54 -62 71 29 -264 -37 -50 354 -74 -68 29 -59 155 -114 13
5762 13 -167 -53 -34 178 161 -141 139 162 -15 -52 213 264 139 -46 126 -161 84 234 183 -113 73 313
5784 313 -11 -63 22 132 226 158 -53 -72 183 -120 -22 205 -165 91 -16 12 71 12 -63 -34 -34 80 -20 -36 -254
5809 -254 -350 64 62 48 70 -49 -221 53 -116 -156 -7 -197 89 -17 8 166 -29 -1 100 -124 97 -9 144
5832 144 -46 -24 38 -120 -56 319 354 42 176 -344 -101 -113 73 -105 182 -152 -235 -37 -136 40 -127 50
5854 50 72 39 -49 -73 -11 -12 93 -65 -93 118 32 -98 -157 -182 -43 -157 -19 -54 -179 -131 -175 318 -24 280 -125
5879 -125 165 -58 -88 -88 -47 -83 -27 83 -19 31 -191 -294 -265 -97 -254 3 49 -39 101 -8 -10 158 73 -1 -25
5904 -25 18 176 -72 -149 255 -235 -146 -230 -140 -25 14 -6 168 39 -6 -109 -188 -153 -97 -125 147 119 73 -42 -123
5929 -123 -35 32 62 -112 153 243 -156 84 92 103 -38 227 -119 -139 -81 -49 184 -142 -90 175 -302 36 -94 67
5953 67 2 167 208 -46 10 -167 -157 -42 -47 0 -66 -3 -250 142 -105 -117 -75 -75 263 261 -102 -268 91 66 -192 -191
5979 -191 -144 -4 10 -7 62 -5 58 -73 -138 3 176 -159 99 28 -115 52 133 59 4 13 183 -214 -76 34
6003 34 28 -201 144 -80 -49 60 84 47 -114 -69 -127 -19 -172 -168 -27 8 -58 54 -222 59 -157 -129 144 295
6027 295 -73 -180 -1 -145 -96 -200 -7 29 -229 -28 165 45 269 -194 -168 43 130 -35 -8 -16 -111 39 -94
6050 -94 -67 37 171 157 27 -51 -214 41 -61 -154 100 -122 -180 157 209 -264 181 225 101 -13 -139 -76 77
6073 77 -223 157 15 100 188 -37 162 96 213 269 -16 53 -185 162 -116 -251 -148 -147 -25 173 -200 -80 166
6096 166 -8 23 239 59 100 -73 -109 -201 -20 -38 -12 240 -135 34 86 41 -192 267 53 108 98 -127 -248
6119 -248 -58 -123 -157 -139 341 117 25 -77 27 -91 -249 155 122 3 -147 -91 -188 111 112 224 118 -125 -53
6142 -53 -201 -42 26 -125 -135 31 -132 -107 -11 146 -11 358 211 99 66 -68 -71 28 -24 -41 -120 -57 64 6 125
6167 125 93 -83 -28 234 131 -96 -54 -381 78 -273 240 95 236 41 175 120 -92 -96 -185 -149 129 145 117
6190 117 249 197 100 -14 61 249 -101 -36 -222 -150 30 -112 21 -88 -272 73 308 142 345 254 -7 -53
6212 -53 -49 85 -77 115 150 -20 19 8 -68 63 -52 41 93 79 -107 -24 41 346 -12 -112 -287 -4 -70 207
6236 207 -72 236 -120 160 -161 -161 25 -2 -243 -69 83 -114 -9 266 -63 -343 258 -5 -21 175 -11
6257 -11 61 -145 20 85 -24 -264 205 73 -107 117 86 87 -24 -12 20 68 88 213 181 -33 -62 -107 65 57 -161
6282 -161 18 -23 19 -384 -176 217 -16 -57 99 -39 80 -139 -114 -60 29 158 -131 -315 -74 125 165 83 179
6305 179 -29 -13 316 -53 34 -11 75 102 14 58 -160 -145 323 96 120 123 -47 -114 -360 76 72 74 -24 -34 -123 -76 -31
6332 -31 209 15 69 -133 47 62 -23 15 10 -62 -206 -218 34 -93 -36 273 -188 11 -43 71 31 68 2 95 -56
6357 -56 208 -10 138 -24 -230 193 111 212 183 -191 64 160 66 34 -63 20 -47 71 -30 140 -253 47 -64
6380 -64 -29 -156 1 -118 -52 11 1 -20 -95 169 130 -35 186 52 47 48 -17 -103 52 26 -49 -192 -4 -25 17 478
6406 478 23 56 209 -24 -34 198 -48 -183 131 -37 -79 -279 211 -151 -88 -178 -185 264 140 -27 -172 156
6428 156 150 112 -37 -33 254 336 40 -48 -133 146 -2 69 84 -117 -36 -9 -279 151 16 93 41 24 2 61 -12 -46
6454 -46 -162 -58 152 239 12 6 12 50 210 -15 180 28 -54 130 24 -194 -328 44 -84 77 12 -77 -97 -264
6478 -264 -153 170 -34 35 90 -90 -94 -14 -49 63 65 26 -123 -59 -67 55 50 -122 -39 97 -73 -35 -60 234 -103 24
6504 24 97 -127 40 -11 7 -152 175 -26 4 57 62 135 49 99 18 -18 56 375 -68 -18 -188 8 -28 -12 86 -38
6530 -38 246 -68 -302 -124 -197 165 -179 -357 117 -220 -43 -16 -356 -271 -206 82 -135 189 360 -297 63 181
6552 181 -84 -122 -97 -14 162 -326 -41 168 -15 -133 80 50 -71 -176 -19 280 -3 -78 88 -237 12 195
6574 195 -167 179 -242 -37 -213 -55 -13 -196 -116 81 -27 -220 -53 172 2 154 21 12 81 114 73 -228
6596 -228 111 -223 273 -48 140 359 -30 124 -126 -29 12 -138 -4 105 -47 -200 -10 92 -58 2 90
6617 90 122 -96 23 -11 -163 -63 148 -139 -48 188 88 -166 -40 35 -25 -236 -157 58 -12 112 198 42 37 -130
6641 -130 -27 -130 -36 6 363 73 -33 19 50 69 32 -64 -290 -108 -31 232 128 -11 6 -16 -14 -54 -59 -241 -52
6666 -52 -30 -31 -28 -250 28 82 -23 27 282 -19 73 207 84 -253 -26 -209 130 -22 119 4 140 135 119 -38
6690 -38 23 112 78 -156 26 25 152 -144 23 27 11 -275 176 -62 -224 101 94 172 -106 152 73 144 63 89 -87
6715 -87 112 -187 -102 -38 130 -36 -17 38 -130 33 -121 -221 -137 46 -50 49 -128 141 136 79 -126 -197 -149 -14
6739 -14 -144 -140 189 114 224 -1 -172 196 -251 5 100 -159 76 92 -30 179 183 29 -10 64 92 -9 -168 -98
6763 -98 85 -120 228 -98 -85 4 37 -304 -94 111 100 3 -70 358 -146 68 -162 -2 -3 55 -209 5 -67 9
6787 9 105 102 -62 74 -87 34 -164 19 43 120 57 -26 71 -214 -25 -174 -112 -7 37 -15 -164 -25 -121 -178 58
6812 58 -57 196 59 -38 71 -58 -194 -35 -4 -21 46 89 -167 3 146 195 -33 -167 150 89 -111 -134 -73
6835 -73 94 -22 35 -100 -6 1 -82 118 180 -274 125 1 7 -9 -217 67 -190 -87 74 65 -57 -18 -7 -171 -77
6860 -77 -40 -98 -159 -106 122 29 25 -25 -174 228 -56 -32 19 120 118 161 179 31 49 32 94 -127 20 -3 -181 122
6886 122 37 -272 29 339 97 342 114 318 -84 70 248 -16 239 116 158 182 -19 33 99 153 -54 -133
6908 -133 89 -212 -107 -87 27 -38 -101 -179 87 -9 -77 15 -229 -125 87 249 -57 -109 44 -1 -254 144 -166
6931 -166 123 67 -108 -121 57 -123 9 -233 -168 272 -141 76 27 -26 5 253 -77 48 3 55 461 -11 -103
6954 -103 106 22 79 520 8 168 -11 16 5 -24 -109 -134 -17 49 137 47 99 -265 -265 67 10 -99 -85 -113 112
6979 112 -105 143 134 14 120 -304 134 165 182 129 -249 115 267 208 45 -78 170 -205 109 -243 -12 289
7001 289 9 -64 -180 104 45 161 197 24 5 100 350 45 5 79 18 245 39 -13 139 -65 155 -196 27
7024 27 -18 -162 -249 -66 345 55 18 130 -129 -73 3 2 -66 -179 193 44 -139 -223 303 53 29 -23 59 22 149
7049 149 -11 177 33 243 127 -143 -234 101 105 4 -52 220 168 100 3 24 19 178 58 -123 -72 22 18 64 -77
7074 -77 -51 -84 -31 390 127 32 9 -13 137 94 -62 148 53 -22 123 211 -103 -111 13 41 32 78 370 113 59 254
7100 254 81 30 -76 218 -100 165 110 -100 9 -141 11 140 82 -154 21 276 287 -227 -38 123 -164
7121 -164 -188 -62 125 200 1 20 41 -154 -124 -155 49 211 163 142 -183 25 -14 170 80 -268 13 282 -136
7144 -136 -117 291 -135 -22 230 169 -228 -10 83 -329 97 137 85 130 -60 163 -41 -26 -40 22 -81 -123 140
7167 140 -112 367 159 -92 103 -152 121 222 -100 -63 -58 -54 -32 59 -284 -69 161 34 105 103 159 -236 -7 82
7191 82 243 131 122 -114 -262 0 64 -58 116 262 -192 -173 252 40 19 75 -45 -125 56 -36 -120 248 -53
7214 -53 -45 125 347 -17 -57 93 -155 137 -30 140 -63 -176 -194 15 141 -5 -79 206 -20 216 -130 -4
7236 -4 -102 110 -26 51 7 51 12 -225 101 -263 68 -212 236 119 116 295 54 -216 -91 233 -19 117 25
7259 25 60 -14 81 -215 18 135 -254 -132 121 137 29 -171 -139 77 50 181 -86 41 101 -91 86 236 175
7282 175 109 -12 -78 -73 -318 35 106 94 205 -47 -203 -202 -124 -212 -218 11 14 -58 104 -33 -37 -20 39 -482 69 106 -1
7309 -1 59 -128 -12 -241 -139 -75 -114 26 -95 76 -218 29 -116 -104 52 115 215 -109 71 101 262 -103 300
7332 300 -8 232 -1 -6 34 -240 -100 199 192 -205 -153 129 -86 -7 -170 349 59 113 394 -12 -250 -129 171
7355 171 -262 148 -296 -87 37 -16 86 79 85 202 30 143 227 -185 -13 -166 -10 354 170 7 138 184
7377 184 -79 96 -328 -124 96 24 -99 225 95 -190 25 263 87 -248 26 81 78 189 -171 -117 88 260
7399 260 -132 148 220 -174 -222 3 -82 16 52 -295 -121 -36 -117 -73 -35 89 59 144 -64 -18 58 33 -84 -40 -2
7424 -2 41 -154 -203 196 -48 25 259 145 4 59 -128 96 8 -8 148 -180 12 -127 -37 -133 65 -191 -15
7447 -15 -57 -108 -29 -99 79 182 -83 -35 -347 107 109 -133 218 40 288 -13 -147 -139 -38 164 -167 -81 -144 -68
7471 -68 134 23 -125 104 44 -27 41 -49 -114 -455 -188 -57 -115 95 220 -103 -29 -378 210 195 -74 31 406
7494 406 -73 -69 -140 -19 -18 -14 50 -225 35 24 -226 -35 -15 -135 -67 -67 -82 137 -42 123 -292 -55 109 -255 91
7519 91 120 -105 -86 -52 -50 186 -23 -146 -21 -181 -52 -193 25 28 7 51 263 -52 167 127 -311 -179 -158 -194
7543 -194 -195 -159 32 39 -127 -17 -216 10 25 -104 -124 160 -38 63 104 -67 293 -13 37 94 -128 -46 -243 101
7567 101 -104 -1 220 -26 98 -57 -194 -93 -15 56 29 -74 1 18 172 10 -213 -111 97 91 -44 -66 47
7590 47 5 -203 84 -172 145 -39 169 113 -44 93 -242 102 -101 -134 -234 -51 -48 152 -181 18 -443 -141
7612 -141 55 75 -20 -177 144 79 388 82 -12 -51 -102 -207 -146 150 95 -9 -32 -91 -14 83 -142 308 283 -40
7636 -40 70 13 149 30 -127 100 -77 -275 133 -83 102 178 -163 75 -223 -21 4 75 -297 20 68 -105
7658 -105 -166 9 -192 72 123 209 -310 -177 -31 63 -2 -206 103 40 164 -261 -88 -379 -32 33 375 -82
7680 -82 132 180 -74 21 -78 23 95 -99 2 -4 274 175 -5 -8 145 250 -279 -128 -102 -197 -117 17 -37 -171 -10
7705 -10 32 -41 -2 60 59 343 16 166 87 177 -108 -205 -134 -197 -143 -87 52 -87 37 -237 -19 -180 122 143 -29
7730 -29 2 137 203 -81 -98 126 7 -116 -138 111 -96 -79 316 139 156 67 105 -109 -136 201 -31 -195 134
7753 134 -6 128 -244 -80 -119 -262 -41 -3 -63 243 -15 0 91 102 158 -29 -108 102 -15 122 -155 -61 -80
7776 -80 -105 -116 10 47 68 304 47 -66 -5 29 108 -102 -5 185 10 -241 -38 12 186 -24 66 -55 -53 154
7800 154 -30 181 -76 -22 94 398 -212 -39 -12 22 193 -20 79 -100 -113 -29 129 -203 -42 -243 24 103
7822 103 287 -99 -120 -101 -93 -249 -125 122 41 -74 193 109 -59 -56 41 -193 -48 55 8 241 -66 118 -8
7845 -8 -29 -173 185 -119 129 -143 -16 41 -188 191 46 -17 -283 26 -86 8 -51 -139 -109 -68 -17 -91 14 28
7869 28 -33 7 136 -128 -145 -24 -236 -64 1 23 -197 -206 -66 144 -37 -129 -178 -117 -189 -104 10 -39 118 -56 -43
7894 -43 130 46 -75 28 -9 -113 -280 44 -208 -45 -280 -146 127 -19 -114 112 34 -101 213 -168 44 -57
7916 -57 -232 169 -69 -168 -59 -65 -208 143 24 -217 -44 -52 179 -48 -137 -218 -144 -117 48 71 257 91 23 133
7940 133 -69 -17 -157 -305 -163 -178 77 -49 77 174 -129 -242 -115 184 -72 -97 -241 138 331 52 -245
7961 -245 -199 78 0 417 68 37 96 3 103 -27 238 -198 70 -115 22 79 200 139 120 -52 -82 151 32
7984 32 -192 -52 89 -112 -7 62 75 -60 -88 -34 -142 -157 -17 -134 -94 79 77 -147 241 -4 -5 43 -164 -12
8008 -12 149 8 102 -56 -9 -115 126 150 -23 180 -204 -49 254 -140 -43 176 -174 -132 41 -176 -25 114
8030 114 -107 -172 -66 186 20 -103 -31 -178 -396 41 -5 134 158 58 42 341 3 95 -97 2 78 4 20
8053 20 21 113 -177 -127 -251 -5 -34 34 -90 8 52 11 -109 -125 54 -90 129 67 45 9 -211 28 164 -77 -55
8078 -55 -207 -278 62 -59 180 14 -153 7 -5 -258 -92 -25 -108 45 201 115 -23 9 -498 51 -144 -143 -137 -109
8102 -109 46 -14 172 180 -96 84 114 47 -311 12 -181 -57 62 61 -13 -56 -58 -114 23 63 5 135 -61 3 182
8127 182 -180 -86 -287 -99 -222 159 -12 88 139 54 -148 -19 60 -292 150 -22 -4 -45 54 -208 -155 195 53
8150 53 -98 -32 -2 100 160 81 -123 -19 83 -223 -107 165 -138 90 62 9 155 94 -4 112 154 -82 19
8173 19 -149 -77 -82 -375 74 134 -19 -264 47 -80 69 -182 42 -164 -238 11 209 10
8191A0
$$ Imaginary data points
##PAGE= N=2
##DATA TABLE= (X++(I..I)), XYDATA
0 0 0 0 0 0 0 0 0 0 0 0 0 0 8 -8 8 -8 9 -16 16 -24 24 -32 37 -40 48 -56 69 -80 89 -104 120 -136 154 -176
34 -176 197 -221 250 -280 314 -349 389 -431 478 -528 586 -647 714 -787 867 -957 1053 -1160
52 -1160 1281 -1411 1559 -1728 1919 -2138 2392 -2693 3054 -3497 4058 -4791 5798 -7268 9640
67 9640 -14087 25381 -121337 -157273 95934 127744 22594 -101513 -64044 18040 53755 9446
79 9446 -7906 -295 5939 -24387 -31335 -8629 15595 -3784 -21332 -3910 35688 37386 9127
92 9127 -10069 -513 503 -16052 -24463 -2680 16100 237 -29871 -23656 15829 39522 21791
105 21791 -1486 3250 15138 1257 -23456 -21798 4682 13587 -10313 -30804 -14300 19083 28896
118 28896 11203 -2560 3555 11795 5675 -4285 -7453 -13082 -25037 -24792 1930 30667 26043 -5855
132 -5855 -23423 -4001 24124 25763 5903 -7081 -7394 -11938 -25260 -24454 824 22481 15128 -4808
146 -4808 -4550 15313 23393 5325 -14990 -13116 1042 3586 -8029 -14898 -8579 -2552 -3637 -46
160 -46 16827 30275 20340 -4894 -18266 -10870 356 490 -5091 -6967 -5941 -7943 -6616 5814
174 5814 21168 21735 4583 -7977 -2767 6803 1611 -13425 -19103 -9913 -145 1129 2172 8662
188 8662 12377 5035 -3966 199 14195 15413 -3226 -23492 -24477 -9151 3584 6199 5448 6339 4693
203 4693 297 765 7601 11412 2687 -11313 -14439 -6492 -477 -4950 -9897 -3561 8654 14196 12606
218 12606 10547 8230 771 -11086 -14096 -4195 7384 5066 -9043 -17552 -9230 6035 14630 14531
232 14531 11647 6825 -1864 -10252 -10388 -3336 303 -4097 -9469 -6851 2346 8523 7105 3571 4120
247 4120 6616 6379 2577 -1913 -7487 -14207 -15731 -7841 5473 12877 8768 257 -2850 2441 8119
262 8119 8498 4928 -249 -7078 -13265 -14407 -7444 2411 5960 3716 2256 4929 8906 7730 1616
277 1616 -4292 -5844 -3969 -2688 -2328 -4494 -6394 -6760 -2073 7546 15663 15896 7426 -2910 -8544 -8058
293 -8058 -3733 -178 -145 -4372 -8998 -8711 -1213 8687 13159 9844 3721 446 427 -528 -4370 -8265 -9052
310 -9052 -6179 -1527 2864 5951 6166 3490 519 1630 5747 8171 4010 -5489 -13548 -15051 -9191
325 -9191 -44 6675 8021 4714 1296 1502 4524 6486 4970 -1131 -6215 -7504 -5889 -4213 -3808 -3236
341 -3236 -383 3723 8519 10850 8863 2507 -4130 -7653 -7112 -2394 939 177 -4478 -7686 -4963 3269
357 3269 11154 13670 9228 1590 -3815 -5517 -4920 -3921 -3350 -3865 -4507 -3535 581 4495 6299 4628 2713
374 2713 3393 5068 4037 -2167 -9103 -12106 -9648 -3482 2762 7684 7445 3243 -1112 -1154 3786 7965
390 7965 6578 -1153 -9093 -11687 -8393 -3305 803 3338 4643 5161 4305 4626 4484 1999 -2752 -6106
406 -6106 -5363 -2490 -1105 -2696 -5791 -5934 -672 6788 12124 11865 5886 -2689 -7973 -6870 -1915 585
422 585 -1259 -4270 -5530 -4039 196 5126 8601 8424 4829 67 -2475 -2326 -3002 -6582 -9096 -5907
438 -5907 773 5376 4365 2183 1488 2012 3099 3973 4781 3234 -2674 -11133 -14152 -7911 2492 7612
454 7612 6039 2265 1064 2106 2535 2683 2806 1228 -3461 -7483 -7770 -3786 -281 -599 -1410 2716 8725
471 8725 10487 5738 -906 -3932 -4674 -4315 -2493 -420 -148 -3708 -7394 -5371 3077 11160 11300 5181
487 5181 -948 -3218 -3259 -3507 -3458 -2517 -2696 -3494 -2504 809 4524 5208 3156 2278 3588 4253 1284 -3743
505 -3743 -7229 -8272 -6813 -4005 2266 7584 7538 1767 -2625 -97 5212 7550 2961 -3001 -6643 -7614
521 -7614 -7258 -4840 931 4893 4844 1811 1694 5125 5969 981 -4586 -5798 -2515 192 -1532 -4474
537 -4474 -4430 -2205 712 4908 9488 10166 4554 -4260 -8360 -4635 98 724 -3018 -4666 -3475 -1047
553 -1047 1049 3419 6932 7732 4408 -697 -2028 -1391 -2929 -6592 -7109 -2824 1982 3193 1886 1339
569 1339 2372 2467 2430 2553 3974 2458 -3597 -9711 -10112 -4300 2185 4390 4342 3976 2972 800 626 2585
587 2585 4087 394 -4673 -7221 -4555 -848 -912 -3212 -1730 3961 8422 7155 3545 350 -2214 -4718
603 -4718 -4898 -2156 1169 545 -3797 -6367 -2953 4057 8280 7256 4296 911 -2243 -4480 -3927 -1573
619 -1573 -1009 -2907 -4324 -1255 3105 4787 2841 792 2918 5229 3671 -1141 -4547 -5131 -5408 -5903
635 -5903 -3306 3130 7320 4892 -634 -2744 919 5097 5378 1753 -2574 -5296 -7012 -6311 -2526 2678
651 2678 4386 2587 1747 3481 4921 2719 -1531 -3087 -2169 -1403 -2168 -3166 -2946 -1847 -1493 -212 4101
668 4101 8706 8164 2335 -3949 -5616 -2950 -507 -740 -1521 -2464 -2584 -1887 548 4769 6762 4880 881
685 881 -1223 -572 -1071 -3622 -5313 -4421 -1880 472 2156 3095 3119 1819 276 951 3701 4260 73
702 73 -5616 -8414 -5831 -1772 1326 3130 3939 2815 810 -297 1605 3969 2945 -1621 -5126 -4430
718 -4430 -1472 -1101 -2578 -1987 977 4261 5389 4521 3128 603 -2561 -4569 -3517 -454 847 -1140
734 -1140 -4127 -4085 -702 3257 5999 6330 4189 514 -2962 -3995 -2194 -510 -1539 -3446 -3007 -161
750 -161 2765 3306 2274 1740 2362 2559 1517 -49 -2234 -5212 -6437 -4904 -420 4143 4960 2596 290
767 290 -273 1114 2668 2927 1652 -1816 -5241 -6629 -4319 -271 2039 2144 1669 2861 3892 3179 1192
784 1192 -1000 -1906 -2306 -2460 -1892 -879 -1170 -2567 -2909 399 5412 7660 5476 367 -3458 -4033 -2841
801 -2841 -1259 -366 -527 -1901 -2502 -1927 1276 4121 5017 3118 1132 83 -616 -1760 -3511 -4469 -3857
818 -3857 -1344 1282 3101 3098 1317 168 197 2256 4271 2804 -856 -4811 -6291 -5135 -2261 1597
834 1597 3940 3728 1893 -56 469 1504 2212 1037 -1480 -3652 -3658 -2949 -1881 -1298 -211 1243 3176
851 3176 5051 5068 2246 -1891 -3479 -3089 -654 502 117 -2143 -3661 -2536 109 3049 5702 5404
867 5404 2628 -1232 -3314 -2909 -1124 -907 -1893 -2115 -1584 63 1797 2471 2121 2127 1948 2004 1569 -254 -2669
886 -2669 -4808 -5107 -3117 156 2923 3488 1945 302 -705 1022 2713 3055 1107 -2415 -4869 -4807
902 -4807 -2761 -218 1233 1574 2000 2370 2404 2284 1301 -891 -2458 -2525 -1273 -759 -979 -2210 -2764 -1086
920 -1086 1825 4958 5606 3431 14 -2701 -3251 -1951 -344 -352 -1583 -2351 -1786 -234 1596 3058 3084
937 3084 2562 1302 -200 -1138 -2159 -2535 -3232 -3073 -1073 1181 2628 2330 1214 472 472 1826 2548 1706
955 1706 -1127 -4106 -5288 -4129 -1368 1731 2872 2418 1840 1040 557 767 1250 413 -1079 -2850 -2874
972 -2874 -2019 -775 -1096 -809 291 3166 4943 4348 1393 -1932 -3386 -2896 -1093 405 -381 -1567 -2604
989 -2604 -1679 639 3055 4004 3621 2091 -35 -1439 -2347 -2524 -1414 -1174 -1366 -1187 277 2063 2151 1243
1007 1243 1277 1857 2224 1355 -1341 -3426 -3875 -3440 -1777 517 2379 2754 1818 221 159 1371 2033 1563
1025 1563 60 -2174 -3283 -3819 -2936 -692 1634 2663 2275 1910 2187 1859 331 -1850 -2213 -1209 -527
1042 -527 -855 -1755 -2000 -1409 -230 1922 3680 4620 3089 -274 -2740 -2887 -1548 -688 -827 -1027 -956 -771
1060 -771 -192 1099 2673 3143 2136 764 -457 -985 -1867 -2943 -2920 -1856 -25 1302 1587 1494 1383 642
1078 642 522 1333 2034 1416 -1303 -3806 -4301 -2673 232 1251 1924 2391 2217 569 -35 766 1363 596
1096 596 -1393 -3065 -2475 -1328 -761 -1142 -533 1645 3568 3823 2404 827 -933 -2169 -2462 -1226 53
1113 53 202 -1274 -2480 -1485 1213 2882 3171 2945 1596 185 -1911 -2801 -1945 -874 -1022 -1160 -321 1001
1131 1001 2382 1721 889 978 2186 1987 736 -1292 -2622 -3532 -3523 -1722 1214 2798 2644 784 -280
1148 -280 465 1308 1471 803 38 -1629 -3059 -3318 -1862 536 1635 1590 1191 1880 2698 1455 -695 -1670
1166 -1670 -1242 -844 -1059 -1006 -1306 -1159 -906 -728 1210 3776 4541 2091 -1136 -2368 -2090 -1529 -1166 -509
1184 -509 -55 -436 -1118 -787 1480 3233 2999 1352 -90 13 79 -1123 -3113 -3101 -1352 455 936 1660
1202 1660 1770 1309 78 -54 1218 2407 972 -1802 -3998 -3771 -2127 -157 1249 1934 2525 1365
1218 1365 170 110 898 929 189 -1580 -2311 -1686 -1245 -1246 -1010 366 1867 2619 2677 2223 834 -1106 -2667
1237 -2667 -2381 -271 503 -524 -1787 -1767 -501 935 2010 2810 3222 1630 -640 -2541 -2127 -1275 -673
1254 -673 -1547 -1505 -321 1241 1170 889 720 1672 1431 809 -52 -648 -1870 -3165 -3192 -948 1479 2334 1153
1273 1153 310 502 814 497 866 748 126 -1476 -3122 -3287 -1609 909 1263 1251 1562 2294 2079 1054
1291 1054 -422 -1099 -983 -1062 -803 -809 -647 -1183 -1415 -214 2045 3832 3006 1112 -723 -1827 -2273 -1314
1309 -1314 -664 247 -330 -1023 -1068 74 2061 2243 1626 548 301 331 -724 -2149 -2337 -1995 -1055 9
1327 9 1269 1790 1404 483 143 599 1610 1347 193 -1921 -2779 -2719 -1611 -501 1397 1973 1729 766 255
1346 255 776 759 28 -1017 -940 -1144 -720 -1411 -1684 -495 778 1678 1997 2410 2183 585 -1863 -2350 -1285
1365 -1285 39 302 -338 -1341 -1160 -297 767 2156 2600 2382 846 -1025 -1735 -1423 -1179 -1228 -990 -647
1383 -647 598 1104 899 888 906 1121 1068 968 260 -1061 -2577 -3144 -2193 -224 1638 1885 1102 451 133
1402 133 564 1049 1144 605 -447 -1730 -2416 -2121 -1082 116 1098 1389 2026 1480 1084 687 -110 -616 -1207
1421 -1207 -872 -366 -454 -758 -1477 -726 500 2420 3039 2448 899 -619 -1745 -2037 -1279 -485 -171 -503
1439 -503 -807 -611 635 1855 2034 1661 939 487 -318 -943 -1641 -2175 -1812 -855 509 1196 1475 809 54
1458 54 291 881 1159 805 -191 -1553 -2406 -2239 -1352 225 1535 1821 1355 856 655 657 459 99 -570 -1173
1478 -1173 -1428 -1067 -1119 -911 -193 736 1398 2042 2174 1487 105 -1170 -2256 -1518 -537 68 -51 -970 -1064
1497 -1064 -403 1161 2342 2459 1027 238 -539 -1209 -1526 -1226 -1212 -696 -282 54 814 1172 944 918 723
1516 723 983 975 -53 -913 -2206 -2611 -1623 -335 1130 1975 1479 438 -158 384 1010 805 359 -651 -1470
1535 -1470 -2023 -1793 -1066 33 1560 1821 1562 1466 1352 309 -658 -1316 -939 -731 -241 -458 -951 -978 -808
1554 -808 294 1772 2774 2290 731 -1210 -1679 -1436 -766 -254 5 -202 -107 -119 274 968 1871 1524 817
1573 817 82 -480 -667 -1614 -2058 -1721 -84 884 1241 868 1000 578 337 440 925 1086 160 -1545 -2897
1592 -2897 -2233 -681 421 1334 1125 1249 543 395 221 236 691 -454 -1216 -1234 -1206 -1358 -1097 -391 483 1584
1612 1584 2168 1882 773 -233 -1241 -1754 -1205 -41 251 -395 -1173 -1114 91 1403 1983 1757 1279 401
1630 401 -697 -1626 -1511 -666 -742 -688 -560 372 918 952 441 665 1009 965 231 -457 -890 -1212 -2142 -1681 -315
1651 -315 1524 1826 1048 -38 15 801 808 393 -185 -838 -1657 -1667 -1721 -618 523 1054 833 977 1252 1224 133
1672 133 -936 -686 -535 -243 -602 -913 -630 -384 -509 605 1711 2616 1571 73 -1200 -987 -772 -840
1690 -840 -794 -429 72 -98 -226 507 858 1441 1459 704 94 -294 -686 -1507 -1604 -844 -214 515 994 1198 904
1711 904 311 169 428 971 646 -94 -1712 -1999 -1354 -676 393 871 1569 1416 342 -10 624 527 66
1730 66 -877 -1066 -673 -616 -892 -1116 -261 695 1606 1849 1204 807 -157 -1510 -1557 -709 549 92 -541 -858
1750 -858 -623 367 1122 1349 1609 1099 450 -907 -1324 -1150 -667 -877 -614 44 645 979 466 370 721 983
1770 983 990 341 -425 -969 -1404 -1921 -1130 306 1353 1409 460 -125 107 628 542 355 33 -550 -1176 -1527 -1246
1791 -1246 -422 306 885 922 1399 1309 423 -238 -705 -475 -422 -686 -691 -608 -396 -761 -363 951 1882 2014 1016
1812 1016 18 -725 -761 -960 -902 -342 -416 -156 -391 -303 587 1251 1312 970 548 722 -128 -944 -1855 -1332 -799
1833 -799 -61 509 916 980 654 299 56 860 996 487 -690 -1699 -1484 -1046 -751 83 933 1278 1019 244
1853 244 -1 357 322 -31 -564 -546 -745 -615 -690 -611 154 887 985 1411 990 430 -242 -1115 -1133 -788 -191 -120
1875 -120 -619 -562 -200 133 781 1328 1680 826 -28 -863 -1013 -891 -933 -744 -314 224 455 549 186 479 612
1896 612 675 563 427 -168 -1095 -1279 -1538 -623 647 991 986 597 363 53 294 207 212 82 -310 -1333 -1372 -1053
1918 -1053 -151 243 765 1089 1009 986 230 -279 -216 -702 -526 -343 -259 -109 -560 -559 62 814 1460 1666 1081 -88
1940 -88 -828 -1114 -948 -532 -272 205 -214 -162 35 434 654 1019 792 593 99 -410 -863 -1284 -1310 -825 161
1961 161 742 880 657 216 531 169 735 673 226 -684 -1326 -1594 -1191 -472 344 953 809 693 637 355 131
1982 131 48 -254 -266 -376 -282 -559 -644 -320 303 518 1270 1143 884 174 -521 -974 -815 -257 -13 -207 -561
2003 -561 -748 -300 125 1062 1396 1244 485 -39 -821 -657 -777 -939 -577 -120 135 590 592 254 356 609 698
2024 698 510 -122 -642 -1272 -1262 -1331 -481 337 816 920 473 400 109 288 436 560 -236 -671 -1046 -1070 -740
2045 -740 -105 208 833 722 802 861 643 -30 -596 -448 -428 -269 -191 -239 -563 -378 -209 922 1362 1617 896
2066 896 27 -674 -976 -746 -334 -472 -193 -145 -286 246 489 694 1007 584 649 -4 -611 -765 -1245 -1141 -776
2087 -776 268 749 1026 765 89 47 103 448 543 247 -697 -1157 -1213 -877 -125 555 867 768 797 605 -98 379
2109 379 230 -197 -500 -544 -649 -547 -775 -267 -93 833 1483 1184 706 -138 -587 -907 -843 -390 -77 -50 -228
2130 -228 -612 -352 203 1042 1367 818 486 36 -871 -1183 -806 -638 -536 -174 178 226 588 302 495 341
2150 341 756 617 23 -861 -1201 -1124 -760 -227 740 673 637 523 173 77 93 426 10 -115 -603 -1151 -739 -515
2172 -515 88 349 635 730 787 909 36 -693 -421 -418 -156 -421 -418 -376 -147 -13 25 675 1474 1198 639 -62 -869
2195 -869 -753 -580 -416 -444 -25 -234 -55 94 576 792 598 289 376 93 -135 -1002 -1283 -860 59 154 631
2216 631 649 570 277 143 419 361 464 -175 -678 -1058 -967 -669 -47 669 843 613 542 543 31 251 79 -330
2238 -330 -538 -391 -345 -612 -606 -451 355 798 1008 1100 596 157 -547 -944 -574 -80 -64 -325 -280 -303 -188 326
2260 326 846 1082 778 510 -410 -614 -818 -602 -598 -396 132 359 442 476 440 398 397 682 309 20 -306 -784 -981
2283 -981 -836 21 579 892 559 101 324 152 60 158 119 -167 -477 -834 -592 -321 75 264 410 672 800
2304 800 427 110 -551 -439 -449 -414 -314 -417 -385 -320 -411 468 1166 825 969 321 -310 -480 -807 -799 -311 130
2326 130 -78 -303 -243 90 328 841 507 285 160 167 -545 -755 -918 -564 -308 -11 694 770 551 -156 -7
2347 -7 261 735 318 -268 -633 -783 -693 -450 -46 574 897 698 334 71 122 118 -150 -216 -349 -635 -342 -707
2369 -707 -432 3 296 452 950 1062 342 -57 -438 -650 -658 -102 -105 -189 -197 -496 -244 385 741 901 545 83
2391 83 -356 -353 -700 -519 -611 -154 -114 331 228 329 495 352 265 195 69 -95 -495 -843 -1025 -857 136 322
2413 322 826 469 234 185 157 -1 420 -251 -378 -460 -589 -626 -195 -21 263 712 975 825 553 -305 -464
2434 -464 -103 -169 -518 -259 -87 -563 -305 -100 405 699 818 466 156 -544 -786 -793 -567 -483 -189 -85 -172 -1
2456 -1 406 479 401 372 539 230 -31 -452 -713 -763 -808 -36 211 300 445 272 13 216 -26 423 324 -201 -413
2479 -413 -932 -824 -457 -79 323 916 534 373 515 242 -56 -394 21 -442 -322 -167 -254 -393 -76 281
2499 281 732 1014 664 176 -316 -683 -486 -483 -89 -49 -285 -345 -292 234 395 666 516 604 137 -32 -195 -526
2521 -526 -541 -531 -95 314 311 223 204 106 9 518 140 247 -368 -583 -1055 -790 -426 -125 517 847 219 225 318 84
2545 84 370 155 -149 -317 -605 -709 -344 -396 -93 280 357 615 573 29 53 -628 -440 -438 -263 -228 -136 -347 -316
2568 -316 90 318 774 526 475 174 -298 -536 -497 -600 -192 -241 170 -222 255 450 388 551 278 172 489
2589 489 -97 -270 -586 -940 -404 -56 297 509 540 241 203 198 269 190 60 -131 -552 -660 -643 -257 -154 525
2611 525 756 708 670 102 -36 -96 -194 -259 -284 -181 -542 -198 -173 -32 303 637 912 570 296 -146 -508 -527 -244
2634 -244 -214 164 -309 -262 -194 42 440 713 493 402 366 -156 -412 -532 -294 -571 -105 -64 313 426 115 191
2656 191 202 406 364 257 17 -749 -595 -743 -362 -135 198 620 471 251 240 128 205 12 18 -63 -520 -501 -306
2679 -306 -107 117 342 636 493 549 158 -98 -150 -248 -281 -167 -403 -404 -53 -115 -88 36 550 690 499 296 -290
2702 -290 -437 -419 -513 -286 -164 144 -63 148 18 382 380 266 132 362 13 -359 -722 -841 -229 89 287
2723 287 277 630 600 140 -132 227 466 -166 -282 -720 -544 -542 -179 82 561 598 415 115 -25 108 45 18
2745 18 -289 -131 -151 -69 -260 -198 183 357 697 627 263 94 -399 -538 -383 -394 -266 -34 -488 -488 -32 28 492
2768 492 444 675 490 9 -326 -400 -394 -620 -358 -243 -19 236 551 137 -28 270 256 79 -37 -272 -471 -881
2790 -881 -485 -158 117 503 529 271 156 289 307 224 73 -105 -308 -392 -596 -543 -32 171 136 455 513 565 424
2813 424 -125 -216 -432 -72 -285 -206 -172 -283 -27 -23 432 674 660 114 -73 -185 -477 -567 -505 -351 87 -51 39
2836 39 172 326 218 159 294 240 51 4 -627 -581 -406 -205 0 193 503 327 133 126 -133 191 12 -71 -216
2859 -216 -651 -427 -526 -399 -3 415 236 323 215 375 95 6 -389 -331 -93 -79 -327 -380 -141 160 287 564
2881 564 460 265 233 -312 -639 -418 -99 -60 -281 -273 -100 -38 196 430 503 651 494 -117 -230 -533 -432 -403
2903 -403 -127 -19 258 498 28 -91 87 407 103 263 53 5 -260 -705 -617 -57 302 493 459 492 282
2924 282 33 -16 -7 50 -258 -545 -553 -407 -121 -34 107 211 540 422 474 124 -16 -275 -418 -208 -167 58 -76
2947 -76 -220 -211 -56 421 567 648 82 150 -267 -611 -277 -309 -20 53 -107 -71 -44 300 185 251 204 394 303 -285
2971 -285 -399 -721 -506 -142 155 281 328 369 88 -198 138 7 119 61 -225 -374 -317 -99 -160 -9 531 486
2993 486 321 226 60 -7 -230 -112 -82 -418 -496 -291 -286 -134 215 535 521 482 224 -148 -557 -343 -482 -316 -130
3016 -130 100 21 -139 -142 178 314 280 564 204 -10 -445 -406 -464 -781 -193 -66 188 372 175 113 195 250 298
3039 298 141 41 -122 -458 -466 -201 -229 169 556 801 294 168 387 17 -183 -69 -163 -280 -209 -367 -187 -119
3061 -119 104 12 430 623 111 122 -179 -370 -376 -135 -104 -214 -110 -204 -189 -4 532 826 313 229 -342 -299 -509
3084 -509 -451 -329 94 -289 -140 119 93 13 163 312 150 87 71 -336 -426 -549 -590 -58 221 558 169 201 -27
3107 -27 262 162 88 199 13 -382 -406 -325 -282 -9 214 306 337 339 359 -170 -119 19 -104 -282 -217 -361 -68 38
3131 38 30 256 466 682 530 273 97 -103 -239 -448 17 22 229 275 -167 350 -38 400 503 638 25 -131
3153 -131 -171 -625 -293 25 195 -87 106 401 182 118 164 132 394 288 -76 -218 -544 -634 -406 -105 281 364
3175 364 341 170 23 161 -57 -73 19 150 -268 -356 -265 98 76 -128 384 400 317 265 1 -254 -443 -71 -352
3198 -352 -212 -3 -122 2 44 157 301 611 590 8 -63 -233 -262 -273 -56 -503 -133 339 137 -25 376 297
3220 297 146 247 50 52 -240 -295 -557 -359 -270 52 325 212 279 47 -226 -54 83 164 -265 -297 -245 -367 -531
3243 -531 -131 309 467 128 546 -26 6 244 -268 -11 -367 -207 -99 -251 -109 34 201 375 234 557
3263 557 138 -141 -385 -615 -441 -424 93 -149 58 184 -98 299 229 229 339 47 -325 -277 -432 -330 -337 -201
3285 -201 38 210 178 115 35 177 159 83 367 85 -245 -360 -274 -214 -349 309 417 92 316 302 -71 -331 -95
3308 -95 117 -196 -331 -480 35 -233 148 156 202 336 546 459 -312 -67 -337 -621 -358 -267 -153 -71 -168 -55 176
3331 176 589 451 138 2 29 -436 -243 -533 -1 -25 15 193 100 230 146 120 176 408 51 -241 -378 -636
3353 -636 -670 -364 136 113 429 305 209 207 -181 65 393 -43 43 -115 -591 -59 -165 -118 176 420 179 -43
3375 -43 125 4 -131 -23 -82 3 -366 24 -133 -216 10 98 384 369 346 286 -50 -575 -244 -93 83 -250 179
3398 179 -26 -3 86 171 293 225 142 -138 -83 -271 -152 -74 -238 191 421 -109 -96 93 23 133 208 76 103 199
3422 199 74 -255 -458 -286 52 382 293 297 205 -29 -189 -138 -97 177 -415 -13 -333 -184 33 3 159 520
3444 520 246 254 -26 -197 -247 -232 -361 -13 -26 163 37 -110 -5 302 330 181 454 -29 -60 -462 -308 -146
3466 -146 -157 100 -31 55 118 54 62 129 -10 44 115 -74 -295 -210 -295 -241 -46 -143 152 320 117 162 34 -104 62
3491 62 -77 50 -81 -292 -247 -221 -8 245 346 69 263 -28 95 -171 -154 27 -212 -94 -49 -533 -240 359
3513 359 212 416 142 324 -162 -157 -449 -414 -175 -53 -409 -100 213 -107 -187 129 430 179 108 -57 -276 -273
3535 -273 -694 -340 2 -132 51 193 325 80 -68 185 -26 57 -138 -296 -186 -545 -307 21 30 244 343
3556 343 366 250 252 -69 -54 -68 91 -291 -150 -262 -173 -63 -129 401 219 440 98 16 -252 -283 -336 -40 127
3579 127 -7 -98 -7 31 18 157 240 345 264 -193 -87 -227 -328 -175 -225 -31 -101 151 255 37 248 149 186
3602 186 0 1 -143 -192 -305 -247 -191 -324 89 10 281 -94 -26 84 142 4 10 -51 -68 -288 -120 -74 -129 31 296
3627 296 333 237 -83 -153 -185 -124 51 -401 91 -120 37 -36 177 354 175 400 116 -3 -283 -341 -302 -187 -69
3650 -69 27 -116 48 267 21 124 53 121 304 117 -91 -336 -366 102 -301 -60 199 461 217 95 42 58
3672 58 179 129 123 181 -289 -167 -390 -132 -18 267 263 331 -185 190 161 -34 -430 -263 152 -346 -228 -58 -99
3695 -99 -225 115 202 372 220 195 -375 -365 -30 -80 78 -41 36 -46 -68 -1 97 248 307 154 -36 37 -446 -211
3719 -211 -51 -295 -275 337 -81 164 78 142 308 214 353 192 -284 -377 -101 -380 107 128 306 -16 143 -53
3741 -53 366 94 146 -204 -274 -151 -177 -105 -300 -235 74 260 333 292 254 41 -101 -113 -121 -298 -163 -615 -312 -10
3765 -10 -275 118 152 731 292 202 69 -114 -248 -390 -106 58 -156 -113 -22 38 -19 -8 269 286 56 34 -145
3788 -145 -308 -359 -287 -38 -95 333 225 105 271 43 -46 -43 -230 180 121 -33 -33 -143 134 153 380 320 234 435
3812 435 171 -118 -151 -52 -38 -127 19 -173 -125 -103 117 142 547 400 83 101 -184 -372 -157 -142 -264 72 -120
3835 -120 -259 -87 110 241 229 157 208 90 -161 -362 -117 -248 -81 -138 271 242 84 -12 -37 135 83 -38 122
3858 122 15 -277 -81 -371 -137 227 -4 334 263 55 166 182 92 -150 -97 -104 87 -324 -194 18 -74 446
3880 446 190 249 136 -206 -103 -380 40 77 72 -61 -108 -70 -112 13 276 159 243 68 -19 -123 -460 -383 36
3903 36 -24 28 64 -73 12 -4 341 242 361 114 110 -298 -241 -219 -250 -223 178 261 132 287 231 22 30 312 5 150
3929 150 -188 -54 -198 -253 129 63 211 287 119 -24 260 82 -213 -157 144 -127 -102 -266 -76 21 93 200
3951 200 288 136 466 164 32 47 -444 -18 60 54 -3 -142 -43 -50 193 228 360 -3 -49 -140 -314 -124 -68 3 35
3976 35 -97 136 219 183 188 -151 52 -6 85 -133 -156 -171 -277 -324 170 160 204 349 34 141 77 -343 139 -49
4000 -49 25 34 -227 -176 -200 256 216 399 4 128 -203 -202 -242 -107 8 -163 89 41 117 122 18 129 346 207 138
4025 138 178 -263 -270 -265 -257 -26 138 56 157 106 -15 -130 157 204 283 -104 11 -370 -403 -238 -33 342 366 -97
4049 -97 223 -136 -123 325 155 202 -16 -42 -313 -213 -47 39 125 385 155 305 -31 38 -232 -424 54 23 -108
4072 -108 -77 -88 -139 -161 141 224 275 307 35 190 -289 -127 -265 -134 -155 -109 -33 -91 112 72 34 293 244 264 1
4097 1 -555 -299 -306 -127 14 220 81 258 73 8 260 179 173 154 -105 -73 -522 -458 -154 77 194 129 259 -8
4121 -8 -210 -105 42 -266 -13 -113 8 -237 -176 -319 -16 148 307 189 170 106 -161 -70 -120 -239 52 -175
4143 -175 -519 92 -68 -64 244 -1 621 202 134 19 -103 -235 -398 -209 -266 -65 258 258 250 -261 115 139 21
4166 21 163 -212 54 -325 -543 -271 -100 108 166 290 213 0 203 108 129 -22 -34 -157 -16 -45 -99 64 361
4189 361 60 169 353 54 -164 -197 -310 -118 32 -89 65 -134 -247 112 -105 301 251 385 197 -75 -259
4210 -259 -33 -172 -18 -176 -108 181 -99 83 208 435 39 86 -140 46 -50 -59 -244 -162 155 -11 121 167
4232 167 274 0 62 86 191 -61 -184 -247 -111 -94 -346 -65 215 186 121 333 27 50 216 196 -126 -245 -34
4255 -34 -306 -128 -152 -89 208 161 324 57 369 -62 -272 -285 -340 -265 26 -336 -155 -267 -31 29 -123 89 201
4278 201 65 -136 -282 -138 -274 -249 86 -5 58 -8 121 358 -171 -8 39 -154 -530 43 -166 -21 -440 6
4300 6 -114 81 178 54 -89 -65 -18 118 11 -166 -142 -84 -299 -154 42 316 199 83 71 38 -221 -242 36
4323 36 -74 107 -2 -216 -68 -17 80 90 42 -114 91 192 176 -191 -152 -83 -296 54 -25 -174 50 25 72 240
4347 240 -124 39 174 234 -172 -236 -106 -388 128 306 180 -115 12 13 69 104 160 103 161 -240 -356 -277 -26
4370 -26 -231 165 459 174 196 135 69 298 -2 114 25 -318 -199 -66 -254 -136 324 263 367 333 145 -23
4392 -23 -44 13 105 143 -70 -249 -115 -121 -174 -92 432 127 240 -59 -62 -94 -271 -1 -205 75 -119 -133 118 -58
4416 -58 139 495 62 -36 97 -162 80 -278 -372 -97 -83 301 264 322 235 292 17 13 70 92 -108 -18 -60 -83 4
4441 4 13 70 -89 143 175 -35 215 15 -180 -146 68 -95 -211 -337 -78 197 208 277 44 277 -23 44 -324
4464 -324 75 -138 -27 55 32 -89 145 -39 -104 317 -90 427 -77 -150 -157 -197 144 78 94 -64 70 52 380
4487 380 77 158 107 -50 141 -348 -190 -176 -230 -189 -146 133 345 347 161 120 57 20 -190 -229 149 -139 48 -145
4511 -145 -1 -35 140 246 143 317 97 -23 50 21 1 -251 -24 129 -175 -26 316 -102 132 -123 145
4532 145 -229 156 -81 -248 28 -172 -53 -100 -159 -242 -82 291 -11 133 18 38 -252 175 -227 -90 16
4553 16 -186 -43 109 237 -196 89 -126 35 37 -231 -19 -265 -291 -69 -91 118 109 196 206 284 52 69 -118 -106
4577 -106 12 -311 13 -235 -317 95 -12 150 346 270 13 256 -19 177 -68 -116 73 213 229 44 -51 125
4599 125 324 72 300 247 31 -88 -297 13 103 -155 95 133 195 80 123 186 358 114 25 251 -180 -229 -118
4622 -118 -244 110 -104 32 -41 138 -4 -153 125 -257 42 32 290 -351 -141 -6 30 235 -18 172 341
4643 341 -32 -29 -97 -118 -1 -235 63 -76 -76 -82 80 298 94 1 199 111 -108 -39 -191 -106 149 -45 -59 8 110
4668 110 249 -101 143 194 152 -102 31 -31 62 -386 -277 38 5 150 71 169 -58 -121 -80 318 223 -237 -92
4691 -92 48 -136 -72 -186 -246 -64 -4 184 337 -118 -75 -138 -123 -141 -79 134 -279 94 -139 -168 -148 522 8 281
4715 281 11 -154 -177 -154 -91 -263 76 125 61 -189 -64 -153 317 68 3 -208 -199 -98 123 -55 -206 100 105 68
4739 68 -208 33 31 -164 253 207 -209 199 -342 -293 -137 -265 30 18 65 263 -129 19 -221 25 -355 -126
4761 -126 -95 142 -142 -244 -385 332 -78 -2 64 -68 -60 -218 -42 -359 -195 -81 -248 -84 108 -42 -224 59
4783 59 335 139 239 123 -202 -298 -179 32 10 -158 230 -100 117 -117 91 11 183 309 -19 100 -47
4804 -47 -210 -25 -188 70 -193 53 15 -81 112 -65 0 127 41 -224 -311 -224 -184 -54 -12 106 331 356 140
4827 140 -31 -212 -72 -432 -203 -26 -173 19 -303 162 0 315 152 70 152 14 -251 192 -176 -224 137
4848 137 -212 61 78 174 46 1 236 107 -149 64 -349 51 18 -113 106 8 31 110 28 -11 159 120 51 -17
4872 -17 -146 -70 83 -239 -43 -232 -7 198 -3 169 45 43 7 -273 -64 -104 -76 62 -336 -240 109 -188 8
4895 8 467 476 240 26 -132 111 -23 -242 -27 -17 112 39 65 77 79 63 97 297 179 -107 -44 -226 -365 -195
4919 -195 -56 12 -63 -18 -154 137 87 -69 24 95 -158 40 -53 -169 -111 -15 213 85 221 64 83 93 81 44
4943 44 -87 -158 -210 -20 -75 424 -266 110 429 -134 158 327 -68 -18 -209 24 -128 16 -75 -211 -20 -3
4965 -3 191 115 182 175 -73 -109 -359 -178 -167 -24 -58 -18 132 138 11 221 -65 14 152 -79 -97 -357 -370 -14 81
4990 81 74 -54 175 -9 208 160 -49 -78 -186 -143 -130 -119 -40 -19 185 -101 214 78 26 40 0 8 195 43 -194
5015 -194 -189 -16 -95 -285 -29 -62 169 282 -41 -18 -16 -16 -121 46 -163 -61 -20 -48 -75 -24 10 17 132 36 145 -276
5041 -276 -20 -219 -125 68 -40 65 85 -155 174 -2 -156 12 -99 155 -1 -273 -197 -95 256 28 170
5062 170 89 72 -72 120 -53 -13 -23 1 -281 -75 -199 -38 55 -67 -69 127 167 232 159 -119 177 -61 -40 62
5086 62 -138 64 -179 1 154 52 240 19 15 117 -36 -76 -86 -234 -18 -41 122 -186 -94 130 46 -17 -22 67
5110 67 -57 -163 -114 -187 -265 -145 -4 41 78 221 239 -155 36 -294 159 39 -205 27 -175 -49 -57 193 -31
5133 -31 61 -99 152 36 -68 -14 -33 -63 -139 -202 -198 21 -32 118 97 273 201 0 -279 151 -15 112 -142 107
5157 107 -91 -131 90 93 151 -165 41 23 309 170 -156 -45 -72 -56 -52 -64 -71 30 -187 92 222 -141 70 169
5181 169 135 70 176 -212 -137 -156 -28 -356 154 157 58 84 71 -110 -255 -118 -214 -204 -159 -218 50 27 140 155 43
5206 43 451 -137 58 -162 -187 -36 -119 92 45 124 25 243 49 306 108 -12 -185 95 -262 -280 -13 -86 -100
5229 -100 -78 -100 15 121 225 77 252 142 85 -134 -47 -75 -109 61 -97 269 -59 -114 92 98 95 20 -169 166
5253 166 64 58 -80 -10 -127 20 108 446 237 300 174 28 -40 -54 15 -14 113 -99 -71 143 -44 -162 -7
5276 -7 138 163 89 3 -231 -276 -272 -26 -20 -467 16 -5 150 130 155 -70 -65 171 21 10 -198 -24 37 101 -101 37
5302 37 49 87 -65 -167 46 271 55 -40 -210 -51 -247 -166 268 -9 377 103 187 20 229 -46 178 -4
5324 -4 -201 -173 -68 36 131 111 157 161 276 -110 -92 57 204 124 35 -70 83 32 109 -149 -7 358 53 176
5348 176 15 127 51 -38 -173 -331 -334 -180 146 -54 -73 37 -67 122 -29 126 134 -97 -31 -184 -150 4 -44
5371 -44 -48 371 192 -16 -53 -234 4 70 129 -91 -23 150 -16 -120 -129 412 57 41 90 71 64 -150 -227 -175 -84 86
5397 86 75 -380 206 -109 104 133 -199 151 91 10 -82 92 35 116 -19 72 -89 108 187 279 27 24 307 251 -127
5422 -127 -27 3 -274 99 105 228 -248 399 -193 103 -138 -65 60 -53 -66 -130 2 -39 -14 -144 -65 -8 206
5445 206 -325 72 165 -51 36 26 6 -178 -33 -188 43 51 123 255 139 11 43 64 -143 23 -98 -174 -99 -248
5469 -248 -156 68 19 376 32 33 224 151 -162 -227 -129 171 195 48 -28 34 344 -13 235 153 49 213 -177 -216
5493 -216 -178 -220 -299 -126 77 92 22 193 145 16 123 -44 -153 -80 33 -174 -97 -13 42 103 166 -239 96 41
5517 41 -17 -226 -305 39 -144 155 77 -109 -29 234 21 115 77 -98 -77 -121 14 -92 2 -67 -142 -308 -109 48
5541 48 -32 21 67 1 -132 75 117 -123 -301 18 -262 219 -18 99 116 273 94 10 -136 199 -66 52 -116
5564 -116 -62 -124 0 72 136 210 302 190 10 -21 -3 -149 76 -19 33 34 21 -26 0 -181 170 138 108 111 88 -89 63
5591 63 -18 -124 -1 48 218 -25 -129 -66 -67 -27 -27 115 103 -31 -74 25 -159 31 -19 -190 250 198 161 145 -121
5616 -121 101 -2 -41 -241 -171 -52 -44 -90 15 143 48 227 -12 44 191 116 4 197 -50 127 -148 -420 90
5639 90 -19 243 -164 38 134 -174 -77 89 -94 51 8 -75 -91 -228 -57 73 -70 110 234 20 -37 -231
5661 -231 -22 51 -92 -178 -8 426 -175 3 -92 142 194 231 208 -93 -88 134 -209 210 -1 68 282 93 27
5684 27 -182 68 -322 6 299 -78 -110 -214 -393 -96 -44 22 186 38 -54 139 -199 -54 8 134 -155 126
5706 126 168 -156 -94 -3 349 -35 52 -212 105 12 294 -129 14 -69 -11 19 -107 -131 -153 -9 112 192 231 194
5730 194 50 -33 -173 158 -33 6 192 -197 330 37 118 118 71 76 7 1 -29 27 -17 -246 -231 -5 -60 192 135 183
5756 183 42 -133 122 -30 -170 -281 -240 -107 -63 17 318 282 68 164 -257 -23 92 -46 -2 5 96 -241 5
5779 5 54 -111 -176 173 159 47 36 -29 47 -6 117 -56 -250 13 102 -70 31 108 193 -1 -15 -27 81 -211 -212
5804 -212 -155 6 -157 8 373 347 78 21 26 -27 -225 3 108 215 -77 26 -125 -94 190 -3 161 -176
5826 -176 -142 -19 173 -142 61 -41 -194 -29 64 84 -185 -95 -113 -164 121 -116 -234 175 -34 -253 2 -75
5848 -75 -19 25 -88 211 -94 78 -16 -56 -65 -98 -34 -102 -162 54 -7 166 29 203 184 241 193 76 19 -72 156 112
5874 112 -76 -47 -384 91 93 61 89 -77 -131 7 -76 -21 202 147 -255 237 61 -161 207 -83 126 68 215
5897 215 -84 -263 143 -195 123 -252 161 -101 173 -133 65 101 32 38 191 -114 -280 65 -384 190 -83
5918 -83 56 -146 133 103 -135 39 -182 -175 -15 24 -146 215 -132 19 -207 -13 29 201 -129 -155 -214 22 -51
5941 -51 -181 -3 89 106 71 77 -16 46 116 -89 -8 6 -326 74 2 -73 -59 -273 80 -109 25 -85 51 -26 153
5966 153 -15 -114 -77 184 -10 146 -9 -291 92 -100 130 -22 -152 -8 -52 -255 -31 189 168 -4 -75 -65
5988 -65 -2 -1 260 -49 124 28 -26 -93 -344 -66 -118 -159 -65 -125 37 -35 -229 147 272 -93 182 59 -57 -150
6012 -150 -6 -223 -274 -121 -256 77 -2 157 200 61 -9 191 163 36 45 -300 -101 117 -115 102 39 -221 23
6035 23 -66 -211 59 -58 -10 -172 -45 -290 242 -15 91 -88 121 148 -141 319 37 55 -24 -54 223 80
6057 80 -245 -286 -141 79 -116 75 -119 -10 69 158 -91 -72 9 -174 66 -282 -259 -17 93 204 182 13 -98
6080 -98 85 64 -20 253 -85 5 -70 5 -155 189 6 227 -37 -15 48 -302 -165 -44 30 -97 -251 226 -196
6103 -196 -119 -36 -91 80 -255 -16 -45 49 -4 84 -405 -53 469 81 -15 84 -83 157 -82 173 -190 -153 -144 -145 202
6128 202 -110 25 -168 -51 -5 148 -279 -52 -181 74 70 -112 10 40 -243 -29 -62 -173 135 85 -173 118
6150 118 -85 -32 -186 75 57 -192 157 50 -110 -174 -4 94 267 65 60 -24 96 -84 280 -53 55 -41 -59
6173 -59 6 -256 42 -57 -159 155 -297 -103 266 -77 28 64 -59 -139 -108 295 148 -22 34 -15 23 85 -177
6196 -177 49 137 -23 101 -124 -39 -95 -131 180 181 46 -48 -3 -71 -147 -39 -51 108 -174 -204 6 21 -213 -240 196
6221 196 -51 50 206 -85 -156 139 -101 114 77 -49 -68 -233 218 17 -8 -76 -64 -59 -291 -66 217 38 268
6244 268 -98 -350 52 52 -225 250 151 -49 -15 87 119 -364 201 -7 285 179 203 178 82 35 -23 -82 -28 -48
6268 -48 -48 189 -347 52 98 198 250 70 218 -12 170 -127 61 143 242 -28 -91 -121 -142 -6 -20 331 227 139
6292 139 -45 187 -126 172 -31 -128 109 -33 123 -213 -161 24 -131 53 83 228 -104 -250 -19 -15 -123 156
6314 156 4 92 24 79 122 -18 238 270 146 -288 -48 199 -41 -95 -22 102 60 26 221 -62 -1 -55 -85 -93 -53
6339 -53 -175 -84 -42 -24 130 -33 51 -78 227 186 260 -48 -21 -42 -215 -21 61 87 -3 -143 93 -13 68 -24 -193
6364 -193 85 43 -129 -109 61 -83 -53 -72 27 -72 13 -13 43 -211 -127 -89 155 -137 65 -94 93 313 289 -23
6388 -23 8 79 -38 -227 -219 117 -52 76 -46 -81 100 44 175 -111 270 90 71 -175 -32 135 159 145 -31
6411 -31 219 -170 -49 -87 109 -5 48 -312 166 -34 -74 -220 -115 -158 244 164 -38 234 127 -14 198 9
6433 9 -135 -37 -45 105 55 -231 -36 -6 132 67 -69 41 -47 -116 58 158 171 -204 176 233 -35 -32 106 75 63
6458 63 -49 18 243 -325 -112 -121 17 208 40 47 88 82 124 -88 185 -26 198 -125 -168 4 212 -135 -4 -255
6482 -255 72 129 109 95 1 147 -89 113 55 -314 -194 -71 13 -107 49 39 21 114 152 304 -112 58 127 248
6506 248 61 30 35 148 3 97 -138 -6 372 127 11 -9 -101 -143 -160 -97 -250 23 -204 -130 44 108 148 -35
6530 -35 -21 49 -124 79 -2 37 6 52 -46 60 -6 116 -169 62 145 -269 -92 12 57 -6 104 -117 -61 -37 -82
6555 -82 -108 44 -305 133 -26 15 -136 -102 129 80 183 -62 150 216 -288 -187 56 166 -194 -57 -87 -30 -92
6578 -92 179 -290 -125 -150 30 -192 71 216 12 127 19 -58 -36 413 167 117 -45 -34 126 -348 -279 -113
6600 -113 228 462 211 141 28 166 -146 159 121 -17 204 -144 90 -24 75 227 -137 -45 216 54 -442
6621 -442 22 21 142 -161 -128 147 223 -79 252 -52 124 -107 -291 -191 -84 -207 -296 174 65 -40 224 109
6643 109 -70 -37 -66 -240 -71 26 -263 12 -222 333 50 -152 -64 161 201 168 33 358 -45 208 195 21
6665 21 -84 85 119 168 -142 -1 -227 -33 262 -39 -194 189 -46 -14 87 -150 -111 -153 -305 204 233 218 275
6688 275 -259 -96 6 53 -106 -152 -93 106 28 -42 221 98 -145 241 -232 -66 -149 -2 32 -23 -97 -77 136
6711 136 42 -8 86 -33 12 -78 329 160 -222 -174 63 152 168 -64 -177 182 -137 -5 0 -54 285 36 55 108
6735 108 76 -215 34 184 -1 -113 -199 149 -160 -148 150 3 -34 -155 -205 348 -58 -84 -140 53 49 -40 266
6758 266 151 146 -125 -172 -84 -16 14 -127 170 86 -36 172 133 55 50 -268 -368 -3 -7 52 -212 246 112 -132 -23
6783 -23 -77 -158 -118 -100 51 97 -43 -78 144 151 10 162 271 146 -70 -183 121 -63 -244 -175 240 -41 -80 -124
6807 -124 247 214 -141 -41 135 82 16 42 157 -104 70 128 98 -205 -17 232 -52 -97 48 -36 -321 -205 76
6830 76 -190 -79 0 -54 154 -90 -86 -72 116 -36 -173 114 110 261 114 -112 193 97 100 -120 86 96 174 -83
6854 -83 173 -44 -75 15 -16 259 108 82 137 8 15 -25 -100 -79 28 156 -311 1 -61 -16 -117 -1 45 -125 96
6879 96 33 62 -193 -40 -77 204 -82 -36 151 -11 148 100 -129 -6 235 174 -135 26 130 19 -191 87
6901 87 -144 15 81 -157 -125 162 -366 146 -76 329 87 168 184 21 88 177 -80 -145 -81 -19 147 -102 -8 85
6925 85 61 153 -128 -198 -148 -1 104 -6 104 34 -271 68 -153 -176 397 -321 -71 238 297 32 81 19 66 270
6949 270 114 159 183 203 215 12 20 -32 169 206 -125 79 45 211 -77 -224 -80 -2 -103 141 11 -95 -36 88
6973 88 -49 -272 170 68 -158 -142 17 96 63 283 -223 -61 176 -135 182 -331 -191 62 230 166 -44 72
6995 72 115 63 -46 137 -22 -53 -225 -40 151 -124 -65 274 -51 -173 -77 -43 -193 -318 -122 -73 -49 102 184
7018 184 -82 -38 124 50 396 66 -26 -173 -24 -157 170 39 34 206 45 -17 120 222 242 -172 -108 98 163
7041 163 99 133 -88 13 34 64 -132 375 96 61 75 20 172 -62 144 -12 -194 -69 58 4 -5 194 60
7064 60 357 -148 92 132 46 11 -16 -60 -58 -225 -135 -137 21 199 -122 105 -144 -195 110 -56 179 17 -156 10
7088 10 220 0 -107 -36 -136 52 9 -181 -6 202 -142 359 66 -234 -117 233 54 118 -153 136 -98
7109 -98 -18 24 -121 206 36 93 157 3 223 334 -19 -90 -35 -106 -1 -26 -179 222 150 47 12 -288 -58 368
7133 368 -91 37 115 20 186 -103 -16 190 -38 -198 -203 131 167 36 -26 -8 -171 -317 -27 -21 40 40 292 -62
7157 -62 -62 196 278 -55 165 1 117 203 26 30 -147 39 99 82 175 237 -157 -277 94 93 120 1 246 -82 459
7182 459 374 -15 95 265 82 -30 105 87 28 -5 -119 111 44 -151 -119 89 74 -50 -50 140 -198 -155 434
7205 434 -244 -279 -32 175 95 55 -43 102 243 -175 61 88 -137 165 230 -2 -154 61 -271 143 12 -44
7227 -44 222 40 -17 -154 62 -39 28 -205 192 -9 -211 -38 -139 -135 -36 63 -51 -68 -144 139 -116 105 200
7250 200 78 -96 -82 96 -163 23 117 27 2 34 36 -92 -56 -157 -39 -83 -130 38 89 181 -22 -149 50 0
7274 0 -94 13 195 1 -17 -204 -313 -169 155 -109 170 122 120 -217 71 -220 -102 -30 317 247 17 -56 60
7297 60 132 -16 -81 -43 -77 57 51 85 131 -63 -183 -95 -204 107 123 -120 -112 121 186 -64 -104 -91 50 20 -67 -262
7323 -262 67 -205 30 -162 84 -98 141 -6 -209 -13 1 225 -15 -120 -95 -169 -118 -43 281 130 -7 188
7345 188 -192 -79 -89 -130 -101 -174 -84 81 -116 -29 79 -62 43 -108 266 301 131 144 76 20 277 160 -181
7368 -181 -16 204 49 133 139 165 -19 -341 79 -103 69 -38 151 28 7 -254 58 -95 32 -29 -17 -112 57
7391 57 -17 22 -374 -169 8 46 25 17 15 -37 62 78 -131 -91 49 60 -186 -135 -17 136 -34 -37 288 107 -102 -130
7417 -130 -2 302 58 20 -6 79 208 60 -20 -154 -36 -138 6 15 -67 -118 161 -70 -93 173 -388 9 40
7440 40 -180 -249 -172 -23 -123 29 30 -50 41 32 -36 20 251 133 173 163 8 62 108 -301 -23 196 -54 162 28
7465 28 125 -309 56 -198 -35 48 -37 118 -95 -33 -58 10 49 -18 -160 213 -319 98 182 97 -85 23 140 -16
7489 -16 -220 -162 196 -121 -43 112 113 0 193 132 38 188 47 -76 -183 -89 -4 -89 143 -130 152 -174 -112 248
7513 248 61 86 -90 -83 6 -38 226 22 -64 -3 263 323 33 33 -196 56 107 -152 20 41 -115 49 39 206
7537 206 -92 -24 -279 -22 67 -89 -3 40 -107 186 26 -61 -63 -90 -6 -12 122 6 37 178 -234 -142 89 57 62
7562 62 -68 -54 -116 69 -89 -37 34 48 192 110 111 -228 247 101 76 -21 78 141 -157 52 -10 7 48 78 -104 -173
7588 -173 -40 160 5 138 81 176 106 96 38 19 -237 98 266 -166 90 152 232 -111 105 0 78 -38 -211
7611 -211 -14 202 -199 -243 232 84 -121 100 222 38 79 -33 -125 113 135 67 -96 100 44 -46 134 -109
7633 -109 13 203 145 -38 0 246 63 297 -51 -127 -19 -215 -67 39 -48 94 229 181 -162 148 112 -60
7655 -60 -29 88 -251 -55 -74 -90 11 159 123 91 4 -82 96 -91 -181 -161 -185 -245 157 98 -85 -217 57 57 -232
7680 -232 -184 -117 -12 -21 54 -135 -134 -7 -37 63 -291 246 99 -13 -237 29 18 -318 -7 -134 138 33 -43
7703 -43 -77 -68 306 -124 231 65 0 -121 -99 162 -226 -10 66 7 78 80 47 -27 66 -76 32 168 -121 -104 45
7728 45 -27 0 -180 160 19 22 -183 46 3 -166 -37 -83 -35 115 -84 -274 -62 99 -9 187 -80 176 -17
7751 -17 101 -37 165 -30 211 -74 104 -86 179 192 170 105 -184 124 -122 -5 393 -51 -110 -179 214 82
7773 82 2 -126 -189 136 -180 133 85 57 34 -88 -472 -7 198 28 270 241 -42 -195 -91 -275 69 115 -38
7796 -38 -262 -10 2 63 70 213 15 -142 80 -48 58 -53 -67 14 162 -16 -36 -100 9 36 -288 -110 -121 -56
7820 -56 -81 -70 -11 176 -212 193 72 -89 141 -8 166 -9 94 -134 28 -125 131 -84 -84 68 -265 -91
7842 -91 249 -100 19 87 -72 -36 -25 -142 -102 24 322 -2 217 52 -10 199 -36 -16 -136 -145 45 -86 40
7865 40 -172 33 -59 -102 51 -41 12 244 184 -139 -13 -369 56 -190 -99 -139 286 -131 -77 52 80 148 31 178
7889 178 -89 -238 -143 194 2 59 189 209 -88 241 55 -70 253 61 -4 -163 154 34 -14 169 -39 -41
7911 -41 32 8 41 127 138 -109 138 -141 -45 162 -80 -194 -90 -35 37 -8 25 -23 240 2 -86 -15 -3 161 53
7936 53 49 88 30 -79 -182 -89 -147 33 162 252 -108 -62 135 11 -29 71 30 -176 8 34 -20 65 -119 69 124
7961 124 201 -194 -139 159 -156 -14 38 -67 -70 -106 177 -22 -189 -101 188 -126 121 -89 -79 -148 3 217 -36
7984 -36 78 92 -64 100 235 -7 -226 295 44 114 -35 48 -43 -17 19 -37 -106 209 -96 5 64 55 2 -100
8008 -100 166 75 -217 -103 97 -93 -98 37 -134 -4 -65 163 -11 121 130 -22 -49 -217 -123 -129 189 -155 188
8031 188 -43 -73 -9 -110 -26 -103 -27 44 -76 -105 -154 -129 220 -65 111 -3 238 76 209 -36 83 -85 192
8054 192 -142 -81 211 238 177 60 -63 59 219 -115 264 19 58 8 -22 92 -407 -33 237 275 -30 127
8076 127 35 -76 35 195 96 -21 154 119 237 -115 89 -64 -293 129 -14 144 176 133 112 19 57 22 -78
8099 -78 -63 -65 245 108 131 -296 -178 120 -96 -218 -134 -27 -143 91 12 -87 86 -57 203 137 -18 319 -216
8122 -216 -13 -29 59 -102 -345 67 146 -79 100 24 23 19 156 199 2 -21 253 -66 115 -52 113 -100 111
8145 111 -192 44 -295 -224 -5 -140 -23 137 -2 -4 104 -53 -123 -269 68 44 54 -233 138 97 -36 -28 -61
8168 -61 -86 -122 93 82 -281 -205 -162 -72 -97 169 -210 282 67 159 117 -54 10 -57 -92 151 169 -51 305
8191C05
##END NTUPLES=NMR FID
##END=
