##TITLE=1H_5ID(B2)
 DMSO-d6
 8 sc, 
 20.1.2022
##JCAMPDX= 6.0         $$ Bruker NMR JCAMP-DX V2.0
##DATA TYPE= NMR FID
##DATA CLASS= NTUPLES
##ORIGIN= UXNMR, Bruker Analytische Messtechnik GmbH
##OWNER= root
$$ XWIN-NMR		Version 3.5
$$ Thu Jan 20 12:58:29 2022 Russian Standard Time (UT+4h)  she@DPX200
##.OBSERVE FREQUENCY= 200.131346
##.OBSERVE NUCLEUS= ^1H
##.DELAY= (6, 6)
##.ACQUISITION MODE= SIMULTANEOUS
##.ACQUISITION SCHEME= undefined
##.AVERAGES= 8
##.DIGITISER RES= 18
##SPECTROMETER/DATA SYSTEM= spect
##.PULSE SEQUENCE= zg30
##.SOLVENT NAME= DMSO
##.SHIFT REFERENCE= (INTERNAL, DMSO, 0, 15.7039)
##AUDIT TRAIL= $$ (NUMBER, WHEN, WHO, WHERE, WHAT)
$$ ##TITLE= Audit trail, XWIN-NMR		Version 3.5
$$ ##JCAMPDX= 5.01
$$ ##ORIGIN= Bruker BioSpin GmbH
$$ ##OWNER= she
$$ F:/spectra/data/she/nmr/H-F/1/audita.txt
$$ ##AUDIT TRAIL=  $$ (NUMBER, WHEN, WHO, WHERE, WHAT)
(   1,<2022-01-20 12:57:16.65 +0400>,<she>,<DPX200>,
      <created by zg, POWCHK disabled, PULCHK disabled
       configuration hash MD5:
       00 E9 B6 7A A2 85 ED C7 34 08 36 98 17 FE 4E 26
       data hash MD5: 16K
       48 1D CA 81 86 EF C2 19 BC 98 8A DE C2 BA F7 55>)
$$ ##END=
$$ 
$$ hash MD5
$$ 4F 26 0D 46 F3 B5 64 76 4E 0C CF E2 63 4F 2E 5D
##$RELAX= 
##$RELAX= 
##$RELAX= 
##$RELAX= 
##$RELAX= 
##$RELAX= 
$$ Bruker specific parameters
$$ --------------------------
##$DU= <F:/spectra>
##$EXPNO= 1
##$NAME= <H-F>
##$PROCNO= 1
##$TYPE= <nmr>
##$USER= <she>
##$AMP= (0..31)
100 100 100 100 100 100 100 100 100 100 100 100 100 100 100 100 100 100 
100 100 100 100 100 100 100 100 100 100 100 100 100 100 
##$AQSEQ= 0
##$AQ_mod= 1
##$AUNM= <au_zg>
##$AUTOPOS= <>
##$BF1= 200.13
##$BF2= 200.13
##$BF3= 200.13
##$BF4= 200.13
##$BF5= 200.13
##$BF6= 200.13
##$BF7= 200.13
##$BF8= 200.13
##$BYTORDA= 1
##$CFDGTYP= 0
##$CFRGTYP= 5
##$CHEMSTR= <none>
##$CNST= (0..31)
1 1 145 1 1 1 1 1 1 1 1 1 1 1 1 1 1 1 1 1 1 1 1 1 1 1 1 1 1 1 1 1 
##$CPDPRG= <>
##$CPDPRG1= <>
##$CPDPRG2= <>
##$CPDPRG3= <>
##$CPDPRG4= <mlev>
##$CPDPRG5= <mlev>
##$CPDPRG6= <mlev>
##$CPDPRG7= <mlev>
##$CPDPRG8= <mlev>
##$CPDPRGB= <>
##$CPDPRGT= <>
##$D= (0..31)
0 1.2 0 0 0 0 0 0 0 0.06 0 0.03 0 0 0 0 0.0002 0 0 0 0 0 0 0 0 0 0 0 0 
0 0 0 
##$DATE= 1642669035
##$DBL= (0..7)
120 120 120 120 120 120 120 120 
##$DBP= (0..7)
150 150 150 150 150 150 150 150 
##$DBP07= 0
##$DBPNAM0= <>
##$DBPNAM1= <>
##$DBPNAM2= <>
##$DBPNAM3= <>
##$DBPNAM4= <>
##$DBPNAM5= <>
##$DBPNAM6= <>
##$DBPNAM7= <>
##$DBPOAL= (0..7)
0.5 0.5 0.5 0.5 0.5 0.5 0.5 0.5 
##$DBPOFFS= (0..7)
0 0 0 0 0 0 0 0 
##$DE= 6
##$DECBNUC= <off>
##$DECIM= 32
##$DECNUC= <off>
##$DECSTAT= 4
##$DIGMOD= 1
##$DIGTYP= 9
##$DL= (0..7)
0 120 120 120 120 120 120 120 
##$DP= (0..7)
150 150 150 150 150 150 150 150 
##$DP07= 0
##$DPNAME0= <>
##$DPNAME1= <>
##$DPNAME2= <>
##$DPNAME3= <>
##$DPNAME4= <>
##$DPNAME5= <>
##$DPNAME6= <>
##$DPNAME7= <>
##$DPOAL= (0..7)
0.5 0.5 0.5 0.5 0.5 0.5 0.5 0.5 
##$DPOFFS= (0..7)
0 0 0 0 0 0 0 0 
##$DQDMODE= 0
##$DR= 18
##$DS= 0
##$DSLIST= <SSSSSSSSSSSSSSS>
$$ [...]
##$SUBNAM2= <"">
##$SUBNAM3= <"">
##$SUBNAM4= <"">
##$SUBNAM5= <"">
##$SUBNAM6= <"">
##$SUBNAM7= <"">
##$SUBNAM8= <"">
##$SUBNAM9= <"">
##$SW= 18.0517287032376
##$SWIBOX= (0..15)
0 0 2 0 0 0 0 0 0 0 0 0 0 0 0 0 
##$SW_h= 3612.71676300578
##$TD= 16384
##$TD0= 1
##$TE= 0
##$TE2= 300
##$TE3= 300
##$TEG= 300
##$TL= (0..7)
0 120 120 120 120 120 120 120 
##$TP= (0..7)
150 150 150 150 150 150 150 150 
##$TP07= 0
##$TPNAME0= <>
##$TPNAME1= <>
##$TPNAME2= <>
##$TPNAME3= <>
##$TPNAME4= <>
##$TPNAME5= <>
##$TPNAME6= <>
##$TPNAME7= <>
##$TPOAL= (0..7)
0.5 0.5 0.5 0.5 0.5 0.5 0.5 0.5 
##$TPOFFS= (0..7)
0 0 0 0 0 0 0 0 
##$TUNHIN= 0
##$TUNHOUT= 0
##$TUNXOUT= 0
##$USERA1= <user>
##$USERA2= <user>
##$USERA3= <user>
##$USERA4= <user>
##$USERA5= <user>
##$V9= 5
##$VALIST= <valist>
##$VCLIST= <CCCCCCCCCCCCCCC>
##$VD= 0
##$VDLIST= <DDDDDDDDDDDDDDD>
##$VPLIST= <PPPPPPPPPPPPPPP>
##$VTLIST= <TTTTTTTTTTTTTTT>
##$WBST= 1024
##$WBSW= 4
##$XGAIN= (0..3)
0 0 0 0 
##$XL= 0
##$YL= 0
##$YMAX_a= 104972
##$YMIN_a= -173537
##$ZGOPTNS= <>
##$ZL1= 120
##$ZL2= 120
##$ZL3= 120
##$ZL4= 120
##$ABSF1= 10
##$ABSF2= 0
##$ABSG= 5
##$ABSL= 3
##$ALPHA= 0
##$AQORDER= 0
##$ASSFAC= 0
##$ASSFACI= 0
##$ASSFACX= 0
##$ASSWID= 0
##$AUNMP= <proc_1d>
##$AZFE= 0.1
##$AZFW= 0.1
##$BCFW= 1
##$BC_mod= 2
##$BYTORDP= 1
##$COROFFS= 0
##$CY= 11.3945322036743
##$DATMOD= 1
##$DC= 2
##$DFILT= <>
##$DTYPP= 0
##$F1P= 2.36226072786647
##$F2P= -0.459571619588291
##$FCOR= 0.5
##$FTSIZE= 0
##$FT_mod= 4
##$GAMMA= 1
##$GB= 0.15
##$INTBC= 1
##$INTSCL= 1
##$ISEN= 128
##$LB= 0.24
##$LEV0= 0
##$LPBIN= 0
##$MAXI= 10000
##$MC2= 0
##$MEAN= 0
##$ME_mod= 0
##$MI= 1.114404
##$NCOEF= 0
##$NC_proc= 0
##$NLEV= 6
##$NOISF1= 3.799351
##$NOISF2= 2.8
##$NSP= 1
##$NTH_PI= 0
##$NZP= 0
##$OFFSET= 15.70392
##$PC= 1
##$PHC0= -15876.05
##$PHC1= 17.00078
##$PH_mod= 1
##$PKNL= yes
##$PPARMOD= 0
##$PSCAL= 0
##$PSIGN= 0
##$REVERSE= no
##$SF= 200.130013532006
##$SI= 16384
##$SIGF1= 3
##$SIGF2= 2
##$SINO= 400
##$SIOLD= 16384
##$SREGLST= <1H.CDCl3>
##$SSB= 0
##$STSI= 0
##$STSR= 0
##$SW_p= 3612.71676300578
##$SYMM= 0
##$S_DEV= 0
##$TDeff= 0
##$TDoff= 0
##$TI= <>
##$TILT= no
##$TM1= 0
##$TM2= 0
##$TOPLEV= 0
##$USERP1= <user>
##$USERP2= <user>
##$USERP3= <user>
##$USERP4= <user>
##$USERP5= <user>
##$WDW= 1
##$XDIM= 8192
##$YMAX_p= 0
##$YMIN_p= 0
$$ End of Bruker specific parameters
$$ ---------------------------------
##NTUPLES= NMR FID
##VAR_NAME=  TIME,          FID/REAL,        FID/IMAG
##SYMBOL=    X,             R,               I
##VAR_TYPE=  INDEPENDENT,   DEPENDENT,       DEPENDENT
##VAR_FORM=  AFFN,          ASDF,            ASDF
##VAR_DIM=   8192,          8192,            8192
##UNITS=     SECONDS,       ARBITRARY UNITS, ARBITRARY UNITS
##FACTOR=    0.0002768,     1,               1
##FIRST=     0,             0,               0
##LAST=      2.2672688,     0,               0
##MIN=       0,             -173537,         0
##MAX=       2.2672688,     104972,          0
$$ Real data points
##PAGE= N=1
##DATA TABLE= (X++(R..R)), XYDATA
$$ [...]
1769A54Q3j27p02L72O26J29j136K04O38J78l57l36L66N44m44n56M97J85n49l45
1789e76M24P90m00p40P9N83J71n18k48J77P88l02j81j98K35j73l3P0L95k21m40
1810c18J27M61K69m63m13J91M70l5j36k81J07j57K46n1j38K12j9j27J06K98m13
1831f4j74K5K75L18o13o3K23N05k9n87j23M47N0l07o4M76K30r02Q9L47K92m92
1853a41l87P10L04o9r88J51J046l61m51o7O30n1m27n33Q65n3m97j38L88M98m86
1874e7n85N68N47l41n85J83L06K86n25rN21k70m8j93J21M10o14j41M94q6J20n19
1896d17J33K24K22j93m89N44L3L11m18l31M06Q5j63m7M00p6k95k88L40L42m1n49
1918b67oN55J99o37k98M85K45m2o06N69J88l99l6R5P2J19k47n43R50J96o98n27
$$ plain form
1769 154 237 110 -592 -220 406 535 -601 -397 241 419 62 -274 92 636 192 -364 133 318 -231 -576
1789 -576 -152 638 238 -502 -423 160 331 -187 -435 -258 530 228 47 -151 84 -89 -122 -52 343 122 -318
1810 -318 -191 270 539 76 -337 -146 324 289 153 -128 -21 -178 68 17 -121 91 72 -55 51 349 -64
1831 -64 -238 -213 62 380 -233 -296 -73 432 403 -184 -307 140 190 -117 -181 295 525 -377 -288 59 351 -141
1853 -141 -528 182 486 417 -571 -420 626 265 -186 -253 377 326 -101 -634 231 178 -319 -457 -69 429 -57
1874 -57 -642 -74 473 132 -453 -270 36 322 -203 -212 309 39 -9 -202 -81 329 -285 -426 68 -18 102 -417
1896 -417 -284 -60 162 -31 -520 24 57 368 -50 -381 25 110 -53 -100 300 224 -71 -359 -19 323 282 -267
1918 -267 -273 282 481 -156 -454 31 276 234 -372 197 385 -14 -50 45 117 236 -11 -554 396 592 -106 -633
1940f33N27K77k41n01O25N23m25l89J34N24k16o20l8O27J87o29j20M45N86n59
1960H4o25O04J95o7l77J96L07k52l78NN32k35J30m66L52K23k8j99k50M76J31k64
1982I4k46K73K53l28k22K8J0K29l09J44K27ok29l02M84lO0n34K01O48l32m36k41
2005e37J007j83p19M03K42m3l09k3K97L04o68m29N87L28j35o79J46Q39k07l31
2025a10l70N05L53o11j08N37K37o96j83M71K30l33n52L39N83l18k54r6O22l8k88
2046h0k49M12n2o2j98J31O1r3r1M8K80J85m89K43K6J08n4k73K02J86J70l52j87
2069a28k34M54j97k71J74O90l75j47m6K03L2j03l09L49L55o62j58J88L96j20k92
2090b01J74L21j63m99J01N34L6k55m10K90N10n60N0R6L13l42l56K79L32Np04L99
$$ plain form
1940 -633 -106 171 -70 -571 54 577 152 -237 -103 421 205 -415 -453 174 361 -268 -388 57 643 84
1960 84 -541 63 258 191 -186 10 317 65 -313 -308 224 -11 119 -347 5 228 200 1 -249 227 358 94
1982 94 -152 121 374 46 -176 -148 -138 91 -218 -74 153 147 -82 -384 100 97 157 -377 -176 472 140 -296 -537
2005 -537 470 287 -432 -29 213 170 -139 -162 135 439 -229 -658 -71 257 122 -557 -411 428 221 -110
2025 -110 -480 25 378 -233 -341 196 433 -263 -446 25 255 -78 -630 -291 292 -26 -280 -376 246 208 -80
2046 -80 -329 83 31 -31 -229 -98 -37 -130 -221 -173 107 292 -197 46 72 180 126 -147 55 241 411 59 -128
2069 -128 -362 92 -105 -376 -202 488 113 -34 -80 123 155 52 -257 92 447 -215 -373 -185 211 91 -201
2090 -201 -27 294 131 -368 -267 267 303 48 -362 -72 438 -122 -72 24 337 -5 -361 -82 250 255 -449 -50
2112e0K50o2m31K19K86J59l92l16N79j15r9l67K43K39k34KQ2K98p4j01j17K73
2134B72j01l47J03q2K82k12J3J24K01q6m39j36M96j26j34p1j42M82J00k30k52
2155b85M58j09l47J52k0L35j79k29j09P43j75j5m60M53P8m35o3J45M71o64M06
2176A51j12J51j96n02N02N26l71l42J14L75n8j31n09N28R5o7n15L88L00m01K5
2197d9k13M61k35j78M5M66m0m40k7L60j7m72K55J60m6j47r5K39K45l08K16k77
2219i7L66j44j80j04k9L56r3j21qJ43j48j14m3M2L28j50k07P9n7M81k73k19L12
2242A20r4k50o4L68mj26N4lOJ81l62L06j17R2j32j19L37L6k97j06J1M30l09r2
2266a34LL00l05j57K61J43K05l60j6K29M3l25J23j2K00j65j03j0K92m00J15J50
$$ plain form
2112 -50 200 138 -293 -74 212 371 -21 -337 242 127 28 -339 -96 143 -91 -89 -7 291 217 116 -1 272
2134 272 171 -176 -73 -155 127 -85 -72 52 253 167 -272 -408 88 -38 -172 -243 -385 97 197 -33 -285
2155 -285 173 64 -283 -131 -151 184 5 -224 -333 410 235 220 -240 213 291 -144 -207 -62 409 -255 151
2176 151 39 190 -6 -508 -6 520 149 -193 -79 296 238 107 -402 126 221 154 -361 27 327 -74 -49
2197 -49 -262 199 -36 -214 -169 297 257 -183 -210 150 133 -339 -84 76 30 -117 -212 27 272 -36 180 -97
2219 -97 269 125 -55 -159 -188 168 75 -46 -54 89 -59 -173 -216 -174 154 4 -203 -124 -181 300 27 -192 120
2242 120 26 -224 -288 80 76 -50 4 1 7 188 -174 132 15 107 -25 -144 193 229 -68 -174 -163 267 -42 -134
2266 -134 -131 169 -136 -293 -32 111 316 -44 -60 169 212 -113 10 -2 198 33 -70 -80 212 -188 -73 77
2288G7J7P5j62J4J41p9l30R4J43m3p7o4K75p6j5J1l7o8L04j27j28O3J83k32P2
2313C1J3L7M2p1j48J62M4J0k97k43J61N33l11k7N4J1J06l01Q1K18j16j85K26N3
2337H3J18l75J47mL0j48N9M00j27k61m1L39k64r7lJ47k39M82n56K85P9P6k12K2
2361f0J30n3k70N3M71j04j98M5j15J38k20o2L05pK3L8j83j71J96l5K40kJ99k96
2385F2p5j71M10m60K96n7k9J1QK6r4n4L09p1p0k50L78J02m87l3L89j43j00n9M3
2410a19k7J0m6M0K29l28L20j69J22j24n8p4K04J85m39J55K92p1M0k87K10J04l57
2433a88J63K18RJ16m58J66o9PQ8Q5l96J16n5K99l2k16k6m7J7k7J35J03k7j02K50
2458A29k60MJ39j27J8J28j77N3K13M9k57J62m3M2L5p4p2nj96L12o7J10r5m7L8
$$ plain form
2288 77 94 169 7 21 162 83 -247 -153 -10 -53 -130 -194 81 5 -10 1 -36 -104 200 73 -55 8 191 -41 31
2313 31 44 81 123 52 -96 66 110 120 -177 -420 -259 274 -37 -64 -10 1 107 -194 -113 105 -11 -196 30 83
2337 83 201 -174 -27 -31 -1 -149 -90 310 183 -78 -119 220 -44 -141 -144 3 -236 246 -310 -25 54 130 -82 -60
2361 -60 70 17 -253 -200 271 167 -31 14 -101 37 -183 -245 60 53 76 114 -69 -240 -44 -79 161 159 358 62
2385 62 -13 -184 226 -234 62 5 -24 -13 -5 21 -73 -127 182 111 41 -209 169 271 -216 -249 140 -3 -103 -162 -119
2410 -119 -146 -136 -182 -142 87 -241 79 -90 32 -92 -150 -224 -20 165 -274 -119 173 102 142 -145 65 169 -188
2433 -188 -25 193 202 318 -140 26 -43 -36 52 137 -259 -143 -198 101 69 -147 -173 -220 -203 -230 -95 8 -19 -121 129
2458 129 -131 -127 12 -115 -97 31 -146 -93 120 169 -88 74 31 73 108 34 -38 -43 -239 73 6 116 21 -26 12
2483A2j33P0L0j41L01j02P4K9k79k2O0J21J09n9j03j92J92J19o6m9J1l1J89j27
2507A3j87O0J23N3l58M05k75K4K16P0j06o1Rj61K21j25l1J61R2l05K32l4l9n3
2531e6m1J68P6M4k93mL11J36k32j84Rj5K5K4j46J6k6K39j9MQM7o1j22J9J06k8
2558El27L05p8K4K78l19J01K41m49J45m6J26%P2j36K09l28L64j31j29J74j90J24
2581C5J38k01m7L03q7p1j42J35o9Q8m55M08N7r2J30l90K78L4J5j6j80M72m32M51
2605C62j06m41J4J59q7K72j71J12K3j90J48P9l86K66J43k73o6J74j91K52P7M9
2627B19k39J18L5j05n9j58J00J43j2k68K05k08L22P9j71J07k01N6J26J67k68Q
2649dM2j11K7N5Ln8N4J9j25K97O8k8k90n8J31n0k00M73k51R8n8J94k00K60k54
$$ plain form
2483 12 -121 -51 -21 -162 139 37 111 140 -139 -161 -101 20 129 70 -33 -225 -33 86 20 -29 -18 -49 140 13
2507 13 -174 -114 9 62 -296 109 -166 -142 74 144 38 -23 -14 -175 46 -79 -110 51 143 -162 70 36 -3 -56
2531 -56 -97 71 147 191 -102 -106 205 341 109 -75 -66 -81 -56 -32 -178 -162 -188 51 32 36 44 91 30 -92 -73 33 5
2558 5 -322 -17 -95 -71 207 -112 -11 230 -219 -74 -120 6 6 78 -58 151 -177 187 56 -73 101 -89 35
2581 35 173 -28 -75 228 141 70 -72 63 -6 82 -373 35 92 0 130 -260 18 52 67 51 -129 343 -89 362
2605 362 256 -185 -171 -12 -99 173 2 114 137 -53 95 174 -212 54 197 -76 -142 32 -159 93 170 219
2627 219 -20 98 133 28 -31 -189 -89 54 42 -226 -21 -229 93 172 1 108 -93 -37 89 256 -12 -4
2649 -4 38 -73 -46 9 12 -46 8 27 -98 199 267 239 -51 -109 22 -28 -228 245 -6 92 34 228 28 288 34
2674C4m1L55l81K33j68K18l38J99o4L36l03q9K31j42N4o0k96N75n09J51k2J17
2696I0j84k61N00j39J46k52K03j76J80k07j67L15M1k29mJ63O3j01O9o5k6Q4m6
2719cJ74k07RK24j09J88k77J14q2J50k69J09j07O9J43l53N94k05r4r2l44J27L79
2742A38K4k05K10j78m2J02j2Q7l07j96N03k85M9J27q6J72j30K6qj50J0J50K43
2765B42k91J34J23n15M91R4k14M0j46j15j33O8K28j50J33O9k72MJ78j44K84j72
2787f4J04J51k82P7q0K01n0J39l15O8K9j09k17K37O7M2J2j10K80j03k56K58j01
2810b2j62p0K34M3k03K27j57N72n43p3J64J25k41N4j15J97r7l8J10j63L7J58j40
2833a03K7J74j85J03j02M01m14J03L21k71j48j85o1M77j47p8n4J39J67j20P2j8
$$ plain form
2674 34 -7 348 -33 200 32 250 -88 111 47 383 80 -9 222 80 134 74 -222 353 -156 -5 -27 90
2696 90 -94 -355 145 6 152 -100 103 -73 107 -100 -267 48 89 -140 -144 19 82 -19 50 -15 -41 43 -3
2719 -3 171 -36 -27 197 88 276 -1 113 31 181 -88 21 -86 -17 126 -227 367 162 68 -24 -368 -241 138
2742 138 162 -43 167 -11 -53 49 37 124 -183 -379 124 -161 -112 15 -71 101 -29 -3 -11 -161 -151 -1 242
2765 242 -49 85 208 -307 184 278 64 104 -42 -157 -290 -222 6 -144 -11 58 -214 -210 -32 -176 108 -64
2787 -64 40 191 -91 -14 -94 107 57 196 -119 -51 -22 -131 -348 -111 -44 -2 10 -100 180 77 -179 79 -22
2810 -22 -184 -254 -20 23 -180 47 -110 462 -81 -154 10 135 -106 -52 -167 30 -67 -105 5 -158 -121 37 -103
2833 -103 -76 98 -87 16 -86 315 -99 4 325 54 -94 -279 -340 137 -10 -88 -142 -3 164 44 116 98
2855I8K07j77j55j24K37l31K51l01K74j5r8J63k52K51q5K76k34r9j06K09K27k73
2877e7J34r0J13k31K60j0N3k4j58M6j81K52j69J06j44L24j60O2J39k95Q3J2J4
2900G9k92J56J4K8Lm3p6K10M4o6Q9k24L4j89P9J75M4j30J65j30J83l11J06J69
2924A17j52N7k6J72j76J58l16N3J98j18r9%N71m64P3j54K58k20j79K51J31l45
2946b10K55rql8L04k95k8K18j43l6q2K5Q4N6p2O6j3j5j64O1k25L74k33K45j61
2971d4r7K58o9R1J6k21k33K11K31j09J37k37QJ00L1l32k6K88k72K27j18Q8N2M01
2995C81n74K57K55k71n1j66M14m24O0K60q6J54k47J86j58l9P6j82J67K39r4l15
3017a58l4L88q0r4nj1K37k05J12k08j36M28k57Q4r5J6N3k06K07m6j3J39ol06O2
$$ plain form
2855 98 305 128 -27 -151 86 -245 6 -295 -21 -36 -134 29 -223 28 -57 219 -15 -114 -220 -11 216 -57
2877 -57 77 -13 100 -131 129 119 172 148 -10 36 -145 107 -62 44 -100 224 64 126 265 -30 53 65 79
2900 79 -213 -57 -43 -15 -12 -55 -131 79 123 57 146 -78 -44 -233 -154 21 65 -65 100 -30 153 -158 -52 117
2924 117 -35 22 -4 168 -8 150 -166 -113 85 -33 -132 -132 439 -25 48 -106 152 -68 -247 4 135 -210
2946 -210 45 36 28 -10 294 -1 -29 189 46 10 -72 -47 37 93 21 87 74 59 -105 -44 -269 105 -128 117 -44
2971 -44 -141 117 48 139 155 -66 -299 -88 143 34 171 -66 -58 42 73 -259 -285 3 -269 -42 -160 -72 -20 381
2995 381 -193 64 319 48 -3 -169 245 -179 -119 141 55 209 -38 148 -10 -49 27 -155 12 251 157 -158
3017 -158 -192 196 116 22 17 6 243 38 150 -58 -194 234 -23 61 -34 -18 35 -171 36 -10 -23 116 110 -196 -134
3042a34L0K5M3K5K05k44K73k82J61k07R0K1J36L3n80L16K95l44N3J14j23P9j93
3065b08J48K85M5l76m4J51l8K7J9L2n6N8O8J92k53J45k13K3mJ04m05K43J99l41
3089a99k2L22j32Qj3J19J13O3k32J98k22j21M7N7L0lj29J48r1K39n3l19L65j53
3113B0j54J19L19k97l11N8K98p4l9M4K79l51K84k17k64L36j97L73j95M9K4j05
3135aJ04r2J09l17M7K94k35Q4O3J47k05j45NM58n09J41o4p5K51j52J30R4j47J02
3159H7k79J33K17k07lJ61j41J49j48j34K37k38l4J62J43k50M20k95j03n7K57L2
3181A09p7k53M2L08J1k29O6L9M1J23l23K2K0L25m35M1J86n6J92l5N9n89L45q1
3205a49K41q6n9J18k10L28k78O2J12k08R5L2Q2k91j5J06J43j01J17J60l28K57
$$ plain form
3042 -134 -104 -79 -36 -11 194 -50 223 -59 102 -105 -15 6 142 175 -405 -89 206 -138 -85 29 -94 -15 -208
3065 -208 -60 225 270 -106 -150 1 -37 -10 9 41 -15 43 111 303 50 195 -18 5 1 105 -300 -57 142 -199
3089 -199 -221 101 -31 -23 -36 83 196 259 27 225 3 -118 -71 -14 16 13 -116 32 -59 180 127 -192 173 20
3113 20 -134 -15 304 7 -304 -246 52 -22 -61 -17 262 -89 195 -22 -286 50 -147 226 31 80 104 -1
3135 -1 103 11 120 -197 -150 144 -91 -7 56 203 -2 -147 -142 316 -193 -52 -116 -191 60 -92 38 132 -15 87
3159 87 -192 -59 158 -49 -52 109 -32 117 -31 -165 72 -166 -200 -38 105 -145 275 -20 -123 -180 77 109
3181 109 32 -221 -179 129 140 -89 -23 16 57 180 -143 -121 -101 224 -211 -170 16 -40 152 117 176 -413 -68 -149
3205 -149 92 6 -53 65 -145 183 -95 -33 79 -129 -34 -2 80 -211 -226 -120 23 -78 39 199 -129 128
3227A28p1K1j4n6O0n07O72k25o7J21n9Q3k09R3O9J4o6J2J77n0j12j84J33k6j19
3252a82J21r0K78j09k35J9K56j61J40M1j38N2k3J36j26L5L4k09K35M2j77nM4Q9
3276F7j87J63l9L40k6k97k5k11K09J63p3m7j27J11q8k38K72J38q6N7l1j5J76l74
3300a68K37l1J79k5j28k01L64l42K14k33J15q2K40k80P7J1j68J35RJ33k5Q0L7
3323A48p3j94K74M3j74J28k20J71J93l46q8Q1J07M8r0L45l69Q8M7k02r1K62j18
3346c0K60m26J63Q3j61L0J39J1j40M18j98k06j03K68O4j52l6O5j44l9K6M11k29
3369G4nP5j99J12p4j58J07K5j83M94j32q7Nk85L32k39K1MK71l11J40n5J73o6L38
3394C77l92J66q2j92M2m1J17j2P5K28j79l33o3J91J24j76m5P1K87j61L9j46J57
$$ plain form
3227 128 57 78 64 8 68 -439 233 8 -59 62 3 86 -123 -30 39 53 -13 -1 176 126 14 -170 -37 -63 -182
3252 -182 -61 -151 127 18 -217 -198 58 -103 37 78 -60 -8 -31 105 -21 14 48 -161 74 116 -61 -66 -22 67
3276 67 -120 43 4 344 318 21 -4 -215 -6 157 84 37 -90 21 -67 -305 -33 105 19 76 45 30 206 -168
3300 -168 69 38 217 192 64 -137 227 -115 99 -134 -19 -101 139 -141 -64 -53 -221 -86 -77 56 31 111 148
3323 148 75 -119 155 198 24 152 -68 103 296 -50 -138 -57 50 98 8 353 -16 72 119 -83 -174 88 -30
3346 -30 230 -196 -33 50 -111 -81 58 69 -71 347 149 -57 -160 108 172 20 -16 49 -95 -134 -108 303 74
3369 74 69 144 -55 57 -17 -175 -68 -43 -226 268 136 49 54 -231 101 -138 -117 -113 158 -153 -13 -68 105 39 377
3394 377 -15 151 69 -123 -81 -122 -5 -17 58 286 107 -226 -289 -98 26 -150 -195 -124 163 2 41 -105 52
3417E2o1J08j9r4mPm2J97j42oM6q3K12j02j53k01K61J47k08J19j48J81k32R7J05
3442C7k51J17Q4P8O2K5l11J29l61L18j22K44O9j85K33k97K34k22M06l01J9nj82
3465a82L38l23K37l26K28P1j2Q0m18L45j65P4J0J69r1p0j96L93k1k95K15k90K46
3488A7j6l1L01k79j00L39j34J25p9j59j60M71m36J19K7J28l9k02J3l7p6K49p1
3511c0P0lj36L09l19J49j02j96L04N7N3o6j38j03m8K80p3L52l59j23Q4K27j09
3534H0O5J77k94N5K09l64J08J17j78k18K27q3J3Lj30M10k67m7K72o4l6j74J76
3557E7q0l9J27m0O3P6j22j73O5J18k23K31R1j68N1l8J61j17Q9q5j24q0Q0j53K32
3582ak25J08J22j91K99j59m2J40n9j48N5J37j11l0J34K55k9k04Q5J51k73N6j77
$$ plain form
3417 52 -9 99 80 -14 -18 -11 -53 144 2 -4 42 -41 171 69 -84 -285 -24 123 -85 34 -114 67 -165 -68 37
3442 37 -214 -97 -13 65 127 152 -159 -30 -391 -73 -195 49 118 -67 166 -131 103 -119 287 -14 5 0 -182
3465 -182 156 -167 70 -256 -28 43 31 111 -307 38 -127 -53 -43 126 35 -35 -231 162 141 -154 61 -229 17
3488 17 1 -30 271 -8 -108 231 97 222 143 -16 -176 295 -141 -22 5 133 94 -108 -95 -132 -208 41 -30
3511 -30 40 37 -99 210 -109 40 -62 -258 46 103 156 90 -48 -151 -199 81 8 360 1 -122 -38 189 80
3534 80 145 322 28 83 292 -72 36 153 -25 -243 -16 -99 -86 -83 -213 197 -70 -117 155 91 55 -119 57
3557 57 -23 -62 65 25 88 164 42 -131 -66 52 -171 60 151 -17 34 -4 157 40 129 44 -80 -160 -80 -233 -1
3582 -1 -226 -118 4 -187 112 -47 -89 51 -8 -156 -101 36 -75 -105 29 284 255 51 136 287 14 70 -107
3605a07M8L44k44j01K6p7j57J92o7J24j77K95j86O3j22M01l61L31k46J6j24k6
3627a55L98m70K23L29n82L47j7l7m6j0M5r2j01K59n5l5K0j41J69j5Q6k55%Q6j34
3652a83J31J42j50J45l11L27k14L88n04N38k60n2k05P0N8K42l98J52j13J57n1
3673i1KK8J16lp7P5q7K83m53K49l5j13K49J08j97k7Q3p6R7K02k63L4J14P8l82
3698h6K67j27j95P0J44l33J50m1J75j6N4J11o3j16l8J46r5m4N3j58P0rP2j45J36
3723a8j92K30O8m2L48L5n71n9K09J29j58J9J18j91P7K5J32j64J62j64j09K64l43
3746a95J29m4R7K56j4l19P8j31K4J01m6R0p0Q0J80k65J9J0J14L3k13q8J05K45
3770A76k2k97M0Q7j40p0K71k37K52L37k47k68N3j87K49m6J23l37K30k70J0L31
$$ plain form
3605 -107 -59 285 41 -60 -34 -111 -268 -76 -143 -19 -196 99 -87 -24 -146 255 -106 225 -21 -5 -129 -155
3627 -155 243 -227 -4 325 -257 90 73 36 -10 -20 25 -67 -168 91 36 1 21 -120 49 34 120 -135 -135 -49 -183
3652 -183 -52 90 -60 85 -226 101 -113 275 -229 309 49 -3 -208 -138 -80 162 -236 -84 -197 -40 -91
3673 -91 -89 -61 55 52 -25 50 -37 246 -207 42 7 -106 143 251 54 27 110 34 131 333 70 104 218 296 -86
3698 -86 181 54 -141 -71 73 -260 -110 -151 24 8 62 173 110 -6 -44 102 7 -37 16 -142 -72 -81 -9 -154 -18
3723 -18 -210 20 88 46 394 429 -142 -201 8 137 -21 -2 116 -75 2 27 159 -5 157 -7 -116 148 -195
3746 -195 -66 -110 -13 243 229 -90 -12 -143 -119 -18 -64 26 -44 36 216 -49 -30 -20 94 127 -86 -174 -69 176
3770 176 154 -143 -103 -16 -156 -226 45 -192 60 397 150 -118 -65 -252 -3 -49 74 -263 -33 -303 -293 38
3792C8j37P7J48j44M7k96N31j16j08k84Q2J02k7q9K39j22J33P5q7j68L09k71N0
3815a8j16J31J50j54k05R9K12p8j50m0J68J05k56L55j70k31N29l14MM2n30N50
3837H3J12j76K08j17k75J84k51K38k37L78j59O0j81Q4K1P1j33P3R7n08N17k33
3859a44N5J33P6j47l12N89r4l46M02k54J10j07M1k02J52j16J61Mm0R3L4l00L66
3882A54l2%j17R3j01N8r5K27k35K52%l33L43l24j57K55m6K08JN5k32M5j66K47
3906A00p3J92j68k27J22K94l55L4J43k17K49r2P1r2o3q9J75P1p5P5k15q1M15l67
3930a73K20J02l86Q1K24j55P7l26O9K78n5K20j22q5K04j47R0j67J10j36M8R9m2
3953B8J00o9p9K76l95M2L46k64J9K3lNq4r7O7K13k40N8J89p3K73j89j99K4J83
$$ plain form
3792 38 -99 -22 126 -18 29 -267 264 148 40 -244 -162 -60 -87 -176 63 -59 74 149 62 -106 203 -68 -18
3815 -18 -134 -3 147 -7 -212 -113 99 21 -129 -169 -1 104 -152 203 33 -198 331 17 21 63 -467 83
3837 83 195 19 227 110 -165 19 -232 6 -231 147 -12 48 -133 -49 -28 43 -90 -17 80 -428 89 -144
3859 -144 -89 44 120 -27 -339 250 156 -190 212 -42 68 -39 2 -200 -48 -164 -3 1 -39 54 88 -212 154
3882 154 122 122 5 98 -3 55 -40 187 -48 204 204 -129 214 -110 -267 -12 -58 150 151 206 -26 19 -147 100
3906 100 27 219 51 -176 -54 240 -115 -81 62 -155 94 2 73 -19 -82 -171 4 75 0 75 -140 -221 194 -173
3930 -173 47 149 -237 -156 68 -87 -10 -336 -267 11 -44 176 54 -31 173 26 116 -51 59 -77 -29 70 28
3953 28 128 59 -20 256 -139 -97 249 -15 4 27 24 29 -55 -152 -85 128 -112 -54 135 62 335 146 -53 -29 154
3978A54n1P8j91n6J15Q0j32L4P4k28M36k74J92k09J9K0q9l3l3K66k49j61J72q7
4002a53K42O2l67O5L16k68J00J56k39j2L45m32K66j45J82j1m31M09l66M07j21
4023Ej41l5J94k5J14j22k24K90J66l6k42k2O1j60L11k22O9j14J55p1N6J83m19
4046b29J79q5l1N4K24k2l3Q1J5j70L2m9J57o8k1l25K13L7k4KK3k04K52J71R5k19
4072E5l70N85l05J97l37o1J90L6Q4q3K25j10J60j00k58J00M9R0j34M3rK3P8k02
4096e4L6n3O0j03K4l7O4J40j39P0l0k18J59O4k14K18k17K09p9P1o5j2L76j87j92
4121a09O9k3l0J1j61L26p9J51l14N0p9J69l9k26J88K85k45n9k1K55j46k18L31
4144H6m6J19j26J19o5J92l34J08k6J68k95j21L65P4k58j57L14O2k41J83k66j55
$$ plain form
3978 154 103 181 -10 -66 49 129 -3 31 105 -123 313 39 231 22 41 61 -28 -61 -94 172 -77 -238 -66 -153
4002 -153 89 151 -216 -151 165 -103 -3 153 -86 -98 247 -185 81 -64 118 107 -324 85 -281 126 5
4023 5 -136 -171 23 -2 112 -10 -234 56 222 186 -56 -78 -17 -177 134 -88 -19 -133 22 -49 7 190 -229
4046 -229 -50 -135 -166 -112 112 90 57 138 153 -17 15 -34 123 55 34 -291 -78 -41 -65 -63 -40 -244 8 179 274 55
4072 55 -315 270 -35 162 -175 -236 -46 -10 74 -9 216 106 266 166 -92 8 57 147 13 56 47 70 148 -54
4096 -54 -18 -71 -11 -114 -90 -127 -63 77 -62 8 -22 -240 -81 -17 -231 -13 -230 -21 -100 -29 -94 -106 270 83 -109
4121 -109 -40 -63 -93 -82 -243 83 4 155 -159 -109 -188 -19 -58 -284 -96 189 -56 -115 -136 119 -27 -245 86
4144 86 40 159 33 152 87 279 -55 53 27 195 -100 -221 144 218 -40 -197 117 179 -62 121 -145 -300
4166c00K70L07l29q4R8Q0j45J75r2J06k27J1N6J67q0Pj69J8K33j13R2k11J34k35
4190b31J01K4m4J18N9l52L27N1R7jk95K0K82l10K41j35lJ77l19K25O9o5n8K78
4214B56m97N8J87k3J06j86K11k0Q6m62M51j83m5R6Lj78J97L12l67J5P7J53l40
4237i3oK6r6K72j75j32J80K01k5k23o6R0q4K01l07J85K23k20R7n4j00P6nJ52j36
4262a9K0Q1j5l87L52k23k3K64j77J01j38J12j97J15K13k58K35j96Q8R7k1k52L28
4285A00k70J07Q1nk59L80k76QK59J13k56J55M4k63J35k49J08M2J4j51K58k23K77
4308A29j93J0K60J84k98L2k6Q2k66qoq0M4K35K6k02K10k76M54m10N9pK22k37J81
4333A19j58R5J37k46K66M5l22J98lK9m2l48J77R2r7l9K50m4k25O6K23m4l1j05
$$ plain form
4166 -300 -30 277 -52 -136 -38 42 -103 72 -20 86 -141 -130 -74 93 13 20 -149 -131 102 -11 81 -130 4 -231
4190 -231 -130 -106 -150 -32 27 -325 2 53 150 149 -146 -126 156 -154 87 -48 -51 126 -193 32 101 36 -22 256
4214 256 -241 -183 4 -19 87 -99 112 92 178 -284 167 -16 -61 35 38 -140 57 369 2 17 94 247 -93
4237 -93 -99 -73 -169 103 -72 -204 -24 177 152 -71 -137 -47 -131 70 -237 -52 171 -49 48 -6 -106 -30 -35 117 -19
4262 -19 1 82 67 -320 32 -191 -214 50 -127 -26 -164 -52 -249 -134 79 -179 56 -140 -52 45 24 -228 100
4285 100 -170 -63 18 13 -246 134 -142 -134 125 238 -18 137 181 -82 53 -196 -88 -46 -32 -183 75 -148 129
4308 129 -64 -54 206 390 92 124 98 180 -86 -94 -100 -180 -136 99 125 -77 133 -143 311 -99 -40 -47 175 -62 119
4333 119 -39 56 193 -53 213 258 -64 134 131 160 118 -230 -53 39 -58 -97 153 109 -116 -50 173 129 98 -7
4357go7J67j94N7J9r9J39J00k60J12J22k44K65l7k6j1K7J1O5k24M4m6K72l25L26
4382A86l07J9K37j54k2l6K52j45p5M19l20J8l11L9J85l5K10k38J45j50k2K81n81
4405d05L68j26N2J20m41L15K8J7K7M3j8O9q5k9J92j69J13m1r8k6J99j62l9J49
4429E3o2K43m98M72k06j4j5OM5r4J70N9j30K0k35K46Q9m10J39j1Q7j86J00J21
4453a1j12M7J57k14L12l40K81k84K32J10m6j41j46J06rJ58j17j57K5L90j84N9
4475A16J21l40K65l18J44J04j56O8K43k57j10P5Jj83K19k0K61l86N3L26m6k29
4497d9J65k15O0j44j31L22j57M0J49JRM7J55l14K53k78L58m90K91k92L08j62q0
4520a54K99o7j11k44J07R7j84M40k4l9j67k51K81J45k20K1R8j66J61R1k42J75
$$ plain form
4357 -7 -74 93 -101 -44 -25 -124 15 115 -145 -33 89 -155 110 73 47 36 63 74 139 -85 -41 -87 185 -140 186
4382 186 -121 -102 135 -19 -41 -77 175 30 -45 374 54 72 -239 -200 -15 -50 160 -78 67 -83 -105 176 -405
4405 -405 -37 -163 -111 9 -432 -117 -89 -72 -45 -2 -20 49 -36 -65 127 -42 71 30 -68 -94 105 -57 -96 53
4429 53 -9 234 -264 208 2 -12 -27 -21 24 -70 100 159 29 49 -186 60 149 -261 -122 -133 -46 -232 -132 -11
4453 -11 -123 -76 81 -133 179 -161 120 -164 68 178 132 -9 -155 -49 -58 100 -17 -174 -149 241 57 116
4475 116 237 -103 162 -156 -12 92 -64 4 247 -10 -120 -45 -44 -227 -8 -28 233 -153 -100 226 180 -49
4497 -49 116 -99 -39 -183 -314 8 -149 -109 40 41 50 97 252 -62 191 -87 271 -219 72 -220 88 -74 -154
4520 -154 145 78 -33 -277 -170 -73 -257 183 159 120 -47 -298 -17 128 -92 -71 27 -139 22 113 -129 46
4542D6J7R0r7J36Oj29J30k37j6j08K20o5Q9J10j62j10P7l9r8l8K71j29J50l4K91
4567C71j67k11N8K16k09p3K50l06O9j01R5p0j44M84j29n4j18j59K56K64l66N2
4589HM8j18R9J13k9k73N9L08j79k27L08k77Q5n1R7J31j62k09J53K11k3l05r9P4
4613b58M1L2k5L08j67K41l24J43J03r5R5j91O4j70J87q3l7R7O5J08J3k08k04L61
4637I6O6m1j34Mn1Q8j79J97j36J90k50K32J34n03o6J35J35q5R3N6J01j47K37q6
4661H6l11J27K34k26J73K5j23r4K32q4O5m57K71P9L06m81N8K45N6k74L21k16j73
4684a61K51j19K44k88j66K57K03r2j79j23l2r9L75R0k05j18L56j52k87J70q0J16
4706c9J70k92K93j6k58J64K01k58%j32L25n0k01J51l9o3M0J35k05j6J99k39J5
$$ plain form
4542 46 63 153 56 192 198 69 199 -38 -54 -162 58 -7 82 192 30 -80 -3 -42 -140 -178 93 -36 114 80 371
4567 371 204 -7 51 267 58 -15 235 -71 -2 -103 -8 -78 -222 262 133 79 -39 -198 58 322 -44 8
4589 8 56 -62 37 150 121 -152 -93 215 36 -191 117 -160 -75 -126 -29 102 -60 -269 -116 95 72 -233 -332 -258
4613 -258 -217 -185 -210 98 -69 172 -152 -9 94 -1 94 -97 -33 -203 -16 -99 -136 -39 26 134 147 -61 -265 96
4637 96 162 121 -13 -9 -60 28 -151 46 -90 100 -150 82 216 -287 -353 -218 -83 -168 -75 -19 82 -65 172 86
4661 86 -225 -98 136 -90 83 108 -15 -109 123 39 104 -353 -82 -3 303 -178 -120 125 181 -93 228 12 -161
4684 -161 90 -29 215 -73 -239 18 221 129 -50 -173 -205 -304 71 161 -44 -162 194 42 -245 -75 -155 -39
4706 -39 131 -161 132 116 -142 22 223 -35 -35 -167 158 108 -93 58 19 -44 -4 131 -74 -90 109 -130 -115
4729a15K24k68J38J95p5k76L28k68J70j55K04J68j63k55K63j53N3P7O7l01N3K89
4751B00j12R4r5p0P1k9n5Q5O7j85k3J47m5J5j26QN4k07K89m9k30M72k12M4J66
4776B74l73J57J81j86l5p0Q7j02L86l08K14l04QJ9J06k57K24n1P5L0J1j90J16
4799A2J60j83K73j88j86J81r0j07J10J13M5QJ63k40k00P4Q9j12P4K02k70N7k6
4822d1M8j6k6J17k22N8j1KRj12j5M28l0j2k33J23P9j10j41J28P0j18J34k43Q8
4847d6R9n4j93J69JLK14R8m20k0L67j91j70J59J35l72K39o4p1J19J86k36q9J88
4871E1j05Q9j39J25P6Mn1m8k09L74j57K8o6J20j27k89L83J3L8j23J26J6j31k18
4895b20K22J13k12J69k73n8M04j39j09J49q3O4j09j09J83J70l36J81q4J54J00
$$ plain form
4729 -115 109 -159 -21 174 99 -177 151 -117 53 -102 102 270 107 -148 115 -38 15 92 159 -142 -89 200
4751 200 88 182 87 17 88 59 4 89 156 -29 -52 95 50 65 -61 -53 1 -206 83 34 -196 276 64 108 274
4776 274 -99 58 239 53 18 -52 35 -67 319 11 225 -79 -71 -52 54 -203 21 -30 45 75 86 -104 12
4799 12 172 -11 262 74 -112 69 -21 -128 -18 95 140 148 311 71 -129 -55 34 -78 -4 198 -72 -15 -41
4822 -41 7 -9 -35 82 -140 -82 -93 -91 -82 -194 -209 219 189 177 -56 67 146 36 -105 23 93 -25 109 -134 -46
4847 -46 53 -1 -194 -25 -24 -21 193 291 -129 -149 218 27 -143 16 151 -221 18 -46 -117 2 188 -48 -137 51
4871 51 -54 35 -104 21 97 101 50 2 -207 167 10 38 -28 92 -35 -324 59 72 110 -13 113 129 -2 -220
4895 -220 2 115 -97 72 -201 -259 145 6 -103 46 -37 27 -82 -191 -8 162 -174 7 -77 77 177
4916A77k13o7L29l35K36q5j24K42rl03M9J64M2p7o0n6J92j9K57j91k23M5l1J59
4940I9k10J70k6k5R5pk10K5J84k5p8K0k04L45o3l28L92q7j10L1K42o8k02R8j41
4965h3L53j74lj80K59l80Q9J84j91P5k00M19k91J47J34m2k29J96k12L48K2k28
4987A3j50n4J15J39M2r6oR4k71K64l15J56j01K02o1P1j61K05j80K35j38K58n0
5010B11n56N30k36J94o8k75K06j55K29j52k78M85q2k01l2j0l2L50k47L35j84j34
5032a02J63N8o1k49K05K5j49o9L54k75k4J96p1O5J25Q6m87JJ06m7P7K26k42RO4
5057a6L76m34k6K59j66J76k31Q4j6J85p7J18l83K71j69k41K19Q7M7n7K64l03K38
5080B05j28k97M10q7k85K55j88L95l79j72%J63p9Q3Q3Oj17R6J99k51L1r7K6N2
$$ plain form
4916 177 -36 -103 226 -109 127 42 -82 160 151 -152 -103 61 103 26 -34 -90 102 83 340 149 -74 -29 -60 99
4940 99 -111 59 33 8 103 96 -114 -89 95 70 -8 12 -192 153 90 -238 154 67 -43 -12 230 162 -40 58 -83
4965 -83 270 96 93 -87 172 -208 -119 65 -126 -51 -251 168 -123 24 158 116 -113 83 -129 219 241 13
4987 13 -137 -191 -76 63 105 9 3 97 -174 90 -225 -69 -170 32 -29 42 -119 86 -94 141 3 261 211
5010 211 -345 185 -51 143 75 -200 6 -149 80 -72 -350 135 53 -148 -180 -190 -222 128 -119 216 32 -102
5032 -102 61 119 58 -191 14 39 -110 -179 175 -100 -124 72 1 66 191 277 -210 -209 -103 -150 -73 153 -89 -80 -16
5057 -16 360 -74 -100 159 -7 169 -62 22 6 191 114 232 -151 120 -49 -290 -71 16 63 6 270 -33 205
5080 205 77 -220 190 103 -182 73 -115 280 -99 -271 -271 -108 -187 -104 -21 -15 -132 -36 163 -88 -57 -154 -128 -76
5104g6j61J78K72j10o5k8q4J81J73k65N4q3M1nJ80j23p4k18K42r7k05M10k50L7
5128g6J52o4q9O4j00J69q2j76L67k74L12j64j34L8J19j45K2J6J35J5j31p7J02
5151aJ87l37J38K1K01m6j66J88k69j17L47m19J90J11q3K25k25L02m87J84k8K46
5173A62j90M0Q4j47J3K41r4k90J00L3k01o9L04j24P5q6J09j81K60k28l9K94j41
5196g5K2L68o21m2J91J27jk43K73k4K00k77J33m5j55j8J66J46J8k54J38J26k77
5219a24K19j80J69k26M8m9J30j48K80r3o4K01k91J80m28K74J6o3M50l17J01j21
5241c6J15L7j71P5Rk21JN7J24n4J43j02m6M3l8J78k48L28j93j32O9r9L0P0J09
5266D8O7j37j5K69l98J22k5m4J5L26M1j64m31L03K4O9j37L11k82L6J33l18J16
$$ plain form
5104 -76 -237 -59 213 103 38 10 -74 107 280 15 69 -14 27 22 202 79 5 -213 29 -68 -273 137 -113 -76
5128 -76 76 12 -77 -13 -113 56 -26 -202 165 -109 203 39 -95 -57 62 -83 -61 -45 90 105 -26 -103 -1
5151 -1 186 -151 -13 8 209 163 -3 185 -84 -201 146 -273 -83 28 -55 170 -55 247 -240 -56 -84 162
5173 162 -28 12 96 -51 -38 203 109 -181 -81 -48 -249 -318 -14 -138 -63 -149 -40 -221 39 -189 -228 66 -75
5196 -75 -53 315 -306 -348 -157 -30 -31 -274 -1 -25 175 -102 31 -14 -169 -187 -21 125 143 -111 27 153 -124
5219 -124 95 -85 84 -142 -94 -143 -13 -161 119 26 -38 163 -128 52 -376 -102 -86 -149 301 -16 85 -36
5241 -36 79 116 -55 20 29 -192 -191 -134 -10 -64 79 -23 -69 -26 -64 114 -134 194 1 -131 -62 -161 -131 -61 48
5266 48 115 -22 -37 232 -166 -44 -69 -113 -98 228 269 105 -326 -23 1 70 -67 244 -38 -2 131 -187 -71
5289g1L6J78k54P1J92k19j41K40j09k3P7j38J69k45K58J8q8M6j2j60K26k93M85
5312B43Nn58K86L7j69K95j46m9MM2J03M1j09J1k2n3O2P1N5o1j92K61L0j18J47
5337B16j67KO7J2k43O5L05j23k15K33l27K08o3J19j74j02M78m01L34l15L7K20
5359A66l9j59j55J65n1J63k56K73Rj16j78K51p7o8j70M32N8k06j49K74k23j95
5381b51K09m0J9o0K86m88M22m7r5j17L80l90L3K88j50J73k27J04k01J87l17R9
5403a83Q4k3J24j28RM60l58J18k21p9J54n8L85k73k9m4J38k80J32j5M8m8J12k41
5427b16K45k57K65j92L86j92j33K88m36L20j46J20j14j55OK18k34K34k43O8M50
5448B82l30K41k60j19l2J80j2k0nJ4K45k74K28P5l16L6m8J18m4j0K5N6j60M74
$$ plain form
5289 -71 -35 143 -111 -40 152 -67 -208 32 -77 -100 -23 -161 8 -237 21 39 -49 -3 -15 -175 51 -242 243
5312 243 248 -310 -24 13 -156 139 -7 -56 -52 -10 93 134 25 36 14 -39 23 94 149 88 -104 157 187 69 216
5337 216 49 51 118 130 -113 -48 257 134 -81 152 -175 33 -30 89 -85 -187 291 -110 224 -91 -54 166
5359 166 127 -32 -187 -22 -73 90 -166 107 116 0 -178 73 -4 -72 -242 190 248 42 -107 167 -56 -251
5381 -251 -42 -82 -63 -123 163 -325 97 50 -45 -162 218 -172 -139 149 -1 172 -55 49 -152 35 -282 -183
5403 -183 -99 -122 2 -126 -117 343 -15 103 -118 -197 -43 -101 284 11 -18 -62 76 -204 -72 -87 -39 -87 25 -216
5427 -216 29 -228 37 -155 231 39 -94 194 -242 78 -68 52 -62 -217 -211 7 -227 7 -236 -168 282
5448 282 -48 193 -67 -186 -218 -38 -50 -70 -75 -61 184 -90 138 213 -103 -67 -115 3 -41 -51 -26 30 -130 344
5472C44k97Rk5l2K3k36M19k28K53m25K52k02K38k77K3P2J14p7q0N8k17O97o20
5495b14K50M0j24M8J70q3J12j55j07Q8P0l1k28p5L14J48m18P0K1K62j60O9m6j94
5519a73J09J45k19K00M3q5J6J1P3k17K00pj2m1J22j42O1l22K89M7j66J45q1N2
5543D8n8P7P3n4j24m0o5M29k24J42m01L6J28P7j78J05q8L4J02N3q2J30p6j10P4
5568Ho7j85K81m4M4Q3j37J72l79K94L5r4j80P4J87J2o4O4j12Q7n5J45Nl4q1j41
5594h2J71oj80j8J26n5J0p2R9k77J50j09j12K17K13j71m3K11k14J33J82j36j24
5617h7J07n6J5K6K0k6N4n9k43J54j44M23Rl35J60Pm57M69kQ9o1k92M21Qj39j13
5643e2o5K41N1l86M04J21l16k87K66j62L12j78K38k09j05j31K88J5J0l6l7J1K5
$$ plain form
5472 344 47 56 31 -1 22 -214 205 -23 230 -195 57 -145 93 -184 -161 -89 25 -52 -132 -74 -291 406 -214
5495 -214 36 76 -48 0 170 87 199 44 -63 25 95 64 -164 -239 75 223 -195 -125 -104 158 -2 67 21 -173
5519 -173 -64 81 -138 62 105 20 36 47 120 -97 103 96 84 43 165 23 84 -238 51 98 -68 77 -4 48
5543 48 -10 67 140 86 -38 -78 -143 286 62 204 -197 -161 -33 44 -134 -29 -117 -83 19 72 -10 120 44 -66 8
5568 8 -59 -244 37 -7 37 120 -17 155 -224 70 105 11 -169 -95 92 104 40 104 -8 79 24 169 174 140 59 -82
5594 -82 89 83 -97 -115 11 -44 -34 -106 -7 -284 -134 -243 -355 -138 75 -96 -139 72 -142 -9 173 37 -87
5617 -87 20 -36 -21 5 25 -1 53 -6 -249 -95 -239 184 193 -142 18 25 -432 37 35 124 63 -229 192 200 61 -52
5643 -52 -117 124 175 -211 193 314 -2 -289 -23 -185 127 -51 187 -22 -127 -258 30 45 55 19 -18 -7 18
5666A8j52J37m0J13l12L14Pj28o2K52m26K23Q8Q4j71jM4J42L08j55j95j84K66
5689A70j27J17l15M60l31J43k31n1P8J17J28j98K5m4j4j45kL73p4k38P0K14k2
5712A03j92k15K35n5k3M7L58k45M7j05O7K0j05j60K03J36j35LM4j81L0j2K1j61
5736b75K41n6J91j4O7q8j09JK16j69K07m7r2Mj34R1J32p4m8N0j1k82J06K72k03
5761b4K29k25Q8Q2q5J37j45j0J4J04k97N25o01O4L30k85J44j09J55j85j1L41n03
5784b67M46j35k91J71L8J50j07j25J51j79j3J90J11j59J19k02m7J46JJ91l13P3
5806e1O2j02P7JJ6l7j40L93j03k2k0k21J74k66K10L01m02Q3n3K99k38k33J68P3
5830c1P3lJ50l59J44J83k58m8Q6J51k4j66J59OJ20l65R0J17J23n0k26K42j14l2
$$ plain form
5666 18 -134 3 -37 76 -236 78 85 -43 -105 147 -279 -56 32 116 -55 -56 -12 130 438 283 88 -96 170
5689 170 43 160 -155 305 -26 117 -114 -165 -87 30 158 -40 -15 -59 -73 -218 -220 153 79 -159 -89 125 103
5712 103 -89 -304 -69 -124 -147 -100 258 13 60 -45 22 42 -63 -223 -20 116 -19 -16 28 -153 -123 -135 -114 -275
5736 -275 -34 -90 101 87 154 66 -43 -42 174 5 212 165 73 77 -57 34 166 92 44 94 83 -199 -93 179 -24
5761 -24 205 -20 68 150 65 202 57 47 61 165 -132 393 -208 -144 186 -99 45 -64 91 -94 -105 236 -267
5784 -267 179 44 -247 -76 -38 112 5 -120 31 -148 -161 29 140 -19 100 -102 -149 -3 -2 189 -124 -51
5806 -51 11 -91 -14 -13 3 -34 -174 219 116 94 74 -147 27 -239 -29 272 -130 -47 -100 199 -39 -272 -104 -31
5830 -31 42 39 189 -170 -26 157 -101 -149 -63 88 64 -102 57 63 183 -182 -92 25 148 98 -128 114 0 -32
5854c2J02j54m8O9o5K1m2N5J25M1O9p5j33j29K30P4q1k57K75j4K31j88J09j05
5878G8j91K00O9o3J4R2l62Q5J82j19Rq2o4O46m09j46j12L27j99lL18k18n3J34
5902A33k68K13p1m48L82Q6j08J47O4k73m9L21o8o9j6oj21K86o8k84L86j40J75
5925B04k39Q9j20R4n7K6J90k61J81j66j2m5J76j7R8j11j04rL4J97n8j02J3Q3j58
5950g4P8Q2Mp1l86K82J6J65j32j24L91k92K19p9Qj10l8j20K05R0J3J99k60j38
5974g2Q3j55L31k06l2J27j21K88k77N5k23K29o0J83k56N1N8J03j78K9M0j21M0
5997h4M18l83P7M2Q9j59j33K30j95j68K27J95q6j52M6j79L50M2n50O85k22p0j0
6020A0J50j49L0J08p4k75O7K63k04J59k86K62j05j0J28l51M6J39k0K50l0o5l13
$$ plain form
5854 -32 70 -84 -132 -63 -128 -107 -149 -94 31 72 141 66 -67 -196 34 108 27 -230 45 31 262 74 183 78
5878 78 -113 87 156 93 107 199 -163 -78 104 -15 -6 -88 -152 494 85 -61 -173 154 -45 -48 270 52 -1 133
5902 133 -135 78 7 -441 -59 27 -81 66 130 -143 -192 129 61 -8 -24 -30 -151 135 67 -217 169 29 204
5925 204 -35 54 -66 28 -29 -3 187 -74 107 -59 -71 -116 60 43 141 30 -74 -83 -49 148 90 -12 1 84 -74
5950 -74 4 86 90 19 -367 -85 -69 96 -36 -160 231 -61 158 79 87 -23 -61 -181 24 114 127 326 66 -72
5974 -72 11 -144 187 -19 -51 76 -45 243 -34 21 -202 27 -33 150 -106 -55 3 106 -72 -43 -3 -124 -84
5997 -84 334 -49 28 70 159 0 -133 97 -98 -266 -39 156 70 -82 -36 -215 135 177 -373 312 90 20 10
6020 10 160 11 41 149 75 -200 -133 130 -74 85 -201 61 -44 -54 74 -277 -231 -92 -112 138 108 43 -270
6043b70M33o02K78K64k38O4R7j15j47K76J16j72NJ56k15k2R0L3L4k77J40j29L95
6066A94j02k51J73K40l31K00j70j29K21j14J22J43k25L9J10o9k1J0k78J71P5R5
6088A03n7N2j8q4l1j3l0l2J90Q1j49Q4n0k05J62k84J49L32r4J19k81J39j38m4
6112i9K28K3j26M7n7N9j3j09K12n8n0J37k52m2J70P2p2j28j3N7j05lJ28k5k3R3
6138E1J44k92M55k24j8j23K3K2p9J46k09K41j19P1j45pK36L6o4j18j62n5L75j39
6162D6J27k88J46n0K31m04O0K1j6RK2J76l56K06j6O7J08l00J84j11J4m5M32k79
6186a6o5L1J73q4k29L01k21Ll5J73O2j59k1L15r9q4n7O8j85K97l39J17J58k86
6210a82K23J55l94p7L6L12j90K05N6j27j4j84J98q0J63q3O0m9Mj39J23n8K64k80
$$ plain form
6043 -270 163 -439 -161 103 -135 -71 26 -89 -236 40 156 -16 -11 145 -70 -92 -2 31 65 -212 -72 -201 194
6066 194 92 -159 14 254 -77 123 -47 -176 45 -69 53 196 -29 10 120 51 30 40 -238 -67 8 103
6088 103 46 98 80 -4 -35 -48 -78 -110 80 161 12 96 46 -159 3 -281 -132 200 106 225 -56 83 -55 -99
6112 -99 129 152 26 73 16 75 62 -47 165 107 57 194 -58 -100 70 142 70 -58 -71 -14 -119 -122 6 -19 -42 51
6138 51 195 -97 358 134 116 -7 16 38 -41 105 -104 137 18 89 -56 -63 173 209 145 27 -135 -190 185 46
6162 46 173 -115 31 -19 212 -192 -132 -111 -127 -118 -96 80 -276 -70 -86 -19 89 -211 -27 -138 -124 -169 263 -16
6186 -16 -81 -50 123 39 -190 111 -110 -107 -142 31 93 -66 -87 228 129 45 -12 56 -129 168 -171 -54 104 -182
6210 -182 41 196 -198 -275 -239 73 -117 88 144 17 3 -181 17 -63 100 17 77 28 32 -107 16 -42 222 -58
6234e8J4j55R6J50j4k49J79k82K67n0K5L57k26Q5k27ol49J46L49r8j4J29J06n8
6258A17j0k77L11k98K9K55L8m3j18M2J6P6m55N59O9k85J80q4q3l17J63J81k04
6281a38J19O6j19K74l56L7K20K27n17J49N5J13j49l10M57k1k12K41J3j33n3Q1
6303D4j66J04K9J25m96L19M5j2m9j46J11K05o9n0J53k18K8J2J16J60j89r4j72
6326b10K21R8m8q1kR5l3K31m45K07j97O0K74k31J07q4L0O0k5j12L2J61j24J2J53
6351A49j51J25N4m12p4K02J02J2j75J49k9P5jN7q0J1K42k24nR2M6P7k19m8k3J00
6377E2Q7j10l2Q4l1j61n2P5p1K2K80k16j05K66k03RJ84j68k2K75k28L24j47r8
6401A4O6p2J28k45j3O7j37P1L78j43nl34K20K73j90j14o8L75m29L94k88O2l2J9
$$ plain form
6234 -58 -44 -199 -103 47 33 -216 -37 -319 -52 -102 -77 280 54 139 -88 -94 -443 -297 52 -46 -60 69 175 117
6258 117 107 -170 141 -157 -128 127 165 122 4 46 62 138 -317 242 311 26 206 122 39 -278 -115 66 -138
6281 -138 -19 47 -72 202 -154 -117 103 330 -187 -38 17 130 -19 -329 128 107 -105 136 149 16 -37 44
6303 44 -122 -18 11 136 -360 -41 4 -8 -57 -203 -92 113 44 -6 147 -71 -43 -31 85 245 56 -38 -210
6326 -210 11 109 61 -20 -22 73 40 271 -174 33 -164 -104 170 -61 46 -38 -8 52 27 -85 -53 108 -16 -4 149
6351 149 -2 123 177 -235 -309 -107 -5 7 -168 -19 -48 27 26 83 3 14 256 32 27 119 165 242 23 -25 -48 52
6377 52 139 29 -3 81 50 -111 -163 -88 -159 -137 143 -73 -178 88 -115 -106 78 -90 -112 163 -65 259 112 14
6401 14 80 8 136 -109 -122 -55 -192 -121 257 114 109 -225 -5 268 78 -36 -104 271 -158 236 -52 10 -22 -3
6425cM7R6j80j24K14M6m3j95J12QR3J09q6k89K25J72j08k11J63k7l3n2M6j4l6
6450g0O8l4j44K56j01K30j90j47L30k76J66m6k3J37k54l1RK01j18n0R3j26M8K89
6474B17k45r3R1O6J23j39O3P8j59j32J48L8J1N0n9k5q0K3q2J48J07o6k15K03j58
6499h7J57K0j92J56K23m28L56j34M4J24k86j33J77J6J06j93K31j71j54L78j64
6520D6j81L07j85m26N01N6l56J21N5j53K13j26O9K36k77K97j08J32j82n2K04j68
6542B3j9P0Qk99J01J54m2mj1J88j85J07j79J02q1lp5J43J9n8j04q0O2j0J32R5
6568E4o7j44k23Q9N02m17N89k99J14j26k39L51j87n8J02pj98K12j72K65o3k58
6590a80K15j30J46j60N7l1N2O9J00k74L85k25JP0M1q7J02j25J03k02j74K01R0
$$ plain form
6425 -3 44 140 -40 -164 50 96 53 -142 -30 -22 71 180 94 -195 30 202 94 -117 46 19 -14 -66 -20 -34 -70
6450 -70 -2 -36 -180 76 -25 205 15 -132 198 -78 88 42 19 156 -98 -129 -120 81 -37 -87 6 -120 -72 217
6474 217 -28 -121 -30 36 159 20 83 161 2 -130 18 56 67 117 58 33 -47 -24 -106 42 149 83 -132 71 -87
6499 -87 70 90 -102 54 277 -151 205 71 115 239 -47 -180 -3 13 119 -74 157 -14 -168 210 46
6520 46 -135 172 -13 -439 62 118 -238 -117 -62 -215 -2 -128 -59 177 -100 197 89 221 39 -13 191 23
6542 23 4 74 82 -217 -116 38 -4 -8 -19 169 -16 91 -88 14 -67 -70 -145 -2 17 -41 -145 -225 -163 -173 -41 54
6568 54 -13 -157 -380 -291 211 -206 383 84 198 72 -167 184 -3 -61 41 34 -164 48 -124 141 78 -180
6590 -180 35 -95 51 -109 -52 -83 -31 38 138 -136 249 24 25 95 136 49 151 26 129 -73 -247 -46 44
6613D4%J78j13L6l08J62l4J25j32j23K25J71l45m9J07o3m4j35K14R5J53j93M3
6636A4j59L48k72K03j74K04o8N5j97j42L1M5J91j77Q6J14j6q9J77l07J60J15j42
6659@j09P0j7J80n33N13K0q4K9K4j36k5J19m5J53k44L2l5J46k43K78J58k65Q2
6683F8k43O2J20J10J04j12j92L63j36j51P9j34K7J21J41j21j91R4J2j2j13L15
6705B11k55j18J6m5K72k23J01m0m0J41r4J06j75Q9J67k26QL14k79J14k3k31L23
6728A13n2K06j92K4j17K21m11K26r9J72l3K79m23Q2n7k9J0J14N3J13j46n6k8n4
6752h4p9K70k7j81J60j70K23j59J51l3p7J13j39K83k98jLJ25J6j10N0P3p7l01
6776b69N53k13m56O72l05n0Q6J50K74m04O2O1j64K55j88j01J24q2n8K76q5J3N7
$$ plain form
6613 44 44 222 109 145 -163 -1 -35 90 -42 -165 60 231 -114 -163 -56 -119 -163 -298 -84 11 164 -29 14
6636 14 -145 203 -69 134 -40 164 96 151 -46 -188 -157 -112 79 -98 -12 102 86 -3 174 -133 27 142 0
6659 0 -109 -39 -56 124 -409 104 124 40 69 93 -43 -68 51 6 159 -85 -53 -88 58 -185 93 251 -14 68
6683 68 -175 -113 7 117 221 109 -83 280 144 -7 72 -62 -35 86 227 106 -85 9 21 9 -104 211
6705 211 -44 -162 -146 -191 81 -142 -41 -81 -121 20 -74 32 -143 -54 113 -113 -105 209 -70 44 21 -210 113
6728 113 61 267 75 99 -18 203 -208 18 -81 91 58 337 -86 -4 -61 -90 -80 34 87 200 54 -2 -30 -84
6752 -84 -163 107 80 -101 59 -111 112 -47 104 71 -6 107 -32 251 -47 -48 -45 80 96 -14 36 109 32 -269
6776 -269 284 71 -385 287 -18 -68 18 168 442 38 100 161 -3 252 64 -37 87 5 -53 223 138 151 208
6799B08n6J85j79m96J58J72J37O9j26k65K28o3l4J28j41K43m2k74K80Lk95J40
6821b0J95O2n67M83k73K21N6j54j69J86J52n9k17J09j81J58n4J78k42J37jn5J53
6844I8k01N4j7J0lJ3P8q4k6J30j65J78k20M25l05p0K38j68J23r8k81L17j8N2k22
6869a62K22o1j22J68k5P3J04k72J66j13n0no0L03j40o5PL4j10J29K12l00J33l2
6893C4r5M1K0n1J03q9j93K66J5N3j27o9k1J66M8J10l20P2L18k99OK40j25L8j38
6918Cj26K27j28j05J59J83P0k04r4K59k52k74L67J38l30J18M0j62j7J56J35l39
6940a76j9nK2n3L80o3lk94J8J24J35j14o7j42K29o2l9J78l50K47R9p5j90O9Q3
6965f8J4ml3n6J64O6j36J99j67K64M2k28j28Q7J1J82j73o7J52n8K7n5m0n2L9J53
$$ plain form
6799 208 152 337 158 -338 -180 -8 129 198 72 -193 35 -28 -62 66 -75 168 126 -148 132 135 -160 -20
6821 -20 175 237 -330 153 -120 101 157 3 -166 20 172 113 -104 5 -176 -18 -72 106 -136 1 0 -55 98
6844 98 -103 -49 -66 -56 -59 -46 32 -52 -78 52 -113 65 -155 270 -35 -105 133 -35 88 -10 -291 26 8 60 -162
6869 -162 60 -1 -123 45 20 93 197 -75 91 -22 -72 -77 -137 166 26 -39 -32 2 -108 21 233 -67 66 34
6893 34 -61 -20 0 -51 52 -37 -230 36 51 104 -23 -92 -113 53 101 211 -109 -37 281 -18 -12 228 103 141 3
6918 3 -123 104 -24 -129 30 213 283 79 -15 244 -8 -282 85 223 -107 11 51 -111 -128 28 163 -176
6940 -176 -195 -200 -178 -231 149 86 83 -211 -193 -69 66 -48 -115 -257 -28 -90 -129 49 -301 -54 45 -30 -220 -151 -68
6965 -68 -54 -58 -91 -147 17 83 -53 146 -21 243 285 57 -71 16 27 209 36 -31 121 63 90 35 -5 -57 -18 135
6991A35r2pp8J73j84N7r0J52j49L01n38L10k8L1K5m4J13p0M9j52K90j54l3k6J33
7016A24k54J73O7k17K33J62k46L0K40l24q4L51k17K9jl8P6j33K2q0M1J22l9j94
7040a57oK01j12J76pr2j44J64j16%j04L17j26J75j79K8J21j77J20m2j56K66l1
7063A19R9k9k74p8J54j30J65K36l59L6J60M0k46J8J00k7N8J34k30l0l9L71j52
7086I6k25K62J03k54j85nM27l41L28k50L23j68J8q6q7L8j29J93k6l6J88K7j64
7109D7j39J03l3LN2j05P5r5K79l53K34j30j9J19k74J92p5L45j97J16k15K50j18
7132F2j34J49O2m4J4j88q6L8J21J31q9L1r1m5Q4R6k45L48k78K3J07r2L03k45l0
7157BM7l29M62P7n23J64j1Lk36K95j42J87P9k1j34K86j84l76N01k42J59P5o2j50
$$ plain form
6991 135 43 36 -42 131 -53 4 -86 66 -83 218 -320 -10 -38 -7 18 -26 87 17 66 -86 204 50 17 -9 124
7016 124 -130 43 110 -107 126 288 42 72 312 -12 -96 255 38 67 66 28 104 -29 -7 -87 -46 76 37 -157
7040 -157 -163 38 -74 102 95 3 -141 23 -93 -93 -197 120 -6 169 -10 18 139 -38 82 40 -116 150 119
7063 119 218 189 -85 -163 -9 -139 26 262 -97 -61 99 139 -107 -89 11 -16 42 176 -54 -84 -123 248 96
7086 96 -129 133 236 -18 -203 -208 219 -122 206 -44 279 111 129 43 -44 -6 -135 58 32 -4 184 211 47
7109 47 -92 11 -22 -19 33 -72 3 -92 187 -166 68 -62 -81 38 -236 -44 -119 226 29 145 -70 180 62
7132 62 -72 77 139 95 109 -79 -165 -127 -6 125 36 67 -24 -69 15 111 -134 214 -64 -41 66 -26 277 32 2
7157 2 49 -280 182 259 -264 -100 -111 -108 -344 -49 -191 -4 75 54 -80 206 22 -354 147 -95 64 139 77 -73
7181g3J94k26R1m6J12J16k58R8qO6j27k8K41k77J31o2J10l6J66o0o1J08j72m6
7205d7j9R7J27m0k11J98r0j08m0J4L7k75J58J29q5K81j76J95l20J10Q6jJ41l16
7229a55K70k32J11k20K97k87M4P4J85J2j01J52r8K8j23P2Q6k33J76R9k54J15j69
7252a51o4q3L03O6r4oL7K4r8j18Q6J30J11l23K72K4J35l13R5J39j44K30j05k74
7276a21K75j44l7J26n4M8K34m14N0P7R0j78m5M98m40P4k06J73l1kj34j7K31k9
7300B4mJ18k04L4m4n5J93N4j56j3j82N09l78K42P8l60K55j05J37j91K7LK78j70
7324I0k04n7K50K9p0N2j9l8k10K3K84l51J01k9J39o2N0j23M28j54k01J00R6j89
7348f5K0M0M2q0O1j72K7J35j67N38l90J5l8L2J20J15j21m5K65l73M6M7N5j20j80
$$ plain form
7181 -73 121 -105 -14 -60 52 168 -90 8 0 66 -61 -89 152 -125 6 -56 54 18 184 124 63 171 -1 -47
7205 -47 -66 31 158 118 -93 105 15 -93 -133 -119 -82 -357 -199 -70 -155 126 -50 145 -175 -65 21 20 161 -155
7229 -155 115 -117 -6 -226 71 -216 -172 -98 87 99 -2 150 52 80 -43 29 115 -118 58 157 -97 18 -151
7252 -151 -215 -298 5 71 -23 -29 8 32 -66 -184 -98 32 143 -180 92 116 251 -62 33 172 28 258 153 -121
7276 -121 154 10 -27 99 45 93 327 -87 -37 40 130 -48 -93 405 -35 39 -167 6 -25 -27 -161 -178 53 24
7300 24 20 138 -66 -32 -76 -131 62 116 -40 -53 -235 274 -104 138 216 -144 111 6 143 -48 -21 -18 260 90
7324 90 -114 -171 79 108 38 90 71 33 -177 -154 130 -221 -120 -149 -10 -72 -22 -145 283 129 -72 28 124 -65
7348 -65 -45 -5 37 -43 18 -154 -127 8 -159 379 -11 4 -34 -2 118 233 112 67 332 -41 5 52 107 -13 -193
7373a93K57m5M8m2m4k20J22J2J36j55K51K14l79R9j8q2j47L21k71J71K1l2l1j17
7397a24q4L11J0J13j75j56k9K17l0j81j20L97j07R3QJ8k82%Q2r5n3K55k28J58
7421bn3j26J72N6j97q5L0L01n6j89J83J05k35K4K42k1l96K30J16j64p6j39K31
7444d9P0R7k04K30j43n4R0K10n16K60j53k0L74q7j01L1j37N5J84r8K2l5p7j49
7468b00K91p4j03k6j06J53M3q7m4J23l03K06R3L23k29l4R4j04J2R7Q1l19K66j31
7492B2j51J46K4j50L01k71j10K15p9J90k97K6J47K03l91p3K60k48R3J19q6j12
7514b22K58%n9p3J83p2k18L17q5K70m29L5j06K37j86K60M9o1R7l77J31J62j53
7537d2j06Q9K56j04Q2r3k13N4M9R7n4j16L3q1j21J28L2K6n5Kj34M51l58J32J27
$$ plain form
7373 -193 64 19 67 25 -19 -239 -117 -105 31 -124 127 341 -38 61 43 -39 -186 135 -136 35 56 24 -7 -124
7397 -124 -208 103 113 226 51 -105 -134 83 53 -128 -248 149 42 135 143 161 -121 -121 -39 -134 -187 68 -160 -2
7421 -2 -55 -181 -9 47 -150 -235 -205 96 40 -149 34 139 -96 -72 170 149 -247 -17 99 -65 -141 -280 -49
7444 -49 21 118 -86 144 1 -53 37 247 -269 -9 -162 -182 192 105 4 35 -102 -47 137 39 61 26 -51 -200
7468 -200 91 17 -86 -112 -218 -65 -22 -109 -153 -30 -333 -127 -34 289 60 26 120 16 28 125 206 -113 153 22
7492 22 -129 17 41 -109 192 -79 -189 26 -53 137 -160 -134 13 216 -175 -248 12 -236 -143 -24 -110 -222
7514 -222 36 36 -23 -96 87 15 -203 114 29 299 -130 -95 -201 36 -150 110 159 98 195 -182 -51 111 -42
7537 -42 -148 -59 197 93 175 82 -131 -77 -28 69 15 -101 -68 -149 -270 -142 -110 -84 -139 -137 -271 180 -178 -46 81
7562H1ok31K33M9l3j78J54j47q2J29J6K22q6j01Jpj50PJ88j5j67LJ8j28K21qR
7589hl56Q4K45ml7L3J19k93K76m9J11J0k51J77j06Q0j55J04p9J67N5L5j53L2J29
7614A66k46Q8Lk1M4J25k63P6J44k10J82j9j51K65k12K06j33J1k44mK60k04J8q7
7638b06R4K29k11M44j53m34K65K52l26n7Q6J23J76l57PK32j37p1K55j47o9KrP
7662eO2j05nj9L19q6j94Q4k01L08l4k35k6o9K99k28N0j26K11J39K8k5L6m27M20
7687A71k38J40L4k05K58k48n3K98j23J74l6j00r6k37K10J05p3Kl5o6MK20j56O2
7711A2l7k01K41p0L8K61j93q2K78m01K07r2jn2K62q6Q5L8k33K34n03L18j70L59
7735B12q9K6j92K74l80m0R0m2J44P0k36J10n3O5o2j2J99j16M35n43J12j44K37
$$ plain form
7562 81 75 -156 77 126 93 -85 69 -78 -160 -31 -15 207 121 20 21 14 -136 -129 59 44 -123 -120 -102 -230 -9 -17 -8
7589 -8 -364 -280 -35 -39 -76 -43 76 -217 59 10 121 131 -120 57 -49 31 -124 -20 -99 68 123 158 5 37 166
7614 166 -80 8 11 -10 34 159 -104 -28 116 -94 88 69 -82 183 -29 177 44 55 -189 -193 67 -137 -119 -206
7638 -206 -112 117 -94 350 197 -237 28 280 -46 -103 -17 106 282 -75 -68 164 27 -44 211 64 -5 -3 -12 -5
7662 -5 57 -48 -53 -72 247 161 -33 51 -150 158 124 -111 -137 -206 93 -135 -85 -211 0 139 167 142 178 -249 171
7687 171 -67 73 107 -98 160 -88 -141 157 34 208 172 72 -24 -261 -51 54 -19 -17 -52 -118 -114 106 -50 12
7711 12 -25 -226 15 -55 -17 244 51 -31 247 -154 53 -39 -40 -92 170 84 169 207 -26 208 -295 23 -147 212
7735 212 123 149 -43 231 -149 -189 -99 -141 3 73 -163 -53 -106 -41 -103 -115 84 -32 403 -140 -28 -172 65
7758F5J34j89Q3j43N4n0l6K76j65M1j33K76n09J69K21j54J33J9o3j61J01K89j63
7781I5J12k83R4P6k36p0K93J4k19N1Q5K4J21J12k06q7l24M25J46j83j17r7O5K58
7805A49k91m9J89J29p0lM1K8p1j45J30r6L8K17k61J47J57q6r4q5J79k39K69m20
7829b37J85K94l64J88j89O8N7K6k15J97j32K80k83J72j56K5M0Q7m2N1Q4j26P2
7852H2j64o3J01L08k98M31k81l39L65k42O1Lj09J34J04kj74J7p1L7m4kJ05K49
7876B08l65K82p4j02j51K59l4Np4j76L09K1l36K71j36M9J1K94j59M4j67N9PN2
7900I7N3n0k01M9K52l98J19m1R3K13j37k47P3j24L38j24qJ64j89J68k06P9r1J10
7924hJ76r7J91n11K79j20JO4J85Rk89J04j4J35R3j64r5M05j98k36L7ojJ63j93
$$ plain form
7758 65 199 10 93 -50 4 -46 -82 194 29 70 -63 213 -296 -127 94 -60 73 92 29 -132 -31 258 95
7781 95 207 -76 18 94 -142 -212 81 95 -124 -73 12 36 157 269 63 -24 -348 77 223 40 -77 -174 -109 149
7805 149 -142 -191 -2 127 57 54 95 123 52 -93 37 -59 -21 196 -65 82 239 153 59 -26 153 -86 183 -237
7829 -237 -52 242 -122 66 -123 -55 2 28 -187 10 -122 158 -125 47 -109 -84 -44 43 1 52 136 10 82
7852 82 -82 -145 -44 264 -34 397 116 -223 142 -100 -39 -36 -145 -11 93 91 -83 -66 -137 -100 -144 -146 -41 208
7876 208 -157 125 51 -51 -202 57 23 28 -46 -222 87 108 -228 43 -93 -44 -33 261 102 146 -21 38 45 97
7900 97 150 100 -101 -52 200 -198 -79 -120 -27 186 49 -198 -125 -249 89 -35 -43 121 -68 100 -106 -27 -118 -8
7924 -8 168 71 262 -249 30 -90 -89 -25 160 169 -120 -16 -30 105 198 34 -61 344 146 -90 -53 -59 -60 103 -90
7949i0p4J21J07j41o6J76M5O9k28J23l0J0j89J4M25k83j5j23QJ87J37m10J15J16
7973DJ58j3K6k99j34M36j47l52J05M12j25o1j12J55k26L19j65J99o2k82J85k05
7995a84j43M34J05J62m13j86L35k60L17k93L15J24m48l7K05J69m1j67k4Q4j31
8016g7N7q6J42K9r6Pl6M18r2m02L14j87p4J14q5J03n1j0Q8j03Q4J3k6j04R7M8
8042H5j74J78K72m45l7M07k86m14R4K46R1K23k96K75k61O9M8m4j96L06O7r0l0
8065H8j2L06n19J53N7o6q7K90l5k63J08o4J98l05j18L41O9m33J53N3p6L58l1p6
8089H9j62j05J58M6p7o6N2m0J25n3M2N1k38M41k06j95J64k5R8j06L5j13o2J00
8113d7J70j53Q3p1J04n8k6j01P8j30M7L01m40K00L4k85K54k02N35j14k89J48J98
$$ plain form
7949 -90 -164 -43 64 -77 -143 33 78 147 -81 42 12 22 -167 -153 272 -11 -26 -149 -141 46 183 -227 -112 4
7973 4 162 149 175 -124 -258 178 31 -321 -216 196 71 10 -102 53 -173 146 -19 180 118 -164 21 -184
7995 -184 -327 107 212 374 -39 -225 110 -150 167 -126 189 313 -135 -172 33 202 161 -6 -30 54 -77
8016 -77 -20 -106 36 65 -31 -24 -60 358 266 -136 178 -9 -83 31 -54 49 -2 -12 76 -27 57 70 44 -60 37 85
8042 85 -89 89 361 -84 -121 286 0 -414 -320 -74 17 240 -56 219 -42 27 75 31 -165 141 208 118 88
8065 88 76 382 -137 16 73 7 -80 210 175 -88 20 -44 154 -151 -269 72 141 -292 -139 -86 -162 196 165 89
8089 89 -73 -178 -20 26 -51 -117 -65 -105 20 -33 9 60 -178 263 57 -138 26 1 99 -7 28 -85 -147 -47
8113 -47 123 -30 53 -18 86 28 2 -99 -21 -151 -104 197 -243 -43 -9 -294 -40 -242 293 179 -110 38 236
8136B36m4j06j25J05k17j74L73k25J11J35j4j00j45K54r3K29k95j25J60K02k09
8157f7R5Q4J2J11k32k28J23L23j83L3k09Q4p9J37r9P3j71J17P4K51j95j5Nm0N3
8182E7l39J57J35n5j86K56J4j8J18
$$ plain form
8136 236 192 86 -39 66 -151 -325 48 -177 -66 69 55 -45 -190 64 -29 200 -95 -220 -60 142 -67
8157 -67 28 112 124 235 3 -225 -102 221 38 71 -138 -54 -133 4 -95 -22 -193 -76 -2 249 54 39 44 4 57
8182 57 -282 -125 10 -45 -231 25 39 21 139
8191A39
$$ Imaginary data points
##PAGE= N=2
##DATA TABLE= (X++(I..I)), XYDATA
0@%%%%%%%%%%%%%%%%Kj0J6j6J6j6J7k5L2l2L9m7N2o0O8p6Q7r9J09j21J35j51J70
39I0j90K11k34K59k86L14l44L80m19M61n07N56o12O74p42Q18r07J010j128J267
59F71j432J633j884K206k634L230m120N581q359J5405o5936j17898J53239J25270
73A04972l9606p8891p376J0431K7183J2017j3665j3039k5165k7510M6114N8155
85E3620l8979q1120J5750Q3104L7115l7314p4887l3904P2854P4911k3823n4767
97g440k0939m987K1713M6214J508n5713k5444K7412L7075K3866l0412o3497J8090
110c2554Q0602M336p3346l4681K9536M4711K7010k0916n4041p588L4420J5696
122A3185J0118P077l7966l9732K9970N8926L43n5065m4286K2618P2459J3462p5657
$$ plain form
0 0 0 0 0 0 0 0 0 0 0 0 0 0 0 0 0 0 2 -8 8 -8 8 -8 9 -16 16 -16 23 -24 28 -32 36 -40 47 -52 57 -64 71 -80 90
39 90 -100 111 -123 136 -150 164 -180 200 -219 242 -265 291 -321 353 -389 429 -478 532 -596 671
59 671 -761 872 -1012 1194 -1440 1790 -2330 3251 -5108 10297 -55639 -173537 -20298 104972
73 104972 65366 -13525 -20901 -10470 16713 28730 15065 2026 -23139 -50649 -4535 53620
85 53620 14641 -66479 -50729 32375 69490 32176 -42711 -76615 -3761 71150 47327 -7440
97 -7440 -28379 -33366 -11653 34561 36069 -19644 -45088 -17676 19399 43265 12853 -50644 -32554
110 -32554 48048 52384 -20962 -55643 -26107 18604 45614 24698 -29343 -36931 -2511 13185
122 13185 23303 30380 -7586 -47318 -17348 41578 41921 -13144 -57430 -34812 37647 51109 -24548
135b4548l5743N9645N1957j5699l7145j9358J688J7777J6481M967o996l7435l2642
148e7051M9046P2864l0084q4638n45O5647K7161k7120l0708l506K0473J4564o303
161I800m836r334k5365P580N4194J5399n7663m3138L0243N5935J1962m5725m6319
174d7267J8315M9751P568k4211q316j451m170J3352J5018j1138j9877o061J2961
187e526K6196L818l9881k5714L5000M2214r901l9773k0510J8065L9539J1885l2192
200C220k6143P748J3938P749P322p155k1168l373K2300J8327q380l0641j4310
213c0566L3017L4161k4380m4569M714L7870J4955j2745j5976r325P7Q787J7487
226A3507J4133j8329m1257P6N1324K0559m3571l6361K3191L9330J063k9508j5038
$$ plain form
135 -24548 -60291 -646 51311 35612 -1533 -20891 -19203 -1426 15055 20022 13026 -24409 -57051
148 -57051 -8005 64859 34775 -49863 -50408 15239 42400 15280 -15428 -18934 1539 16103 9800
161 9800 4964 -4370 -29735 -22155 32039 47438 -10225 -53363 -23120 32815 44777 -948 -47267
174 -47267 -28952 20799 28367 4156 -4160 -5611 -9781 3571 18589 7451 -12426 -18487 -5526
187 -5526 20670 24488 -15393 -41107 -6107 36107 26206 -13567 -34077 -16012 23527 35412 3220
200 3220 -22923 -15175 -1237 6512 13834 6679 -14489 -17862 4438 22765 14385 -16256 -30566
213 -30566 2451 36612 12232 -32337 -27623 10247 25202 12457 -3519 -12844 -12767 -3980 13507
226 13507 27640 9311 -31946 -31870 19454 40013 -3558 -39919 -16728 22602 23665 -5843 -20881
239b0881J8140J7586n511o590J471j3387j4669K0209L2238p126l7811j6239K4498
252h072L4621q81l4530j6859K0914J9713m508j1617n870j505P643J1395j837j4100
266e493r383O739K0976J1341j9052k7187J680K6136J5152j0789k2526p929J6987
279c348J8650l542j4151l583L181L089M968J241r520r967N654J7564P784j9036
293a016k5228J0017L6832Q725l1478k1931J3448K1993K325j1871p568J62j03J280
307d413J1171O864j4496j6965J2438K5141l865k9394j0393K4440K1967j1519k4442
320a3466j809J5620O902j141J891o297j4799q46K0930J3052j5523k2244K802K1369
334F441R168j4947j3363P134J4346P67q209n687q78K180O151M969m328j2552n620
$$ plain form
239 -20881 -2741 14845 9334 2744 4215 -9172 -23841 -3632 28606 21480 -16331 -32570 -8072
252 -8072 26549 25668 -8862 -25721 -4807 14906 10398 -1219 -7089 -8594 -951 10444 8607 -5493
266 -5493 -14876 -8137 12839 24180 5128 -22059 -20379 5757 20909 10120 -12406 -20335 -3348
279 -3348 15302 11760 -2391 -5974 -2793 296 5264 6505 -3015 -12982 -7328 10236 18020 -1016
293 -1016 -26244 -16227 20605 29330 -2148 -24079 -10631 11362 13687 1816 -5752 -5590 -5693 -4413
307 -4413 6758 13622 -874 -17839 -5401 19740 15875 -13519 -23912 528 22495 10976 -13466
320 -13466 -15275 345 7247 6106 7997 1700 -13099 -13945 6985 20037 4514 -17730 -14928 6441
334 6441 15609 662 -12701 -5567 8779 9546 1337 -4350 -5228 -3048 3103 8072 3744 -8808 -14428
349a4428J1421J5954O04j5432j1647N731J5558N448j1251j2282L111J2390L152
362H329r321o999M336Q138J175m597k675k572j572N864J0116j140j6485r629J3175
377c857J8312k240j7792n660J1306Q527m830o191O37R67j633K448M040l048q991
392h005r7J4292R107j3646j7952O832K0919K298j5303p315N647N023r89L95L543
407D749l058q077R65J1793K695j2927p450J0238J0857n717j1552j609R311Q434
421H652j774p203l216L57L236M706J773o982p589K309O874J855k369l344r70M738
437A053M046k468m879q7M221L717r84q270m518O215O371j587l399j611k061Q55
453c386O229L958m161p235j298P382O092o732q814M967J0013k759q707J53N633
$$ plain form
349 -14428 -3007 12947 13551 -1881 -13528 -7797 7761 13209 1958 -10324 -7213 5177 8329
362 8329 -992 -7991 -3655 4483 5658 1061 -1614 -4186 -5758 106 10222 9082 -7403 -17032 -3857
377 -3857 14455 12215 -5577 -11237 69 8596 3766 -2425 -1788 -821 -2454 -6 4034 986 -8005
392 -8005 -8102 6190 15297 1651 -16301 -9469 11450 13748 -1555 -8870 -3223 1800 811 1206 4749
407 4749 1691 -6386 -5421 6372 9067 -3860 -11310 -1072 9785 4068 -7484 -9093 218 8652
421 8652 6878 -325 -3541 -3184 52 4758 6531 -451 -8040 -5731 1143 2998 629 -2715 -3685 1053
437 1053 5099 2631 -2248 -2335 1886 5603 4619 -3651 -8169 -1954 4417 2830 -569 -2180 -4241 -3386
453 -3386 2843 6801 2640 -4595 -5893 1489 7581 849 -7965 -2998 7015 4256 -4451 -4298 1335
468A335J874j925o43O47k480m810K613J0044Q13j2562n859J0934Q132n307o315
483c509Q91M471R08k915j549K919j17l205L038L380n345o417N318P928j489o795
499b488l519L300N696P92l402p82R88j925R98M341j196n574J35L892k60l022j553
516c579J211L473K345k712l414O21J849L548K658m320p084J656O747L17m705r20
532b309J161O75J45l29O24J304j465n49M063o84p162k53Q612L059o767n480J712
549c643M793K492k033k338R76j324j978L300M320m272n160L755N141l080m657
564c708L08N077L417l056n367P30L583LQ5K766k717o315O67O482K359l748m221
581c655M29M698R77l995p14L771R22j752Q95j152l975K055N379K09n377l744J270
$$ plain form
468 1335 3209 1284 641 1288 -1192 -6002 -3389 6655 7468 -5094 -10953 -19 8113 2806 -3509
483 -3509 -2618 1853 2761 -154 -1703 1216 1099 -2106 932 4312 -1033 -7450 -2132 5796 4307 -2488
499 -2488 -6007 -2707 2989 3781 379 -403 585 -1340 -342 3999 2803 -2771 -2636 1256 996 -2026 -3579
516 -3579 -2368 1105 3450 738 -2676 -2055 -206 3342 6000 1680 -5404 -3748 2999 3316 -1389 -2309
532 -2309 -1148 -473 -328 -657 -33 1271 -194 -743 3320 2636 -4526 -4779 3833 6892 125 -5355 -3643
549 -3643 1150 3642 1609 -729 247 -1077 -3055 245 4565 293 -4867 -1112 4029 949 -3708
564 -3708 -3400 1677 5094 2038 -3329 -2599 984 987 1072 3838 1121 -5194 -4527 1955 4314 566 -3655
581 -3655 -3226 1472 2449 -1546 -2260 1511 2433 681 1576 424 -3551 -1496 3883 4092 -1285 -5029 -3759
598c759M754K811k987k411N33Q04LK686J040m554j867M286K298l818l610R18M581
615A708K483l586m206J422K314Q64J657O90n293l723M888N559j775m878k174L023
631a027M499j442m546P17L448o86j192K105k031m171K491N844J20n193m167K440
647b791O299J743n218l278K342J467n3J719q29m068l40M472J844l016l616M45
663b878M698L078n001m140K112L057K23Q86j57m663j466M767M247k002m704k726
679d669L657M702j218m835J20K399N47J42R75l081k212L402M308j150m892l231
695e036L428N903m3n886k506K778J506J424J209k027m261N51M911J998l380l889
711c320J06N665K086m847l726K697K528P20K85j699l915j18M675L924k296o069
$$ plain form
598 -3759 995 3806 819 -1592 -1059 -255 -252 2434 3474 -1080 -2947 1339 3637 -181 -3791 -2873 1708
615 1708 4191 605 -3601 -2179 135 999 2656 3346 -1947 -5670 -782 4777 3002 -1876 -4050 -1027
631 -1027 3472 2030 -2516 -1799 1649 963 -229 1876 -155 -4326 -1835 4009 4129 -1064 -5231 -2791
647 -2791 3508 5251 33 -3245 -903 564 511 2230 1401 -2667 -3007 1465 3309 293 -3323 -2878
663 -2878 1820 4898 -103 -4243 -2131 926 1149 2035 1878 -2785 -4251 516 4763 2761 -1943 -4669
679 -4669 -1012 3690 2472 -2363 -2243 156 703 845 1820 -1261 -3473 -71 4237 3087 -1805 -5036
695 -5036 -1608 4295 4252 -1634 -4140 -1362 144 1568 2777 750 -3511 -2960 1951 3949 569 -3320
711 -3320 -3214 2451 4537 -310 -4036 -1339 1189 1909 2194 495 -3420 -3538 1137 5061 2765 -3304
727c304j935M693N317k426m610P2J994J017M47Q8k693j723K799L793o89n010l260
744e430M312O165n39o151k462K713K406J145L87k738l661J423M810J499l317m214
760c652J073N100J404m501k582J747K510R25o0k076l643R85M196L385k780n694
776c663j223N242M378k861m054l12J890J705P99r58k303j237K687L198p26m670
792b108k665M170N201j419n217j530K335K301J421m74k638l117J246M783J944
807D233l622m654J205N274J361m398k218J644J928Q94l1k054k533N22M041K847
823D439l071n176k90N366L373k604l982n10J717J813Q24q18k656j221K465L643
839C312p46m634k154M000M301j526m277j693K360K217J362q53k790k216J705M320
$$ plain form
727 -3304 -5239 -546 4771 2345 -2265 -2193 -199 818 1265 1353 -1340 -3063 -264 3529 2840 -2170 -5430
744 -5430 -1118 5047 4508 -1643 -4105 -1392 1014 2159 2546 -192 -3853 -2430 2380 3879 562 -3652
760 -3652 -2579 2521 3925 -576 -3158 -1411 1099 2024 1964 -112 -3755 -2770 1426 4811 2031 -3663
776 -3663 -4886 356 4734 1873 -2181 -2493 -603 1102 1901 943 -1360 -2597 90 3288 2562 -2108
792 -2108 -4773 -603 4598 3179 -2038 -3568 -1233 1068 2489 2015 -623 -3740 -2494 2289 4233
807 4233 611 -4043 -2838 2436 3797 -601 -2819 -1175 753 1647 1616 -438 -2971 -2449 1592 4439
823 4439 1368 -3808 -4098 1268 4641 2037 -1945 -2455 -738 1075 1899 1081 -1575 -2796 -331 3312
839 3312 2566 -2068 -4222 -222 4079 2553 -1724 -3417 -1057 1160 2522 1669 -1121 -3337 -1632 2688
855B688J305l811m352J984M184O68l051k122P80J870J232K00j698k094N62L633
871A978K284k776n184J17M882K418k487l882J58J894J669N74o06k117j388K136
887c30L475l94m915j515L612L386j733l629o40J915K324L04o53k174j935J284
903a618M196R19l555l548J399M387O80k845k165P36J966O33j9j464j982P72K855
920A347K003k828m034P06M266K017k230l266m15K021J495N04o23k181j431K469
936a80L581j278l947p26K924K464j467l007n74J563J502N21m50j956j835J549
952a316M151L36l518k770J769L738K23k899k058J049J515J99L00o11j803L9L202
969A546J642k686l435R03L769J390k695k759N07J688J045Q5l57j819j077K361
$$ plain form
855 2688 3993 182 -4170 -2186 1998 2666 -385 -2507 -1727 143 1375 1575 -123 -2217 -1655 1978
871 1978 4262 1486 -3698 -3581 1301 3719 1232 -2650 -2492 -598 1071 1645 1039 -1078 -2466 -330
887 -330 3145 2751 -2164 -3679 -67 3319 1586 -2043 -2683 -768 1556 1860 1207 -967 -2902 -1618
903 -1618 2578 3497 -58 -3606 -2207 2180 2860 15 -2150 -1414 552 1185 1166 -298 -2280 -1508 1347
920 1347 3350 522 -3512 -2806 1460 3477 1247 -2019 -2434 -413 1082 1586 963 -1218 -2649 -180
936 -180 3401 2123 -1824 -2550 374 2838 1371 -1636 -2210 -647 855 1376 926 -1030 -2865 -1316
952 -1316 2835 3171 -347 -3117 -1348 2390 2613 -286 -2344 -1295 220 419 719 108 -1695 -1656 1546
969 1546 3188 502 -2933 -2030 1739 3129 434 -2325 -1818 -130 915 1000 643 -1176 -2253 108
985A08K414n18l567q58K457K383j259k881n61K118R78L02m37j506j319J604L041
1002B499j43l056k089J765K516N63k274j475O61J412M71K35q46j788K59K643J042
1019B395k477k183J058K643O51k019j635R6J296N80R09m95k151j200K620K662
1035B750j348k750m85K237J710j218k072J80J358K09m15L27j179r68R62K660M6
1052B004k954j540J716K543R6k342j163J261M82R4M06k24j575R9K109P14j519
1069B07j612J60K234O82j695j648R80R07K84M19o24j658L9J371J777r05k233k16
1087a531J639J133n48j648J57R29K35p1J78j017j036J507J686l51k110r40J484
1104c04J818m16j590n57J010j00M95M74p16j257K74J612N74j382j653J109J978
$$ plain form
985 108 2522 2004 -1563 -2421 36 2419 1160 -1721 -2282 -164 814 1116 679 -827 -2146 -542 2499
1002 2499 2356 -700 -2789 -1024 1492 2055 -219 -1694 -1033 379 850 1085 239 -1549 -1290 1353 2395
1019 2395 -82 -2265 -1207 1436 2087 68 -1567 -1471 -175 405 1314 819 -1332 -2532 88 2750
1035 2750 1402 -1348 -1833 404 2114 896 -1176 -996 362 571 156 483 -696 -1664 -702 1958 2004
1052 2004 -950 -2490 -774 1769 1865 -477 -1640 -379 103 197 603 379 -1196 -1097 1012 1726 207
1069 207 -1405 -1245 989 1671 -24 -1672 -692 215 499 918 294 -1364 -1325 46 1823 918 -1315 -1531
1087 -1531 108 1241 693 -955 -798 131 366 295 473 -544 -1580 -73 1613 1262 -848 -1788 -304
1104 -304 1514 1098 -492 -1049 -39 -139 356 830 114 -1143 -869 743 1317 -65 -1718 -609 1369
1121A369m5j741p55R68Q27n70N18M6j821j21J466J287m72k069o03K160Q49r47
1139C46j165M66P57l77l4M06q21k87M31J338J2j706n85J086J573m61j699k89P75
1158b34M06L95j26n24p85M9J206N92j000p87Q4J566j47j316j28P03J85K92K08
1177F39m86r34K81P92Q00m10j606j43J550O90j355l46M09L88m15N37n7n64m17
1196f47M88J116n70j007o38J440J112j022o86k32Q30j14N0M95m52o58K5P40Q12
1215A082q20j155L98J108j73j045j99R87j29o5jP8l20k21N89O60k89j337J81R14
1235B43M70r45j41L86K57m17K06M19k86m44r3Q57k62o61o4Q65L47p48p29M25L27
1256A2o1m3L39j82n88J62J040p0q34l73O52N65o10o35L86P84l30m34k1L51l19
$$ plain form
1121 1369 1324 -417 -1172 -204 623 53 571 617 -1204 -1325 141 1428 956 -1113 -1716 444 1293 346
1139 346 -819 -353 404 27 -7 399 -422 -709 -278 1060 1072 -634 -1219 -133 1440 979 -720 -1009 -234
1158 -234 172 567 441 -83 -868 -819 387 979 -21 -808 -724 842 695 -621 -749 -46 139 431 639
1177 639 153 -781 -500 292 1092 682 -924 -1067 483 1173 -182 -528 -119 269 -146 391 334 -230 -647
1196 -647 -159 957 387 -620 -1258 182 1294 272 -414 -646 184 70 120 615 163 -495 -470 270 1082
1215 1082 262 -893 -495 613 440 -605 -804 183 54 -11 -12 66 -254 -475 114 774 485 -852 -671 243
1235 243 713 -232 -373 13 270 -147 59 478 192 -252 -345 512 250 -411 -475 390 737 -11 -740 -315 12
1256 12 -49 -92 247 65 -523 -361 679 609 -225 -598 54 619 9 -626 -240 544 214 -220 -241 110 -209
1277b09n5M32J92l85q62J02J619k02r88k19O77L26l42j01L64k67n01J30M38j17
1297C2m28J44Q53J30r07l38M50M68l17o8Q2p3l78j74N26L14n75k51M73Q83q01
1318D5o81N85O30j20q81o6O51k01l40L48K25j11o80P15N53o4r01p6O36K2p12K09
1340b14J41L53n72l6O60k4p51r7J016O2r72j60R58K52p02l77L71j12j66j06Q56
1361C80J98r29k10Q16J72n14n66R24K0l97k32MN02l84L6L35j46k49l58N52O68
1382F22m00o63l5R43k43j89k63M57m9l44j92N08p6n15K52M31J31q33lR52R1k17
1404C65m44J35J04k36j04L52m8n98rO61M03m65m98P84J91n40n29L95K31K02p49
1425c97M24J8k90j73N58K03j62p54P08K34P0q71K09O98m48o0L3J97k97l28L40
$$ plain form
1277 -209 -264 168 360 -25 -887 -785 834 632 -356 -575 102 428 86 -15 349 82 -419 -289 149 32
1297 32 -396 -252 601 731 -176 -514 -64 404 87 19 101 28 -350 -524 2 316 -259 -510 -37 846 45
1318 45 -636 -51 579 459 -422 -488 163 -38 -378 -30 195 84 -596 119 672 608 -293 -369 267 289 -423 -214
1340 -214 -73 280 -292 -328 332 308 -443 -540 476 538 -434 -594 364 616 -86 -463 -92 -204 -370 -476 380
1361 380 578 -351 -561 255 427 -87 -653 271 291 -106 -338 -334 168 -216 -180 155 9 -240 -598 -46 622
1382 622 222 -441 -476 467 224 35 -228 229 180 -164 -356 152 76 -439 -187 244 375 -458 -461 491 582 365
1404 365 -79 56 160 -76 -180 172 124 -474 -483 178 581 116 -382 402 593 53 -476 -81 150 352 -397
1425 -397 27 45 -245 -418 140 343 181 -573 135 369 439 -432 -223 475 27 -33 0 197 -100 -428 -88
1446h8L94k11n47J18O93M5n74j47L09K55l11j16K62J8k74q0N29L34r25k53P55
1467A86L34o18n03K83O04j07qk58m1O5J0K22N18o88n82N89N44k05m16k12J2K96
1489B5r8J7K54k25m51M37L07l53m74L64N66r4m03l48L42J92K10j26pp6k97J74
1511f4N65l47p05O8Q82L28p29k29Q7M08k02j4k73L17l38p5P91p4n60o44Q38P14
1533G44k78r83N18J41j68l7k53N98r8m54M23K09j36o09l04J163K42r63k70M20
1553i5K88r0R1k63K70l27j75O51j34n62J11K49N19m25m55J13M08R0j48k56R7m
1575d7K1K38J70o67m30P00N29m39l33J19M1M23k29J82%m59j4J62N23p57j51J52
1597b66P52k85l08j1K32J53j69k38K61k90j53L30M24j16p21j43R74L06q01n87
$$ plain form
1446 -88 306 95 -452 -334 359 404 -170 -317 -8 247 -64 -180 82 100 -174 -254 275 609 -316 -569 186
1467 186 520 -98 -601 -318 286 179 171 -87 -128 -63 -53 169 687 -1 -583 6 550 345 -71 -283 -271 25
1489 25 -73 -56 198 -27 -478 -41 266 -87 -561 -197 369 275 -128 -476 -134 58 268 142 135 59 -238 -64
1511 -64 501 154 -551 -483 399 727 -2 -231 -144 264 62 48 -225 92 -246 -321 470 396 -164 -808 30 744
1533 744 466 -517 1 142 -26 -63 -316 282 184 -270 153 362 226 -383 -687 476 718 -245 -515 -95
1553 -95 193 103 194 -69 201 -126 -301 350 216 -346 -235 14 533 108 -347 -234 174 264 116 -140 -43 -47
1575 -47 -26 212 382 -285 -715 -15 514 75 -258 -139 -98 325 96 278 278 -181 -195 -33 490 -267 -418 -266
1597 -266 486 201 -107 -118 114 267 98 -140 121 -169 -322 8 432 316 -405 -548 426 732 -69 -656
1617f56R30L26n12j43J64M7k87J11J73L60n56p43M44J063j79j188J04M05N74l76
1637F1l18K29o3J7J60J63k27k62JN11l45M6n17K88M03J18o4l07k75K37L61J22
1659C39k71m72J78M30m9l5j71O6j03J70K63l91k99j30P27K20j75r66K86Q93o1
1680D49l25m11L46R0j42J81J04l73k43p0N64M89q13n09M17P64k02q48N5Q90j64
1701B49l54J07J52M9m10l43Q38J17r53J27Q48J36l73n76J54N65Q9q39J14M81k19
1722d1Kl1K71q8j46j33O02k80k65j98J19N41k30j73q0J89J83K01n22j40J08K48
1744A37J12k62l02L28m3J03N7K61j91o31K07O33J90j068j10N81N22L7p73PL90
1765A85k2k94L70L19m54n10K97M91Oq48l98J167L36n79n94K42Q57m09o58M62M95
$$ plain form
1617 -656 274 600 88 -55 109 156 -131 -20 153 513 -43 -786 -342 721 542 -646 -542 -137 437 61
1637 61 -257 -28 -91 -74 86 249 22 -240 -239 272 -73 -27 -544 -256 147 265 201 -106 -381 -144 217 339
1659 339 68 -404 -226 204 155 120 -51 15 -88 82 345 -46 -345 -475 252 472 297 -669 -383 510 449
1680 449 124 -287 59 149 7 188 292 -81 -324 -394 170 659 -154 -663 -246 518 316 -532 -477 413 249
1701 249 -105 2 154 203 -207 -550 288 405 -548 -421 427 563 190 -386 -232 333 422 -417 -303 178 -41
1722 -41 -39 -70 201 113 -33 -166 436 156 -109 -307 -188 353 123 -50 -130 59 242 443 -79 -219 -111 137
1744 137 249 -13 -315 13 -30 73 130 391 200 -431 -224 409 599 -469 -579 2 524 561 -212 -205 185
1765 185 163 -131 239 558 104 -406 -109 382 388 -460 -858 309 645 66 -528 -286 571 162 -496 -34 461
1786D61n61l54K66N58j66p73J70O20J45n03l42N56N43l01p37K15L84J0K9l07J92
1807A05j62j31K97J16jm40j82L53L24j11l39r0J95J97Q4n09J2M15j10J29k61J51
1829D2L4j10M3J55J44o33J89l6P02j67q34L17M03M1m99p9M20Q5m21j53N79J13
1851C35n78k85N73N97n80p68O18O36j20j116L02N43J39l86k57N30L81p39m02O97
1871A20M30n15n02N84K87l08m82q9R84j9p52J25K12%k12J6L34k57k4k79L80L93
1893D26l29n66J40M14K55l45k69Q4M37p6p5j90K24N8k6l06L57j78p9q0J26N15
1915E17k61n72J60M37r6l00j10M73L23n17m31K52N63r6m86J74Q2O7o22K09M13
1936A79R0n96j24O93L75n07m61M92L18m54k60O9M37j82m05J28L60K18n53j51O30
$$ plain form
1786 461 -100 -454 -188 370 204 -569 -399 221 366 -137 -479 77 620 319 -418 -203 181 191 220 -87 105
1807 105 -57 -188 109 225 224 -216 -398 -45 279 168 -171 -261 -66 131 215 -294 -282 133 23 152 -109 42
1829 42 76 -34 9 164 308 -325 -136 -172 530 363 -471 -154 249 290 -209 -288 132 217 -204 -357 222 335
1851 335 -243 -528 45 642 62 -706 -88 548 428 -688 -386 157 296 -90 -347 183 564 -175 -577 120
1871 120 550 35 -467 117 404 96 -386 -475 509 490 -262 -137 75 75 -137 -121 213 -44 -68 -347 33 426
1893 426 97 -469 -329 85 340 -5 -274 -190 247 171 96 -94 130 188 162 -144 213 35 -44 -124 2 517
1915 517 256 -316 -156 281 185 -115 -225 248 571 54 -377 -125 438 342 -144 30 112 179 -443 -234 179
1936 179 269 -327 -451 242 617 110 -351 141 459 5 -255 -186 251 69 -336 -208 152 370 -183 -334 296
1957B96J44m52l88L27K06q8r7J34K23Pl26j47K99k34K02o14R29j14m39l09M16
1978b5L30%m88r2J20M62l00k19j96P46k59k13nK76Q9n75J81L20O0k44l01J35P06
2001E08n24k70o2Q15k65m49RL57K28m51k1L47M4k02m67J88M91l38m35J92L50M06
2023D51r72mO79L80o53m09O78P8k77k30K94M54l68k53r5O25K2o27n7N49K7n23
2045b31J94P6L5P0n30J93L54o8Jk43L10j42r4j05J57L23k81l4jJ61j1l43r0O52
2069C53k19j46O3o2J02m5j64K34O6j19l25l44Q47n1l50j48J90M09l82k70M22K89
2091C50j18l92lM04M2n75r8N69J82j04m22R0L75m50l48M21M79l20m35j4M94o6
2113F1l30o7N65j75j56j84O41r6l99j40K68L05l10k87K13j12M72m24J6K60q7j32
$$ plain form
1957 296 440 -12 -400 -73 133 45 -52 82 305 312 -14 -161 138 -96 106 -508 421 307 -132 -441 -25
1978 -25 305 305 -183 -275 -155 307 7 -212 -408 338 79 -134 -139 137 226 -349 -168 152 212 -32 -333 -198 508
2001 508 -16 -286 -348 467 202 -247 -238 119 347 -104 -125 222 266 64 -403 -215 276 -62 -497 -305 45 451
2023 451 -521 -525 154 534 -119 -528 150 228 -49 -279 15 469 101 -152 -247 378 400 -227 -284 265 292 -231
2045 -231 -37 39 74 144 -386 -193 161 93 94 -149 161 19 -75 -180 -23 300 19 -15 -16 145 134 -209 -299 353
2069 353 134 -12 51 -11 91 46 -118 116 182 63 -262 -606 241 190 -160 -308 -118 291 -91 -361 61 350
2091 350 232 -160 -163 241 283 -292 -390 179 361 257 -165 -75 300 -150 -498 -77 402 82 -353 -367 127 61
2113 61 -269 -336 229 54 -102 -286 355 259 -140 -280 -12 293 -17 -304 -91 -203 269 -155 -139 121 34 -98
2135i8%K54P8j45k26j13M91j57k80o7K21K92k89j61K76r2K79m41k17L95J23j9
2157A04j45l3J31j6m9j67M08Q2m76O3K56p2j46j45l1M01k83P4k68M68J8k53n8
2180a37M26k50k52J7N47j8l02q2J86LPl27j81N78l27o9J19N63m73j59j93N06j68
2203A4j62p4K83j42kk60L57j31k1j29L58Pl24J68m4N8J68l92L23J9J52j74l22
2226b70L54j65M07l66j77L26l7R8r5m78M10j14k50N09j22J04l00K62j57L1N9M
2248C3j05K20M9j65k4L12k19k16j49M06l8J50j15k90M35l23O1j9J67j22j96o4
2270b12O14l37j65j84L13J98n55J65K79N6j56k29K38K69m49n6J46L3J0q3l4N41
2292D02j70k44j87J63K16j87K7j70K08k50j69K45K51k22j88J80K68j12j69J71
$$ plain form
2135 -98 -98 156 234 89 -137 -250 241 84 -196 -263 -42 250 -39 -200 76 -16 263 -178 -395 0 123 104
2157 104 -41 -74 57 41 -8 -175 233 315 -161 -98 158 86 -60 -205 -236 165 -118 -44 -312 156 174 -79 -137
2180 -137 289 39 -213 -196 351 333 31 -51 135 138 145 -182 -363 215 -112 -181 -62 501 28 -131 -324 182 14
2203 14 -148 -222 61 -81 -83 -343 14 -117 -138 -267 91 98 -226 -58 -102 -44 124 -268 55 74 226 52 -270
2226 -270 84 -81 326 -40 -217 109 72 170 75 -403 7 -107 -357 152 30 134 -166 96 -61 -30 29 33
2248 33 -72 148 197 32 8 320 101 -115 -264 142 104 254 139 -151 284 -39 22 3 170 48 -148 -212
2270 -212 402 65 -100 -284 29 227 -328 -163 116 172 16 -213 25 294 -155 -211 -65 -32 -22 -105 -139 402
2292 402 232 -12 -199 -36 180 -7 20 -150 58 -192 -361 -116 135 -87 -275 -95 173 61 -108 63
2312F3j86O9o6Q8RJ30J19r9k04k5pJ97m23L19o9j1K98r5o1J18l31J28J42m1j26
2337f4j17J06L0J05j06j27L30r2j80J27Q9O1n03K56J04M1R1l75K55P9n7j88p9
2360b14J09J98j21K25k98N65n16QJ8k1o1N4L02j83j06r5J57OK4J54j32j11l3Q3
2384A2J76L6k31n3K14j21K07l10q0J49J99m9j45K7j44P7R7o9o1r1n7J33j22pJ29
2409h4L76j82k35K33p9k09M17k29j7M1J13M0j18k38P8K77l4J11l71J53J07j33
2431A7k26M19J79n93J13N6J10j33J23J7mk4J33j62J61j27n4j4k7J78j14o0q6L23
2455B05k42p4M8Q6q6J67Q5j82j34p4J80N1K1k26K88O2j24k3j14p8J87P8J08j75
2479C4m5P5l0J43j04j95L04k4j32j3J0j36O4p5K15p8n6j10J14j83K93j19J39l18
$$ plain form
2312 63 -123 -54 -120 -32 -23 107 226 127 -77 -102 -109 88 -335 -16 -85 -96 202 107 46 164 -167 -39 103 62 -64
2337 -64 -181 -75 -45 60 -46 -173 157 65 -115 12 101 162 -341 -85 19 60 151 -224 31 110 53 -135 -214
2360 -214 -105 93 -28 197 -101 464 -52 -44 -26 -47 -108 -54 248 65 -41 -136 21 27 51 205 73 -38 -71 12
2384 12 188 224 -7 -60 154 33 240 -70 -150 -1 198 149 4 31 -113 -36 61 -8 -69 -160 -217 -84 -206 -213 -84
2409 -84 292 110 -125 108 29 -180 237 8 -9 32 145 185 67 -171 -93 184 150 261 -110 43 150 17
2431 17 -209 210 389 -204 -91 -35 75 -58 65 82 78 54 187 25 186 59 5 -9 -36 142 28 -32 -118 205
2455 205 -37 -111 -63 23 -63 104 189 7 -127 -201 -21 30 51 -175 113 175 51 28 -86 -164 23 101 209 34
2479 34 -11 64 34 177 73 -122 182 158 26 13 23 -113 -49 -124 91 13 -43 -153 -39 -222 71 -48 91 -227
2503b27M31k00j33K40k8l1k02J83l8R9m2J18j6l43K26JL0J02l46J15J08l1K48
2526B64j13l51R5l2K84l8j37J19q5J18j64K21j75k6kj4K4K26J00l18K25q4j67
2549c0J07j09L82l88J07q5J98k47P1l7j32K71l20J69J16r4j61O7r7K87j38R8J0
2572D5J86l05k7J89Q6k67R2l8K76j20k00L01N1l15rJ26j25K37k38K32l25J42j26
2595a32m2K94n0J36k08j11M81m90J55J0j42j64J74K08n8l73Q3L47K8J79m75K23
2617G3k09n4J64J34j44j52M5K78j21r2J64K3k51Q7J08r5M4J28r5j22M16k45j15
2640c1J70l2o7j66N8K27j3j09n4KOJ2M0j37L79q8j45J0k04J51o7L87l79l2j01
2665a83L28k9j63K19k2j71J85k98K58J11k75o2M14k98l6l39J13K43j97J0K64N6
$$ plain form
2503 -227 204 4 -129 111 83 52 -150 33 -5 94 52 170 154 -189 37 38 68 170 -176 -61 47 16 264
2526 264 151 -200 -105 -137 147 109 -28 91 6 124 -40 181 6 -20 -22 -36 -12 214 314 -4 221 137 -30
2549 -30 77 -32 350 -38 69 -16 182 -65 6 -31 -163 108 -212 -43 73 -21 -182 -115 -212 75 -63 35 45
2572 45 231 -74 -101 88 174 -93 -1 -39 237 117 -83 218 269 -46 -55 71 -54 183 -55 177 -148 -6 -132
2595 -132 -174 120 70 206 -2 -113 368 -122 33 43 -99 -263 -89 119 61 -312 -229 118 146 325 -150 73
2617 73 -136 -190 -26 108 -36 -188 -143 135 14 -78 86 109 -142 -55 53 -42 2 130 35 -87 329 84 -31
2640 -31 139 107 40 -126 -68 159 146 37 -17 -15 -9 3 43 -94 285 197 52 62 -142 9 -58 329 -50 -82 -183
2665 -183 145 116 -47 172 150 -21 164 -134 124 235 -40 -102 312 14 -22 -361 -248 -5 -202 -192 72 128
2687A28pk52rM11l19K9K27k27m9m2N8L54m81L8L10m7j51J71q4j8R5j31O4K39k30
2712G7o7PO1o6J55l92L23L9k30j7J46J32K0n39K24L04m68K49l4j8R7j45L09m06
2736b39J72K33l11L00J25m19J36j9J08j09O9j29nK03l7M3j98l8J69O2N8j7j48
2759IQ0J23m78K47k2KK8N4j9K43k57p0k9Q7m2j91K07L0N5j38Q1o1J05j15J43R2
2785A64N3l57M13k21j15L0P3nR8k61J5L26k69K19r3k5p1K0l8j8J58J90n15K84
2809E5J27l13J95J29q0j32R0k24M2k04K74J45m8o8J4m7l5J10j08J88j05k29K44
2832B0oj03J37j99k0J42J07L6r8j13P5o7J77o7n5m4J36J44k05j8L19l72j33P5
2856a32J02j39J40M4o0P7O5l02K72j22Q5J10j59l3K92l13J09J02j34L5nR1j97
$$ plain form
2687 128 121 -131 -140 271 -48 -19 208 -19 -68 -110 -52 302 -179 -141 169 122 -29 142 58 40 135 4 68 307 77
2712 77 10 17 78 12 167 -225 98 137 -93 -110 36 168 188 -351 -127 177 -291 -42 -76 -94 3 -142 167 -239
2736 -239 -67 166 -145 155 280 -139 -3 -22 86 -23 46 -83 -88 115 78 121 -77 -115 54 116 174 157 9
2759 9 89 212 -266 -19 -41 -39 -11 43 24 267 10 -60 -89 -2 -44 -235 -28 2 57 -81 0 -61 44 -71 72 164
2785 164 217 -140 273 52 -63 -33 40 35 133 -128 -113 213 -56 163 70 45 -26 -6 -44 -62 96 286 -229 55
2809 55 182 -131 64 193 113 -19 71 -153 -111 -315 -41 104 56 -12 2 -45 -80 30 -78 110 5 -224 20
2832 20 14 -89 48 -151 -171 -29 78 114 16 -97 -22 -89 88 21 -34 -78 58 202 -3 -21 298 -74 -207 -132
2856 -132 -30 -169 -29 15 -45 32 97 -205 67 -55 30 140 -19 -52 240 -73 36 138 4 39 34 125 -72
2879g2K12k42K27q1J33k56m1J21j58J60j77M9L5J8q7L28j52P7r8M2N9K6L3N0P8
2904B84k53m2R1j9m9mJ11j53k6k03L62k56K62P3r5J70j16k28K79k55J31k92K42
2927A4K64m44K00Q8l38m4N42m00K00n7j94L00j07K35j87l1l4J67l49K06J40k4
2949A47j22k96K09o7L52j71k37J10J9J70j7J50l29K26o0k18J88j92Q1Q9J4J48
2971A94p1l63K60l1J0J77m55K69N5k24K38j37M4P4m5n0j07R8K9Ln2K95l19k08
2995c16L05j04K77l05R8L13j98mj73J45p4J6M5J3P4k86R6J51Jk41L89j26l1j67
3019a02j16K23K05p5J21j36k13K76j99j77J34p3Q0K64j68L1L29m64J70j12j98
3040b00L01j32r3K59j54Q4j25r2J94O1n6j61l2r4K71r4J42o8R3m6j34K20l33K21
$$ plain form
2879 -72 140 -102 125 44 177 -79 -120 1 -157 3 -174 -125 -90 -72 -159 169 17 94 -4 38 97 123 156 206 284
2904 284 31 -11 80 61 12 8 119 -34 -60 -263 99 -157 105 178 83 253 137 -91 188 -67 64 -228 14
2927 14 278 -166 34 122 -216 -260 282 -118 82 25 -169 131 24 259 72 41 7 174 -175 31 171 147
2949 147 25 -271 -62 -129 223 52 -185 -75 -56 114 97 247 -82 144 84 -134 54 -138 -57 32 46 194
2971 194 123 -240 20 -11 -1 176 -279 -10 45 -179 59 -78 -34 40 -5 -55 -162 -64 -35 -32 -84 211 -108 -316
2995 -316 -11 -115 162 -143 -45 268 70 66 -107 38 -36 -20 25 38 112 -174 -78 73 74 -167 222 96 65 -102
3019 -102 -218 5 210 135 256 120 -93 183 -16 -193 -59 -132 -52 212 44 75 404 -60 110 -2 -200
3040 -200 101 -31 -124 135 -19 65 -60 -152 42 103 47 -114 -146 -240 31 -63 79 11 104 58 -76 144 -189 32
3064C2o7p9L08k48M7R3j02J05j24J17l04K83j39J3k3j61L17J03l22m7N7J62J27
3087A48j28j70K19N7n2q2N4J3j67J19Q1p6j91K24j79P2J42J7j26J04P6k35NK99
3111B24k9j14j11J10n9Q7j93k7M51l93p1K72j12m7j68K5M7R2k4k96M18Q8k33K39
3135A76m44K73J81J06l45J09r0QN1N6j85O3O0j27pl8L23k70K1K9K1Q4k07K56%
3160A04l1l8j06j61O8K47j39L97j87k88O0J81j45J00J14j08k86J73k00M71j53
3181G3k38m9K1M6K87k98L24Mk18J4J59O7k95J04K02k22j5M4J7j07Q5j42K93k4
3205A32r2j35p5J51n5N9J31j24KK20l89L80j28k11O8J93j23j43j29L00J30l54
3227a92K57J24j06j98J02r6K5J20l9QJl5O8J8j21J02k79M0K86j6p3L7j20K71j63
$$ plain form
3064 32 -35 -114 194 -54 -7 86 -16 89 -35 82 -222 61 -78 -65 -88 -249 68 171 -151 -198 -141 21 148
3087 148 20 -150 69 126 74 -8 46 59 -108 11 92 16 -175 49 -130 -58 84 101 -25 79 155 -80 -75 224
3111 224 195 81 -30 80 21 108 -85 -112 339 -54 -125 147 35 -12 -180 -155 -108 -16 -40 -336 82 170 -63 176
3135 176 -268 5 186 292 -53 56 -34 -26 25 81 -104 -41 19 -108 -115 -153 170 -100 -79 -50 -29 55 -152 104 104
3160 104 73 35 -71 -232 -164 83 -56 341 154 -134 -74 107 -38 62 176 68 -218 -45 -245 226 73
3181 73 -165 -214 -193 -147 140 -158 166 170 -48 -34 125 192 -103 1 203 -19 -34 10 27 -80 5 -137 156 132
3205 132 40 -95 -170 -19 -74 -15 116 -8 -6 214 -175 205 77 -134 -66 127 4 -139 -268 32 162 -192
3227 -192 65 189 83 -115 -13 -109 -84 36 -3 5 6 -29 39 57 -64 38 -241 -201 85 69 -4 33 -87 184 21
3252B1j73j06K80J1m09M93j63K9J49ol61K28l0l37K37M9M3l2N2J3j05L78j75j14
3276b8O1j59K19j27L10m24L27k79J80K16k80J47k59J80nJ15l3p8J60l97J53LK61
3299B63l13J84q3p5R6j55M5j14J55j61J66k6p6l1K45k24R3j20K19J04j50p3q6
3322a17M1J75m39M51k59K99l46r8K90Q2j12J83o6l0r9l7P0M9l05M29J16l05J89
3345A61j38J7k86K26Mk13K00r9J58k9m9k0Lj46M8J24J71j26J04k60J08k7l32M35
3369C4l45N04k63P5J41K7j85k0n4%J92k30J18j59R8K97L9j26j32j8J87o1j28p
3393a6l02O5Q1M47l03J29p1j37M2o3K49J02m02K00N3L6J09j2q5l4l6J00j93n4
3417i5K46o8j49J98l09Q4j64K47L2j01P3kP3j01M5mk3j46L16l39L84k85J94J65
$$ plain form
3252 21 -152 -258 22 33 -376 117 -46 -17 132 126 -235 -7 -37 -374 -137 -88 -45 -77 -25 -12 -117 261 86 -28
3276 -28 33 -126 93 -34 276 -148 179 -100 80 296 16 163 -96 84 79 194 161 83 243 -154 -1 2 263
3299 263 -50 134 51 -24 72 -83 -38 -152 3 -158 8 -18 -94 -125 120 -104 -11 -131 88 192 42 -31 -117
3322 -117 -76 99 -340 111 -148 151 -195 -293 -3 79 -33 150 84 54 -45 -82 -12 37 -268 161 277 -28 161
3345 161 23 40 -246 -20 -16 -229 -29 -128 30 1 -48 -68 -65 -211 -163 -39 132 6 110 -150 -42 -69 -401 34
3369 34 -311 193 -70 5 146 173 -12 -32 -86 -86 106 -124 -6 -165 -67 230 269 143 11 -7 180 119 -9 -16
3393 -16 -318 -253 -172 275 -28 101 30 -107 -65 -128 121 223 -179 21 74 110 219 207 122 88 52 152 -41 -95
3417 -95 151 83 -66 132 -177 -93 -257 -10 22 -79 -6 -8 65 -36 9 5 -18 -164 152 -187 197 -88 106 271
3441B71l21j57K94mj56J63k29P3m2K71j83K06p6r5j04J88j6o6K11k54J2J25J16
3464B27l81L57r9k27M8J7j1o6k05L76j26K18k86M7N1J06j27J71k51M2r5J31k8
3487a11J89J26k46r5K51l68K64l0J26K62k68j00J45J17n47L00m8pL39k38J54l12
3509i7N3o1J53n1j67R2J13k1j51P4K66k32M6j18Q4J71k08P7P3j81N2o4NP0J44
3534A22k70M6J89j04r2%J11L7M8j06j43K41q8k68K57K75k33o1l1K37J3k76M0J23
3558F7J42n6k33J42K6k87R2J0n3J79n3k5j00K92o7p0nJ7r3K52j52J67k33l4M3
3583c2K12l6Jj9k23J72j73l2J76M4K74m50J43k66L33l4k7L9Ql32J82Q5k81L20
3607H4k23K20j2j05k4N6j69J00j3P3M3j51J19N3J09m89M35k46J24J35k64K57j69
$$ plain form
3441 271 -50 -207 87 83 -73 90 -139 -66 -108 163 -20 186 110 15 -89 99 83 17 228 -26 -14 111 227
3464 227 -154 203 104 -123 -75 -58 -69 -135 -340 36 -90 128 -158 -111 -60 46 -81 90 -161 -119 -214 -83 -111
3487 -111 78 204 -42 -137 114 -254 10 -20 106 368 100 0 145 262 -285 15 -33 -40 299 61 215 -97
3509 -97 -44 -105 48 -3 -170 -78 35 14 -137 -63 203 -29 17 -101 -17 154 -54 23 96 -85 -33 -97 -92 -22 122
3534 122 -148 -102 87 -17 -109 -109 2 39 87 -19 -162 79 -9 -277 -20 255 22 -39 -70 167 180 -96 -56 67
3558 67 209 153 -80 62 88 -199 -107 -97 -150 29 -24 -49 -149 143 76 6 1 18 -75 177 25 192 -41 -75 -32
3583 -32 180 144 145 126 -97 75 -98 -130 46 90 364 -86 57 -209 124 90 63 102 110 -222 -40 45 -236 84
3607 84 -139 81 69 -36 -60 -4 -173 -73 -86 -13 30 -121 -2 51 160 -329 106 -140 -16 119 -145 112 -57
3630e7J74k86M00m4l42L2O1J65j1j36J77j81J66m9j52L8q6K41K3k52Q0j4M2mj46
3655a61K66n8Q8j11k8J10J06j27m35L91J98l16K49k00J43l50J01J1R4J08J05k72
3677h8L07n2l97K43j66R0L17n32K83J8O9j66K94l61m2R3L01j23k7mk9K1j7j28
3701i6M6J05J44J6k6q4j50n6m9j09L07r8L2Q8j81k06L52o6l49K49M27N8l27l0
3725cO3j17R8j21O8R9n3N9o0m4K2n0Q1K2P2k20J2K25k23J61k47K39k64K87l35
3750b29J53q3J13k72L93L0j56J91j45n5Qq2j6qM52k83O9r1Rj56K91j17p8K7J00
3775F5R2k70L16k55J44oL4l86K22J45k19J58l03J37j30L34l00L90j89O7jr8K51
3798A98m31L22Q5j70MJ25j26N9k04J82P5j07j30P1L07m64M16l04O5l1m8P3P3m2
$$ plain form
3630 -57 117 -169 231 187 -155 -123 -62 103 92 -44 133 -48 118 69 -83 -45 -131 110 133 -119 -39 -53 -11 -15 -161
3655 -161 105 47 135 24 -4 106 212 85 -350 41 239 -77 172 -28 115 -235 -134 -123 -29 79 184 -88
3677 -88 219 167 -230 13 -153 -63 254 -278 5 23 92 -74 220 -141 -183 -90 211 88 61 57 28 49 32 -96
3701 -96 -50 55 199 215 189 105 -45 -101 -150 -259 48 -50 -18 70 -111 -317 35 -31 -380 -131 296 354 27 -3
3725 -3 60 -57 41 -80 -12 87 34 93 33 -11 11 -39 42 64 136 -84 -72 153 -70 91 -156 83 -181 106 -229
3750 -229 -76 -159 -46 -318 75 105 -51 140 -5 -60 -52 -134 -150 -158 294 11 80 -11 -2 -158 133 16 -62 -35 65
3775 65 157 -113 203 -52 92 86 120 -266 -44 101 -118 40 -263 -126 -256 78 -222 168 -21 46 45 -53 198
3798 198 -233 89 174 4 8 133 7 66 -138 44 119 12 -118 -47 260 -204 212 -92 -27 -58 -106 -33 40 -2
3822bP1j94N05l88k7j74K41k75J02J87k3M5Ol33M26k41J26K51k47J48l20rL13
3845A88j93K96k09j0J69K0l73L34k11j67J06j75K61J5j14O7k5j46K36l1J22j21
3867C9K14k89K37j73J3j82J37P8l28K80j7j5J89k14J89k20q4K71J07Q9l23J01
3889I9n7O6j12o5j34J09j8J3J44k59K86j08j35K14j71j32L43k16L46j71KK4%R6
3913A64J02k77l8K83k78R7j11j38R8K19K03k77k32rK58J13k12nR6l26K19J10l12
3936b53K01O5p4J75j21k27L50j70J01k67K11j24j09L54J21l79k8J77J43j81K0
3957a5J90N5rk91Q2k36K39N9k58L01O5l6K0l58J46K0j27K24j7K15m48J99o4j67
3981b11K32J04l92N5K48o1J54J01k71j14J35J27K3j32K37j70r1j24K44j86K7J13
$$ plain form
3822 -2 69 -125 380 -8 -35 -209 32 -243 -141 46 23 68 74 -259 167 -74 52 303 56 204 -116 -125 188
3845 188 -5 291 82 72 241 261 -112 222 11 -156 -50 -225 36 51 -63 4 -21 -167 69 38 160 39
3867 39 253 -36 201 28 41 -141 -4 74 -254 26 9 -6 183 -31 158 -62 -146 125 232 321 -2 99
3889 99 42 108 -4 -69 -203 -94 -112 -99 45 -214 72 -36 -171 43 -128 -260 83 -133 213 42 44 68 68 164
3913 164 266 -11 -49 234 -44 53 -58 -196 -98 121 324 47 -185 -194 64 177 -35 -40 56 -270 -51 59 -253
3936 -253 -52 13 -61 114 -7 -234 116 -54 47 -220 -9 -133 -242 112 233 -146 -174 3 146 -35 -15
3957 -15 175 230 221 -70 12 -224 15 74 -184 117 182 146 166 -192 -46 -26 -153 71 54 269 -179 20 -44 -211
3981 -211 21 125 -267 -212 36 -25 129 230 -41 -155 -20 107 130 -2 235 65 -26 -150 94 -92 -65 48
4003D8p5M6k46K09J21N8r8r5R0Q7l24L2J84mM3K52o60L24K11k61N8j4L90m97K13
4028I2Mk22J76J7l40L08r3j51J80N8k1R1o0j4Mj37L27l20J71K01l20j28K04j9
4052HJ45j01l70Q6L33K9n8K42j91N3j0l19J20O5N0k6r2r4J16P6J13k13J64m0l28
4077b42L18j56j39J33J95N2j73j43J40R8j15k2L8j15K74o8k45j82O30k53J68k08
4099a5m7K40l14L2j4j13K07j39K27M2k87N6P6J44k34R2J36O8o4P4j77J94j12k37
4123a65J20k1q9J9J10l2J53j97J18p6r4jJ96j18J8L02J5n51J91J58m5l5k03p8
4147c05J93j15J56J95j89J63n9k15K77j42J85J7p2l42J40J24l9l9Rr2OJ01m0k85
4171c68J16j55L71r5K10l36J12J00m3J88J16r1j48L2J12q3j44J75j58j7J59j00
$$ plain form
4003 48 -27 19 -227 -18 103 161 63 -32 58 145 -179 -147 37 33 76 328 -332 -8 203 -58 0 -14 376 -121 92
4028 92 96 -126 50 67 -273 35 -58 -209 -29 29 8 99 39 25 29 -108 219 -101 70 271 -49 -177 27 8
4052 8 153 52 -318 -232 101 130 72 314 123 176 166 -153 -33 32 82 56 -36 -130 -14 62 175 -38 126 86 -242
4077 -242 76 -80 -219 -86 109 161 -12 -155 -15 83 -32 -54 -16 -131 143 75 -170 -352 278 25 193 -15
4099 -15 -62 178 -136 -104 -118 -231 -24 -163 64 106 -181 -125 -49 95 -139 -47 89 157 93 167 -10 184 72 -165
4123 -165 -45 -66 -155 -136 -26 -58 95 -102 16 -60 -154 -155 41 -77 -59 243 258 -293 -102 56 11 -24 -227 -305
4147 -305 -112 -227 -71 124 -65 98 39 -176 101 -41 144 161 89 -253 -113 11 -28 -67 -58 -150 -144 -43 -83 -368
4171 -368 -252 -407 -36 -131 79 -257 -145 -45 -88 100 216 125 -23 9 121 38 -106 69 -89 -106 53 -47
4193d7jn5R6J43K84m08r9N2n5L6r4J86k93L73N7l84L6K77j45J44nr4k17jK91r7
4219b0J10j92J70mq9p2J95J22k14n7J88k10l8j83M16P0o7O5o7j69p4J31l0J8n9
4244f0J06o9K6J9j08J74j26O8Nj22l4p3J97l3N7P3j2m5J04k2K0k7P2j74j93L73
4270A96k69J16Q2l83J35J96K30m18k9K66K01j85j04k1P8k10J16k06N9R3L09j46
4292A06R0l14J86j99O9J31j33Oj83M70K0m77L13J95l97m3o2K96j62N2j9J64J95
4315C04l56J16k97K25l5j13L2J23j56L41k13j53J93P0k32K29k2n5l0j70K05k50
4337b44J95n5j7kOK17k80J16N4o9P2J00jp3j72J8M1N0K05Q3j71J03k63l9K13o5
4363B2O3j10J04o5j06J44OJ1j67J77j79q8P0R9o0J22K04j68j35L4O8k23k5K16
$$ plain form
4193 -47 -48 -103 -7 136 420 12 -87 -35 -90 -54 -148 38 -255 118 175 -209 -173 104 -41 103 98 4 -213 -214 77 -20
4219 -20 90 -102 68 64 -25 -97 98 220 6 -51 137 -73 -111 -294 122 192 125 190 123 -46 -120 11 -19 -1 -60
4244 -60 46 -23 3 22 -86 88 -38 30 35 -87 -121 -194 3 -30 27 100 88 43 147 125 145 118 190 16 -177 196
4270 196 -73 43 125 -258 -123 73 303 -115 -144 122 323 138 34 13 91 -119 -3 -209 -150 -57 252 106
4292 106 196 -118 68 -131 -62 69 -64 -58 -241 229 249 -228 85 280 -117 -160 -222 74 -88 -36 -55 109 304
4315 304 -52 64 -233 -8 -43 -156 -124 -1 -157 184 -29 -182 11 81 -151 78 56 1 -29 -199 6 -244
4337 -244 -49 -104 -121 -123 -117 100 -180 -64 -10 -79 -7 93 92 19 -153 -135 -94 -44 161 244 73 176 -87 -126 87 22
4363 22 85 -25 79 14 -92 52 58 69 -98 79 -100 -188 -118 -19 -79 43 247 79 -56 -22 46 -177 -202 14
4387A4m1q9K0M3J52o7k15J19J43L2n0l31N13j02j84L61l92P9Pj10L9K17l05K96
4411A49m89K14j33M81j04j04K71l84J72k65Q2L48j22j2r0l9j95J79L8J48j80J19
4433H4N7k19J36j59J87k6j47N1N1q0j33K44oM0l32L12l60J33K38J38l25p2L67
4456A79l95M01k61n3K90j55L8k36L66j79N0J92l61L65l97J80q1J46J25k16J37
4477A35J59l64J97k13K88j61r7J49J15k78J87m6j14m9J94J50j43p0P7K7k38J12
4499A7k0j67K39rj62l2M1n1J4J7K07J55l83J68J47m13J55l1M8L7j51O2jK28n7
4524E8n1P2j57J89m33R2J80n3Q1j76N32j95Nk21K05o9j41j39N3J84j63K41p3n9
4548c8K48j64q9J02J8j5J36j43Q9k9nM1k05J53o9k94K33o0K29K8k21J5O8k26K78
$$ plain form
4387 14 -27 -116 -96 -53 99 32 -183 -64 79 111 61 -270 243 141 -43 318 -74 5 12 -98 -59 158 -147 149
4411 149 -340 -126 -259 222 118 14 285 -99 73 -192 -110 238 116 104 14 -25 -220 -41 -3 145 -35 84
4433 84 141 -78 58 -101 86 60 -87 -36 15 -65 -198 46 40 80 -252 60 -300 -167 71 209 -116 -188 179
4456 179 -216 185 -76 -129 161 6 44 -192 174 -5 45 237 -124 241 -156 24 -57 89 214 -2 135
4477 135 294 -70 127 -86 202 41 -56 93 208 -70 117 71 -43 -92 102 252 109 39 116 143 -95 17
4499 17 -3 -170 69 60 -102 -134 -93 -144 -130 -113 94 249 -134 34 181 -232 -77 -108 -60 -23 -174 -112 -113 115 58
4524 58 7 79 -78 111 -322 -230 -50 -103 -22 -198 334 139 144 -77 128 59 -82 -221 -168 16 -147 94 21 -38
4548 -38 210 46 -43 59 77 62 198 55 144 115 110 151 -54 99 30 -264 -31 -91 138 166 -55 -40 28 -198 80
4573H0r7O7K5j00M38o61L76l47K57L9j26J3JJ02J25j64J48n68K37K94l0m68L54
4596ej62P6n2Q1J60n6J02J08o7j59K9n2j58K16k36M71o2j08OQ9j6K2j93J58j45
4621D7K26j13o2n0k3J05r2L1j99R0j2J5N0m24K46K2o9K40K9j39j74M61j89J00
4645A16l58J83J6nn7J89k14R7j0k14J61L02k96j70K29ml9R7j29O1j09J12l3J68
4669I3l09Q7m4r5J75n7J86M3r2J48j76M1k63n4L98j17R1q1O9j16o3J43J8k0q0
4694g5J01M5j81o9Q0Q3K63r7l69J13J13J87k55K27j60O8j6r2j82K59J1m29K19
4717a56K72P8k53J34m0J7Q2J82l53k4k50L65k10J02O3K6Pk3m5K5J00j18N9j98
4741a58KJ87n5j96J84q4l7J89j16K03q5j47J91j12N2P0j64k51O4L55m08M73o5
$$ plain form
4573 80 -17 50 75 -25 413 -248 128 -219 38 77 -49 -36 -35 67 192 28 176 -392 -155 139 109 -359 -5
4596 -5 -167 -91 -143 -62 98 42 144 252 185 26 55 3 -155 61 -175 296 234 126 132 221 205 227 34 192 47
4621 47 273 160 98 48 25 130 38 69 -130 -40 -52 -37 13 -411 -165 -143 -212 28 57 -82 -256 205 16 116
4645 116 -242 -59 -43 -48 -105 84 -130 -33 -43 -257 -96 206 -90 -260 -31 -35 -74 23 -106 -45 -154 -42 -75 93
4669 93 -216 -129 -173 -268 -93 -150 36 79 -13 135 -41 0 -263 -317 81 -36 55 -26 43 -73 -136 7 25 5 -75
4694 -75 26 71 -110 -179 -99 -16 247 150 -219 -106 7 194 -61 166 6 74 58 -34 -216 43 54 -375 -156
4717 -156 116 194 -59 75 35 52 134 316 -37 -61 -311 54 -156 -54 9 35 42 19 -26 -1 99 -19 40 -158
4741 -158 -156 31 -24 -220 -36 -120 -157 32 -84 119 34 -113 78 -34 18 88 -76 -327 -263 92 -316 157 92
4764I2k09K77l32j3L03k5K4q3K52l32O2l2j54j7L0L65j44l5lJ18j44L9k4j55j
4789a41L06m6l12K15M5K9j26J75n9k5J64m27R9J41j08j81K51N2k7L9j30K8M0M9
4813E1j95K37j24J09l1q0k8M2P3j1KQJ02l42L70j26k14L34k54Q4o8J14k37L28
4837A44j33l4J07l63K92rJ5j97K27M7J12j24j71P7J55j46m3j32K20J35r8K14k52
4860D3N8j95l6K18r5K5l3P9J42M5l47M9j30K29k58j6J72K33k62m8J11L8k95L62
4884H9j42J15j77L8K00j51l0k28J14K73j53O3L9k5L7j55M0j30J39j1L8j14J80
4907D9J56p3p3j07L12j59k36L1K39l24l3L99o9k33O0K35k83J42P9j71M8j73K84
4930A00J9j47J74J3j59l95O14k18j67j26K72J51j75K10L0j26m9Q5N7k5k13k1J21
$$ plain form
4764 92 -117 160 -172 -185 118 93 117 34 286 -46 16 -16 -170 -187 -157 208 64 29 26 144 0 39 15 -140 -141
4789 -141 165 119 -193 22 67 96 -30 145 86 61 225 -202 -103 38 -70 -251 0 52 25 64 -66 -38 2 51
4813 51 -144 93 -31 78 47 -33 -61 -19 54 43 45 53 155 -187 183 57 -157 177 -77 7 -61 53 -184 144
4837 144 11 -23 84 -279 13 4 19 -178 49 96 208 84 -87 -10 145 -1 -44 -176 44 179 81 295 43
4860 43 101 -94 -130 88 -7 18 -15 64 206 251 -96 -47 -177 52 -206 -222 -50 183 -79 -127 -16 22 -273 89
4884 89 -53 62 -115 -77 123 -28 -58 -286 -172 101 -52 11 50 25 62 -93 -53 -183 -44 -55 -17 -131 49
4907 49 205 132 59 -48 264 105 -131 -100 139 -185 -218 181 112 -121 -61 174 -109 33 112 -59 -11 -184 100
4930 100 119 -28 146 159 0 -395 219 1 -166 -292 -20 131 -44 166 196 70 21 106 163 138 -75 -96 25
4953B5O0j31K40l01K08j73Q0pj3J7pp3P9o2K28k96J48j9l54M29j75K52n3k81q1
4978b60J83J46K3R0k87j18M27j38J58j69nj55k9N3K4P8J37l91J28o8j79L74j99
5001a77K1L16j76k47L97k4l45K40j36J53P2J10j06n5O8j52J18j80J70M1j63M4
5023a1n9j24K2L38j92j24J14o1J87j66O2j48l2J72L91l03m9j05L2P4j80L27j98
5046c3r8M83m52P6r4J84N5q3j36K36j22o4K27m45L15k47J23L11l1k05Q0j06L24
5069B98r9k66M1K7K20m9k02RK7j37k9J98l7l93M10l2K04k49n8L10j50p9n8R5M2
5094D3l31L98L6l36J35L1k5J79J3m67J66K32N0k79J57M2k01J19K32k96J50o1j40
5117a53K03k2k3J3N6j96J33j24O5o3n3J57J47lk24L20k99j16j79M45j52K78j32
$$ plain form
4953 25 85 -46 194 -107 101 -72 8 1 -12 5 -2 -75 4 -58 170 -126 22 3 -351 78 -97 155 102 -179 -260
4978 -260 -77 69 92 182 -105 -223 204 66 224 55 50 -105 -134 -81 -57 21 158 -233 -105 -173 -352 22 -177
5001 -177 -156 160 -16 -263 134 110 -235 5 -131 22 94 204 98 43 111 -41 77 -103 67 108 -55 -11
5023 -11 -70 -194 -172 166 -26 -150 -36 -97 90 -76 -14 -162 -194 -22 369 66 17 -88 -56 18 -162 165 -33
5046 -33 -131 352 -100 -24 -118 66 121 38 -98 138 16 -48 179 -266 49 -198 -75 236 205 0 80 -26 298
5069 298 199 -67 -26 1 221 172 -30 -21 6 -131 -160 38 1 -392 18 -14 190 -59 -117 193 43 -36 -94 1 43
5094 43 -288 110 146 -190 -55 -24 -49 130 143 -324 -158 74 124 -155 2 44 -157 -38 194 -102 48 -13 -153
5117 -153 50 28 5 18 74 -122 11 -113 -48 -111 -164 -7 140 137 -87 233 -66 -182 -361 84 -68 210 78
5140G8k62J56L50k43p1j46L14k74K18k13j3K34m3k17K28Rj5r0K13r5p5J56j61
5163C8M2n3P8m1K22k39L1j01J09O5K0k26J40q9L0r3r6M8L24k07n6J88j6R7j53
5188F2j11j54Q8K14k55K17r5J37j42k64M65k45K29q7m4p5l0J36j95K39k5K2j81
5211i4R3j49L88j92J91l86J81k5k25M83o1k21n8K25q5L5j83J48L1Q9l1l57N9n4
5235a98J97j13J93J70Jj57K8j84L88l63J74k41K2N7J29n6j3o7q7O7mj45K24K5
5259D7j61J51k3k88L96L9l16M73j08j22p2L90m68Q0pm7k8O2j99K69m0Q9q2j0k8
5284cK00j74r2L40l29q0j07K40j13om1K68olq1LL1j11J00q9L26j58j84K05r8m1
5310cJ78k20J72n42L13J77n6m7J67o3O0j12k1k95J28K73j17j08j13K17k02M07
$$ plain form
5140 78 -184 -28 322 79 8 -138 176 -98 120 -93 -106 128 85 -132 96 105 90 0 213 118 43 199 38
5163 38 80 27 105 64 286 47 78 -23 86 151 171 -55 85 -4 26 -67 -163 -115 209 2 -54 134 118 215 62
5188 62 -49 -203 -115 99 -156 61 -34 103 -39 -303 162 -83 146 59 15 -60 -90 46 -149 90 65 87 -94
5211 -94 -1 -150 238 46 237 -149 32 7 -218 265 204 -17 -75 150 65 100 -83 65 96 185 154 -203 -144 -198
5235 -198 -1 -114 79 249 250 93 121 -63 325 -38 136 -105 -83 -26 103 47 34 -33 -120 -53 -57 -202 22 47
5259 47 -114 37 14 -274 122 161 -155 318 210 88 16 406 -62 18 11 -36 -64 -2 -201 68 28 117 35 25 -3
5284 -3 197 23 -69 271 -58 -138 -245 -5 -118 -124 -165 103 97 94 13 16 47 -64 36 -53 273 115 -69 136 38 -3
5310 -3 175 -45 127 -415 -102 75 19 -28 139 76 136 24 3 -292 -164 109 -8 -116 -229 -12 -214 193
5332A93k36J30p7q3j17J35K87k64q2Q3J45m3j6M2j2J1O3l39J60K20k00q4J71q1
5356FM6j24M3P1q0l3j02J26J33J7j20n7M11l38j9J1O1RM7l07J2J2J4K97r2M2p
5383G9j08J26P9j25K1j06N3L3J3k34L04j88J25k39K52J81k83J1j53J70k59J86
5405f2j88N4K27N9j40K2k09K70j37J84l00Q0L4J32o5O4O4j84K7q3Q9J81q8J2J69
5430B12k26k9q7M2Q1j13k06K94m5J26NR0r7k4nL9J04j01k04j1P3N8n2R3L9q3J2
5457a5M5j8j43o4J62k26J97J5L3o1J60j05l48L63J05o7N4p7k3P3k77J70J80j05
5481B8n8O0k99J87j36K51r1K04j49j9K5L2O0L1k77m3K68j23J81o5O7m9K5N6j50
5506A6J17o0K20k37k9j77L42j58mj38J35m7M8p8K5K4K3J18j75j56K43k05O6M3
$$ plain form
5332 193 -43 87 10 -73 -190 -55 232 -32 -114 -31 114 71 55 97 85 96 159 -180 -20 200 0 -84 87 6
5356 6 52 -72 -29 42 -38 -71 -173 -47 86 103 -17 -74 337 -1 -20 -9 52 61 108 -199 -187 -175 -161 136 44 86 79
5383 79 -29 97 176 51 72 -34 19 52 65 -169 135 -53 72 -167 85 266 -17 -6 -159 11 -248 -62
5405 -62 -250 -196 31 90 -50 -28 -237 33 -104 80 -220 -140 -106 26 -39 25 89 -95 -68 -151 -62 119 31 43 212
5430 212 -14 -43 -130 -88 -7 -120 -326 -32 -77 49 54 144 47 23 18 57 161 60 -144 -155 -82 -24 -76 17 56 -27 -15
5457 -15 30 12 -131 -195 -33 -259 -62 -47 -14 -75 85 -20 -368 -5 100 33 87 10 -13 60 -217 -47 133 28
5481 28 -30 30 -269 -82 -218 33 -58 146 -3 -22 3 35 95 126 -151 -194 74 -49 132 67 134 85 110 166 16
5506 16 133 73 293 56 27 -150 192 34 30 -108 27 -20 28 -50 -25 -1 22 140 -35 -191 52 -153 -87 -44
5530d4m8Q5Q4p7n8l52N02j42O0o5K3N2J16k71K37j81J1L16k01j11K34j15Nj1n2
5555ck52K52J75J32m20k90L52j47K97j49P1j7j25L09j04k67J76J24j52K20j48
5576C4j32P7k9k0L2L16j94P1j31k8o8J39O2Kk06J91k5j85J73k8J82j72j46O5Q5
5601F5l09K29J75l49J64O2m6r5K04K2j57m8J7k4K96l29K28j01L6n5k45K05P8M4
5625F7n6K08m8n0k66K50k52J34j2j09L58j83n0J03M6m54L28j09L2J82j46J61k23
5648h9K54m25J67J11j64J23Q2N0O9j64K5j89j17L25J8j19K30l06J36j2J02j57
5670e0k84K42j69K11j16J76M3p9J17j71J36m9R2k76L1K79j28J28l1r1m9J60j20
5693BJ88o9j64M9o4L8k33K12j6J6j12J81Jk33L47j10J51j45K20l37K85k06J58
$$ plain form
5530 -44 -92 -7 77 0 -58 -410 92 -50 10 -55 -32 20 136 -135 102 -79 -68 248 47 -64 170 55 60 49 -3
5555 -3 -255 -3 172 304 -116 -406 -54 -201 96 -53 18 1 -124 185 81 -186 -10 114 -38 182 34
5576 34 -98 -21 -50 -70 -38 278 84 155 24 -4 -72 67 129 131 -75 116 91 -94 79 51 233 61 -85 -20 65
5601 65 -244 -15 160 -189 -25 37 -9 -104 100 122 -35 -83 -66 -90 206 -123 105 4 40 -15 -260 -55 23 67
5625 67 11 219 171 121 -145 105 -147 -13 -25 -134 224 41 -9 94 140 -314 14 -95 -63 119 -27 134 -89
5648 -89 165 -260 -93 18 -146 -23 59 109 178 14 39 -150 -267 58 76 -43 187 -119 17 5 107 -50
5670 -50 -334 -92 -261 -50 -166 10 53 -26 91 -80 56 7 99 -177 -146 133 5 133 102 11 -38 122 2
5693 2 190 121 -43 6 -58 -20 -253 -41 -57 -41 -153 28 29 -204 143 33 184 39 259 -78 207 1 159
5716A59m46K03j0N7L89l16j23L9L32l31q6J43K4L8l0Oj63Q2j61R2j14J17P4OJ84
5741A65l60K62l9j41K1j03M62j77l18L21L0j32M7j20M2k9J36k15M0J28l9J97p
5764A71k12M7Mn6K18R9k94j65J77J58j43K5k83J31L16l10j7K65k53J1j84J38K2
5787a35J52j99L8o3L11lM5N6j68k22K10J06rL9k15R6j18j06J91K6K01K1k49K13
5811B18j21m35N00j32K20k70K40l24Q6J06n2k26J21J80k09L36k87j25Q4l5J12
5832a3L0J06k5Pm4r4N0p3Q2m8j1k32K43K21m70J54R8j26J74m0K24l38L16l08o1
5857a78K40n3j13M16m26j01N85k58j9j27m9ON9k12L10Q4k18JO0j57N5N2N8R6k29
5882a18r7m9K78k43M88l27j2J89m9J47j20l4O0l07Q0K55p5j92O7q4K74k50q4M71
$$ plain form
5716 159 -287 -84 -94 -37 352 36 -87 -48 284 -47 -133 10 34 72 42 48 -115 -33 -194 -102 -216 -99 -25 -19 165
5741 165 -195 67 28 -113 -92 -195 267 90 -228 93 123 -9 38 -82 -40 -69 67 -148 -108 20 -19 178 171
5764 171 -41 6 10 -46 172 271 -23 -188 -11 147 4 29 -254 -123 193 -117 -134 131 -122 -111 -295 -157 -135
5787 -135 17 -182 -144 -207 104 101 146 202 34 -188 22 128 119 158 -57 39 -79 -185 6 32 233 254 5 218
5811 218 97 -338 162 30 250 -20 220 -104 -18 88 36 -190 -69 111 -98 238 -49 -174 -90 -125 -13
5832 -13 17 123 98 105 61 -33 17 -56 26 -22 -33 -265 -22 199 -271 -117 -19 -145 29 -11 213 -125 191 -117 -178
5857 -178 62 9 -104 312 -114 -215 370 112 93 -34 -83 -77 -18 -230 80 164 -54 -53 7 -150 -95 -43 15 111 -118
5882 -118 -215 -264 14 -229 259 -68 -80 109 60 207 87 53 113 -194 -114 141 66 -126 -59 -143 131 -119 -203 268
5906B68o28J61KK36M5m8p8J88j06m1o7o7J08m8P1K24k16k00N5L14m8j10m0j66
5930a91L34l26K89j67J26k17M1L16j39o6J75j69K26j01l5j2l16K96r6J17N4Q5
5952B24l23L82j32m6L16l86k26J1P2J29KQ5q3q6l0N4l2k48O30j86l20K00J08M4
5976A59j9K7j72j2Q2j21j25j5L60k72O5j04J45p7L22j53K14m60K51K6k18J83l77
5999b91K44Mo5J3K12j80q6J43L51m06J09n9N2m5J88k06j28M76l25l3J54n0Mj29
6023e3m2J81k09l4J80L9j0j01P8j51K0K86m69K98j02K15K3R1m05J76o4J2L6r9
$$ plain form
5906 268 -360 -199 -197 39 84 36 -42 146 40 -1 -68 -135 -27 -75 -4 220 4 -196 -141 173 125 15 -25 -191
5930 -191 143 -183 106 -61 65 -152 -111 205 66 0 175 6 232 131 96 84 -232 64 -32 85 139 224
5952 224 -99 283 151 105 421 35 -191 -180 -108 21 23 108 25 -61 -91 -37 -69 -317 313 127 -193 7 115 159
5976 159 140 167 -5 -17 65 -56 -181 -196 164 -108 -43 -147 -2 -79 243 90 304 -156 95 121 -97 86 -291
5999 -291 -47 -43 -108 -95 117 -63 -149 -6 345 -61 48 -11 41 -4 184 -22 -150 326 1 -32 122 72 76 -53
6023 -53 -95 86 -123 -157 23 62 52 -49 29 -122 -102 184 -285 13 -89 126 149 240 -165 11 -53 -41 -5 -104
$$ [...]
8191H0
##END NTUPLES=NMR FID
##END=
