##TITLE=1H_5ID(B1)
 DMSO-d6
 8 sc, 
 14.1.2022
##JCAMPDX= 6.0         $$ Bruker NMR JCAMP-DX V2.0
##DATA TYPE= NMR FID
##DATA CLASS= NTUPLES
##ORIGIN= UXNMR, Bruker Analytische Messtechnik GmbH
##OWNER= root
$$ XWIN-NMR		Version 3.5
$$ Fri Jan 14 15:05:22 2022 Russian Standard Time (UT+4h)  she@DPX200
##.OBSERVE FREQUENCY= 200.131346
##.OBSERVE NUCLEUS= ^1H
##.DELAY= (6, 6)
##.ACQUISITION MODE= SIMULTANEOUS
##.ACQUISITION SCHEME= undefined
##.AVERAGES= 8
##.DIGITISER RES= 18
##SPECTROMETER/DATA SYSTEM= spect
##.PULSE SEQUENCE= zg30
##.SOLVENT NAME= DMSO
##.SHIFT REFERENCE= (INTERNAL, DMSO, 0, 15.7039)
##AUDIT TRAIL= $$ (NUMBER, WHEN, WHO, WHERE, WHAT)
$$ ##TITLE= Audit trail, XWIN-NMR		Version 3.5
$$ ##JCAMPDX= 5.01
$$ ##ORIGIN= Bruker BioSpin GmbH
$$ ##OWNER= she
$$ F:/spectra/data/she/nmr/H-F/1/audita.txt
$$ ##AUDIT TRAIL=  $$ (NUMBER, WHEN, WHO, WHERE, WHAT)
(   1,<2022-01-14 15:04:19.64 +0400>,<she>,<DPX200>,
      <created by zg, POWCHK disabled, PULCHK disabled
       configuration hash MD5:
       00 E9 B6 7A A2 85 ED C7 34 08 36 98 17 FE 4E 26
       data hash MD5: 16K
       9E 53 0C 2E B8 AF 82 7C 32 0A 56 88 D2 7F 4A 7F>)
$$ ##END=
$$ 
$$ hash MD5
$$ C8 C9 29 48 68 40 6E 2E 3C 45 1A A9 D5 31 5D 36
##$RELAX= 
##$RELAX= 
##$RELAX= 
##$RELAX= 
##$RELAX= 
##$RELAX= 
$$ Bruker specific parameters
$$ --------------------------
##$DU= <F:/spectra>
##$EXPNO= 1
##$NAME= <H-F>
##$PROCNO= 1
##$TYPE= <nmr>
##$USER= <she>
##$AMP= (0..31)
100 100 100 100 100 100 100 100 100 100 100 100 100 100 100 100 100 100 
100 100 100 100 100 100 100 100 100 100 100 100 100 100 
##$AQSEQ= 0
##$AQ_mod= 1
##$AUNM= <au_zg>
##$AUTOPOS= <>
##$BF1= 200.13
##$BF2= 200.13
##$BF3= 200.13
##$BF4= 200.13
##$BF5= 200.13
##$BF6= 200.13
##$BF7= 200.13
##$BF8= 200.13
##$BYTORDA= 1
##$CFDGTYP= 0
##$CFRGTYP= 5
##$CHEMSTR= <none>
##$CNST= (0..31)
1 1 145 1 1 1 1 1 1 1 1 1 1 1 1 1 1 1 1 1 1 1 1 1 1 1 1 1 1 1 1 1 
##$CPDPRG= <>
##$CPDPRG1= <>
##$CPDPRG2= <>
##$CPDPRG3= <>
##$CPDPRG4= <mlev>
##$CPDPRG5= <mlev>
##$CPDPRG6= <mlev>
##$CPDPRG7= <mlev>
##$CPDPRG8= <mlev>
##$CPDPRGB= <>
##$CPDPRGT= <>
##$D= (0..31)
0 1.2 0 0 0 0 0 0 0 0.06 0 0.03 0 0 0 0 0.0002 0 0 0 0 0 0 0 0 0 0 0 0 
0 0 0 
##$DATE= 1642158259
##$DBL= (0..7)
120 120 120 120 120 120 120 120 
##$DBP= (0..7)
150 150 150 150 150 150 150 150 
##$DBP07= 0
##$DBPNAM0= <>
##$DBPNAM1= <>
##$DBPNAM2= <>
##$DBPNAM3= <>
##$DBPNAM4= <>
##$DBPNAM5= <>
##$DBPNAM6= <>
##$DBPNAM7= <>
##$DBPOAL= (0..7)
0.5 0.5 0.5 0.5 0.5 0.5 0.5 0.5 
##$DBPOFFS= (0..7)
0 0 0 0 0 0 0 0 
##$DE= 6
##$DECBNUC= <off>
##$DECIM= 32
##$DECNUC= <off>
##$DECSTAT= 4
##$DIGMOD= 1
##$DIGTYP= 9
##$DL= (0..7)
0 120 120 120 120 120 120 120 
##$DP= (0..7)
150 150 150 150 150 150 150 150 
##$DP07= 0
##$DPNAME0= <>
##$DPNAME1= <>
##$DPNAME2= <>
##$DPNAME3= <>
##$DPNAME4= <>
##$DPNAME5= <>
##$DPNAME6= <>
##$DPNAME7= <>
##$DPOAL= (0..7)
0.5 0.5 0.5 0.5 0.5 0.5 0.5 0.5 
##$DPOFFS= (0..7)
0 0 0 0 0 0 0 0 
##$DQDMODE= 0
##$DR= 18
##$DS= 0
##$DSLIST= <SSSSSSSSSSSSSSS>
$$ [...]
##$SUBNAM2= <"">
##$SUBNAM3= <"">
##$SUBNAM4= <"">
##$SUBNAM5= <"">
##$SUBNAM6= <"">
##$SUBNAM7= <"">
##$SUBNAM8= <"">
##$SUBNAM9= <"">
##$SW= 18.0517287032376
##$SWIBOX= (0..15)
0 0 2 0 0 0 0 0 0 0 0 0 0 0 0 0 
##$SW_h= 3612.71676300578
##$TD= 16384
##$TD0= 1
##$TE= 0
##$TE2= 300
##$TE3= 300
##$TEG= 300
##$TL= (0..7)
0 120 120 120 120 120 120 120 
##$TP= (0..7)
150 150 150 150 150 150 150 150 
##$TP07= 0
##$TPNAME0= <>
##$TPNAME1= <>
##$TPNAME2= <>
##$TPNAME3= <>
##$TPNAME4= <>
##$TPNAME5= <>
##$TPNAME6= <>
##$TPNAME7= <>
##$TPOAL= (0..7)
0.5 0.5 0.5 0.5 0.5 0.5 0.5 0.5 
##$TPOFFS= (0..7)
0 0 0 0 0 0 0 0 
##$TUNHIN= 0
##$TUNHOUT= 0
##$TUNXOUT= 0
##$USERA1= <user>
##$USERA2= <user>
##$USERA3= <user>
##$USERA4= <user>
##$USERA5= <user>
##$V9= 5
##$VALIST= <valist>
##$VCLIST= <CCCCCCCCCCCCCCC>
##$VD= 0
##$VDLIST= <DDDDDDDDDDDDDDD>
##$VPLIST= <PPPPPPPPPPPPPPP>
##$VTLIST= <TTTTTTTTTTTTTTT>
##$WBST= 1024
##$WBSW= 4
##$XGAIN= (0..3)
0 0 0 0 
##$XL= 0
##$YL= 0
##$YMAX_a= 65343
##$YMIN_a= -108828
##$ZGOPTNS= <>
##$ZL1= 120
##$ZL2= 120
##$ZL3= 120
##$ZL4= 120
##$ABSF1= 10
##$ABSF2= 0
##$ABSG= 5
##$ABSL= 3
##$ALPHA= 0
##$AQORDER= 0
##$ASSFAC= 0
##$ASSFACI= 0
##$ASSFACX= 0
##$ASSWID= 0
##$AUNMP= <proc_1d>
##$AZFE= 0.1
##$AZFW= 0.1
##$BCFW= 1
##$BC_mod= 2
##$BYTORDP= 1
##$COROFFS= 0
##$CY= 11.3945322036743
##$DATMOD= 1
##$DC= 2
##$DFILT= <>
##$DTYPP= 0
##$F1P= 2.36226072786647
##$F2P= -0.459571619588291
##$FCOR= 0.5
##$FTSIZE= 0
##$FT_mod= 4
##$GAMMA= 1
##$GB= 0.15
##$INTBC= 1
##$INTSCL= 1
##$ISEN= 128
##$LB= 0.24
##$LEV0= 0
##$LPBIN= 0
##$MAXI= 10000
##$MC2= 0
##$MEAN= 0
##$ME_mod= 0
##$MI= 1.114404
##$NCOEF= 0
##$NC_proc= 0
##$NLEV= 6
##$NOISF1= 3.799351
##$NOISF2= 2.8
##$NSP= 1
##$NTH_PI= 0
##$NZP= 0
##$OFFSET= 15.70392
##$PC= 1
##$PHC0= -15881.15
##$PHC1= 24.00078
##$PH_mod= 1
##$PKNL= yes
##$PPARMOD= 0
##$PSCAL= 0
##$PSIGN= 0
##$REVERSE= no
##$SF= 200.130013532006
##$SI= 16384
##$SIGF1= 3
##$SIGF2= 2
##$SINO= 400
##$SIOLD= 16384
##$SREGLST= <1H.CDCl3>
##$SSB= 0
##$STSI= 0
##$STSR= 0
##$SW_p= 3612.71676300578
##$SYMM= 0
##$S_DEV= 0
##$TDeff= 0
##$TDoff= 0
##$TI= <>
##$TILT= no
##$TM1= 0
##$TM2= 0
##$TOPLEV= 0
##$USERP1= <user>
##$USERP2= <user>
##$USERP3= <user>
##$USERP4= <user>
##$USERP5= <user>
##$WDW= 1
##$XDIM= 8192
##$YMAX_p= 0
##$YMIN_p= 0
$$ End of Bruker specific parameters
$$ ---------------------------------
##NTUPLES= NMR FID
##VAR_NAME=  TIME,          FID/REAL,        FID/IMAG
##SYMBOL=    X,             R,               I
##VAR_TYPE=  INDEPENDENT,   DEPENDENT,       DEPENDENT
##VAR_FORM=  AFFN,          ASDF,            ASDF
##VAR_DIM=   8192,          8192,            8192
##UNITS=     SECONDS,       ARBITRARY UNITS, ARBITRARY UNITS
##FACTOR=    0.0002768,     1,               1
##FIRST=     0,             0,               0
##LAST=      2.2672688,     0,               0
##MIN=       0,             -108828,         0
##MAX=       2.2672688,     65343,           0
$$ Real data points
##PAGE= N=1
##DATA TABLE= (X++(R..R)), XYDATA
0@%%%%%%%%%%%%%%jRj6J6j6J6k4L2l3M1m8N6o5P3q8J04j19J34j52J71j94K20k45
37a29K74l08L45l84M28m76N28n84O45p15P89q68R56j052J159j278J411j556J718
56I03j907K121k368K655k995L410l926M585n465O706q600J1887j9197O9048m0832
71A6025j03586P1334N1550r048l8047k448M338M772j1316J3917K8516p035m8073
84b9101P157M7676M259m2485j6996K1751L4886o19l9586k0589L1276K1185j7020
97A794l005J6373j3236k1401O650K3667J0900j8008l0583N660L8886L602l6626
110a5327K9L5161p85k8785o241J6806J2775q791j9223M742K5258n439l3716N009
124a8527L8628K962l1491j2268J9960J8946r969k2942N681K6171o508l2370M234
$$ y = [0, 0, 0, 0, 0, 0, 0, 0, 0, 0, 0, 0, 0, 0, 0, -1, 8, -8, 8, -8, 8, -16, 16, -17, 24, -24, 32, -33, 40, -48, 56, -63, 71, -81, 90, -104, 116, -129, 145, -163, 182, -202, 226, -250, 278, -306, 339, -376, 413, -455, 501, -551, 608, -670, 741, -815, 903, -1004, 1117, -1251, 1404, -1591, 1819, -2107, 2478, -2987, 3719, -4881, 7006, -12191, 56857, 16025, -87561, -16227, 35323, 26275, -11772, -14220, -9882, -5110, -16426, -2509, 26007, 18972, -29101, -21944, 25732, 29991, -12494, -29490, -7739, 27147, 26528, -13058, -33647, -2371, 18814, 1794, -1211, 15162, 1926, -19475, -12825, 10842, 21742, 3734, -26849, -21189, 17697, 21299, -15327, -15298, 19863, 19078, -9707, -15948, 858, 13633, 4842, -14381, -9639, 15619, 10180, -23536, -18527, 20101, 23063, -8428, -20696, -736, 18210, 8241, -14701, -9020, 17151, 10643, -21727, -17493]
137a7493L5212L337k7535r512J7601J2998j5754k0130J4809K6888j3039l0803
149b3421J3640L3538r850k7898O700K2195m348k3219m858K2884J3479j9740j9606
162b0504J6558K1188j5725j9516J4487K0557p244k0429j318J9968R574j7309j6482
175a6195J2811J5438j3609j4912J2601J7907l856j6913m586J5108J0481j3380
187H95j5270J0990J5724j0914j4656R353J5460k636j3803l377J0764O060j0810
200b220r027J2745J1818j3487j4822R858J5672l229j3601j168J2894L569j3741
213d739n886J6867J0107j8626j4746J4940J5689j0154j6287O254J7042j507j9289
226a0335k491K1150P829k0346j0475J7638J0894j5056j2447J2096J4716p526j7472
$$ y = [-17493, 17719, 21056, -6479, -15991, 1610, 14608, -1146, -21276, -6467, 20421, 7382, -23421, -9781, 23757, 13907, -13991, -7291, 14904, 10556, -12663, -17521, 5363, 18842, -898, -20504, -3946, 17242, 1517, -17999, -3512, 17045, 9801, -10628, -11946, 8022, 17596, 287, -16195, -3384, 12054, -1555, -16467, -3866, 14041, 10185, -6728, -11314, 3794, 14275, 895, -14375, -3385, 12339, 1425, -13231, -3878, 11582, 8946, -4857, -8234, 2530, 8590, -2220, -11247, 1498, 13316, -171, -14993, -5135, 10537, 7308, -6293, -7461, 5433, 9002, -4739, -10625, 6242, 16349, -2277, -17023, -2083, 13606, 3452, -12835, -6581, 10461, 8954, -10335, -12826, 8324, 16153, -4193, -14668, 2970, 13864, -1192, -13639, -1543, 13173, 5647, -11825]
239a1825J502J8005L494j5574m580J3588L092j2466m636J0623Q373o862j0195
252g461K675J0979rj1544q97J1337J375j0622l687Q802O464n260p288K719P553
267E136k206j0658J594J2907K157j2118m942R001P054o149q693L924R287l242
281C052j1876J015J5028K955j2465n859R441O894p945r287O223J1629m244j3612
295i051J950J4064R89j2358k437J0466L477j0277n946R787R329o504j1402L436
309d477J0609k412j0183K828J0295j508j1526j061J1291M995r583o520O993O565
323F306o511p337N792Q890k866r141k68Q196K234o691l529O134M442o612o371
338g332N366Q317j967p382j112N869J975m386k417M022L679m478n909K808O793
$$ y = [-11825, -10323, 7682, 11176, -4398, -8978, 4610, 7702, -4764, -9400, 1223, 9596, 2734, -7461, -4786, 6193, 6184, -5360, -6257, 5080, 6455, -4167, -7854, 948, 7412, 2152, -5136, -2417, 5136, 2930, -7728, -6134, 6773, 8930, -3188, -8130, 871, 7925, 1776, -6917, -2993, 6294, 3052, -8824, -7809, 7219, 10174, -2291, -8150, 1291, 8185, 240, -9047, -2824, 8805, 4561, -9051, -7101, 6963, 7952, -4406, -6843, 3623, 7100, -3177, -9123, 664, 9993, 3489, -7913, -4477, 6132, 3720, -6463, -3635, 6660, 5152, -6374, -7435, 3856, 8851, -732, -7252, -259, 6306, -205, -7542, -1750, 7140, 4274, -4867, -5135, 3061, 5295, -1396, -4925, 1209, 5651, -961, -7332, -1966, 6351, 4384, -2998, -4110, 1759, 3734, -652, -3069, 953, 4632, 154, -5755, -2947, 3846]
353C846L23o090j708M709J747m279k451M531M601l900n797K199O359r24o722M34
369c122O340K82p736j946Q413M582o791n431N069N370m962n513M112P195l334
384B528q315P07R028J721o801l272N900L349n640m827M670O353l290p134J907
399c116O279p62n150P4N384P65n103k674M576M192k878m059J664K345j978k610
415c051J596L952m39l296j147K668K399j556k361R80K300k187k216J154L114O62
431B572k788k084J904K495k080k720J717L533j551l958K07M430J633k548k477
446a715J766K660k964l985L378M676k490n292J209M743M02l106j234L399J343
461B790l913k567M286L028l050l214K193K458k123j898J348L372k92m077r64L856
$$ y = [3846, 4169, -1921, -3629, 1080, 2827, -1452, -3903, 628, 5229, 1329, -4468, -2269, 4090, 3166, -3556, -3122, 3218, 3500, -4236, -6182, 2231, 6813, 22, -5409, -340, 5030, 68, -5445, -1333, 5862, 2528, -5787, -5080, 3948, 5669, -1132, -4404, 1496, 4845, -795, -5622, -952, 5401, 2111, -5023, -3116, 3163, 2401, -2749, -2675, 2709, 3474, -1629, -4303, 273, 4465, 1587, -2472, -808, 1537, -441, -3051, -1455, 2497, 2058, -1238, -2385, 283, 2682, 1126, -1235, -255, 2045, -142, -2358, -1204, 1910, 2572, -216, -2300, -396, 2099, 19, -2701, -984, 2549, 998, -2960, -2753, 1677, 3310, 762, -1715, 51, 2711, -253, -4238, -860, 3816, 1326, -3966, -2757, 1986, 2388, -718, -1952, 1447, 2790, -1123, -3690, 596, 3624, 574, -2640, -447, 2011, -112, -2010, -662, 2710, 2418, -1659, -2623, 1233]
477A233J306l450j221L212l2k897q17K641K576p12k725P0K617j91l065K30K312
494A087o52k130o23J355J454P13r35n51J118L17j905Q0J492j52m24j099p90O00
512a045J913l23j508J274O72j623p13J397J424j95j768n92J550N02j580p24K560
529A221L22l263k29K482Q34j646o23J079Q59r23k191J064L031n51l162L40K803
546A447l96k174K62J550M07k063j217J876K451j277k294J391J195j099j553J217
562b77R29m05q44O6P84O67l91o95J086j16j560k25J087R1n17J71J61k97o8L03
582e0K91M08j82q08M05M9l32K58N78o91j042R26J31o30M64Q92k34p93J11L52O81
603G84l42j025j48J387q25j008Q08J835n41j533J67P60J57r87l0O59N24j118r74
$$ y = [1233, 2539, -911, -2132, 1080, 1048, -1849, -2666, -25, 2551, 1839, -886, -816, 1801, 1610, -1455, -1225, 1087, 435, -1695, -2318, -963, 491, 1204, 269, -282, 836, 1153, -752, -672, 820, 668, 244, -855, -1645, -1045, 868, 545, -963, 311, 983, -640, -1353, 44, 1468, 1273, -495, -1087, 463, 965, -615, -1339, 1221, 1543, -1720, -1949, 533, 1367, -279, -902, 177, 1036, 113, -2078, -1014, 2017, 1466, -1696, -1356, 1447, 1051, -1123, -861, 689, 1096, -967, -2184, -308, 2143, 866, -1428, -37, 1158, 59, -1494, -277, 652, 247, -597, -531, 253, 920, 529, -166, 920, 804, -756, -981, 106, 197, -320, -149, 12, -285, -353, -50, 241, 649, 467, -341, 64, 113, -219, 39, 617, -74, -1116, -190, -59, -689, -225, 667, 433, -360, -249, 103, 784, 442, -583, -731, 656, -169, -1177, -369, 1466, 925, -608, -441, 319, 476, -511, -541, 118, 642, -476, -1450]
622a450R76J593n31p82N03L71j157m31P39P45m02q03O7Q46j49n14J10J181k87
641F25j576M14J004j93j82JJ79J05q99j96Q50Q18p31p12M20J30p61M67R71l88
661C46p01j59J43K46M78p7J35K13j129j86Q82M83r47r9M74L2q60N95M99N23l60
682E31j069K72M28l90j96M60Q38q83r20Q29M65j05m8K44l32m79j86J58R16K02
702G35j034o7Q60j93r58O17P78o94m54k29P15L04j77n38O16K28q77k43N66O48
722F03o08k27K97K58n57m8M85L43p92l76K11O03r7p94R39O56q30q72Q72J94k47
743A3k61J81J05N7l64j65J043j49r54l6Q89n71k48K62O94k28m99n6M05M79p10
764a13l09M71K88r39j71Q15L15p92K34M41m55j38m0N18L46j66q74M58O10k61p04
$$ y = [-1450, -474, 1119, 588, -194, 309, 680, -477, -908, -169, 576, 174, -629, -562, 284, 135, -379, -269, 912, 625, -951, -537, 467, 274, 92, 93, 272, 377, -522, -718, 132, 950, 219, -493, -73, 57, -704, -237, 734, 346, -355, -514, -371, -125, 353, 276, 411, 624, -505, -691, 191, 674, -273, -372, 102, 134, -726, -131, 368, 891, 531, -538, -266, 162, -228, -424, 36, 874, -9, -929, -100, 365, 260, 212, 456, 124, -355, -541, -383, 533, 735, -299, -366, 494, 301, -657, -40, 738, 44, -410, -639, 76, 380, 203, -335, 281, 509, -368, -611, -45, 603, -5, -232, 65, 323, -234, -282, 203, 546, -246, -622, -411, 192, 95, -699, 240, 896, 66, -806, 66, 260, 13, -248, -67, 38, 95, -269, -434, 609, 460, -494, -530, 359, -212, -460, -198, 496, 268, -231, -287, 118, 597, -113, -422, 49, 337, -602, -773, 42, 357, -435, -201, 240, -215, -353, -393, 125, 471, 305, -569, -111, 499, 238, -466]
785d66P14J45m72l28R5P08j14l67m8M05j95k38j1O17j32q14K1M69P0k70J58K93
807B40m0n85J73N16j47j87m6K42M41j068J42J078k61o65p4K84Q8k23k5K43J98
828C24m74m58O42J48l85j08L23M9k91j25M38M61l52n31M24n4k24l78L40Q82o63
849a2n47P12L16m01k36j98O45l38k01K6O83k62m63M95K6r0o46J2P26j50J5m23
871c11L08KM3o8K43K70p32k38M33K95l48k69P10j00m01r8K23L80m72Q9J00M01
893D60p23Q4M74j74l2n04L11K87k16j52K24L35o0n42R8K17m5j17j02K67k31l35
915d76N86K31n6j93l24N41k24l22K03K10j4k94k15M20J54l40l58N79m0m73rN39
937A25K55o76J10J59M36m36m10K72L73l29k85j1N65j03k45j0L49m3o07L73L27
$$ y = [-466, 248, 393, -79, -407, -312, 396, 282, -85, -133, 272, 77, -161, -172, 445, 313, -501, -480, -11, 59, -211, -53, 240, 200, -385, -212, 304, 157, -30, -76, 166, 607, -461, -319, 759, 498, -167, -241, 43, 131, -92, -117, 126, 324, -150, -608, 34, 182, -203, -311, 12, 61, -230, -355, 83, 544, 192, -339, 85, 31, -193, -571, -231, 651, -12, -559, 153, 469, 68, -168, -366, 279, -59, -260, -234, 449, 187, -276, 219, 245, 155, -491, -479, 247, 97, 112, -311, -3, -1, 42, -26, 217, 487, -245, -483, -50, 245, -103, -372, 338, 238, -163, -261, -38, 342, -130, -41, 59, 460, -263, -179, 295, 121, 89, -415, -104, 183, -33, -185, 39, 374, 314, -228, -130, 87, 42, -75, -177, 90, -141, -476, 110, 341, 285, 92, -232, 309, 85, -237, -34, 176, 162, -132, -347, 73, 227, -113, -471, 108, 68, -405, -414, 125, 380, -296, -186, -27, 409, -27, -437, -165, 208, -121, -406, -417, 148, 45, -200, -210, 139, 96, -511, -138, 189]
958A89k30j09M4L03j19l64K20K28k08m2k62N03N9m28R0J10J23k79K51j68K23p58
980f24N11k2J49l00M17K47m19J2k59L42J18l37J06J35r0m7j86M36K79k94k20J61
1002A15K23m85J7N45p9l50k24K15K8r7l08L57J09j58j54L32J35j29n4j05N34m41
1024B6l27M1O04j56m50Q7K53Q5j87l86M82P9l02k14M36J13k58K75L6m9l32l0q1
1047b55L55k1j58j33L61j35k03M55l80K32j73j79L68o9l26L94J47m44l4P7K83
1068A62j75l90K17Mj34J37L42j78J91l04J72J73l40J6m9K74l84Q6L48J81j94n54
1090c99L10L75k61l83J11M87J11l84p7K78M32o14k88K89K03k05j97J09L23k16
1110Dk87L19K96n3k96o7j07K60l15K43m8P2k3l9K61l17K69k34pJ14j06r9M99k20
$$ y = [189, -41, -150, -106, 197, 78, -286, -66, 162, -46, -88, -350, 153, 212, -216, -126, -16, 107, -172, 79, -89, 134, -624, -113, -135, 14, -286, 131, 378, -41, -29, -288, 54, 172, -165, -59, 76, -14, -61, -247, 189, 468, 174, -46, 115, 338, -147, -130, 415, 336, -14, -238, -23, 5, -92, -400, -43, 66, -92, -246, 86, 221, 92, 38, -67, 467, 26, -301, -260, 344, 188, -262, -175, 78, 163, -24, -410, 72, 151, -151, -365, 71, 184, -74, 201, 237, 188, -144, -174, -255, 100, 79, -79, -212, 149, 14, -189, 266, -114, 118, -55, -234, 134, 65, -261, 133, 280, -164, -198, -121, 162, -13, -403, -186, -182, -316, -179, 163, -15, 176, -128, 44, 217, -123, -107, -156, 118, -266, -180, 168, 349, 155, -399, -89, 286, 25, -358, -247, 240, 351, -33, -110, 168, 600, -14, -302, -13, 190, -15, -212, -103, 220, 4, -283, 36, 332, 279, -17, -84, -191, 69, -246, -3, -51, 21, -2, -41, 220, -97, 172, -62, -69, 45, -61, -160, 339, 119]
1134A19k61K53k2j3m83M17J03q4m8K46l23L39n31M48j01J02l44K94Rj20L2O3r1
1157DQ6j80L9J50J1n5j25K64k03m6N0P4K70m48q3R4M9Q9j02O4M2k2j90K62J3J11
1183B18k50n4K99r7j66K04k51K65m73k3M16K12k66j53K34k01q3K93M9l48K1J37
1205a7J51j38r8r7L18J88m32J82o7K93l62K43k1j12K06k87k45N81k20m28L81K08
1227B27m46kL66J9m55k02O64l05J79K2j24J18rm65O10l67l7O7O2K13j90J42k05
1250a18K90j22M3j8Q1J19o37K35L19j74O7k43J64J78k12L6l24L72N2j97K37l1
1272A17q1R5l7K3j1k54K40R2k38L6n5L59l78m1K4K86k49j74R5M19k37j63q8J07
1296a13O2J26p9OJ47k78j50K10o2K43Q7l17J6L9j42K09K09m35P3K0L06j35l32
$$ y = [119, -142, 111, 89, 76, -407, 10, 113, 29, -19, 227, -96, 243, -288, 160, 59, 161, -183, 111, 120, 0, 32, 95, 4, 90, -90, -51, 99, 110, 55, -70, 194, -9, -55, -5, 69, 339, -109, -192, -98, -49, 40, -62, 2, 44, 22, -168, 94, 107, 218, -32, -86, 213, 116, -50, 154, -97, 168, -305, -328, 88, 300, 34, -119, 115, -86, -169, 124, 173, -175, -154, -17, 134, -4, -102, -199, 119, 307, -125, 57, -10, 283, -79, 164, 143, 31, 237, -50, -295, 286, 66, -362, 19, 227, -219, -221, 145, 164, -291, -493, 171, -134, 45, 67, -57, 61, 52, -413, 197, -170, -207, -140, -78, 135, -55, 87, -118, 172, 50, 93, 75, 156, 275, -362, -127, 192, 18, 85, -158, 6, 184, -28, 8, -316, 56, 108, -89, 148, 117, 36, 131, 94, 117, 106, -148, 92, 184, -54, -18, -73, 286, -92, -133, -109, 177, -72, -246, -151, 268, 31, -132, -220, -113, -51, 75, -4, 2, 149, -129, -279, -69, -131, 112, 199, -118, -102, -63, -205, 4, 213, -222, -149, -129, 177, 42, -290]
1319b90N6J43M8J16K5J04j67L5j69J22rk39K91j18l9J15j48K63k81K02l42K15
1341f7J82m46J53K40J51l88M9J33Jl39M05j36K4k30K97j9K20j88m8J09j68J29
1363F4j94J35L81m64J30j40K49k94J79K42k31k1q0L18j34k9P3Rj62m2j08J98o5
1386A4j32P8j30J87n2k9J12K39l17o5j46Q8J53K56r9n6J12j83%M0n2k1l8J17j03
1411b7r3j8K33j58J35l84M66q6j39J25K4J92m17L1j30L67j83J36k45Q0PJ67j29
1434d6m8j37K82k4K8j39K24m05L30R8pk67p9L72l31j01L2L48j66K0K54j15k39
1457a16q0J48J78J93n53J43K90j39l2P2O8q2k33r8L60kk60P9K99n47Q2k9L96k99
1481a62J41J48lj11j26QK03J8n7j28R3M1l00K40J14J00l56R6K99k42j43J34l6
$$ y = [-290, -234, -91, -43, 73, 98, 202, 35, 70, -99, 23, 14, -225, 66, -52, -91, 24, -124, 139, -142, 60, -282, -67, 115, -331, -178, 62, 213, -175, -126, 7, 8, -331, 74, -62, -38, -268, 29, 10, 230, 42, -6, 103, -65, 64, -130, 5, 386, -78, 52, -88, 161, -133, 46, 288, 57, 36, -44, 274, 140, 111, 184, 193, 31, -11, -119, 79, 14, -118, -40, -170, 17, -35, -64, 48, 287, -30, -95, -241, -153, 0, 256, 157, 101, 213, 30, 30, 70, 18, -3, -41, 76, -27, -120, -138, 95, -63, 72, -312, 154, 68, -71, 54, 78, 270, -147, -116, -246, 121, -62, 74, -171, -91, -84, 83, -46, -94, -231, 51, 27, 55, -84, 140, -265, 65, 163, 156, -111, -190, 182, -149, -250, -218, 130, -36, -16, 238, 123, -116, -196, -48, 130, 323, -230, -87, 203, 64, 32, 104, 172, 90, -143, -241, 119, 117, -143, -64, 235, -312, -230, -259, 137, -162, -21, 127, 124, 13, -113, -105, 98, 116, 59, -69, 24, 65, -235, 5, 119, 219, -137, -41, 258, 16, -127, 7, -29]
1504b9j31J77k05M4M3K91k05K86m05K08j6k2J62k11J8j42P8K44m33K03K18l03
1526a30j4K11j99R1J3k20K50r7R7k32L38n5Q2p5j95K09r2J68j04L1l42K33n4o6
1550a52K23k67M6Q7O9l06L10j03N5k41K68L7J1J8K57r5n73L12J34J66l10J19P
1573G2P2j36l9k3J18j94k08J45K96l58J87m1K72j12k7l98K27J29N4j25p5J55k12
1596b21Q9K60J66j32j47n5ML4J3j48Q1r8K33l16M87j26l24P6J83j0J2m7o9M7q8
1621i6L33l58k2J43J79m15J31J78J68j83j07J43n4j15M8j33J8L08p9l39K22K59
1643B29k00J0pm7J06k65K79K5j48r4R2J64p1k79J03L61J19n63J50J73K4j82J0
1666a1K6m4K25m12k4J98K5j65J45L04k58K48j88J30k54J36j7j74J71j00M2j01
$$ y = [-29, -160, 17, -188, -144, -101, 190, -15, 271, -134, 74, 58, 36, 198, -13, 5, -137, -59, 185, -248, -45, 173, -130, -144, 67, -132, -41, -28, -248, 2, -95, 2, -230, 108, 53, 135, 60, -135, 74, -18, 150, 46, 77, -265, -32, -86, -152, 71, -196, -150, -63, 6, -300, 10, -93, -38, -279, -11, 26, 37, 55, 312, 217, -356, -44, 90, 256, -54, 65, 72, 144, 8, -31, -54, 64, -130, -338, -193, 103, -255, -68, -109, 163, 51, 24, -374, -147, -18, 36, -89, -164, -9, -221, -132, 128, 294, 162, 15, -40, -36, -2, 11, -137, -56, -154, 79, -237, 250, 124, -200, -124, 59, 49, 61, 14, -55, -8, -96, 237, -121, -143, 0, 179, -236, -105, 73, 241, 58, -49, 94, 40, -75, -27, -160, -142, 166, 87, -252, -30, 229, 29, 39, 32, -15, 91, -174, 105, 130, -18, -112, -20, 144, 73, -206, -103, 258, 377, -186, -36, 137, 161, -21, -11, 15, -29, 196, -216, -240, -42, -17, -182, -37, 267, 9, 257, 69, 199, -55, 81, 64, -110, 61, -39, 3, -98]
1688i8M2J29j48n6J87J53j5K1k71K11j65j25n0m5K86j69j42J50Q4O1J67j60j23
1711g6P3j87j19L42K2N8j54m2J07K45j67n23K89M50l51k86M30K36l63r8K66p3
1733G9m1Q1l03K02o0R3k38M16j46o9Ql97N13j1k16J98j9m4k76J23K74p1k52k25
1757c81K90L6J80l22j02L50j5K77k25n7j56R9j25J42J80m4j06k61L47J02k02j16
1779a09J19J18P1j54J03J11m18r1K6N60l53J9j37Q8ok56K42J62n3o6j14J97O6
1802A25k06k8K31j37J05k71O4Q3oj16k25O03j67r6r5Q6K10L17n50Q0K92j0m62
1825a73J62j99M53k44k2P4l0J09k71k77M23Q6l18L27j51L5J38k63J22J94k54l7
1847a16M15j18j80R1p3k1L2l39J81r8L22l40j31P7K91J03j85J55j28K77j41o0
$$ y = [-98, -56, 73, -75, -131, 56, 209, 194, 215, -56, 155, -10, -135, -185, -230, 56, -113, -255, -105, -21, 40, 207, 47, -76, -3, -190, -309, 33, 55, 113, -41, -83, 24, 269, 102, -421, -132, 318, -33, -319, 111, 347, -16, -114, 152, 79, 38, 119, -184, 18, -42, 51, -187, 229, 83, 14, 22, -375, 138, 127, -89, 109, 90, 46, -230, -107, 167, 96, -156, -381, -91, -55, 125, -197, -299, 51, 36, 313, 88, 31, -125, -26, -151, -9, 171, 127, 21, -240, 107, 209, 7, -109, 10, 128, 199, 45, 148, 259, -159, -250, -224, 336, -17, 2, -135, -47, -53, -309, -67, 95, 42, -24, -138, 59, 125, -81, -109, 122, -15, 90, -181, -117, -34, -40, -156, -381, 222, 55, -41, -136, -50, 160, 477, -73, 7, 299, 289, -173, -11, -210, 243, -1, -23, 51, 21, 130, -141, -418, 5, 91, -227, 100, -51, -16, 122, -141, -19, 175, -79, -116, 299, 181, 1, 92, 19, -2, 30, -309, -128, -226, 96, -244, -375, -298, -7, 96, -89, 66, -62, 215, 74, 14]
1869A4J42j13J5l68K06K38m01K9J19J58J06k53L5J47o4j31j12J11K44k76j88J87
1891a55L29Om41J7L56o2k87J05J81L43n02o4L21J33q4k27o6K93P1o00L00M0K26
1914B33o8l14J61J2m9l27K85L38k77j43J62M1R7K5m72J88M02m56k4M6J31Q2L5
1937A08l71M46J51l39p7J52K00n2o72M96L93j87n22L46N9j8j17l72O37L29p34
1958a44j86K66M67l09m02J23M90j77n78M75ok79j30L10J77R2j69q1l0K85l1p5
1980H8k53L70Q1k71r5O3M0pl26M77K13k67n8N5%ok45j2K46P4j75m49L73J58j09
2005c5j03K50oj16k60K80L2L27k06l67J53J59M5l81K74k7O7q2j05J94L80n88j15
2028b30J49K85l11r2L08j94R9k31J4K84L04m40j61K35n8r2j8K55k97J99r2J50
$$ y = [14, 156, 43, 58, -310, -104, 134, -267, -238, -119, 39, 145, -108, -73, 74, 10, -121, -233, -122, 122, -154, -342, -155, 174, 180, -261, -244, 112, 50, -237, -132, 49, 392, -110, -174, 147, 280, 196, -31, -97, 196, 267, -333, -33, 7, 233, 165, -149, 12, 24, -25, -352, -67, 271, -6, -149, 13, 54, 151, 176, -296, -108, 294, -162, -186, -140, -9, 73, 108, -263, 183, 334, -5, -82, 70, 270, 218, -454, 42, 435, 248, -274, 72, 131, 113, -4, -376, 261, 590, -144, -330, -64, 403, 94, -308, -185, 305, 128, -450, 25, 19, -260, -390, -80, 97, 189, 20, -61, -91, 194, 163, 88, -165, 205, 286, 15, -80, -17, 23, 16, -310, 167, 380, 113, 55, 110, 110, 104, -141, -153, 93, 167, -8, -457, -84, 74, -35, -138, 112, 106, -10, -270, 10, 42, 369, 163, -204, -51, 108, 153, -228, 46, 19, 86, 4, -101, 93, 473, -115, -230, -81, 204, -107, -199, 109, -85, 14, -217, -203, 81, 385, -55, -216, 19, -39, -131, -149, 106, -191, 8, -84, 66]
2050F6K8l9m21L61J37k16q3j2L26%K9k35J23m7P9m30K21M21j11j98l69J3P11k64
2074I0nj56K71j48r9j35R0K42j70j78J05L02j72j36K9R9P8j98Q7J23r6l79J17
2097b39M41j44q1l82K43M83m47n4K58J42k04O8m9K99K9o72J43L54P2j42j45J94
2119A67J6m40Q7m1M12k8o25J23L13J46l41J42K12K13m91k32N18k08K6l85K24Q1
2141a11M40l64K9p1L22j70k13Q5P6J74n05K96N4J27kj78k27M66l2m95L55J50j89
2164A7k05J17K4K67l83M1K48J54m77K01M9PR0k87J67m8K08k15k13J20M22l96M8
2187d4l9K35k71q9K59J92k60ol28L81lj0m5j22N8o7J12O1K21k22m29R7K02k8j36
2212b81M97l65J93j14j3Q7Q3J14k92R2K16k51p6M7M2M7m4r2L8J65lq1r6K4j2j
$$ y = [66, 94, 55, -366, -5, 132, -84, -167, -179, 147, 147, 176, -59, 64, 17, 96, -334, -113, 308, 197, -1, -370, -357, 354, 90, 85, -71, 200, 52, -47, -182, -92, 150, -20, -198, -93, 209, 37, -99, -70, 29, 107, -91, -4, 119, 23, -356, -239, 202, 58, -23, -405, -162, 321, -126, -180, 78, 220, 16, 84, 35, 334, 363, -309, -166, 188, 260, 118, -27, 167, 183, -257, -170, -211, 201, 173, -452, -329, -16, 130, -211, -69, 143, 356, -135, -367, 151, -57, -31, -416, -192, -111, 329, -35, -6, -77, 245, 75, -138, -53, 23, 197, -308, -12, 42, 169, 167, -11, -238, 228, 196, -299, 56, 206, 17, -188, -71, -47, 220, -163, -122, 126, 280, -197, 4, 53, 60, 150, -137, 30, -18, 190, -25, -238, -118, 304, -92, -44, -83, 152, -119, -208, 51, 243, -17, -23, -351, 30, 27, 17, -28, -150, -92, -159, -47, 14, 235, 13, -416, -319, -117, -145, -281, 216, -149, 44, -70, -83, 4, 87, 201, -91, 1, 217, -34, -110, -63, -21, 26, -18, -110, -72, 93, 90, 9, -87, -63, -75, -76]
2238g6r2K19o6J63k42K90j45k46P3M8K18l53L98j77J54l18K68j71P7q6O7J09k87
2261a75M10j91l83J02M58J1k20k07M20k61j13J76J55m9l9j79q0L62j39q2r7J66
2283D5J0k87J72K89N5k92k7n3J53j28J23j42M6k0k79J52k3N43k89r4N0k17K93
2306H0j51L03k87O9j12K14J18m5k90O6J69k24J73jJ06k58o3J93p3q4M22k98j54
2329a27J52K54k51J15r7l9K31m38L79j17j13pj63L41l7M4k77L59K6k48j44l6L2
2352a61j11K01j69M39K3j88p4k57L12O8n8l19O38j81l00M2J6J39j48N1K10k85
2374a12j58K22j06M04j82j89L22l7o3n0k92J16J41Q2Mj24L13l18P7O9r1J30j40
2397A8r9Q1N1R2j31p2J06J64n95O47j41j22r7j11K02J40j14j85L27j73P2k31K32
$$ y = [-76, -168, 51, -15, 148, -94, 196, 51, -195, -122, -74, 144, -209, 189, 12, 166, -152, 116, -55, 22, -64, 3, 112, -175, 235, 44, -339, -237, 221, 232, 12, -195, 225, -36, -149, 27, 182, 133, 94, -85, -165, 197, 58, -24, -121, 45, 55, -232, -60, 229, 284, -8, -35, -88, 65, -63, 60, -82, -36, -56, -335, -183, -206, 337, 48, -46, 4, -213, 80, -71, 232, -55, 14, -98, 116, 234, 189, -101, -35, 134, -90, 83, 82, 188, -70, -133, 60, -13, -97, 325, 27, -127, 25, 279, 28, 143, 46, 7, 238, -200, 179, 62, -51, -58, -221, 120, 83, 127, -150, 209, 235, -13, -157, -193, -161, -272, -71, -240, 199, 222, 34, -40, -297, 15, 83, 25, -294, 344, 163, -137, -95, -79, 60, -88, -37, 173, -112, -270, -48, -154, 250, 68, -121, 201, 164, 101, 51, -241, -125, 16, 98, 102, -22, 291, -27, 50, 119, 28, 158, 18, -81, 0, 51, 143, 12, -60, 46, 210, -385, 262, 121, -1, -98, -209, -7, 133, 19, -166, 161, -12, 60, -171, 61]
2420F1J38l25R1%J04k35K85j60m7K30j63N1LN3j22j86J72N8m1k24L58N0j4p7j9
2445D1l1L0j62K23n1j04L8K23m2j57J97m5k71J99j62K4n5J08M6j87R9On3j63M17
2470A68j05j00K44k56O0K11j36K11k14p4J54j48j56J88J3j1l31J19J1J06L55k69
2492D0k2r6K60k28n2K08q7q1P8j11Q0J3j30L77jk00j10k11K17R5j2N3J78k50R8
2517A06k47K93J11k3k26Q5R0o08J02L15J82j50Q1o7L7l2j96J8K42j89J07j54J14
2540iR6m8j9l7r8P5P0j18J99L7j03j94J94k57J32q5jQO3J5J59o9LK30n0o2j08
2567B3j16J45k30mK44j20l4qJ71r0J32o5r4K02j36Q7j9l68L33j36K20k68J07K0
2591dM1j3j69J56j5Q9J19n90M48L0j03j57J09K42m28M10j97r7K49q9j32K97k88
$$ y = [61, 199, -126, -35, -35, 69, -166, 119, -41, -88, 142, -21, 30, 33, 86, -36, -222, -50, 8, -33, -257, 101, 151, 137, 60, 41, 10, 40, -122, 101, 50, -54, -16, 207, 165, 8, 205, 160, -111, 88, -74, -50, -105, 3, 49, -138, -39, -33, -86, -249, 168, 63, -37, 207, -49, 11, 222, 86, 297, 83, 9, 163, 15, -141, 47, 60, 49, -282, -163, -152, -46, 309, 40, 18, -78, 182, -46, -98, 110, 23, -58, 20, -91, -11, 2, -128, 249, 248, 48, -62, -273, -56, 39, 27, 80, 258, 8, 106, -141, 152, 263, 240, 14, 99, 189, -419, -317, -2, 180, 30, 111, 44, 81, 49, -147, -129, 113, -76, 31, -123, -9, 87, 39, 20, -17, -115, -40, 30, -88, 111, 148, 45, -149, 45, -212, -80, -165, -166, -158, -95, -80, 79, 10, 13, 243, 193, 131, 23, -93, 52, -178, -182, 62, -58, -92, -100, 71, -19, 113, 48, -46, 156, 20, 107, 88, -280, 53, -83, 137, -131, -24, -4, 37, 24, -145, 11, -4, 85, 204, -386, 62, 92, -11, -168, -59, 183, -245, 165, -32, -129, 120, 31, -101, 196, -92]
2614i2o6J32J51R7j74j54K84j17o7J00q7J72l66L24P0k10m7j74L35r4q7m2jL21
2638B08k18j79J55LJ57k03M3n8K04k78Q2J2J05M7N5j10n0k6J75o4m8K18k34p6
2662h0k4K51qj22j27J38p9J43j65q4M4k1k5L87m26J41K38j83J46j02j65K42N7
2685A76k52K9l9Q9J09k43J74m0K34q2j31k28K0L44l48O8j59K87k0p2J59n8j23
2708a06K34k71R1rp5L08l88L42k72L6J53O3p6J45k75L36j84k11L00k11j3J86j55
2731e2R7k58L25j11pm2R0Jn0J86k74M2j69L41M9n0l16L15Q8n07J83K81j48K1J63
2756A98l20L51l36J27O5j10M1P3j9r2j06J65n0p5J52o7j35Q6l6M3L10l34%q9N0
2781a08M4l1L7Q2j52J85k11L56k44k10J86K88k72J81k48q4J29K47k74L73j09j57
$$ y = [-92, -158, -26, 125, 222, 48, -106, 178, 61, -6, 94, 7, 179, -187, 137, 207, -3, -50, -224, 111, 17, -70, -112, -113, 208, -10, -189, -34, -31, 126, -77, -34, -92, 112, -166, -84, -72, 33, 80, 135, 25, -25, -51, 124, 60, 12, 230, -4, -80, -104, 147, 139, 17, -110, 28, -51, 92, -73, -157, -113, -134, -159, 228, -198, -57, 181, -2, 144, 42, -123, 119, 176, -76, -47, -86, 3, 112, -131, 43, 3, 237, 155, 24, -204, -184, 160, -188, -120, -279, 8, -12, -84, 75, 17, -106, 128, -143, -52, -61, -136, 172, -216, 126, -146, -110, 43, 106, 30, 175, -100, 236, 52, -159, 141, -70, -83, 103, -52, 45, -213, 112, 1, -6, -48, 42, 43, -7, 179, -95, -53, -222, 119, 168, 118, -198, 117, 205, -302, -119, 162, 14, 35, 198, -122, 229, -107, 20, 85, -25, 16, 89, 70, -22, -128, 37, -13, -88, 64, -3, -138, -52, -88, -45, 265, -69, -69, -158, -108, -64, -95, -58, 24, -128, 57, -154, 202, -42, -252, -66, 222, -50, 131, -117, -201, -72, 175, -99, 274, 165, 8]
2803Hk38L78j71J5j46j0J65M4r8j24N59j83m36K62j40m2J81p6J74J4m19K08J69
2826I4M5J87m20O3K48n47L48m0n2J48RP1J86l18n5J38k65R0p8K88mrk38N0j15
2851a76R0P3J19k01K81o8L6m05J27J07r8J65r5j50J6J90K09k97M8J02q8k2j69
2874b06L96j76N6j88qJ77N0k4L7R3j76J65l05R4o0J18k33R0J02OL9J36k28P6L07
2899C38l38J60m4m1q8P6k35r4J19J49J20j26m7L2m1NJ82Kj42j01J22j8j14L12
2923A88o9l19K29r1K33J1j88mpO7o5j2n7Q2k26K44j10j88M35l15J73j1j46R1j48
2948b03P5M08l21K8pJ66m4j27k96J83K28k07J88o3O3l4j96K6m0K34r5nj76K23
2972Hk3m0R8K7k55n3K51j44J59o8Q9K00k69j22K62l50K78k77J63P8j3P6N5J4l32
$$ y = [8, -230, 148, -23, -8, -154, -164, 1, 45, -53, -177, 382, 199, -237, 25, -115, -157, 24, -52, 122, 136, -283, -75, 94, 139, 326, -94, -31, 217, -330, 18, -22, -74, 74, 83, 154, 340, 22, -33, 105, -160, -70, -148, 140, 136, 127, -111, -61, -176, -86, -13, 106, -95, 186, 118, 154, -251, -124, -17, -115, 50, -45, -195, -179, 11, 220, -77, -29, 73, -15, -37, -206, 190, 14, 70, -118, -126, 51, 101, 77, 114, 207, 31, 196, -109, -15, -75, 43, -190, -100, 2, 8, 47, 183, -45, 31, 338, 0, 160, 116, 75, -13, 63, -172, -266, -147, 2, 122, -4, -51, -19, -60, -55, 127, 129, -13, -114, 8, -10, -124, 188, 119, -200, 29, -62, 171, 182, -6, -10, -17, 50, -15, -27, -84, -2, -228, 16, -94, -282, 153, -162, 11, 0, -146, -55, -203, -128, 280, -41, -13, -20, 146, 102, -25, -321, -138, 90, -117, 71, 8, 71, 37, -159, -133, -173, 61, -34, -39, -215, 8, -15, -55, 43, 70, -185, -238, 13, -131, 28, -40, 49, 249, -20, -142, 120, -230, 48, -229, -66, 12, -1, 75, 130, 144, -188]
2997a88J54K13l27J78p6p5J66N7M5l13M61k72j10M28k29l1j33K64o5k65Rn9L08
3020A40r4j17j07K97k53L15m20K69J08O6k09L3l3M5j78p0Q5K86k9Q3j63j63J76
3043F7m8J6m0l7J01l92K84J95k32Q6K02l51J09mp3J47K43o3k72k07J88K69l58
3066a70Q6K21j82K11P6l63k4L38k74K6j42J00J86j04q0J61j88K94k51K7K65k3
3088A90n7p8j10M0j71K16k86M06k24o9K63r0j35K83k04M9L1q3J74j37k70K39k5
3111d8J00l08N8J32j3R8n1J83k7l84J48J07J79j98J03r2P5o6K42j26k82J71K1
3134B2j81J41J28j84lJ24J43l92J90O5p9Q9m7n2k95K60K03k29L1R9qrq4K25l14
3159a57j21K08m9j9O3qJ23J88j74q1j33K40l01J03K63j91k3m7LK11j12m2K5m4
$$ y = [-188, -34, 179, -148, 30, -46, -121, 45, 102, 147, -166, 295, 23, -87, 341, 112, 81, -52, 212, 147, -118, -109, -168, 140, 46, -71, -178, 119, -134, 181, -239, 30, 138, 204, -5, 28, -5, 40, -138, -208, -123, 163, 134, 217, 54, -109, 67, 19, 35, -5, -42, 59, -333, -49, 146, -86, 0, 202, -149, -40, -44, -117, 30, 273, 210, -62, -269, -81, 188, -170, -84, 137, -45, 166, 242, -121, -145, 193, -81, -55, -197, -97, 89, -15, -95, 66, -122, 172, -79, -52, 213, 190, 133, 55, -55, -15, -186, 30, -256, 150, -74, -143, 120, 30, -105, 178, -26, 23, 54, -29, 145, 8, -262, -23, -48, 52, -256, -198, -66, -79, 19, -32, 151, 124, -260, -112, -5, 174, -24, 79, -13, 62, -4, 238, 112, -170, 1, 22, -159, -18, 110, -74, -77, 47, 190, -202, -12, 53, -26, 63, 16, -36, -331, -71, 132, -97, -66, 33, 25, 16, -68, 157, -157, -278, -70, -119, -138, -75, -83, 40, 228, 54, -27, -160, 80, -221, -118, 145, -46, -69, -116, -113, 98, -14, -56, -31, -75]
3183g5K22o0j04k5l1M7j5o2k33L65k16M65j26j99L9J47k12P6l1m2J46k0j31o6
3207a41nN0P6j26K82k51j41L25j98O9K04j35o2r1K93j59J54P9j58R6l3j32j32
3230a36K33k49M40n96K62L8j64K09k06K07J9J1J61k38P5o9j21K44m0j65R5k55
3252b45L39r8k8j82L67k2l5N0j25p6Kr9J68J3j61L47j47j02K05k65q8J51R3j91
3276a29j05J21J00l9l3K47l88K42J68p3K5J8L0m5j7j5m5k99K39Q5k15m7J99m3
3300a9K72l15K09J8m00J87j9J09j53r7K68k85L01j71L3k9j5r8K74k2j76L1J43
3323D6%k25K81j12m6L0q4N7N9q6K31Lj82J41oj96K14j98n5rL76k55p0J43K22k26
3349E3k89M0L06k28j35M05k75L25m40p4L16J52j62J20l22J53q2LJ42j0K3J04O4
$$ y = [-75, 147, 87, -17, -42, -73, -26, -41, -103, -336, 29, -187, 278, 152, -47, -8, 139, -73, 3, -28, -70, 76, 56, -75, -141, -146, -96, -20, -146, 136, -115, -256, 69, -129, -60, 144, 9, -53, -144, 149, -10, 144, 223, 65, 161, 128, -4, -136, 97, -152, 288, -308, -46, -8, -172, 37, -169, 38, 57, 68, 229, -9, 66, -3, -124, 120, 80, -85, 10, -245, 94, -4, -32, -214, 153, 131, 96, 146, 21, -55, -53, -152, 16, 29, -132, 215, 68, -34, 171, -94, -182, -31, 62, -129, -234, -113, -13, -52, -85, 162, -226, 16, 184, 111, 136, 154, 184, 139, 122, 107, 62, -237, 2, 87, -128, -175, 24, -19, 253, -62, 147, 165, -235, -48, -67, 42, -111, -208, 60, -225, 76, -95, -62, -91, -106, -204, 70, 48, -128, -97, 46, 46, -179, 102, -10, -56, -26, -110, -53, 6, -80, 151, 154, -28, 113, 107, -89, 125, -73, -128, -137, 239, -16, -86, 57, 279, 53, -236, -196, 110, -118, -253, 152, -123, 202, -238, -312, 4, 156, -6, 114, -208, -55, -137, -134, 8, -2, 21, 125, 189]
3372A89j06Rm3jk06L41q2l60K01K0n7m5K09r7J48r5k09K99p4m6n8o8K08K27l13
3397iM8k10J93K6l58P7K16k5L7j11J4J35P0l05M6J76J65k81k5L22j90O6j62K62
3421A77l1p3O1j39l6J47l8j05Q2J1J9J04j50j57J59O9J6j94J71oj25J32j60Rr7
3446a54J17J94j53J7K1k50L49l09K34nj13K25k66O6M1P0k79J68K57k19J33j8j61
3469c5o7J36j04M69k87k67O0N1K37k63J24Q5j5r2O9l57N17l6j98o9P6K68j63k29
3493i0q8L25l01J84k31J25J97l40L80j76R8j77j34K28K05k53p4J21M7O8k82M2
3515a26l28M86j94K51o0k67M26o0k61k5L14q8j72N7J79n8j1M3l59N80m24R0r7
3538a04J63j03n3J15n3J40p5m5Q8Qj71L9o0q8L41j55j77K44k23K5L46J37l47l3
$$ y = [189, 83, 92, 49, 48, -158, 183, 101, -259, -58, -38, -95, -140, 69, -28, 120, 25, -184, 115, 41, -5, -63, -131, 77, 304, -9, 39, -171, 22, 48, -310, -233, -17, -42, -5, -116, -102, 33, 103, -202, -156, 20, 185, -96, -121, 201, 11, 77, -85, 177, 146, 73, 134, -5, -41, 106, 68, -37, 45, 56, 75, 179, 29, -128, 31, 100, 116, -78, 93, 87, -38, 94, -66, -57, -154, -37, 157, 4, 21, 42, -208, 141, -168, 66, 61, -52, 173, -93, -27, 14, 84, -195, -27, 230, 11, 144, 126, -35, -102, 34, -70, 399, 112, -155, -95, -44, 193, -70, 54, 139, 124, 32, 101, -256, 261, 225, 27, -42, 34, 302, 139, -90, -178, 147, -154, 30, -201, -76, 121, -219, 161, -15, 83, -94, -228, 0, 205, -48, -122, -1, 46, 114, -168, -126, -454, 32, -162, 89, 29, -238, 188, 128, -133, -158, 156, 68, -104, -47, 132, 74, 63, 106, -253, 327, -97, -7, -104, 59, -44, -97, 18, -35, 105, 30, -15, 73, 81, -90, -51, -111, -199, 142, -13, -190, 54, -169, -144, 202, 339, -8, -41]
3562d1M1l6M0j76M9J41K5m2j82L6K91n2q2J07j04J89j29j43j04L10o3r1J24j13
3586en7J05m1J13O3k94J10k80L35J66m13J96o5N1K36j11j18j20J73O8q4j12K20
3609A36o6j66L4n4J05J9r2J3o2K26k40P8J10q1R3nq7j97p1M03L7k17m9J73l90
3634c50J91J43J65j36J68K0p5K47l92o8Q2P7l25j70M55L51l17l4P8Q5j43j64J21
3657IJ67l9j56j97K37q7J28j82L75l88m8L95k15J16o7K10j56n2r7K12n01M43l5
3680G2j98J17J82k95J67j44K46q2k0m2Q7o0K20k71L7k83L70O7j30J71k01K52l42
3703h0j07L16J0j69j28j02P7K41j8k39J12J72j94j8p9L88l65K39j06n5J36l26
3725b95L24m8j20L16l23L6q2K24r5J07J69l88O2J54n6J34j0pj37lL7O0k15R7L09
$$ y = [-41, 0, -36, 4, -172, -123, 18, 43, 1, -181, -145, 146, 94, 12, 119, 15, 204, 75, -68, -172, 138, 75, -16, 108, -5, -62, 43, 2, 115, 178, -116, -6, -286, 49, 215, -198, -2, -67, -16, 220, 109, -9, -129, 44, 112, 28, -84, 136, 70, -96, -62, -116, -11, 8, -84, -71, -133, 93, -147, -69, 41, -40, 53, 48, -39, -236, -307, 96, 133, -84, -133, 40, -350, -159, -16, 149, 13, 181, 201, 126, 373, -19, -87, -5, 72, -253, -423, 32, 383, 66, 32, 110, 195, 52, -112, 9, 176, 137, -19, -216, 21, -66, 62, -120, 255, -133, -181, 214, -1, 115, 48, 258, 102, 50, -47, 165, -336, 107, 72, -126, -9, 173, -122, 45, -99, 147, 65, 45, 3, 90, 30, 250, -21, 16, -267, 103, 170, 40, 211, 10, 262, -80, -187, 129, 139, -30, -158, -260, -183, 58, 40, -199, -87, 85, -109, -127, -206, 182, -183, 56, -50, -105, 31, -295, 29, -19, -139, 177, -146, -110, -192, 32, -63, 44, 213, -175, -113, 41, -15, 119, 109, 102, -35, -38, -1, 59, -156, -59, 250]
3750B50j50j80N1J53m49K45PJ8n2N7j40J89K68l85N3J01j00j26O6M27l48Lj40
3773a82P2l7J89J74l83L10j73o6J21O7J67l22J62j00J68k47J28j05L44k37r1J17
3795G6j47K74l45J95l03M88n7O3k19N2L6k42J52J29j91J9K38k06j70J68r1L05
3817B24l44J97q1L0P4J04k61R2K40k76L3J00k31K06k19K47L8j62J16k72N2J4P2
3840gk61L46j53M5J02k18j09M25j01j84J69j93j39M48m62L18j50J03j69J79K29
3861B18j79Jr1O1J1N6M9r5K0K0O5j62n5K81m71P6L14j75N9J02j12L1q4l49M40
3886C1k0m5j00J11J27J78n80L50K6l24K86m4j55J64n2%p1R2p7L4N2R5r5O8r5J8
3912b6j62K29J6j41L08k92J73J39K49n88L9K79p5j76j01K65j59J08k99K25r8P2
$$ y = [250, 100, -80, -29, 124, -325, -80, -73, -55, -107, -50, -190, -1, 267, -118, -65, 36, -64, -190, -124, 303, -45, -42, -182, -110, -147, 42, 216, -167, 143, -30, -96, 25, 92, 259, -63, 99, -1, 167, -80, 48, -57, 287, 50, -41, 76, -71, 203, -142, 53, -250, 238, 181, 244, 25, 77, 113, -129, 23, 152, -39, -20, 218, 12, -158, 10, -81, 224, -120, 77, -4, 26, 100, 204, -57, 35, 275, -1, 32, 132, -99, 107, -112, 135, 173, 11, 127, -145, -93, -79, -7, -268, 78, -75, -30, 72, -146, -255, 170, 69, -115, 54, -139, -278, 170, -292, 26, -124, -21, -190, -11, 218, 39, 40, -51, 10, 21, 77, 126, 31, 51, 71, 136, -26, -81, 200, -271, -195, 119, -56, 3, 105, -7, 24, -60, -409, 31, 11, -34, -134, -23, 104, 282, -298, 52, 78, -246, 40, -4, -159, 5, -47, -47, -118, -26, -103, -69, -17, 78, -17, 51, -44, -26, -188, 41, 57, -84, 224, -68, 105, 244, 493, -95, -56, 223, 148, -28, -129, 136, -23, 85, -214, 11, -87, -15]
3934a5J52l48K09k15K26r0J20Rl7Rj90K70r1j60J69k32L20o5k19K66J17k83K16
3957A38k18J90j92r2L55l19J03P3j5j94L12j12J30p5j90j0j27M00O8k59J02q4
3979a6J43K8j74J90k95J45O3K8N6m1j21J18l53K39J87m93M50k15K54k54J6J50
4001A05j81m0J86l4J1l1r3j76Q6L33k85O3j29J98k99R0K91j98QJ5l8J3L7J20k57
4026b05kL41n3r2J02J8M4j54J39J7j8j93qK57l06J48j74J49j2p7M2Jp9O1R9k79
4052b34R2K04l2K7Q9n8P5k44n1J74n0o3j76M30k9j68R0kn9j96J46J88j58q0L19
4077B34j81l0jJ35o4r5j21J08m6J1k1K43l27L22l57K33%k25RL70k72J91J10j58
4101F8q8K5n2QK4k86J66K17j37p6L24k95L28l40j99M57K3N0m58L39J4l73N04l68
$$ y = [-15, 137, -211, -2, -217, 9, -81, 39, 48, 11, 20, -170, 100, 9, -151, 18, -214, 106, 41, -178, 88, 205, -78, 138, -80, 110, -82, -174, 181, -138, -35, 38, 23, -171, 141, 29, 159, 84, -106, -116, -243, 157, 225, -34, 68, -16, 127, 155, -19, 171, -124, 21, 84, 112, 168, 127, 6, 124, -229, 10, 197, -296, 154, -61, 193, -61, -45, 105, -76, -116, 70, 36, 47, 16, -77, -253, -167, 166, -119, -56, -185, 13, -286, -196, 95, -103, -95, -80, -118, -105, -68, 52, -205, -207, 134, 81, -11, 91, 109, 153, -1, 138, 155, 137, -56, -64, 193, -113, 35, -139, 10, -2, -79, -37, -36, -115, -54, 45, -234, -142, 62, 30, 57, 146, 88, 163, -81, -132, 42, -8, -71, -247, 183, 154, -14, 76, 74, 15, -181, -35, 153, -5, -85, 234, 53, 23, 22, 157, 93, -2, -123, -15, -61, -50, -71, 172, -155, 167, -190, 43, 43, -182, -173, 197, -75, 116, 226, 68, -20, 5, -47, -39, -15, -301, -135, 82, -55, -131, 193, -102, 226, -114, -313, 144, 167, 217, -241, 98, 112, -261, 243, -125]
4125a25n8K65j35JJ65l15J09K1K23m0l07K07J28L0j11j05R1R0J5ml73J61j55L41
4149A19j80j31K29M1j06o7P8L75m7l21R9l42M37o8j66j01L51l46K81j67L6J61
4171A65j66J07l1R4n0P0j25j42RL0n7L49j53j30K00l9l18K44m1L7j37J45m32L92
4195B1K06rM6j83K0m1O1J57p0k58p6K71m05J33m6J82K98l94P9J76r3Oj65K74p7
4220A13L9N0k55J31j13k1l2p5k0L84k01j72J26J0q9J18K11l22J78J86k49k02K52
4243D7L11n12OJ28l6J54j57J75j46j78J46J74k11K93L8l5j84n5J71k07K07o2k14
4266a47K36K71l63j26k8K08j18J00K7pL2k77J0K74k1j57K2p5K78q8m9j19J68K08
4290B59j97P1k57K54j0%J3m5j58j6J4j1J34j64K38j76J60k47j90N9L9N54l67J80
$$ y = [-125, -183, 82, -53, -52, 113, -202, -93, -72, 151, 111, -196, 11, 139, 169, 58, -47, 44, 134, 149, 145, -228, -67, -222, 119, -61, -192, 37, 78, -28, -95, -17, 358, 311, -10, 89, -253, 184, 116, -50, -151, 200, -146, 135, -32, 4, 165, -1, 106, 75, 169, 119, 189, 64, -78, -69, -39, -96, 253, 100, -30, 170, 131, -187, 57, 16, 53, -84, 61, -371, 21, 227, 218, 264, 81, 101, 60, 121, 278, 208, -50, -126, 145, -260, -127, -173, 9, 307, -87, -8, 168, 75, 81, -84, 190, 113, 152, 202, -53, 78, -35, -56, -88, -163, -183, 201, 0, -172, -46, -36, -125, -7, 204, -118, 60, 246, -3, -205, 47, 358, -154, -148, -20, -56, 98, -59, 116, -30, -208, -62, 112, -99, 194, 232, 197, 13, -42, 129, -78, 129, 67, -147, 89, 360, -3, -129, -157, 51, -67, 33, 60, 53, 85, -192, -182, 92, 71, -86, -64, -139, 139, 51, 2, -117, 51, 259, 62, 133, -124, 130, 120, 120, 133, 88, -70, -86, -72, -83, 51, -113, 125, -51, 109, -138, -328, -269, -230, 324, -43, 137]
4314A37k3Q0j74j5J04j03j91J12l56M55j27Q3K04l37J27j40O6N7KK33j50r0J58
4337A12M9j11m0M0N9k19K43j50o5J15R3j37r4l05M39k74K68k14K39K30j87j94
4359a03J01j15K93J1lj02O1j41j87J53J36J66l26Q0J04j33k6L7N1o5M1M6j17l7
4383g5q7L00j08j78J91k25J66j17J30M3k00K22Q7K5k1l08Q7J29K9r1J46O1n66
4406c60M57k78Q9Q3K3j75J02J42j51p5R9N6j70Q6J75j13j14j07N9K96j79M9J85
4429A79l79J57L00p3r0K2N2l23L89j97k02K88k82K33l7k63J43O5n7P5l75K78K48
4452A51r7p6k5J17Pk20j2j35L98m41ML84n7l73K70Q7Lor0L73k24k04J15j30J70
4477a1R7q1%m6j38K79k46K25M7q2l9O4oO3j82j87J01K08l9q0o7J09L6K59k50j66
$$ y = [137, 114, 194, 20, 5, 109, 6, -185, -73, -429, 26, -101, -18, 186, -151, -24, -164, -98, -41, -39, 194, 44, -46, 112, 161, 50, 10, 50, 109, -110, 133, -17, -82, 33, 126, -11, -105, -410, 29, -245, 23, -191, 48, 278, 91, -103, -2, -117, 176, 187, 184, 82, 143, 2, -185, -32, 104, 270, -56, 24, 128, -5, -31, 6, 57, -8, 33, 79, -38, -75, -162, 138, 30, -148, 43, -182, -16, -133, -3, 40, -160, 62, 149, 174, 153, -155, -68, 61, 90, -1, 145, 206, -360, 97, -181, -92, -9, 14, -161, -59, 83, -68, -143, -44, 12, -158, -72, 103, -10, -124, -231, -172, 124, -55, -6, 179, -200, -43, 257, 184, 94, 116, 168, -155, 234, 37, -165, 123, -159, 74, 37, -226, -83, -18, -75, 0, -375, -97, 151, 54, -22, -47, 70, 77, -143, -155, -290, 108, -333, -329, 55, -2, -375, -105, -18, -15, -21, -111, 262, 38, -166, -51, -181, -11, 86, 5, 5, -41, -179, 100, -146, 79, 126, 44, 5, 69, 63, 126, -56, -243, -142, 66, 27, -53, -120, -11, 25, 284, 34, -132]
4503a32J70k62K44j24N1l3M7p2L21l91K92m9j55j17J76J78k05J89j84K33j52j33
4525a08J52j15n6K27k47J35j72K36l0j46K99j76J0k1k44K95l25J2L81j58K23l12
4547a40J93j7l5o5K10k0j87N7J03K7j32k1l4L25j66k13J56j25k5R9rJ78k3n5o8
4572A3p0K09j53m7J11J03j14l08M42m4j29J57j82j42K29K10l97m5L05j05j54j80
4594b91J62J7J46P9l25J16K83l24J14j06K60q3j32pj9L50n19L82r3O8j80J03j36
4617a35K77k78p4J89r2K46j1k37R5k39J87j95M14n6J41k79n4L41k85j40P4J16
4639Ej09J97j25j43K10K35k16j52K87k01k23K7J15Q4j11J15j62K96L65m21k18
4660a45J48J3k29n9L86k48O3K22m73O16k79N0q1j5J55k51O3K3P8k47K8mJ30K60
$$ y = [-132, 38, -224, 20, -104, -53, -86, -39, -111, 210, -181, 111, 62, -93, -210, -34, 144, -61, 128, -56, 177, 25, -108, 44, -71, -127, 100, -147, -12, -184, 52, 22, -124, 175, -1, 9, -12, -256, 39, -286, -274, 107, -51, 172, -140, 53, 36, 1, -64, 146, 126, -61, -4, 99, 126, -6, -27, -61, 264, 98, -115, 41, -84, -109, -10, -19, 159, 136, 81, 13, -57, 152, -1, -48, 63, 166, 52, -256, 186, 142, 13, 170, -12, -154, 75, 285, -112, -157, 148, 43, -111, -291, -129, -112, 34, 113, -212, -96, 187, -137, -23, -129, 131, 48, -84, -91, -110, 240, -279, 103, 10, 78, -102, 1, -135, 142, -136, -210, -21, -113, 133, 122, -115, -20, -259, -72, -267, 147, 91, 232, -47, -101, 240, -45, -185, -111, 5, -104, 93, -32, -175, 35, 270, 54, -98, 189, -12, -235, -208, -93, -9, -120, -5, -167, 129, 494, 73, -145, 3, 16, -213, -272, 114, -134, -71, 151, -322, 294, 15, 65, -16, -31, 124, -127, -64, -41, 37, -210, -182, -186, -56, 204]
4684B04m8l59K15k28M1L43ql12N2K86j05k7o3q5j53L62rj74Jj79L50q4p9N9J12
4709A12k45J64k6k34J94K55l14J09J82j41j13L02l8q3j22Q6k10J09M9R5k67K42
4731A06j87P7L8j47P0O9R5k53J20M8J05k81K72l08M18j51p7p4R5j88O0J85j54
4754f2k38J93K45l01qK42n6J05L1j37N0J2k07p5M57k49P3j19k59L92k21J31J18
4777A17K2J0j08k15M05l26j88L06Q8l26L42j34j95K84k02J38j10O2R2J49r9Pl29
4800b10K14j84J93p2J04J57p0l21MJ54k91M49k10J97l6k04K84J2q4Nn1J1M8j16
4824a7R5k04R0Jm0L0j96L47M4q9j2k23M4J43n3P6j06M3p7J70k23K78k62q1L90
4849A68j49l0M3n4j05K44j08K54n84Q6K45j94K74J35l33L1J0n1J35r8J3k18J39
$$ y = [204, 156, -203, 12, -216, -175, 168, 160, -152, -100, 186, 81, 54, -9, -94, -247, 115, 106, -68, -67, -246, 104, 20, -59, 0, 112, -133, 31, 5, -229, -35, 220, -94, 15, 197, 56, -57, 245, 207, 124, 2, 88, -122, -13, 36, 131, -136, 106, -81, -4, 34, -113, -43, 26, 121, -132, -12, 36, 141, -140, 132, -176, 242, 91, 14, -60, 35, -153, -93, 92, -62, -300, -107, 138, -163, -171, 71, 15, 120, 151, 14, 64, 76, -131, -206, 251, 2, 75, -44, -303, 89, -132, -1, 117, 139, 149, 41, -174, 231, -95, -283, 23, 111, -215, 127, -7, -202, 82, -120, 18, -92, -30, 62, 211, 112, 119, -210, 4, -180, 13, -59, 45, 202, 132, -189, -185, -31, -322, 127, -83, 114, 78, -126, 158, 170, 86, 91, 40, 51, 99, -17, 78, -126, -36, -35, -75, -45, -241, 106, 150, 61, 49, -174, -130, 13, -40, 36, -70, -27, -104, 66, -157, 121, -141, -222, 168, 19, -11, 32, -22, -127, 117, 9, 263, -321, -235, 10, -184, 90, 225, -108, -77, -67, -118, 17, -81, -68, -286, -147]
4872a47L04k11k8j35j7K00M2j04J21O6J40Nj33j4k3q0k86J51r0O5J70p4o6J50
4896FL1O7K8m9N6j17j31J26L36l42j21K1K25k62j56L83j34mj91M57kl04J10J45
4920A78j67jj46J21l0k8N2l5L4K1Q4j76K7K81j07m6r1J02N6k43J5K53j55j27l2
4945a60J23L4o4J36o2P8K5k19Q1K0O7k71K34k7n4J07k75L4J18q3K06J39l56K01
4969C2l3n4J68j40n5k78N94m49R9q6R9J65m0j01J14K09k0j47m9n3pJ1P3K86n13
4994a75L94k13j02P2L3J83j01j42qj68P5Q6R5k63J72K07j64l2j3K96j06j31K59
5017B54k93J65j69O8L36m19K04j27l40L49M4r8l9K38k18J10j05L1mL6K21l39M9
5040d6q9K49j56k19K01J78k72M6N5Q8k29K50j57J23K51k57K96n20K06Q6q6J31
$$ y = [-147, 157, -54, -82, -217, -234, -34, 8, -96, 25, 91, 231, 236, 103, 89, 66, -14, -300, -149, -239, -174, -4, -78, -144, 6, 37, 104, 132, 83, 139, 22, -109, 17, 353, 11, -110, -89, 136, -126, -282, 101, -33, -37, -228, 229, 227, -77, 33, 178, 11, 10, -136, -15, -45, -73, -21, -56, -22, -1, 83, -93, -66, 215, 108, 62, -29, 73, 129, -114, -99, 154, -1, -128, -160, -37, -3, -67, 69, 7, 85, 110, -109, -28, -8, 59, -212, 22, -5, -59, 48, -227, -193, -75, -158, 48, 187, -169, 32, -1, -55, 113, -27, -82, -360, 234, -215, -116, -202, -103, 62, 22, -79, 35, 244, 224, 77, 28, -25, -32, -21, 52, 338, -175, 219, 6, -96, -24, 9, 192, 91, -51, -59, -227, -152, -66, 29, -234, -62, 145, -19, -51, -64, 232, 126, -5, 254, -39, 126, -43, 25, 361, -58, 146, 19, -321, 28, 72, -26, -65, 173, -45, 65, -40, -9, -13, 23, 244, -95, -46, -135, 114, -42, -261, -60, 118, -154, -108, -53, 35, -194, 56, -101, 22, 273, 16, 312, -208, -2, 84, -2, 129]
5062A29j38O5J28k91J27J7k32JL46j24KR8j57P9k14K95j51k39Q2L88j03K9j25
5085A2p2L9j9J81j77K50m17K59j03M2L42k30r2o7R4J9l8q8n0K54k56NK12p0J13
5110A43j37q1L3j73L22n2k24R9k02J32J62K36o9j19Lk72J34L62k68J00j54n1p2
5133a48L62j63J74o2j02Kl00K90k31J18K34k87J27j59K18j49K16r3K89r5l04%
5155f3J52j53KK06m23K36j86j1K17P8p6M7P3O6j44j3l9qp6L55j14J41n5j55j27
5180g0J25j6j89%J39K6L0k3M8k19kK7K45l07K61j82K6L3pJ97J97l50k28J02L0
5205a07n8K77k27J44j35M1J06J20j47J0j21QK03k29J36r1L8j54l1K88j67o4L7
5228a23J77q6l9J46j54K9j47L05j17J19k5rj65m9K07P7l21POJ44KK4j81J79o7
$$ y = [129, -9, 56, 184, -107, 20, 37, -195, -194, 152, 28, 30, 128, -29, 50, -164, 131, -20, -259, -177, 211, 108, 137, 12, -60, -21, -40, 141, -36, 214, -203, 56, -47, -5, 337, 107, 15, -52, 42, 61, 23, -65, -115, 139, -117, -112, 100, 30, 143, 6, -75, -42, -215, 107, 55, -169, -70, -272, -140, 22, 258, 189, 70, 73, -199, -65, 297, 29, 129, -25, -76, -148, 214, 51, 225, 163, 61, 63, -237, 53, -178, -60, 174, -113, 14, -145, 73, -76, 140, 47, 336, 241, -63, -63, 89, -64, -62, 144, -279, -43, -229, -240, -23, 55, -21, 26, 99, 165, 21, 8, -31, -39, -115, 240, 126, 267, 212, 57, -70, 55, 39, -150, -150, -11, 15, 45, 22, 70, -149, -151, -124, 121, -186, 75, -107, -81, -48, -55, 142, 339, -11, -239, -137, -107, -165, 112, -115, 29, -106, -65, 41, 161, 14, 24, -97, -89, 114, -115, 21, -70, -32, -186, -217, 71, -96, -160, -123, 54, -32, -71, 75, -79, -50, -197, 108, -9, 110, 85, 76, -89, -138, 69, 146, -175, -168, -162, -18, -16, 8, -173, 6, -61]
5253f1p6J36J26q9j39k4j17L14j08R5L36n12K85r0k31L21j62J52k94QJK71j27
5276A5J15j31j52L08j52p9N0j59O6J20J7k9Rl6k08J77o8R3j4K78j75L36m14j00
5300a33M6L14j25k45L07O3j53k1o5K24j30J99o22K94J65j83k9j8M9K38k62L2L8
5323a7K69k74pj3N6J23j95o7J82K6m7k08K45j36K33j52kR6j17Q5j18q4K41R0j72
5348C7J47m18M10n20N36m51J12J91m0oo5J68n5j65L8j10J58J82K5j60kj91J09
5371g0j11J24M7J31j94mj70J57K19Q8l21N4o4K91k12K37l42P9J86j75K09l33M89
5394C15m29j30J77j1K3J94M6j18k73K89l16K30m3R6k7O6k49R7%j6N7K66k30J52
5418A66j99n9J55j03j56J3K79P6qn03O22j54j26J88j45k18o9M54j87nJ16m43N93
$$ y = [-61, -137, -1, 125, 36, -103, -127, -244, 70, -38, 57, 393, -119, 166, 76, -155, 166, 4, 156, -138, -130, -129, 142, 15, 130, -1, -153, 155, 3, -76, -26, -185, -119, 1, 18, -11, -2, -38, -246, -69, -137, -44, -58, 220, 45, 381, -33, -133, -87, 227, 102, -143, 164, 227, 74, 53, -12, 212, 82, 281, -341, -47, 118, -65, -94, -112, -63, 175, -87, -55, -17, 252, -22, -29, -42, 14, 137, -58, -125, 57, 83, 36, -172, 73, -63, 170, 18, 16, 112, -5, 80, -38, -122, 119, 209, 37, 184, -234, 176, -344, 192, -259, -147, 44, 4, -2, -67, 101, 46, -119, -81, -191, -33, 149, 174, 14, 12, -179, -70, -181, -57, -10, 121, -73, -77, -247, -90, 129, 217, -104, -50, -114, 177, -35, 202, -140, -61, 125, -50, 159, -174, 315, -114, -244, -67, -78, -55, 139, 185, 67, -206, 83, -233, -3, -46, 50, 23, 89, -160, -63, -63, -79, -22, 244, 14, 166, -33, -92, 63, -40, -196, -183, 96, 172, 164, -339, 283, 129, 3, 191, 46, -172, -241, 213, 26, 21, 137, -306, 287]
5441B87k66O6k35j35L88J41l51k46K79QlK46n3K0m45K96j10J76P0k65K53P9l60
5464a60K58j21qK64j61r4K56m51L52j18M5P2k30J82k0q4Rp1L22r2j66R1r1M3j17
5489i0j77M24p0k47K58l7J59q4k75N9j2p3J89o2o8L6J23k01R6k22L07J73m3r3
5513G0j08j00m8K52N7k03M82l47o5L3K74l61R9K39m51J51L5j79J32oN1P6j93K07
5537I7j87k5K11k04k38N02j5l57J27L6k73M63n8j38o4L29k25j72L86p8k4k91K38
5560D0%J71k67n7J44L32k40k50J32Q4j94rR6J80lj06J77q7j77J32J3j09M37l39
5584A00qql7J06l58L03K28l64L3p2L6K55q9k96M34ll45K89l24K30l09L70k64r0
5608a83P6J59l40K08Q2j40mK03K6K4N2J1l04K21L3Q9l15J73n5m07O47l02j50M70
$$ y = [287, 21, 87, -148, -283, 105, 246, -105, -351, -72, -64, -67, 179, 126, 146, -299, -3, -113, 63, 133, -132, 121, 200, -160, 98, -23, -31, 233, 72, -22, 234, -217, 135, 17, 62, 134, -96, 86, 66, -18, -9, -80, 242, 150, -16, 75, -16, 27, -90, -267, 157, 87, -160, 98, 61, 220, 136, -139, -80, -92, -165, 24, -38, -106, -70, 53, -148, -52, -274, 33, 206, 163, 70, -38, -138, -186, 66, 123, -80, 402, 55, -10, 23, 297, -64, 35, 274, -177, -26, 9, -170, -38, -44, 7, 83, -110, 97, -90, -115, 96, -108, -346, 156, 141, -216, -89, -53, -326, 137, 79, -59, -123, 206, -19, -191, 195, 117, 93, -198, 40, 40, 211, -56, -113, 31, 363, 123, -127, 5, 89, -105, -114, -18, 162, 159, 53, 230, 143, -34, 98, 111, 2, 439, 100, 92, 84, 47, 153, -205, 98, 326, -38, -5, -77, -41, 214, 125, -171, 263, 260, -85, 204, -120, 110, -199, 171, -93, -183, -107, 52, -288, -80, 2, -138, -142, 61, 87, 111, 163, 174, -130, 91, 124, 213, -102, 71, 16, -391, 256, -46, -196, 274]
5632B74l60L21j63N5j59M7P9j71k8L8J64j30o7Q7j70J87L9j08l2J47n2r0N7m1
5656g6K18J38l57K82J01k67J38j64n4J35rj12J7j22K2K5K03J41k85J23k03M25
5678C19l14Ml06M88p0o2L8P1j86O0k87N77k59k10J25j19K74k36K95l15K23J4J5
5701A39j58L6J54k5l16K40m5K21o8j98m7N4j27J25l55M09J95j44O4k54J16l12
5723b96K32j07M9M3J4J99r0o6L6J36k96k8M28j51k9kj06n0M5J79J56l86QJ1L8
5748c3OR6k37K62p2J38k06j33q2K50l3k9J37o9L7j8K56k47k15L64J14j79j91R0
5772FQn9j57R2Q0L76j27k24J13n6l25q4N85p5k06K93l85J87J27Jn08L58J28n0
5796I8o5k36L62j3k44J44Rj70J62j34R3K29n30K76K3j29M8o4K35k70K25l56Q7
$$ y = [274, -86, 235, 72, 127, -32, 15, 94, -77, -105, -67, 97, -33, -100, -13, -183, 4, 43, -65, -97, 50, -2, -92, -35, -76, 142, 280, -77, 205, 306, 39, 177, 13, -41, 94, 85, -27, -10, -132, -110, -85, 118, 259, -26, 97, -106, 319, 5, 9, -297, 191, 121, 59, 97, 168, -18, 42, -245, 332, 73, -137, -12, -131, 143, -93, 202, -113, 110, 124, 139, -19, 17, 171, 146, -170, 70, 25, 246, 178, -20, -67, -13, -140, -15, -370, 39, 234, 90, 154, -100, 16, -296, -64, -171, -122, -79, -65, 134, 44, -22, 14, 150, -146, -174, 254, 103, 74, 72, -34, -84, -39, 140, 296, -90, -82, -71, -33, -27, 69, -168, 94, 22, 160, -46, -179, -261, -11, -44, -73, 64, -5, 32, 14, 270, 23, -192, 172, 286, 107, -84, 6, 14, -45, -202, -110, -30, 346, 219, -5, 108, 52, -273, -357, 228, 153, -53, 240, -145, 42, 169, 170, -338, 20, 148, 98, 33, -203, 159, 146, -98, 46, 55, -115, 47, -87, 6, 235, -295, -19, 4, -125, -77, -141, 94, -176, 49, -307, -220]
5819b20N66k41j79j47K88k42K11j65PM4K58J60m38J56n3J5Q0R6j6j20l3j11L11
5842B27l10r8K44j43j14J95j82K72j83N7q4Q4M5N4J43j19m00K78KM8L8k16J40
5865b2n8NO5q5K01J50j66r7l10K54J51J8j89O2j76M8J21j12m1L37k36J32k33L57
5889A76j59j89K1O1J19l11M8J72J82j31Mo2j80L64j34J66k75K45l30K65k3l3o2
5912f6j69K20P3j73K06R7j18J52j56jj4L3j56J13N6J94m02O4k75L52Q3k2j28O4
5936B7J20j30K9J13k26J09n9p9M04l32J06m1R1l74J74J56l26L61j36kj97L76J09
5959B73n2j49k94K67o5J20j48R6j26R5J09k58k2L08m3m06M71k45j01Q0J32K14
5981B56m14J48J46l00J46J2k23L67l06J73J02j74Q6J24j25k75K95K14l78J09J44
$$ y = [-220, 346, 105, -74, -221, 67, -175, 36, -129, -122, -78, 180, 340, -98, 58, 5, 20, 100, 196, 180, 60, 27, -84, 227, -83, -181, 63, -80, -194, 1, -181, 91, -92, -35, -119, -35, 10, 64, 207, 88, -312, -34, -32, 16, 54, -162, -22, -80, -75, -10, -95, 106, 256, 90, -7, -317, -63, 88, 106, -83, -21, -197, -149, -28, -140, -181, 156, -80, 52, -181, 176, 17, -172, -151, -90, 29, -282, -234, -62, 120, -11, -7, -69, -249, 115, -19, 147, -128, 117, -213, 52, 29, -4, -66, -235, -15, 58, -115, 91, 188, 70, 222, 66, 65, 51, 84, -72, 41, 97, 291, -111, -47, -322, 30, 113, 91, -37, 27, 147, 17, 46, 159, -67, 42, -17, -96, 308, -24, 82, 41, 132, -242, -68, 88, -238, 123, -13, -15, -212, 164, 273, 221, 72, -222, 45, -20, 100, -48, 48, -78, 17, 126, -132, -154, 154, 111, -295, 176, -69, -170, -90, 42, 256, -158, -10, 136, -164, -18, -6, -229, 138, -168, 5, 107, -67, 19, 143, 18, -257, 38, 252, -126, -17, 127]
6002A27Q6k49K23k97L26l6n5O7k49K4M5Q6p1P1K1j63%O7j53O1QO2j28K06j96M7
6028g0K17j32J74j90j17K09j80L10p9P3k05J16q0M3p6l6O0J97P7j19j9k4k23J30
6052E6j78K93J2k3Pr0j10R5o3J6Q7l03J65j56O8J83k27K05N0mm4p3J80k44k05
6077c03L37R1k88j81K29J11q7K50k68J88J33j82o2p7l2K03nR4j60j1J20K9O1m91
6101c01K90j45K49j53J83j41r4r7K27P3j12J94j73j17K30k46J92j06K2N1j7K40
6123B49mMk69L8k09M32j87K24m3l27J97j71r2J55k81L33J39k00Ll7K32l58Q2Q
6147h2o7J5P0J61ML9l12K35j20K58k62l5J41K56l02r4L59l22K76r9M7J1k01j54
6171a78K97rm3q2j07j58K21j15J29J03r8lmp6L72l10n2mK6j9Q6j62K58j71K69
$$ y = [127, 213, -36, 187, -110, 216, 180, 125, 192, -57, -33, 12, 98, 27, 98, 119, -44, -44, 23, -130, -69, -61, 1, -127, 79, -117, -70, 147, 15, 189, -1, -118, 91, -89, 221, 142, 215, 10, 126, 46, 89, 13, -23, 37, 234, 311, 192, 173, 149, -74, 56, -122, 171, 183, 160, 167, 77, -33, 62, -1, 15, 102, -201, -36, -192, -124, 59, -168, 37, 87, 83, 39, -34, 146, -98, -303, 34, 125, -163, -344, -115, -4, -91, 159, -109, 79, 212, 30, -32, -109, -141, 62, 57, 151, -9, -20, 100, 129, 190, -301, -11, -156, 93, -60, 123, -18, -112, -209, 18, 91, -21, 173, 0, -117, 113, -133, 59, -47, -25, 26, 9, 249, 245, 249, -20, 18, -191, 241, 54, 278, 235, -92, 105, -66, -158, -3, -284, 49, 188, -12, -9, -46, 186, -172, -90, -82, -149, -134, -64, 97, 101, 140, -172, 63, -57, 201, -61, -96, 45, 301, -1, -95, 264, -58, 218, 119, 166, 177, -24, -178, 119, 110, 67, -15, -122, -280, -59, -174, -45, 58, -40, -43, -47, -123, 249, -61, -113, -117, -91, -110, -24, -186, 72, -99, 170]
6196A70j86QOol4k2m5J03K53l43Nm6J04j3K22P0j97Kp3J40k1k63M49k73J5q8K18
6223A55Qk78j48P7K52l4J79k34J60l30J69J43k77K40k06K00k7%J70k12k02K16
6245B1N5j20p8J12j30M2R3J04k36J84j47M53l85K95k37j63L97j93N2k36K60o6
6267G7J73k73M8J64o3j5k12o4L51o9k33K78r4j20oK05o3N7j18j4Qp2ok2J67o1
6293B3J39j02j59p4L72l59j20J91K26k47K03j06l6MJ53j81m2O2l7p9K97j74k06
6316b52J86K9P4k59L04j22j6rN7O0k73M48k58N4M4M2n9J91l61L34l66L23k11J62
6340A22K0j02J55lk33J80k03J22k05K11J57l92J19K24p5Nj30r6J78j44K46j26
6362C0l6j75J12L10l10J00k6n8J5L05m94L61l3k58J58q4M6j24J78m7J33j66Q1
$$ y = [170, -16, -8, -2, -8, -42, -64, -109, -6, 247, -96, -91, -137, -33, -46, 176, 246, 49, 51, -22, 118, 97, -166, 283, 10, 25, -63, 155, 163, -115, -263, -186, 66, 32, 211, -23, 137, -193, -24, 119, -158, 82, -124, 76, 49, 49, 219, 7, -195, 21, 76, -44, -122, -10, -140, -98, -5, 99, -137, 47, -100, 353, -32, 263, 26, -137, 260, 67, 119, -117, 143, 77, 250, -23, 25, 189, 126, 111, -101, -165, 186, 117, -116, 162, 68, -52, -58, 147, 84, 141, 23, 9, 17, -55, -61, -83, 84, 23, 162, 60, -99, -173, 199, -160, -280, -89, 137, -110, 93, -13, -49, -45, 108, -73, -115, -53, -90, -169, 128, -46, -252, -66, -37, 37, -222, 82, -40, -56, -65, -8, 52, -221, 227, -31, 23, 67, 109, 50, 241, -120, 214, -152, 171, -40, 122, 142, 40, 195, 192, -41, 139, -64, 58, -147, 64, 221, -171, -52, 172, 97, 102, -28, -124, 54, -90, 156, 30, -6, -181, -69, 241, -69, 31, 5, -53, -38, 267, -227, 134, 101, -157, 1, -83, -37, -161, 17, -30, 103, -63, 18]
6385A8j6q2oP4J58l7P2p6o8M0k6j11K20k77K59j81M8Q8P7k95K03K14j98j24k6
6410e2K98m26K35Q8j06j75J74m1K64l08nK31N7k78P9J56l23K14k44J84J94j49
6432F7J09j83J07p9j12M5l9P4J26n0k2K7k23L32j66J42j92K54j71j4J8L3O5l60
6456b12Q5L8Q3p9Q0p1K0J40j32J45l0r1r1J1K58j43J51k0k44k8N3L19l38j29j11
6481c36M54j51L9o2N1k34J06J04K15k41J85k78J59K41l50k5j44L23j51K82l16
6502a29L14j13j54J40J9L7l02J12J71l22K82K2j83l8L09k90J77n3k73L73j02J87
6524A84k12o8J12J54q9m5r6q4J9M74q5m34J13J25L01k57j8k62J98J3k76K39J8
6547B4Q2j40J69k20q3P1q6M23m29K36L38k14J1l46J51j67L8K3N5J02K16j95J07
$$ y = [18, 2, -80, -86, -12, 146, 109, 181, 105, 37, 77, 51, -60, 160, -117, 142, -39, 9, 97, 174, -121, 82, 296, 98, -26, -52, 246, -180, 55, 143, 37, -138, 36, -5, 259, -49, -54, 177, 234, -44, 35, 191, -132, 82, -162, 22, 216, 67, 176, -7, 100, 21, -91, -46, -85, -11, 115, 65, 43, 70, -153, 179, 13, 155, -37, 217, 46, 32, 50, 83, 148, -212, -127, -89, -6, -85, -5, -76, -56, 84, -48, 97, 67, -24, -115, -104, 154, 11, 162, 142, -102, -130, -77, 242, -96, -225, -336, 118, -33, 6, -56, -5, -239, -133, -29, 186, -55, 130, -148, 11, 252, -98, -123, -267, 56, -95, 187, -129, 185, 72, -82, 58, 77, 114, -188, -76, 95, -227, 55, 77, -106, -144, 165, -125, 52, -1, -274, 99, -3, 184, -28, -96, 16, 170, 81, 36, -60, -144, -125, 349, 264, -170, -57, 68, 369, 112, 94, -168, 30, 43, -233, 6, 24, 106, -34, 135, -85, -168, -97, -183, 240, -189, 47, 385, 171, 182, -164, -13, -180, -142, -119, -64, 38, 254, 59, 166]
6570A66k82K1J98l34L20l1n4J00k5k72M25k58J07J05n41L21R1k05N4M07k90R4
6592A17k78p5K20j22R2n2J1k13J61J35j40M13j36k80r7Q3J87K34k87O5j00Q7J25
6615A50k37j51L40o2L7J93l9k89J35k3j31K55l5l05J41J15k22J49J08q9kM8j49
6638f3L22l27J18M9k01N3m4K0o2J59j19J30O9J4jP5j36r6J71J92j86j83m7J0Q2
6663aO2J95j77k1j30k1L52j37j78M4N3K3k21L00l21J75K1R1k34L02j95L8J21J1
6687A52oj21o7J03J58Km03L23k4J3J56l14J40N7k41Q1j23J22Q1k77L93p3j59P9
6711E2R9m50L38j79j61L08rj0j79J08J30k48M18j34n3j20K09P0Jl80K82j24R6
6734F4j33J9O2j00J37n7k9K71k44J4j9o2J09k23J74l6K15k95J64K71m29j91J99
$$ y = [166, -116, -95, 103, -231, 89, 58, 4, 104, 79, -193, 232, -26, 81, 186, -355, -34, 57, -148, -94, 313, 23, 117, -161, -236, -16, -138, -46, -98, -87, -300, -139, -4, -144, 269, 133, -147, -244, -161, 26, 260, -27, 38, -62, 25, 150, -87, -238, 102, 40, 77, 270, 231, -58, 77, 54, -77, 178, 143, -162, -21, 94, -128, 21, 129, 40, 38, 86, -63, 259, -68, 50, 99, -102, -49, -93, -73, -135, 24, -95, 35, 104, 118, 117, 192, 56, -40, 131, 323, 137, -46, -93, -83, -1, 61, 256, 79, 58, -72, -93, 259, 122, -56, -12, 41, 64, -157, 143, -178, -3, 18, 109, -125, 177, -18, 20, 141, 152, 146, 25, -42, 61, 219, 221, -182, 141, 117, 130, 286, -28, 112, 169, -72, 9, -114, 8, 89, -188, 205, 132, -27, 52, 151, -299, 39, -140, -301, 7, -2, -12, -191, -83, 47, -201, 217, 83, 30, -90, 119, 189, 190, -190, 92, -32, 64, -69, -50, 12, -88, 49, -8, -37, 234, -10, 4, -15, -77, 32, -191, -17, -53, 162, -133, 31, 302, -127, -318, -119]
6757a19k8R2K24l00N5J30N0k12J6K0q7J50m3Q6L55k80L1n6K2n61M69m1K06m86
6781c07J26L07k0j02j09jJ18j05J95j48K5J22j41P8j4J28l75L07P2q3J15k99k7
6804a38J46q3K27l12N35k77k21Q2o1k2Q9j09K53L0M0j32k90K80M0j04P9k46L08
6827A14J53q4k65JJ77J40r6l08l3J99k15J60J8p4K52j42j10J82J32j68k07J88
6849A4ok27J71R2r6j93L45O5k71P2p3pj03j32J06L97K02j42p4k34J93j54J0n7
6873a02K32J9o8K27l48M6j18J77J22j46L5l9kk0J53l59R9J82k6m6o3RJ68l8l8
6898E6L6j1K8J68n54K36k18K57j62k9j38K34l3K45K35m11j09k5L32j2O5m55L91
6921A26p1k6M8K3k28J94Q1k67Q4j44J71p0J05j23R8j72O4J36l4j70L77k37j22
$$ y = [-119, -147, -55, 169, -131, -76, 54, 104, -108, -92, -72, -159, -9, -52, 34, 389, 109, 140, 84, 106, -455, 14, -27, 179, -307, -181, 126, 106, 4, -105, -106, 12, -93, 102, -46, -21, 101, -40, 38, 24, 152, -223, 84, 156, 73, 188, -111, -138, 8, -75, 152, -160, 375, 98, -123, -41, -102, -124, -35, -144, 109, 139, 179, 47, -243, 37, 77, -27, 52, -194, 114, 267, 183, -82, -81, 96, 236, 140, -168, -201, -2, -217, -57, -39, -113, 139, -3, -113, 69, 201, 33, -174, 14, 8, -219, -48, 44, -52, -245, 100, 165, -106, -34, -107, -114, -217, -349, -243, 154, 356, 214, 140, -94, 99, -55, -45, -102, 130, 149, 81, 308, -40, 6, -112, 65, 187, 41, 76, 37, 35, 15, 168, -191, -92, 90, 64, 18, -45, -36, 132, 94, 56, 92, 81, 109, 277, -277, -41, -259, -2, -164, -193, -331, -97, -130, 115, 350, -61, -170, -195, 137, 125, 190, -265, 126, 55, 29, 77, 100, -128, 66, 147, -120, -36, -180, -9, -79, 26, -97, 1, -171, -107, 29, -5, -175, 202, -35, -157]
6944a57J37O1M1j21J13m7J23k35j44K61k0J97J9j28q8j86K4L89k65K4k58K23L8
6967AJ12Q4k33p6o6J53j57K22J7m58L47N5j76J36J8j00J46J13k30J83l1P9K09
6990C48k44J03j79o2RQ3m3j0J09p5j2J33k23K32k3l45M89l89K74j11O2M0p0j27
7014c1J5RM7p7K3K3k07Q4P8J32j36J27P2j60O3k36P0L78k02k7j80L15j49k2P7
7039H6j81M8k6n6J42p8J21R5l25K29Q8j18k48J71R2K2j63P8Q3m0k01J02j27K17
7063A1J28m10L64l19J67j9J77k3n9L3mj33r6J1L13k76M28j38k4K6m40J16J24k2
7087f5o1J43K0k8R0j47J34j1j03qO0M3l05K94K13k42j65K68k81J27P3j5K3j03
7111d6L29m99K06j61K13n8l04N41k91K0K37j34q7j09N5J59j03n8J30q1n3L39o1
$$ y = [-157, -20, 41, 82, -39, 74, 27, 150, -85, -229, 32, 12, 209, 228, 100, 12, -174, -150, 239, -26, -2, -260, -37, 1, 113, 197, -36, -112, -178, -25, -182, 40, 57, -401, -54, 1, -175, -39, -21, -121, 25, 138, -92, 91, 60, 139, 348, 104, 207, 28, -34, -25, 58, 15, 5, 114, 39, 27, 160, -63, 169, 146, -199, 290, -99, 175, 64, 126, 166, 96, -31, -16, -7, 40, -37, -14, 9, -198, -114, -36, 96, -40, 87, 159, -1, 62, -174, -104, 274, 72, 45, -135, 180, 31, 9, 86, -95, -47, -73, -129, 13, -65, 56, 151, -174, 55, 143, 25, -223, -52, 40, 62, -101, -23, 60, 20, -181, -79, -206, 11, 139, -271, 93, -226, -59, -78, 99, 76, 17, 50, 46, -87, -183, -172, 141, -135, 293, 155, 131, 157, -283, -167, -43, -65, -126, 17, 37, 9, 99, -48, 86, 75, -28, -36, 24, 67, -238, 56, 269, 27, -138, 130, -151, -24, 49, 34, 57, -46, 283, -216, -10, -171, 42, -16, -320, 221, -70, -50, 187, 53, -34, -143, -88, 71, -32, -90, 40, -41, -94, 245, 184]
7134A84r0o1J3Q9k59K34N5j87M40n98J63R9LJ8l53K81Jk23K30K0k33N9n5J48j81
7159b03J76K76k64J33P1j89J36k52P2M2r2J44n6R0n3J85n69J46J80J05Kj24K69
7182B25j46j73k27J80j71J91L57j89no0j05J14Pk37K91Q2j80j48L07j26j07K89
7204A69k65O8q2MJ74o5P8lM0l53P2KL11n2j2K5n30K95p9m2L85j47p9j56J89K45
7230A92j19J14m02K56%j56L19k56J35j43p4R5J93l56J29K95n9k75J15R0q2J60
7252A71j79O5L9l20J79j55J41k35L64j57J40l0M9j64Q3M8L0O8m7j57lmJ20j91
7276a45J17J67Pj44J78j57O0l6K47m93K37j90K67k44Q7l9J19k7j66k5K11p0k8
7299f7K50k09N9j46K60J53Jk33k17J14n1L00k95J02NM2n9L3M3j48j28J88J30l16
$$ y = [184, 94, 33, 46, 135, -124, 110, 165, -22, 418, -180, -17, 82, 85, 103, -250, 31, 32, -191, 39, 59, -174, -115, -170, -22, -203, -27, 249, -15, 118, 189, 0, 136, -116, -44, -2, -94, 50, -6, 84, 31, 216, -353, -207, -27, 78, 80, -44, 225, 79, -94, -321, -141, -312, -121, 236, 47, 42, -18, -123, -9, -2, -239, 52, 134, -46, -194, 113, -13, -120, 169, -96, -28, -110, -106, 68, 3, 81, 78, 118, -235, -163, -161, 150, 98, 86, 111, -419, -124, -203, -245, 140, -7, -86, -242, -53, 192, 73, 187, -215, 41, 41, -115, 204, -52, 83, -60, -134, -39, 154, -202, -73, 222, 163, -112, 3, 93, 11, 171, -8, 57, 96, -224, -45, -200, -59, -294, 70, -87, 53, 23, 72, -92, -9, 39, 69, 137, 90, -67, -70, -74, 46, -145, -28, 139, 146, 2, 180, 23, 83, 47, 294, -199, 38, -152, 115, -129, -42, -81, 38, 11, -155, -180, 31, -39, -67, 183, -26, 33, -113, 147, 300, 301, 68, -149, -35, -86, 214, -81, 21, 26, 68, 9, 42, 85, -63, -191, -3, 127, -189]
7323a89N42l24l27K31K42R4j66Q4p3l36J57Q2k32L75m65M96k55J8L15l42J00M7
7345G4n8j48J44J6j14J21p0O2J75j35M1j82n0M86m84j06K14l13L84M4l3K4j88
7368i6j49J88r5J3P9J14J52k40k1J59k10J6L5r2K05o5j3j91J86j54l7K83j52M34
7392C49n08J47m0L80m02K12k5j02l20J91L37k47R9O3j06N2p8n4l6j2J49j13M0
7415b4M0P1k41r9L47j30J10J17j83k60J80J64j68QN1N5j39K1M3J27j47m6J05n7
7439e5O6Ll6p2q6N15n40K25j09J37n5J72k40k08J90K26k17J11N1J04k78M8J53
7462A05j82K05j11Ln9l2j23L37l51R8n9J04J0o1j89K17J84J00l4k24r7J98L22
7485C61k30j67J06k5k16J93j4O8O3l86J74J36m2M5j26op6K06P1o2J46o0n3J45
$$ y = [-189, 353, 29, -298, -67, 175, 269, 103, 187, 114, -222, -65, 17, -215, 160, -305, 191, -64, -46, 269, -73, 27, 74, 16, -132, 12, 28, -86, 35, -35, 27, 202, 67, 108, -74, -124, 362, -122, -228, -14, -327, 57, 101, 68, 92, -96, -245, -57, -152, -139, -60, 54, 206, -34, -55, 104, -106, -90, -55, -147, 58, -7, -20, -211, -25, -179, -216, 67, -85, 349, -159, -12, -52, 328, -74, 138, 113, 11, -309, -118, 219, -28, 71, 134, 28, 80, 2, -52, -88, -100, 49, -64, -24, 16, 87, -154, -253, 94, -36, 74, 191, 8, -252, -72, 92, -76, -68, -17, 38, -101, -80, -37, 90, -57, -103, 2, -55, 11, 14, -22, -94, -180, 335, -205, 20, -89, 48, -7, 165, -75, -283, -93, 133, -84, 27, 78, 182, -96, -48, 105, -77, 128, 17, 20, -39, -71, -194, 143, -208, -110, -169, -65, -55, -116, -305, -88, 96, 196, 162, -62, -159, 39, 361, 131, -36, 70, 45, -171, 22, 8, 76, 139, -247, -73, 63, 21, 66, -60, -66, -142, 64, 135, 73, 219, 159, 106, 251]
7509B51j60j0r5R7o5r9K0M4k5O3jl1L2j34M4MK9J9k53L55J7k05J24j26P6L8J54
7536A63k04K3rm0J38R8l50PK7J55J00n7j57L35j86j66K09l54M02r8m5r7L10j40
7560F4j9jj47J60R1k8j53M5L4j3J33j78j57K2K54J14j51K02l20j20r6K24o9K00
7584I1j12J9p6l5J3J03j29r1K82m8J65n8k53L2J59k19J70k26K05nQ3r8J23O5K21
7609C81m65L12k4j86J44r9j77R0l2K47k43P7r1r2L39l63M12l58J35P1J09m37j7
7632b67M05k78L46l20O0k44M74k70kj14K78n6k0p7OO4N9j16j03K52j77K57j2m11
7656b66L62J47m49N29j74Jn9j95p4L2J87j39q5K62j84J43J15j62j9J63j31J14
7678A18Q3j59j90J08n5J59j14M6o5q4M68m86oJ86l7J12l2n2J25k26L20k23j01
$$ y = [251, 91, 81, -14, 83, 18, -81, -61, -17, -42, 21, 20, -11, 21, -113, -69, -65, -36, -17, -270, 85, 102, -103, 21, -105, -29, 9, 163, -41, -18, -27, -67, 71, 169, -181, -174, -147, 8, 108, 51, -106, 229, 43, -123, 86, -268, 134, 36, -9, -106, 204, 64, 45, 44, -103, 57, 148, 120, -33, 12, 46, 33, 166, -12, -169, -147, 107, 221, 70, 272, -48, -168, -264, -40, -109, 91, -21, -2, -78, -113, -100, 3, -126, -217, 65, 17, 182, 124, -129, -97, 62, -157, 13, -213, -8, -13, 70, -28, 95, 160, 381, -84, 228, 204, 18, 162, 63, -114, -24, -56, 191, -52, 25, -66, -158, 181, -182, 230, -128, 7, 78, 187, -250, -267, 138, -140, 206, -114, -54, -298, 176, -94, -96, -210, 68, 12, -8, -85, -79, -15, 44, -72, -175, 77, -100, 157, 145, -266, 96, 243, -206, 323, 149, 150, 91, -104, -178, -146, 41, -98, -183, 79, -105, 38, 153, -9, -28, 135, 4, 118, 201, 42, -148, -40, -95, 64, -50, -4, -69, -153, 315, -171, -177, 9, -28, 84, 52, 0, 125, -101, 219, -4, -105]
7701a05j4Q0o0J47j39J25j30K39k46J28Q3m4j4m2m4K00l40K88j46J03j1J84j31
7724A11j32L3K0j38J36L5Q5j72Nq2L4K06j55N5O2J4jj01K04l44J14lj63N60m42
7749e9J19j02J8Q5mp9L0r0J55o9p7J25k62J4L78L8j28l3J50l13J50k79J28L93
7773B88n18K42l37L57o1l6N1L5r9P2K38m60M20j57j21J05J56J2k15M2P4J54j55
7796H7j26K72l35J31r5J18k07L57j07N7j26k03J49j47L01j16k9Q5m0NN2p2L8J29
7820A78l06J39J69j94k6J47j57m9L53l53J53j60N6P5L0q0l1K42o0l7l0j74K12
7843I7o3J42l38J52K9k80K95j04K56k56lL0J26P3k71K40J1k94K48k49K75k11j39
7866b34J90J17kk34K00Lo1J32k49r7M4L71j63K85k23J50j03J83l54K14k13j8J59
$$ y = [-105, -119, -39, -99, 48, -91, 34, -96, 143, -103, 25, 108, 64, 50, 8, -36, 164, -176, 112, -34, 69, 58, 242, 111, -21, 12, 32, -106, 30, 65, 150, -22, -17, -99, -65, 141, -14, 41, 103, 117, 116, 15, 219, -125, -11, -14, -177, 383, -59, 60, -42, -24, 61, 57, -22, 8, -82, 73, 4, -73, 52, -210, -196, 182, 220, 92, 59, 209, -104, 46, -233, -105, 288, -230, 12, -325, 32, -29, -65, -14, 21, -78, -6, 232, -228, 192, 35, -86, 19, 175, 187, -28, 14, 88, 242, 87, -39, 233, -102, 29, -66, 52, -155, 202, 95, 152, 26, -177, -28, -175, 126, 10, -19, 66, 26, 31, 83, 11, 49, 178, -128, 11, 180, -14, -40, 107, -50, -99, 254, -99, 54, -106, -50, 25, 55, -25, -56, 186, 126, 89, 59, -115, 97, 34, 176, -162, -10, 19, -261, 34, -70, 186, -70, -73, -43, 83, 156, -115, 125, 136, -158, 90, -159, 116, -95, -234, -44, 73, 71, -163, 37, 40, -21, 111, -138, -235, -191, 180, 17, 302, 79, 229, 126, 309, -45, 169, -44, -62, 97]
7889I7j89l5R9k8Q6j82K65P3l58L50j34r5n7K45k51L05j90j3J01l7o8J11j44q0
7913a29KK36M4p0o0n7n4L06l13L7R9l2k3J23j84K97m03O3J48k53K13j75K78K2
7937A15j67o4L19k14J34k78L30k59K52j04j21N8o3J1k02J46M46l51L2J02j24R1
7959H9j04p2J53l56M13jq5p0J84l18J8J47mJ10r2Ro6J7M19l90J20j04l2j6M2n9
7985d8j45M16l50K78r5j94J91J29j38k24K6J0J03J23j86k28M51k46J32P1k09L15
8007A82k97K31L7k00N9N3j48L6K01l62J77k07K37jk30J73LJ32K9q9j26J54l03
8030b59O2K91k66j99N90m00L42l71L13J76j05q8mn2o5K21r5j45J77J54k88J11
8052A00j11J71k60J56jj22R5J24o5J36o8k24J04k34K69p5o7M3P4j08J8j41K15
$$ y = [97, -92, -127, -28, -56, 30, -152, 113, 186, -172, 178, 44, -51, -108, 137, -114, 191, 1, -12, 89, 52, -16, 95, -49, -129, -127, 109, 153, 83, 23, -34, -88, 218, -95, -58, 41, 9, -14, 109, -75, 222, -181, -118, 30, -223, -10, -185, 93, 115, -52, -116, 203, -11, 123, -155, 175, -84, 168, 64, -57, 1, -62, -51, -253, -107, 339, -12, 20, 122, -2, 89, -15, -87, 66, -290, 123, 122, 37, -33, 151, -167, -149, -2, -6, 104, 12, 21, -45, -28, 391, 1, 121, 17, -15, -31, 11, -48, -193, 223, -127, 151, 56, -138, 53, 182, 44, -180, -154, -144, -41, 82, -104, -332, 119, -127, 5, 76, -133, 182, -115, 116, 153, -47, 12, 65, -83, -47, 154, -208, -31, -238, -1, -2, -232, -59, -56, 76, 105, 16, -110, 44, -259, -197, 94, -172, -371, 219, -181, 161, -210, 103, 279, 174, 86, 82, 30, -35, 186, 91, -54, 123, 277, -11, 100, -11, 160, -100, 56, 55, -67, 28, 152, 87, 223, 155, -69, 35, -199, 70, -5, -72, -29, 45, -63, -45, -186, 29]
8075B9J40k5j93K11l17J59j89J36k45K86n0J71J34k7k29K21l31K68k35JQ4o2m8
8098a11k8J31L07l87K25pj84K22q3l09M30p7p8j79q7K86l5Q9j93J32j45NJ20o7
8122b3l4j38M9J83m5j10J7L85l57l9J07n6K21k47L08j79R8Kk67k7K10oJ07k70
8146a11j46K76R8J59j22M1k48oN8o4j6NQ2j13J79r2k19Q9M26k80j59K23P8k94
8170a56q5R1Q6j8k2J88M2j99L8M7q1J67J01l06K71k44J31J98k38j19J15
$$ y = [29, 169, 144, -49, 162, -155, 4, -185, -49, -294, -8, -58, 113, 247, 220, -9, 212, -119, 149, -86, -85, -1, -63, -111, -139, -8, 299, -88, 137, 130, -54, 168, 85, -224, 206, 129, 51, -128, -215, 71, 36, 125, -68, 64, -81, -76, 44, -23, -57, -195, -146, 37, -8, -118, -101, 284, -73, -112, -5, -61, 160, -87, 221, 42, 140, 142, -125, -152, 58, 52, 159, -111, -257, 19, 117, 276, 154, 195, -53, -59, -1, -65, -81, -76, 6, -107, 72, -20, -239, -150, 276, -4, -163, 60, 138, -156, -241, -150, -64, -82, -104, 84, 126, -73, -35, 12, -69, 98, 199, -107, 164, -80, 51, 249, 11, -108, 7]
8191G
$$ Imaginary data points
##PAGE= N=2
##DATA TABLE= (X++(I..I)), XYDATA
0@%%%%%%%%%%%%%%%%%%Oj4J6j6J6j6J6k4L2l2L5m3M8n5O3p1Q1r0J02j13J26j42
40g5J58j74J92k14K37k62K90l19L52l87M26m70N18n72O30o98P77q66R70j093J243
61F63j425J655j961K380k994L985n842J0480m3612p2157R7615P6556k9303n0339
75a4299L614J2907N029q758K286J7092j1952m0020J0738M9029J78m6571r723L4530
89D080K6571j1818l9021j3597L8737K3864k2576j2180J3155p539j9275J0764K4880
102A6045P69k1319k0585J1227L7268L87l9579j581L3930j782l2529j952K5524
115E823J0414j1897j5119M808K1911n742l0187N420L5576j260l6023p003K7686
128D407J5554j4706k1081N678K4335n821k9535P037L5012L50l0464o481K2907
$$ y = [0, 0, 0, 0, 0, 0, 0, 0, 0, 0, 0, 0, 0, 0, 0, 0, 0, 0, 0, 6, -8, 8, -8, 8, -8, 8, -16, 16, -16, 19, -24, 24, -31, 32, -39, 42, -48, 54, -59, 67, -75, 83, -91, 101, -113, 124, -138, 152, -167, 185, -202, 224, -246, 272, -300, 330, -368, 409, -457, 513, -580, 663, -762, 893, -1068, 1312, -1682, 2303, -3539, 6941, -36671, -108828, -11213, 65343, 36040, -14299, -10685, 2222, 7251, -1507, 779, 17871, 5919, -34101, -23363, 25666, 25844, -20727, -30450, 4080, 30651, 18833, -20188, -33785, 4952, 28816, 6240, -5940, 7215, -324, -19599, -8835, 16045, 16814, -4505, -25090, -13863, 23405, 23792, -15787, -17368, 16562, 14780, -17749, -19701, 5823, 16237, 4340, -10779, -5971, 15940, 10198, -19989, -14569, 21007, 19747, -16276, -23279, 4407, 19961, 5255, -15826, -10148, 14187, 8366, -21169, -14132, 20880, 21230, -9234, -15715, 7192]
141G192J0169j8099j7786J3300K2925j4652k9757J5099L3610j0091k8901Q769
153h222K6017o698k3173L74K1915R219k2201j8420J7857K0434j6089j9737J5496
166c228K0406j0957k0689L983K0456O559j8790j4245J4930J5699j3396j4844J2702
179a414J6294q482j7820N30J6218Q642j3667j4074J1556J4826j1559j5263R910
192d303J6119n979j4155O66J2678N745j0732q242J1068R254j4613j3856J1998
205d352J5711o008j3979J733J3342K641j2706n573J5178P274j8538j2353J7070
218e60J6467j2160j5976P897J6261m630j8326o63K0667N501k0873r504J9181J0797
232A4079j6222j1839J4137J3357j0093j6332M848J8764J614j7173m348J3685L209
$$ y = [7192, 17361, -738, -18524, -5224, 17701, 3049, -26708, -11609, 22001, 11910, -16991, -8222, 17795, 11097, -12076, -11702, 10213, 19432, -2769, -21189, -3332, 17102, 1013, -18724, -3228, 17178, 6221, -14468, -10485, 9971, 16530, -2260, -16505, -1575, 14124, 728, -14116, -1414, 14880, 6398, -11422, -10892, 5326, 13968, 301, -13773, -2217, 12609, 1050, -14213, -4303, 11816, 5837, -8318, -7652, 5026, 10771, 39, -8203, 2865, 12119, -2494, -16350, -4352, 11359, 5351, -8628, -6895, 6447, 9088, -3618, -9191, 5987, 13261, -5277, -17630, -560, 15907, 3747, -12229, -4332, 11929, 7299, -11027, -11690, 8977, 14478, -6395, -15899, 3282, 14079, -2143, -13982, 155, 13512, 3419, -12913, -8065, 10699, 12313, -4860, -9208, 4477, 7686]
245G686j3417m102J2191O093q480q581M864J1833n60j1875o02J0461M48j1610
259e651k692J0199N020o575o312L879P874k445r108J657J1517lj3058l439J1252
274B115N924p644p210M644Q797l204j1319K693J3228Q37j3852m707J1336O713
288H351q366p829O565J0252n530j3168L678J4291j58j3138j547J1093K326j0982
302d162m267R793P456p953j0492N231J1655k192r920J999J0058k934j1431L90
316f769J1278L280j0531n804Q353P486o621o627N704P753m617r482J612Q703J644
331E362p124l250O796L502o815n103O073P308l643p903K45O889J831m637k679
346c148M389K495m816m600L805O579q37n913r93M578J870m453k343L996L176m577
$$ y = [7686, -5731, -9833, 2358, 8451, -29, -8610, -3746, 8087, 7527, -4348, -4950, 5511, 5959, -5651, -8343, 1856, 6876, 301, -6011, -2132, 5742, 3297, -5811, -4154, 7363, 7360, -5698, -9137, 2115, 8039, 395, -6815, -2171, 6626, 3422, -7897, -5204, 8024, 8861, -4991, -9698, 1638, 8351, -15, -7844, -1279, 8973, 3443, -9725, -6047, 8244, 8086, -5052, -6599, 4494, 6820, -4162, -8429, 1364, 8820, 867, -9625, -4394, 7261, 5069, -4851, -2852, 7206, 4272, -7159, -6769, 4509, 7789, -2742, -8546, -193, 7293, 672, -5955, -251, 7502, 2885, -6597, -4985, 3718, 5362, -1762, -5012, 1784, 5286, -1529, -6632, -559, 6749, 3106, -4797, -4552, 2337, 4168, -469, -3148, 1241, 3736, -1080, -5680, -1875, 4704, 3867, -2046, -3039, 1539, 3409, -1044, -3387, 609, 3785, -792]
362g92n108L238P052o49o695P39O326n44p142j292Q288K635p689m915N836N828
378E116m472n373M757N996l981q236K204Q724N84p900k699O704L251n562m146
393e033N362N447m306o489K392O371p57n872J58N197J93n379k108N379L803l227
409A131l728J772L722j830k734J588K674j436m068n19L276K303j719j874J488
424D6J903j407k619K027K361o74k758j411K096K252j037k575J721K619k044m033
440c533J246M050J019l316k364K671L164k189l457K773M266l441n028J567M829
455B257M18l888j052L492J189l729j986M070L147m202k877K782K917k279k322
470b063J861K514q58l652l33L686J514l421q46L271J20l294p71K617J598j765
$$ y = [-792, -5900, -2662, 4390, 3741, -2954, -2215, 4111, 3567, -3575, -4867, 3421, 6056, -1633, -6548, -712, 5116, 644, -4729, 28, 6024, 2043, -6193, -3989, 4735, 5319, -2581, -5280, 1424, 4675, -887, -5033, 329, 5776, 1470, -5019, -2627, 3744, 2987, -2885, -2727, 2470, 2663, -2716, -4824, 555, 4358, 1131, -2597, -825, 2897, 1067, -1667, -79, 2595, 1159, -2909, -3428, -152, 2151, 432, -1442, 46, 1949, 542, -2077, -50, 2311, 1637, -1121, -2532, -436, 1816, 779, -1796, -75, 2544, 500, -3533, -2287, 1763, 2782, -534, -2898, -227, 2937, 748, -2709, 64, 4330, 889, -4139, -2572, 2257, 2675, -1213, -2265, 1227, 2416, -1313, -3299, 771, 3918, -284, -3161, -379, 2538, 259, -2063, -202, 2312, 1454, -2198, -2531, 1155, 2669, -752, -1598, 1673, 1793, -1501, -2272, 345, 1943, 178]
486A78k694O95L252O07k598J80K717o96k889l74J501M54l09j118k58J271Q74j355
504e62J05J781M4j117p72l08R71J199q73j645J017J074j637r50J796J288j209
521B02j295k07J643J060j512n67J851K30k706m86K839M19j812m77J150P23j082
538b7j464N44K848q82k925J76L177j19k281N88J610N4k154o48J479J953j177k468
556a716J207K139j302j328J400J000j269j069j94O96P59l78k69Q70M74j183J52
573a1J059m47q06K3L52r10J1N94J44O5k22l14L54N98l17k3M62l74q09N68N42p20
595a81o8N42j37r07j92J002J045p58p84J95R87l52j355L32J874n78j641K03J142
614C69J05m99P9N54J95j201p89Q39J206r13r01Q79N68q09k17P29P32n04j022m02
$$ y = [178, -2516, -1821, 1431, 2038, -560, -380, 2337, 1641, -1248, -1622, -121, 333, 24, -1094, -1352, -81, 793, -562, -457, 1324, 1368, 251, -521, -829, 142, 1341, 468, -1177, -160, 914, -723, -1673, 123, 1411, 202, -1093, -1300, 343, 1403, -109, -676, 1175, 1405, -1301, -1787, 1052, 1471, -341, -818, 332, 1055, -27, -1491, -947, 1901, 1019, -1906, -1730, 1447, 1328, -953, -365, 1245, 1299, -855, -1503, -24, 1929, 752, -1716, -509, 1630, 328, -1000, 400, 1400, 131, -938, -1132, -436, 323, -55, -324, 546, 1020, -163, -11, 1048, 601, -205, -182, 170, -740, -729, -135, 9, 74, -148, -462, -108, 490, 173, 150, 612, 238, -571, -3, 539, -181, -249, 293, 156, -751, -943, 59, 1104, 346, -438, -243, 744, 392, -963, -631, 1243, 665, -976, -773, 369, 474, -25, 54, 608, 803, -398, -1187, -348, 858, -55, -956, -77, 491, -318, -535, 194, 926, 422, -600, -1002]
634a002J283n9o30K34Q78n16j210M85J112k20o18K8nK34k33q9Q41L04p32r25R22
655H2J31l85K47M44k38j153K06N56K18J9j81RJ76n56j79J164M41p36n42N44j99
676F8r42K59J039k1m50o73M30P59K90p62K51J89p27p51R35O80m99nJ21J23l21
697gk94M01N51l12q54j16J017k59o40M49Q33o89o68J13L53O53m21j54q9L42o93
718d84l11J264p8l34o00P27n7k11o9N22J98o08l24P6M32k46m94P31J87m07n71
739f57R15M84o25n26N36J27l70l67O23L09J26j101L09O69l70j59M08pk62j52k11
760c01L16M73n27j13M59j83l21k94J139l71m69l26Q98k57k78k7M85J55n67k93
780d02J69N34q5m27L14L36n13m36P88K71p85J73l25K70PrP0O90k95r04M13N85
$$ y = [-1002, 281, 222, -408, -174, 704, 188, -1022, -537, 575, 355, -263, -235, -240, -6, -239, -328, 513, 817, 85, -840, 82, 213, -172, 75, 519, 281, -872, -666, -110, 108, 127, -54, -45, 131, -425, -604, 560, 1001, 265, -277, 267, 68, -874, -615, 424, 403, -47, -720, -290, 469, 759, -3, 248, 437, -290, -1041, -106, 574, 75, 70, 191, 314, -7, -301, 100, 651, 339, -515, -631, 386, 127, -513, -64, 769, 80, -588, -475, -122, 531, 110, -44, -133, 209, -484, -795, 469, 391, 57, -543, 184, 127, -84, -153, 369, 567, -41, -365, -289, 143, -103, -597, 134, 321, -86, -657, 258, 742, 117, -409, 127, 254, -116, -483, 140, 449, 575, -526, -217, 452, 82, -77, 331, 324, 62, -90, -301, 15, 488, -39, -152, 307, 124, -197, -491, 648, 277, -192, -518, 380, 123, -155, -182, 303, 458, -109, -402, -233, 301, 216, -211, 103, 439, -74, -510, 278, 549, -236, -63, -388, -118, -111, -120, -50, 640, 345, -559, -146, 439]
802D39l44m03K21K98k94k45j45N32K07k44k36J38J34m18Q4N73J04o35j7J81L18
823B48k70R8P7M22n38n28M58O36o64q0L21r6n58L1P13N1j01n07K52L73k22m66
845c50M59K07l85m31M98K06n1m30M96K07l64p56N58L36k33j32J79J91q8l01RO29
867D54l07j90m01L52M96o06L56J72J16n82k25N01P6j33j04M0K5k44r4J96L74l52
889h0r7K10l4m3q0L27K66p39jJ76K71k6n90M44k0j49k28P38J9nm11lL39j69n27
914d12K14L04j28k26K1N60k72k6j55L95l10j85J10J65J59l95J7K60m1m61P6L84
936E4M28m46l59N35J7l89r7N14L2m56j85L58O0q9j65J49K75j64m30L37N39k95
958B23k61P6l9L3k97J03K00j35k27K38M1K49m40j28N37j37k45K6M15Mk28n4q7
$$ y = [439, 95, -308, -87, 211, -83, -328, -473, 59, 266, 22, -214, -76, 58, -360, -276, 297, 401, -234, -251, -70, 248, -22, 76, 153, 575, 37, -491, -33, 603, -61, -141, 180, 84, -474, -443, 270, 321, 220, -287, -35, 338, 116, -350, 109, 316, -69, -500, -2, 204, 153, -277, 219, 426, 62, -694, -136, 200, -33, -165, 14, 205, 117, -184, -175, 454, 147, -43, -444, -92, 404, -202, 154, 326, 442, -140, -365, 136, 212, 79, -25, 15, 40, -204, -298, -102, 272, -80, -177, 33, -1, -44, -124, 203, 469, -270, -271, -95, 176, 150, -440, 4, -16, -165, -393, 345, 364, 359, -52, -55, 284, 115, -412, -198, 106, -22, -248, -227, 333, 61, 35, -120, 275, -35, -220, -110, 55, 214, -181, -164, 96, 55, -406, -330, 54, 482, 36, -323, 212, 229, -160, -257, 257, 289, -167, -352, 6, 66, -23, -188, -39, 236, 72, -358, -21, 518, 223, -38, 38, -1, 32, -265, -162, 38, -97, -324, -86, -45, 204, -236, -364, 173, 36, -209, -183, 232, 236, 8, -46, -133]
981a33K40m79J1O22k14l69J37N27j43l06L83n1r1m26k11M49K70m04k5L76K16k71
1003A08n19M79L04n27L3J99r3o7l26M22K80k53n97P06p7J09k26J10L74m42k42
1024b45K53M2K12l01l28K15L90l66k23M27K47m93N7q3K78k31j6K95j21o8k10N81
1046C12j23k48J91j59q2K7M5m0J43j61j21Q5J02j31K4K54j34j98J81j7J20J55
1068B25l47J37N8r6k19K10kJ72k18M8J72j92k14L45J41m43k09L58K68k39j15J15
1090d5oJ38l15j08N33j4k23l74M31L70m98J57K88q1j30p7l5K4j15j09K66J27n1
1113A53l90j19N72L9l34K07L5l90J69kK60Qn3j46J46o2j81l3Q5K28o6k13J25J69
1137B07k92J13M20n41k37K43L19j35j13RJ3N4lk51J91P3k4M4j72K9PQ3K1m5l71
$$ y = [-133, 107, -372, -361, 261, 47, -322, -185, 342, 199, -107, 276, 225, 134, -292, -503, -54, 216, -188, -213, 163, 379, 108, -411, 68, 372, -155, -122, 77, -16, -83, -409, 13, 293, 40, -557, 149, 72, 181, -45, 65, 439, -3, -245, 8, 50, 262, -39, -367, -152, 238, -128, -351, 76, 323, -170, -113, -196, 82, -149, -165, 130, 9, -59, -269, 312, 189, -59, 132, -27, -109, -82, -37, -77, 66, -95, -216, -131, -29, -160, -136, 118, -16, -214, -33, -50, 70, 225, -122, 15, 73, -23, -242, -32, -34, 138, -80, -32, 140, -52, -266, 79, 220, -223, -432, -74, 194, -45, -160, -45, -51, 87, -228, -336, 197, 183, -40, -414, 17, 387, -111, 46, 334, 253, 123, 46, 11, 35, -80, -189, 77, 204, 153, -237, -356, 216, 255, -79, 128, 163, -227, -58, -60, 200, 208, 155, 9, 155, 93, -88, -121, -36, 192, 126, -87, 38, 207, -85, 28, 448, -93, -330, -87, 232, 97, -16, -7, 6, 60, 57, -194, -3, 70, 46, 90, -82, -53, -46, 37, 58, 13, -358]
1162c58J52L06J10m03P6J40N7k21n8J43R6m9j24J37R5j27M6K39j49p4k08K06k9
1185CJ86j98L0J3K4l2l2j00L1O3j71K50q5q9j23L83k5j55p0j83L25j99K14K6j9
1210F7k85M37k07j70K82j59K80k08K08m51nK87j58O9k78K16J17j09P7J47k41j29
1232b13J80J14k59K48k4j24K4n3L52k40k38K21M5o0k44K30K41M6j0n8k45L9OQ3
1256F1j65K34K11l46J42k68K20j57o6K8K12o8j47J03M1P9l36J74K26k05j35q3
1278b45K91N9j03R8q7J22l30K19r9k0r0O0K05J18j97L2K55l04j34Q1J07L0k16
1301a48L72l45l9LJ82M0K02k84J58N1j23j04q7Q8J0m0p9L11J36n06m5K70R9M6
1325A68l19K49L7k38j43Q9J50J14k09j35J78J35l71K81L06J58k19k03m6J28J6
$$ y = [-358, -206, 100, 210, -193, -117, 23, 80, -141, -199, -56, 40, -9, -133, 4, 99, -28, 18, 257, 108, 34, -174, 32, 3, 189, -9, 21, 34, 58, 26, -6, -106, -75, -12, -183, 67, -18, -107, -230, 153, 128, -27, -97, -280, 45, -154, 60, 86, 67, -218, 219, 12, -158, 124, -35, 245, 37, 245, -206, -211, 76, -82, -13, -291, -75, 42, -67, 10, 157, -84, -213, -33, 81, -178, 70, 46, -78, -54, -107, 245, 5, -233, -12, 33, -27, -271, -41, 200, 246, 236, 178, -67, -28, -22, 61, -104, 130, 341, -5, 137, -131, 89, -68, -134, -106, 106, 38, -109, -6, 35, 114, -222, -48, 178, -27, -162, -245, 46, 105, 2, 100, 13, 135, -195, 24, -75, -95, -185, -125, 80, 198, 1, 33, 288, -16, -150, -69, 38, 68, -148, 224, -121, -160, -157, 25, 65, 267, -17, 141, 192, 69, -35, -122, -34, -24, -64, -143, 168, 304, -202, -247, 23, 122, 168, -151, 98, 135, -103, -246, -157, -7, 107, -102, -237, -59, 76, -295, -14, 292, 450, 231, 28, -18, 110, 126]
1346A26l2n7k88Q1J99J87j73n1j25P6L0%N5NJ10l4k3J66p9j67L7L7J03l12K31
1371A02k69m4M56k80L31R9j14j76J45L6l38P4%J77r8N4n9k14j1J83j51rK16l0
1395H0L7q1J57j25k19O5N9K01q7R1k21k4L28m30L65j42j21Q7o0J65l34K72L3j50
1419e4J46j40J3j82J67L4J00k80l4J60K04l28P1L06n2j23K8o9m3j8J86J38j00
1442A30Q2o2j95K4L7k24L74j75J64lk84p8K29p1o9J30J4N8j06J7R9k2m0o6L01
1467B64l02j5j6J66j59o9J38J09k92J8Q7K70m9k25m1j57J74K07j56K60k47j02
1489a37J16M7j19P5p5J01L7m9j62K10J33j20k92J20K53m2j63j31L56k88K71O7
1511B08j98p8J48J07n9n1K8j65P9j64M22l23R2m6J78j87N1K85m94L64k46J57l34
$$ y = [126, 94, 37, -251, -170, 29, 216, 43, -8, -133, -57, -27, -27, 28, 33, 143, 109, 86, 252, 173, 6, 43, 80, 183, -129, 102, -167, -211, 245, -35, 296, 395, 281, 105, 250, 286, -52, 22, 22, 199, 101, 155, 96, -118, -129, 54, -97, -106, 110, 80, 117, 36, 193, 68, -151, -86, -27, 174, 87, 178, -43, -67, 261, -169, 196, 54, -67, 20, -40, 125, -209, 63, 96, -54, 92, -48, -35, -217, -50, -16, 84, -196, -230, -70, 134, -194, -123, 183, 131, 8, 36, -33, -76, -94, 92, 230, 130, 212, 150, -45, -21, 16, -208, 166, -9, 155, 152, -132, -210, 19, -52, -121, 9, 23, 81, -25, -8, 91, 69, 29, -37, 264, -38, -53, -69, 97, -62, -131, 7, 116, -176, -158, -71, 199, 150, -75, -116, -273, -99, 108, -48, 212, -35, -137, -21, 26, -93, -18, -93, 8, 45, -4, -166, 44, 177, 57, -235, -115, 138, 96, -67, -198, 158, -130, 141, 208, 10, -68, 80, 187, 128, 77, 105, -60, 19, -145, 277, -46, 46, 0, 178, -9, 42, 327, -167, 197, -49, 108, -226]
1534b26M61j20j36o9J56l1k29J9M07k08M4l06R9K33J05q7l65J82J31P1r6n1j37
1557a53r3P8J45K38j6j97l2j60QK12J54j97j54L39k24J75q2j39M64l41l6j01J2
1580a00L2L02k48r9L5J71k00J3J83N8Ll31J64l8j37M14j12m3Q7k04j56K09Q9k93
1604b01P2j01K68p0l3Lk2R9j08k23J73J28j02J48n0O6k49J51L02l37J48J61k76
1627e3K55j7k92M8J06N7J9l14J45K08j30K78n14L07k11j46m6K44K80k33j46l5
1649a90J54J26j94J55J44k93q6J79J66j5J4m49K83o6M0q9K81k6k34J30j82N4O5
1672c3k38R3K06r0K48l95Q6R2J10k1j60L04l43J9j04L31J5j6r9jl8J14l28L80
1696A32J9l4m30L21j72K48O4j86J1M0M05n73m1K00k6j25J79k76K28j07K22l8K44
$$ y = [-226, 235, 115, -21, -90, 66, 35, -194, -175, 232, 24, 68, -238, -139, 94, 199, 112, -253, -71, 60, 131, 35, -16, -153, -246, -168, -23, 215, 199, 2, -30, -190, -182, 30, 184, -13, -167, 172, -52, 123, 41, -98, 366, 25, -11, -112, -100, -68, 234, -14, -113, -78, 93, -107, -94, 89, 147, 150, -181, -17, -55, -192, 222, 110, 67, 154, -50, -206, 3, 92, -201, -129, -230, 38, -32, -65, -62, -84, 15, -93, -316, -143, -15, -117, 31, -19, 47, -202, -51, 251, -86, 62, 223, -53, 202, 185, -107, -59, 47, 104, 123, -191, -46, 162, 32, 310, -204, 103, -108, -254, -300, -56, 224, -9, -155, -190, -36, 90, -104, 51, 195, -98, -184, -5, 161, 146, 160, -289, -6, -72, -32, -121, 160, 134, -100, 30, -152, -98, -33, -271, -178, 28, -62, 186, -209, -123, -31, 79, 58, -102, 202, -141, -122, -226, 105, 120, 104, 5, 4, -34, 80, -248, 132, 151, 117, -313, 8, -164, 84, 148, -38, -27, 13, 418, -155, -196, 4, -22, -147, 32, -244, -16, -123, 99, 61, 305]
1719C05j66k83o1J33J79m9j12j41O48m99K3M8K62j09m95M08j74L25l35k04%M43
1741A46k60j48J45L83l15l22K34K27p8k68J79J77J49l19O4n2J29j45l66M20J87
1762A67M4l71R7K87l32N8k31L40j01j48O0PN14k36k11j13J47J19l06k05N62r4
1784E4j50j02J57K8J4k35K98o2j41j20M18l52L90l17j85L80L5j69k33K88K14k24
1806a4n3J66J39P9j43k43L4J68j50l2P2J74l13j27K47J64J30j84l60N74p1l21
1828f4k53K52J43j61K1q6J36J40j18k2L5K2J7n4J02M9j55k13Q3K30N8k25J5J37
1852H9j42Mj37R3n3K95j58m7J10M1K0l37L70M3k72k51N00j6j38l84L55q9J63j24
1876f5L7L47j24l60K0O8J82r7j28L2K40j35l85M47O9rl51J34K57K42m84j95J95
$$ y = [305, 139, -144, -205, -72, 107, 58, -54, -195, 453, -46, -23, 25, 287, 178, -317, 91, -83, 242, -93, -297, -297, 146, -114, -262, -117, 266, -49, -371, -137, 90, 12, -256, -77, 100, 249, -70, -6, -58, 71, -74, -440, -20, 167, 211, -160, -63, 224, -108, -50, -281, 59, -42, -190, -130, -123, 391, 155, -56, -169, -22, 97, -209, -414, 148, 54, -96, -198, -41, -13, 1, -234, 64, 2, -139, -259, 159, -193, 197, -120, -305, 75, 110, -59, -292, -4, 210, -14, -67, 99, 238, 317, 174, -69, -35, 133, -17, -49, 23, 197, -116, -243, 4, 168, 298, 114, -246, 328, 257, -64, -317, -65, 78, -83, -62, -148, -12, 128, 10, -12, 23, 45, 62, 8, 110, 159, 4, -209, -126, 104, 162, -63, -48, 89, -53, -49, -186, -93, -146, 149, -9, -56, 54, 95, 115, -222, 148, 191, -81, -332, 168, 152, 14, -370, -15, -104, 59, -65, -28, 319, 195, -165, -145, -77, 105, 8, -120, -88, 152, 17, -368, 79, 148, 139, -212, -78, 179, 421, -63, -258, -63]
1899f3J40J1l66K86K15K7p98K89L51j01K1o2m0J29l70q3N23K29k30l12J45k96
1921c55N07k12R3k29L87j79m31K95K00J45m42L66p0l2j71lM50J11k25m32K11J84
1943A68j74j33pM29L4m39J0L18j42l21K96p3K45k05k22J98M17m13l14K01L95m14
1965a46j6N8K46q2j47Q8J10L68n66q4J61O5J57l79j76O32l24j93n1M61J6n47K11
1988a38J47J60q6l29L16K17j73m95J26M92l39J71j99J88J26j40j38J35O2J07k51
2009d1j81N63j08l66j57K01m7L71n20L35R4j16k6J11ql3k39k67P47j21m01k3K37
2032Eq3J99l77lM27k12R1l14M08K75o18K68K5K9K69l72o0J42j0k43J73l6N6k33
2056a94jM21j15j96j81J37K09j1k03P7N9K51j68j64r7K99O7m29J91J27J11n25
$$ y = [-63, 77, 88, -278, 8, 223, 250, -548, -259, 92, -9, 12, -50, -90, 39, -331, -414, 109, 338, 108, -204, -59, -355, 152, -60, 33, -196, 191, 12, -419, -124, 76, 221, -221, 145, 75, 43, -128, -131, 319, 430, 205, -227, -16, 168, -6, -139, -146, 283, 317, -122, -112, 206, 64, -257, 39, -34, 211, 6, -216, -18, 399, -14, -328, -127, 268, -146, -162, -104, 142, 60, -87, 1, 111, 479, -87, -171, -10, 55, 212, -167, -343, 289, -35, -228, -279, 182, 198, -349, -138, 9, 169, 83, -246, 70, 287, 114, -381, -255, 237, -102, 69, -130, 58, 184, 44, -94, 41, 103, 210, -41, -222, 341, 233, -133, -290, -89, -136, 235, -285, 50, 144, 28, 2, 113, 105, 72, -167, -434, 313, 192, -209, -232, 5, -78, 121, -256, -259, 168, -44, 47, -267, 141, 416, -202, 66, 91, 120, 389, 17, -43, 99, 89, -154, 19, -17, 39, -194, -195, 226, 111, -85, -266, -129, 80, 69, -134, -57, 2, 253, 85, -79, -176, 123, 190, -239, -48, 79, 190, -335]
2078c35L11J11k9j37K14k56P7k19k7N68k5j83k01J96J4m4j03l8%M71l39K2J77
2101B25j56Q1Jj24L41m72on3L58P8o50M15p9l0N5m0j38M71k75j55MM01o7k14P1
2126D2l9L92n64j87O49j02k80k40J93L52j16l35J91R3J66l78J91L21n8k96l33
2147c38L39J93o8k65K11J51j95j63Q9q1K12j46k14J44K34j96J50j19P1M7j96L64
2169B24j96K72k02l19J44M10l81L6j94M08j0o10K57L21j1j02j73M0K97q0l11P5
2191a05L66l08Pj68L65j81K3J32j68M0N0k72J51J69P9l4k71J78r6J21O2L7k25
2214d8N9j05K88k0m00j81K94K24j48J3J55j23QK8k23K10J12l69qM34l02J68j82
2237a16J61J58m98K69q6J10J03n5j78K26j15R3ok27K45J38j20r6j29K32j74K2
$$ y = [-335, -24, 87, 58, -79, 135, -121, -44, -263, -290, 278, 253, 70, -131, 65, 79, 35, -68, -106, -106, 365, 26, 48, 225, 69, 150, 151, 27, 368, -104, -110, -163, 195, 273, -377, 38, -41, -71, -16, -56, -194, 277, 2, -153, -149, 252, 185, -29, 42, 3, 395, -169, -356, 293, 191, -89, -329, -136, 216, 100, -235, -44, 49, 215, -163, 28, 349, 291, -5, -338, 1, 194, 126, -139, 72, 223, 28, -135, -46, -127, 85, -61, -275, -131, 103, -93, 57, -62, 9, 56, -140, 224, 28, 300, 98, -221, -77, 333, -48, -12, -206, 202, 192, -418, -161, 160, 149, 47, -126, -86, 211, 131, -180, -105, 261, -47, -40, -208, 157, -24, -1, 131, -37, 3, 53, -219, -68, 101, 180, 146, -125, 53, -43, 78, 140, 177, -48, 11, -94, 194, 174, -226, -407, -113, 111, -37, -24, 131, 8, 16, 44, -179, 31, 143, -226, -234, 200, -102, 66, -116, 45, 203, -295, -26, -112, -2, 101, 46, -132, 94, -21, 72, 66, -161, 84, 222, 102, 6, -123, 109, -65, -43]
2259d3k1o9mL6J42J38l69R4J6J98N8k06k01J47M90l98k15j2O8J94m31K72K49r
2283A24m34N8K55J27j26l3O2L22k96l12J13K59n3j56K8K43k47r3J92j70J27l8
2305d8j31K19j37j42J72n9L15k00K19l76K10K02k76j09J15k9q1o9K4N5P4p4M4
2328h2k37K50o5Q6L07k83K19l72N82l84P4j22l0K2j02M9p8M10l55j20L51r9K9
2351E0K28j53k77K53J21k42j43K01K59j39j07r0R4k68J40K02j83Q4j65J81J8M
2373F8j11p5K90nk51k37L91N6r0j08K23j4J32j77rj64j9j36L62k48L03j43l35
2396b97L9J00q3L37K55j12k71k5M5k0P7j43pO9j44K91k23k41N94k84Lk56K64r
2420d1r2J55j58K04k53R2P2K9mm1K52k19J11j99R3j11K17j73n8J01K67j38o2k07
$$ y = [-43, -64, -133, -137, -101, 41, 179, -190, -96, -80, 118, 176, -30, -231, -84, 406, 8, -207, -219, -151, 43, -388, -116, 133, 124, -310, -252, 3, 130, 4, -29, 33, 355, 59, -253, -140, 119, 66, -90, -62, 181, -66, -159, 33, -137, -10, -48, -179, 40, -97, -239, -67, -126, 189, -11, 208, -168, 42, 244, -32, -141, -26, -55, -136, -205, -181, -126, -52, -126, -82, -319, -69, -134, -48, 259, -24, 195, -177, 405, 21, 95, -27, -57, -35, -137, -88, -166, 244, -111, -231, 120, 21, 50, 278, 125, -152, 101, 222, -20, -163, 38, 297, 158, 51, -39, 55, -213, -73, 129, -54, 30, -135, 46, 64, 68, -43, -118, 172, 167, -84, -321, 70, 126, 36, -72, 151, 137, 269, 92, 83, -81, -100, -236, 126, -122, 181, 38, -297, -258, -158, -241, 96, 351, 239, -32, -57, -12, -32, 45, -98, -105, -36, -180, 111, -112, -353, 241, -43, -40, -296, -32, -41, -133, 22, -136, 68, -185, -93, -21, 8, 4, -37, 215, -4, 107, -92, 1, -110, 107, -66, -124, -23, 244, 106, 44, -163]
2444a63K77j34j07j34J83K10l99K27J5J66j06k37L45j35k22J35J15m0Lj86o0M06
2466A59j36k8J49J2J96l72m6K71k65J16k8J34k15N0r2K51o0L3q4k38L91l60M08
2489B46k35j74J04k32L80J32l28J76j7J18j43j16M7J57p3k52J73n1j43L69Q2l1
2511A89j71K1n1k8J34q3m0P6J46m38J24J41l4k1M2Nj95J34j9J61j56P%R3q8N6
2537EJ7K45k83o9j60o2M53j42o8j19J97rk0k17J87O6j45L7m8k2R4R1J78k16K5
2562A5j6K0q5J05j3m9J24l3j21P4j24J63jk93M21l91M37k01K67l34j2J4O2j12
2586h3P7J65j66n6K45o9p1K8l55J46J85L4l1O1Q9j29j62K24J9j98P6p1r8K06j11
2611d5M6r1N3J05j87j34L10mm0j90K16Jp1J25l8K42k43J71n01L36j56K50j00k52
$$ y = [-163, 114, -20, -127, -261, -78, 132, -267, -40, -25, 141, 35, -202, 143, 8, -214, -79, 36, -4, -1, -187, -247, 159, 23, -5, 144, 156, 352, -20, -66, 205, -60, 56, 28, 162, -53, -3, -95, 156, 96, 129, 45, -193, 198, -162, 246, 11, -163, -59, -291, 89, 221, -107, 69, 52, 170, 27, -89, -42, 115, 42, -210, -37, -88, -231, 138, 220, 189, 18, 39, -12, -40, 94, 11, -29, 47, 193, -245, -121, 20, -14, -35, 7, 12, -183, -49, -68, 93, -63, -56, -56, 37, -51, 5, 22, 267, -16, -85, -245, -307, 146, 4, -64, -183, 14, 5, -15, -232, -45, 21, -124, -87, -135, -157, -63, 28, 206, -10, 15, -1, 19, -66, 39, 26, -23, 101, 68, -53, 21, -103, 60, 59, -234, 187, -204, 233, 32, 299, -35, -47, -33, 29, -83, -6, 159, -7, -63, 182, 113, 42, 70, -285, -139, 46, 80, 49, 110, 199, 70, -92, 132, 151, -47, 29, -42, -140, 66, -45, 1, -90, -37, 68, -119, -253, 57, 53, 13, -177, 39, 40, -31, 94, 56, 298, 55, 226, -275, 61, -95, 155, 55, -197]
2635a97J07Q3K24k63O4K89m54L86Lm40J35P2j43N5J73j53O8m2J58l59K10o7l8
2658a29J53j40pK53l88L74j71Q0L9j00J53j59k16L63k9j40P5j20J61Rr4r2J38
2681A3J5l6L3o1l9J09r9J5j93M07j94K3O2m3M0n3r4K19j27p4Pr2M54m07J26m3
2707c2j0j5K93p8k79K03PJ34j71k67J91K3K7J22LL5n22N02k10Q1P2J98l52j22
2731a67P7J24Q0M4K8j94j66j3K9l7M79k58J68m06K77J59k51J43J23l55L12K26
2753D22m14j29K60j66J08J19k09k31L02M6k29J8L2n7J66O5r3q5Q8j16K7J35l24
2776b65L30k64K29nn5K13j05k55k1Q4N9J90k58J89j06P2K46J2k84N4j35O6M9k4
2800A6n6K72l06m2K02%j52P3M0l20L09k35K41j5j11R4J3O4j74j23r1K83j53J08
$$ y = [-197, -90, -7, 217, -46, 18, 307, -147, 239, 242, -198, -63, 9, -134, -79, 94, -59, 9, -33, 125, -234, -24, -91, -129, 24, -116, -123, 130, -258, 116, -55, 25, 64, -36, 117, -42, -258, 105, 76, -64, 11, -109, 52, 61, -33, -125, 13, 28, -8, 25, -36, -75, 34, -65, -50, -243, 164, -30, -7, 55, 12, 52, -1, -95, 124, -3, -77, -70, -162, 292, -115, 11, -32, -42, -57, 236, 158, -121, 82, 89, 223, 52, -215, -24, -1, 26, 148, 151, 186, -336, 166, -44, 37, 109, 307, -45, -167, -90, 34, 114, 158, 186, -8, -174, -187, -158, -195, 284, 26, 194, -212, 65, 224, -27, 116, 239, -116, 196, 422, 8, -121, 139, -27, 81, 200, -9, -240, 62, 108, -121, -103, -71, -128, 38, 103, 10, -75, 13, -103, -76, 59, -265, 65, -199, 30, 25, -30, 183, 78, -177, -198, -114, -55, 135, -123, 66, -40, 32, 278, 290, 6, 60, -75, -9, 40, 16, -40, 232, -74, -116, 86, 86, -66, 7, 47, -273, 36, -199, 42, 27, -84, 10, 23, 87, -87, -210, -301, -18, -171, -63]
2824f3j4N0j10J67P7j82l4j19M17k9k29Q8j18N8K3M1Q3J05l20K07j96K48k6j63
2848c9L65j80n1r7K0J22j87p4K27K22k78j34j8K12l5j8L3j60q5n5K8Q8n1Q0j02
2873a67K56k61r3L38j83K07L3j78j34K10Oj03o8QK7J12r6J24J59p1j72J00k88
2896b34L84k37K05k90J62P6j47M7N0K4r7n0r4L51j70j39K43k03N3lj35K44k28
2919a88L0L61J08j86l27L7J79j34J73J11j2K6l46K09j05q5J85L0j73J88j59RK53
2942A84L4k38J58j39K43l43P7L1j8J20j79J08k91R0J41p5J27k59N08n59J71J45
2964C6j98K15J14l6J18L9j0m01q2J83K53k73j7L8K25k67o4J35P7j59J5P0q2K8
2988d3J71o3j00m7nn1kJ6K58k8J04j43j53K72l04K06j61J17L4j7o9j29J23j03
$$ y = [-63, -77, -27, -137, 30, 107, -75, -109, -228, 189, 160, -69, 19, -99, -41, -18, 23, 106, 211, -109, 98, -98, 150, 124, -39, 326, 146, 95, -2, 18, 140, -47, -121, 106, 328, 50, -84, -102, 110, 75, 57, 90, -70, -155, -210, -182, -94, -145, -65, -167, 89, -172, -265, 73, -110, 97, 130, -48, -182, 28, 34, -69, -137, -129, -102, 10, -86, 38, 197, 126, -46, 54, -234, 150, -87, 118, -172, -10, 66, -81, -34, 16, 40, -57, -107, -201, 150, -20, -159, 84, -119, -66, -69, -204, 40, -188, -158, 203, 311, 125, -202, -165, 14, -120, 53, 164, 152, 178, -168, 41, -64, -149, 36, 66, -107, 81, -78, -69, 184, 218, -20, 138, -1, 242, -101, -24, 7, -11, 109, -70, 38, -253, -163, -22, -97, 30, -229, 279, -280, -109, 36, -162, 53, 167, 131, 249, 288, 278, -123, -205, -22, 231, -42, -59, -21, 204, -63, -127, 8, 85, -74, -59, 11, -71, -43, 128, 65, -35, -82, -87, -138, -140, -124, 134, 106, 210, 67, -86, 186, -118, 88, -73, 44, 78, 61, -8, -137, -14, -117]
3012a17j05J76j58L04L7m83K91j4r2K41r4j25L18k41J33j48j57K38q6R5n3J37
3034I7k1l44J76P2l7L28l54K0M3J88k41q8P7J47p4m8J9J46k00J89Kl58L06n3J09
3059A01R7l0j46j75L3l8J29jN8L4j27j0K8J24k83N9J51K56j93j11j18K79O1Oj97
3084a3j57R1J58k97L07o5j59J30n6K48k25oJ18j16j63J71M3J65k65k34L26n8N5
3107bJ3k81K06J95K5j26R9k07L62k47K17m68K44m5L8j48J55K46j25n3k00J34M0
3130G2p2j00L27q4k10P0O0l5r6K8o3j9L24k16j54L55Q0l60r8J45J7J18K01o1l21
3155i2J82j85K12k31O4Q6q2j8J17o9J6pj90K75Lj10n3L16j8j64k21J02o2m9J8
3180a60J28k0P6N4k58K37J60l2p5k50J19K02r1L4k06K35k81J19j65L39n8m36L38
$$ y = [-117, -222, -46, -204, 100, 137, -346, -55, -69, -161, 80, -14, -139, 179, -62, 71, -77, -234, 4, -82, 13, -40, 97, 76, -268, -92, -20, -57, 271, -83, -63, -20, 168, -73, -161, -84, 63, -11, -59, -40, 106, -94, 95, 97, -261, 45, -8, 101, 198, 168, 22, -153, -120, -158, -29, -30, 28, 62, -65, -75, -47, 77, -206, -147, 4, 260, 67, -44, -162, 117, 178, 184, -13, -170, -79, 79, -218, 89, 24, -135, -5, -61, 187, -38, -44, 74, -42, -205, -34, 9, 174, -91, -325, 1, -57, -2, 11, -270, -64, 131, 156, 30, 129, -78, 284, 37, 254, -214, 30, -15, 23, -125, 30, 276, 151, 98, -102, 32, 72, 0, -100, 227, 143, -67, 3, 63, 28, -68, -40, -103, -122, 202, -14, -168, 187, 267, -93, -191, -46, -29, 89, 290, 229, -92, 90, -95, 117, -114, -50, 36, -46, -64, 53, -16, 0, -7, -197, 78, 81, -29, -82, 234, 216, 52, -169, -67, -129, -178, -160, -32, -52, 24, 78, -180, 57, 217, 185, 110, -140, -21, 181, 90, 124, -82, 153, -128, -9, -174, 165, 107, -329, 9]
3203Im5J62n3j18N3K35k31Q2p5K46l70J93r2N7j38J55K12m63L55k91R7M3r6p2
3227a45j0J51Q0j20J38J60l64j16J66N6j1j3n1l6J42O3o5J84j44O7j03j24J04
3250Ij03O5O4M1L0k64K67j76n7J34m9j95J46L83l10K21k91q1K36o2n7k46J65J11
3274a9j39J09q1Q5j26O6J32J69l65J21J44q4j3m18M88j8o4K53k01K25k5k16m9
3297b6J68k91J15K27j69j84p2L34k44j07%P4J15p3J92q1o3N4K10k07L6K19j91
3320C6k32K37j24K40k54J56j10J9k22M83k75j7R9J36j97j54K25q7k7j5r1m9L83
3343A60l60J76J16n3l26K13m8j30K09J13j32O9jJ17J2j77N0n9p8K42p1k02L6J03
3367b1k1K3N2k0K47l42K28k24M6k98K79M9j5j18K53k27J2L55l00j01J6Q6P0q2
$$ y = [9, -36, 126, 73, -45, 8, 243, 12, 94, 19, 265, -105, 88, -4, 53, -85, 70, 282, -181, 174, -117, -20, 23, -73, -145, -155, -4, 76, -44, 94, 254, -110, -226, -60, -4, -15, -28, -79, -115, 27, 90, 25, 209, 65, 132, 29, -95, 9, -94, -29, 35, 76, 106, -158, 109, -67, -124, 10, -39, -234, -88, 295, -15, 206, -85, -166, 70, 8, -49, -295, -130, -19, -158, -49, -130, -45, -171, -105, 27, 196, -169, -48, 96, 12, -1, -419, 69, 51, -13, 240, 39, 264, 239, 23, -26, 142, -149, -34, 193, 24, -160, -232, 102, -142, -249, -249, -175, -60, -133, 59, -22, -85, -31, 179, -28, 8, 227, 36, -196, 41, -83, 157, -97, 59, -51, -32, -254, 229, -46, -63, 36, 172, -25, -179, 46, -41, -68, -83, -174, -223, 160, -200, -24, 92, 39, -287, -74, -122, -252, -43, 70, -62, 7, 6, 123, 135, -42, 8, -51, -129, 113, 42, -160, -124, -21, -42, -19, 33, 13, 260, -82, 146, -78, -32, -330, -51, -2, -17, -135, 118, -109, -97, 258, -42, -143, -127, -41, 29, -53]
3391e3P0N6Q8j96j5K29j78j85K51O7K4j48K00j83J00j15j2J53k04k20L95l2j46
3414e4n7K71k1m5m8m02L08p6J21J37j39K33k82P2n7Q6q2J83k16J39J08k75j20
3437b16K38j09L52k57O0m07L30q8N4J77L20n04R6p6J7J68j75J7K30j1k25K11j14
3460H8k81K68o5j7J12K32k07j04j5k7l0m5K40j90m1p5K11p0j86K70N0r7N4k12
3484a37K63M5j11j88L61j69k44L63J39l94R4J7N0p1K8Kj93Q0M4L6j2Q1j70J90
3508A04j34L8k67L41J89l57K64k49o1O2K69l68L26m68K01J89j40R0r3R1J46P1
3530B44j74j66J51K58k06l57J20K16j5j04J6q5p4K21j9k1P2k07J97M9q4J32m91
3553c27M58L5l59L28k9j2ml21J42j01R4k03N07K04m51p1J10O6k12l1J27n7J66
$$ y = [-53, 17, 73, 161, -35, -50, 179, 1, -184, 67, 134, 158, 10, 210, 27, 127, 12, 0, 153, -51, -271, 124, 92, -54, -111, 160, 139, 94, 46, -356, -48, -124, -3, 134, -5, 228, -54, 18, -39, 47, -35, 148, -68, 71, 179, -96, -216, 22, -87, 265, 8, 68, -339, -9, -97, -43, 134, 454, -50, 46, -30, -13, 155, -20, -3, 227, 216, -9, 202, 88, -193, 75, 10, -7, 105, 337, 130, 26, 11, -16, -46, -91, 149, -41, -82, -157, 54, -16, -202, 68, 118, 21, 75, -137, 126, 171, 60, -128, 233, 64, -180, 183, 322, -72, 22, 39, 89, 18, 46, 48, -145, -65, -21, 15, 3, 84, -86, 104, -30, 8, -259, 82, 271, -86, 178, -71, -132, -70, 199, -169, 157, -311, -110, 79, -61, 29, -64, 27, 173, 244, 70, -96, 55, 313, 107, -250, -130, 86, 71, -33, -17, -102, -176, 45, 26, 5, 77, -130, 67, 116, 32, 164, -327, 131, 166, -193, 135, 106, 94, 90, -231, -89, -190, -96, -299, 208, 412, -39, -110, 0, 66, -146, -177, -50, -107, 59]
3576E9J50k12O6K9j12J47j57L05Q3m81J44k55M12k48n3K38k7qn1q6J27jj75O9
3600c7q5K28n6l7n7Q8l04L52k54L84k6l81J48J26k20L1J36r9Q5P0k28M8l6K26
3624A02k10j17L57Qk71P4m9J76p7j25J27j22M4kO5K4k08K26L52l68L0l7O1K7P3
3649A60j70qR6Q2m8l76K8O06m67o7J16j0J88k35nJ21k27K68m6J37K6l9k11K23
3673A42l98M17j57j61J25kM2M5o4J01j41L3Qj28P0j72l8L62K60m08j2P5m4J46
3697A01k02K06k66L03j73j52K24P9j86j10M12k00j05p4l8L8M6J5K18j16l6J37
3719A21k68J05J88N8l54J89J99m29K76p1o4R9j68L84j07k50M5P0m7j29M05k58
3741fQ4o8p0j00K32r4j67m0K78K29k67k73L05q3k1K53k09Q8k71L87k50l6K97j65
$$ y = [59, 209, -3, 63, 92, -20, 127, -30, 275, 358, -123, 21, -234, 178, -70, -123, 115, 88, 80, 29, -57, 70, 69, -106, -37, -122, 106, 50, 13, -44, 44, -260, 92, -162, 222, 196, -185, -37, 89, -131, -100, 36, -63, 22, 92, -136, -88, -124, 102, -108, -225, 132, 140, -131, -57, -106, 70, -7, -132, -5, -127, -83, -85, -20, 4, -204, 22, 374, 6, 36, -1, 60, 87, 160, -10, -18, 78, 160, 112, -264, -236, 370, -97, -164, -48, -58, 130, -105, -110, 11, -216, 52, 6, 143, 169, 130, -81, 142, -256, 161, 4, -157, -32, -34, 8, 53, -11, 90, -51, -18, -10, -138, -68, -240, -278, 84, 344, -64, -76, -1, -45, 101, -101, 105, -161, 142, -31, -183, 41, 120, -66, -176, 236, 36, -69, -143, -181, -143, -97, -82, 136, 20, -16, 121, -147, -42, 146, 204, -150, 39, 238, -191, 85, 14, -50, 49, -119, 265, 158, -92, -47, 23, -24, -153, 252, -6, 78, 10, -60, -160, 72, -22, -189, -229, 49, 278, 11, -262, 43, -40, -61, 192, -17, 71, -200, 187, -63, -99, 198, 33]
3765C3M9l56R3L80l43J05k37K28J6k87K58J06k46M95l38p8J17J04k51R1M28k51
3787A16L3k8P2j12j38pK6j7R5j14J29M6j52p8N5Q8K00k49K7j29L66j01l00K7J33
3812a2L4k63J62J37o4K1N4N5o3j82J4J8K42k51k18J90J80j83N0pJ42M6j97J52
3836E7j72O8m00L46N9k4Q2j95K02k16L25m6j67M2J16Q5j76P8j6q3L9J2J20j20
3860A6j29JM40m19O3M6k15K48M6k20J25j6R7k48K21O9r8J77k62J49K26l53r6R1
3884d1L6j50O2m5rL50j03j36R3L1K03k22j29K3K13r2k34L11M8j91k35L70q2pp6
3909a2m7R3p3J28N6m2j00Q2k06K56N1r1m11J82K31j74RJ31L4N2j73K4N1n3j04
3934a06L02j35J76l26j59Q9L20j43J18l1n0J28j23j2k62L93J15j34j28J37l1j33
$$ y = [33, 82, -274, -181, 199, -144, -39, -276, -48, -32, -319, -61, 45, -201, 294, -44, -122, -5, 99, -152, -61, 367, 116, 149, 121, 193, 81, -57, -64, -38, -55, 40, -74, 55, 101, -51, -129, -74, 14, 214, -35, -8, -137, 229, 128, -172, -145, -12, 22, -241, -79, 58, -6, 15, 69, 124, 61, -121, -107, -89, 153, -98, -316, -126, 54, -129, -79, -86, 56, 102, -95, 57, -115, -47, -447, -101, -42, -66, 16, -179, 23, -193, 132, 86, -81, -39, 77, 162, -14, 64, 48, -35, 4, 16, 136, 16, -113, -112, 328, -91, -28, 18, -197, 51, 97, -123, 2, -14, 83, -165, 56, 125, 27, 204, -58, 91, 317, -36, -132, -41, -5, -155, -93, -138, -147, 203, 100, -36, 57, 88, 291, 69, -60, -37, 176, 84, -150, 161, 209, 18, -217, 153, 71, 64, -12, -59, 34, -39, 89, 145, 103, 3, 85, -121, 135, 186, 95, -316, -134, 97, -77, -68, 63, 97, 149, -24, 0, 51, -2, -106, 196, 61, 237, -89, -248, -159, 161, 18, 136, 105, 55, 183, 60, 48, -214, 179, 294, 160, 32, 169, 138, 5]
3956Ej61K43k46L09j48J96l59j64P6K08q6J31J8R2o8k3N0q5K9m9J72p1L7k43Q7
3981e0J2J0K51j29m9j6J08j86L7J3l4k37K75m4J95j28J03m9l84K64r9j09Q7J79
4005B0j01m3k46M64k26L27j98M9k20K88J2l33K83K39j81j17N2j62K69j15NJ05
4027A71k32J4J22O0k09k4n5L06j00q4J4l4K02k0m05N42k31J94k08j36j12J81K1
4050b3k6qQ1k3k30L28J4k70M6K64k1k12K26l77J30J63j37J71n9J42j70L8m8r3
4074i4N2K9k3j4p9K13M8o7o4n1R7J4L7j5K0R3j72J1J86L1l88l7j05K20nn9j00
4101b22M09k32N9k5K9M0K7j10P9k25J05M00n99K42o3K25Jj47K30k32K44l32K2
4124g5p4L77l90P4m8M5P8M8N0K04m61M17k39j9L77l80j06P3L2j22J51J31k76N9
$$ y = [5, -156, 87, -159, 150, 2, 198, -161, -325, -249, -41, -127, 4, 22, 114, 46, 23, 73, -12, 17, -32, 140, 69, 106, -137, -50, -38, -28, 223, 94, 45, 29, 137, -49, -12, 1, -33, -270, 5, -39, 156, 28, 131, 82, -302, -38, -137, -246, -159, 20, -81, -124, -370, 94, -132, 195, -3, 46, -174, 114, 126, -207, 76, 315, 134, 17, 69, -93, 176, 61, 66, 171, -61, -47, 75, 135, -74, -98, -153, 153, 53, -31, -17, -51, 151, 131, -274, 268, 37, 231, 23, -113, -225, -44, -23, -49, -57, 24, 1, -229, 99, 113, -157, -111, 153, 132, -80, 146, -231, -101, 62, -75, 96, 37, 179, 9, 47, -1, -94, -42, -13, -36, -50, -129, 84, 132, 65, 1, -50, 47, 61, 98, 83, 103, 196, 24, 35, 221, 252, -136, -173, -278, -58, -63, -122, -222, 187, -45, 14, -11, 18, 58, 85, -25, 54, -171, -66, 334, -265, -23, -86, 139, 140, -7, 223, -9, 235, -97, -75, -149, 228, -162, -88, -136, -91, -13, 35, 85, 289, -172, 245, 6, -13, 364, -16, -122, -49, -17, -139, 12, 143, -133, -74]
4148g4J96R2l84J13j94K25K1K25l88K72q0N8j87NJ98P2j97k79J51R0J04l60M28
4171A07j34J37k8l66K41O1k66K62n1K53j13j49K70k77J24kj25rp6K96l8L8j42
4194A3L0N6l19L32j90P3j31L04j82k7P7j41K68j50j21K84j19j04p4j1J70q0J47
4217A05N0k77O0q5N6J67j33L4J00k53J25Oj40K85j10%O9K11l12j46J53J59k05
4240h1j95L19j09o4R8L3K03l44K68j67M1j00j51K16P9M5K22k92q2q7N5k32J36
$$ y = [-74, 122, 214, -170, -57, -251, -26, -5, 220, -168, 104, 24, 82, -105, -100, 98, 170, -27, -306, -155, -65, 39, -321, 107, -27, 110, 82, -284, -43, 18, -248, 14, -37, 216, 103, -46, 224, -53, 71, 69, -56, -65, -141, 155, 117, 155, 13, 43, 99, -220, 112, -78, -5, -136, 168, -14, -41, 36, -105, 163, 13, -108, 176, 57, -47, -121, -132, 38, -42, 105, 155, -122, -62, -147, -91, 76, -57, -23, 77, -176, -51, -45, -185, 100, -10, -10, 59, 270, -42, -188, -35, 124, -81, -276, 43, -66, -130, -32, 1, 204, -140, 128, -39, 2, -98, -249, -33, 46, 91, 313, 21, -61, -148, -93, -325, -189]
$$ [...]
8191a42
##END NTUPLES=NMR FID
##END=
