##TITLE=abcd
##JCAMPDX= 6.0         $$ Bruker NMR JCAMP-DX V2.0
##DATA TYPE= NMR SPECTRUM
##DATA CLASS= NTUPLES
##ORIGIN= UXNMR, Bruker Analytische Messtechnik GmbH
##OWNER= root
$$ XWIN-NMR		Version 3.5
$$ Wed Apr 13 09:00:12 2022 Russian Standard Time (UT+4h)  servis@DPX200
##.OBSERVE FREQUENCY= 200.131235884673
##.OBSERVE NUCLEUS= ^1H
##.ACQUISITION MODE= SIMULTANEOUS
##.ACQUISITION SCHEME= undefined
##.AVERAGES= 32
##.DIGITISER RES= 18
##SPECTROMETER/DATA SYSTEM= spect
##.PULSE SEQUENCE= zg
##.SOLVENT NAME= CDCl3
##.SHIFT REFERENCE= (INTERNAL, CDCl3, 0, 16.4885)
##AUDIT TRAIL= $$ (NUMBER, WHEN, WHO, WHERE, WHAT)
$$ ##TITLE= Audit trail, XWIN-NMR		Version 3.5
$$ ##JCAMPDX= 5.01
$$ ##ORIGIN= Bruker BioSpin GmbH
$$ ##OWNER= servis
$$ F:\spectra/data/av/nmr/H1/1/pdata/1/auditp.txt
$$ ##AUDIT TRAIL=  $$ (NUMBER, WHEN, WHO, WHERE, WHAT)
(   1,<2022-04-13 08:59:05.35 +0400>,<servis>,<DPX200>,
      <created by zg, POWCHK disabled, PULCHK disabled
       terminated by command 'halt'
       configuration hash MD5:
       00 E9 B6 7A A2 85 ED C7 34 08 36 98 17 FE 4E 26
       data hash MD5: 32K
       5F DA 8F BB 26 A9 D4 2F 02 C6 21 42 F3 BB A4 AB>)
(   2,<2022-04-13 08:59:14.48 +0400>,<servis>,<DPX200>,
      <Start of raw data processing
       efp BC_mod = 2 LB = 0.05 FT_mod = 6 PKNL = 1 PHC0 = -103.6262 PHC1 = 3.701452 SI = 16K 
       data hash MD5: 16K
       D4 96 32 59 BD 57 E7 5C B5 FB 82 C6 C2 02 2F FD>)
$$ ##END=
$$ 
$$ hash MD5
$$ 56 31 24 61 E9 E7 3C 17 76 8D EB 72 01 C4 54 47
##$RELAX= 
##$RELAX= 
##$RELAX= 
##$RELAX= 
##$RELAX= 
##$RELAX= 
##$RELAX= 
##$RELAX= 
$$ Bruker specific parameters
$$ --------------------------
##$DU= <F:\spectra>
##$EXPNO= 1
##$NAME= <H1>
##$PROCNO= 1
##$TYPE= <nmr>
##$USER= <av>
##$AMP= (0..31)
100 100 100 100 100 100 100 100 100 100 100 100 100 100 100 100 100 100 
100 100 100 100 100 100 100 100 100 100 100 100 100 100 
##$AQSEQ= 0
##$AQ_mod= 1
##$AUNM= <au_zg>
##$AUTOPOS= <>
##$BF1= 200.13
##$BF2= 200.13
##$BF3= 200.13
##$BF4= 200.13
##$BF5= 500.13
##$BF6= 500.13
##$BF7= 500.13
##$BF8= 500.13
##$BYTORDA= 1
##$CFDGTYP= 0
##$CFRGTYP= 5
##$CHEMSTR= <none>
##$CNST= (0..31)
1 1 145 1 1 1 1 1 1 1 1 1 1 1 1 1 1 1 1 1 1 1 1 1 1 1 1 1 1 1 1 1 
##$CPDPRG= <>
##$CPDPRG1= <>
##$CPDPRG2= <>
##$CPDPRG3= <>
##$CPDPRG4= <mlev>
##$CPDPRG5= <mlev>
##$CPDPRG6= <mlev>
##$CPDPRG7= <mlev>
##$CPDPRG8= <mlev>
##$CPDPRGB= <>
##$CPDPRGT= <>
##$D= (0..31)
0 2 0 0 0 0 0 0 0 0.06 0 0 0 0 0 0 0.0002 0 0 0 0 0 0 0 0 0 0 0 0 0 0 
0 
##$DATE= 1649825944
##$DBL= (0..7)
120 120 120 120 120 120 120 120 
##$DBP= (0..7)
150 150 150 150 150 150 150 150 
##$DBP07= 0
##$DBPNAM0= <>
##$DBPNAM1= <>
##$DBPNAM2= <>
##$DBPNAM3= <>
##$DBPNAM4= <>
##$DBPNAM5= <>
##$DBPNAM6= <>
##$DBPNAM7= <>
##$DBPOAL= (0..7)
0.5 0.5 0.5 0.5 0.5 0.5 0.5 0.5 
##$DBPOFFS= (0..7)
0 0 0 0 0 0 0 0 
##$DE= 6
##$DECBNUC= <off>
##$DECIM= 32
##$DECNUC= <off>
##$DECSTAT= 4
##$DIGMOD= 1
##$DIGTYP= 9
##$DL= (0..7)
0 120 120 120 120 120 120 120 
##$DP= (0..7)
$$ [...]
##$SUBNAM4= <"">
##$SUBNAM5= <"">
##$SUBNAM6= <"">
##$SUBNAM7= <"">
##$SUBNAM8= <"">
##$SUBNAM9= <"">
##$SW= 20.6817932712277
##$SWIBOX= (0..15)
0 0 3 0 0 0 0 0 0 0 0 0 0 0 0 0 
##$SW_h= 4139.07284768212
##$TD= 32768
##$TD0= 1
##$TE= 0
##$TE2= 300
##$TE3= 300
##$TEG= 300
##$TL= (0..7)
0 120 120 120 120 120 120 120 
##$TP= (0..7)
150 150 150 150 150 150 150 150 
##$TP07= 0
##$TPNAME0= <>
##$TPNAME1= <>
##$TPNAME2= <>
##$TPNAME3= <>
##$TPNAME4= <>
##$TPNAME5= <>
##$TPNAME6= <>
##$TPNAME7= <>
##$TPOAL= (0..7)
0.5 0.5 0.5 0.5 0.5 0.5 0.5 0.5 
##$TPOFFS= (0..7)
0 0 0 0 0 0 0 0 
##$TUNHIN= 0
##$TUNHOUT= 0
##$TUNXOUT= 0
##$USERA1= <user>
##$USERA2= <user>
##$USERA3= <user>
##$USERA4= <user>
##$USERA5= <user>
##$V9= 5
##$VALIST= <valist>
##$VCLIST= <CCCCCCCCCCCCCCC>
##$VD= 0
##$VDLIST= <DDDDDDDDDDDDDDD>
##$VPLIST= <PPPPPPPPPPPPPPP>
##$VTLIST= <TTTTTTTTTTTTTTT>
##$WBST= 1024
##$WBSW= 30
##$XGAIN= (0..3)
0 0 0 0 
##$XL= 0
##$YL= 0
##$YMAX_a= 2175492
##$YMIN_a= -2195939
##$ZGOPTNS= <>
##$ZL1= 120
##$ZL2= 120
##$ZL3= 120
##$ZL4= 120
##$ABSF1= 0
##$ABSF2= 0
##$ABSG= 0
##$ABSL= 0
##$ALPHA= 0
##$AQORDER= 0
##$ASSFAC= 0
##$ASSFACI= 0
##$ASSFACX= 0
##$ASSWID= 0
##$AUNMP= <proc_1d>
##$AZFE= 0.1
##$AZFW= 0.1
##$BCFW= 0
##$BC_mod= 2
##$BYTORDP= 0
##$COROFFS= 0
##$CY= 18.4799938201904
##$DATMOD= 1
##$DC= 0
##$DFILT= <>
##$DTYPP= 0
##$F1P= 9.9274215381318
##$F2P= -0.165520771350173
##$FCOR= 1
##$FTSIZE= 16384
##$FT_mod= 6
##$GAMMA= 0
##$GB= 0
##$INTBC= 1
##$INTSCL= 4.127829e-11
##$ISEN= 128
##$LB= 0.05
##$LEV0= 0
##$LPBIN= 0
##$MAXI= 10000
##$MC2= 0
##$MEAN= 0
##$ME_mod= 0
##$MI= 50
##$NCOEF= 0
##$NC_proc= -1
##$NLEV= 6
##$NOISF1= 3.799351
##$NOISF2= 2.8
##$NSP= 0
##$NTH_PI= 0
##$NZP= 0
##$OFFSET= 16.48848
##$PC= 4
##$PHC0= -103.6262
##$PHC1= 3.701452
##$PH_mod= 1
##$PKNL= yes
##$PPARMOD= 0
##$PSCAL= 4
##$PSIGN= 0
##$REVERSE= no
##$SF= 200.130005582386
##$SI= 16384
##$SIGF1= 3
##$SIGF2= 2
##$SINO= 400
##$SIOLD= 16384
##$SREGLST= <1H.CDCl3>
##$SSB= 0
##$STSI= 16384
##$STSR= 0
##$SW_p= 4139.07284768211
##$SYMM= 0
##$S_DEV= 0
##$TDeff= 32768
##$TDoff= 0
##$TI= <>
##$TILT= no
##$TM1= 0
##$TM2= 0
##$TOPLEV= 0
##$USERP1= <user>
##$USERP2= <user>
##$USERP3= <user>
##$USERP4= <user>
##$USERP5= <user>
##$WDW= 1
##$XDIM= 16384
##$YMAX_p= 360885810
##$YMIN_p= -97595
$$ End of Bruker specific parameters
$$ ---------------------------------
##NTUPLES= NMR SPECTRUM
##VAR_NAME=  FREQUENCY,     SPECTRUM/REAL,   SPECTRUM/IMAG
##SYMBOL=    X,             R,               I
##VAR_TYPE=  INDEPENDENT,   DEPENDENT,       DEPENDENT
##VAR_FORM=  AFFN,          ASDF,            ASDF
##VAR_DIM=   16384,         16384,           16384
##UNITS=     HZ,            ARBITRARY UNITS, ARBITRARY UNITS
##FACTOR=    0.252644378177508, 1,           1
##FIRST=     3299.83951724647, 0,            0
##LAST=      -839.233330435636, 0,           0
##MIN=       -839.233330435636, -97595,      0
##MAX=       3299.83951724647, 360885810,    0
$$ Real data points
##PAGE= N=1
##DATA TABLE= (X++(R..R)), XYDATA
$$ [...]
9806e4638j290J030m80k25Oq02J356l94N65o56p1R7P3J65p93R81p5j061L40J50
$$ -54638 -55928 -54898 -55378 -55603 -55597 -56399 -55043 -55437 -54872 -55528 -55599 -55502 -55429 -55264 -56057 -55076 -55151 -56212 -55872 -55722
9786e5722m9J05l59o49J052j120N56N37K77J06j73l88P01l61m60j23J070K17k89
$$ -55722 -55771 -55666 -56025 -56674 -55622 -56742 -56186 -55649 -55372 -55266 -55439 -55827 -55126 -55487 -55947 -56070 -55000 -54783 -55072
9767e5072p57l23N92n67M30l34L56k89n09M80Q47j080l06J127L07K52j298j49
$$ -55072 -55829 -56152 -55560 -56127 -55697 -56031 -55675 -55964 -56473 -55993 -55146 -56226 -56532 -55405 -55098 -54846 -56144 -56293
9749e6293M84L17o1q3j141K68M06O88j48L27k89q36M83M74p30l1J185n12k49p11
$$ -56293 -55809 -55492 -55553 -55636 -56777 -56509 -56103 -55415 -55563 -55236 -55525 -56361 -55878 -55404 -56134 -56165 -54980 -55492 -55741 -56452
9729e6452J524m35K73N4q01m39L29M02L93j384p07J250j76R55q52l65J612k45
$$ -56452 -54928 -55363 -55090 -55036 -55837 -56276 -55947 -55545 -55152 -56536 -57243 -55993 -56169 -55214 -56066 -56431 -54819 -55064
9711e5064q78P64m13o04Q08M51p63r06J160m57j06n87K116j239m29M30m31K85
$$ -55064 -55942 -55178 -55591 -56195 -55387 -54936 -55699 -56605 -55445 -55902 -56008 -56595 -54479 -55718 -56147 -55717 -56148 -55863
9693e5863o93N10M91O78n05j76p17N40l7Q0l77N31O26j286R23j49j56N35r26M45
$$ -55863 -56556 -56046 -55555 -54877 -55382 -55558 -56275 -55735 -55772 -55692 -56069 -55538 -54912 -56198 -55275 -55424 -55580 -55045 -55971 -55526
9673e5526P57j533P99q00K24O96l21l04O10o38J445q14n65j072J053J04K7N95
$$ -55526 -54769 -56302 -55503 -56303 -56079 -55383 -55704 -56008 -55398 -56036 -54591 -55405 -55970 -57042 -55989 -55885 -55858 -55263
9655e5263M10o09k85Q24k15j97J97J55p48K31p29P90J06l06J717j144K10p09R16
$$ -55263 -54853 -55462 -55747 -54923 -55138 -55335 -55138 -54983 -55731 -55500 -56229 -55439 -55333 -55639 -53922 -55066 -54856 -55565 -54649
9636e4649o65l77p5O9K02J355j712R84m11j00P18q85Q9O61k457J557r52J206m62
$$ -54649 -55314 -55691 -55766 -55697 -55495 -54140 -55852 -54868 -55279 -55379 -54661 -55546 -55457 -54796 -57253 -55696 -56648 -55442 -55904
9617e5904k94J163O04k367J845o66M06j076R41L9l15K06k80n10P90q24k05n86
$$ -55904 -56198 -55035 -54431 -56798 -54953 -55619 -55213 -56289 -55348 -55309 -55624 -55418 -55698 -56208 -55418 -56242 -56447 -57033
9599e7033P81O65l64j5r27J084q52J162j089j85L41J243o92l16K6Q89p38O75K32
$$ -57033 -56252 -55587 -55951 -55966 -56893 -55809 -56661 -55499 -56588 -56773 -56432 -55189 -55881 -56197 -56171 -55282 -56020 -55345 -55113
9580e5113j165J048J5p75J123o52j44K6j994K166n17L0J97j79O00K24j076J020
$$ -55113 -56278 -55230 -55215 -55990 -54867 -55519 -55663 -55637 -57631 -55465 -55982 -55952 -55755 -55934 -55334 -55110 -56186 -55166
9562e5166j17K31r86j38J82P16j52j2m32J04j80J154l15k97L71N48o12q06L02
$$ -55166 -55283 -55052 -56038 -56176 -55994 -55278 -55430 -55442 -55874 -55770 -55950 -54796 -55111 -55408 -55037 -54489 -55101 -55907 -55605
9543e5605J57n8M43l00J05r1r96P38j36O27k14m3Q37q79n5Q80q16m92N29n11Q04
$$ -55605 -55448 -55506 -55063 -55363 -55258 -55349 -56345 -55607 -55743 -55116 -55330 -55373 -54536 -55415 -55470 -54590 -55406 -55898 -55369 -55880 -55076
9522e5076r42P00p89P58J51M72r16J35P84n88K28k04M9l80O27o24k8n11O60j303
$$ -55076 -56018 -55318 -56107 -55349 -55198 -54726 -55642 -55507 -54723 -55311 -55083 -55287 -55238 -55618 -54991 -55615 -55643 -56154 -55494 -56797
9502e6797K325q71o88l8O68n36K18j104J685Ql09o12Q74j906K025j364J030K8
$$ -56797 -54472 -55343 -56031 -56069 -55401 -55937 -55719 -56823 -55138 -55130 -55439 -56051 -55177 -57083 -55058 -56422 -55392 -55364
9484e5364l62On01J184p60O3P59o14N05r40L33J734k157j66O36P89n33p84J052
$$ -55364 -55726 -55720 -56221 -55037 -55797 -55734 -54975 -55589 -55084 -56024 -55691 -53957 -56114 -56280 -55644 -54855 -55388 -56172 -55120
9465e5120o97M33q77J146Q6j809J427L76q53L60P56q50P58N45j157p40N84k90
$$ -55120 -55817 -55384 -56261 -55115 -55029 -56838 -55411 -55035 -55888 -55528 -54772 -55622 -54864 -54319 -55476 -56216 -55632 -55922
9447e5922M0o6N46r6m3N81Q0n5o69l42P04m59K95J58J08k28O13j489J891j964
$$ -55922 -55882 -55948 -55402 -55498 -55541 -54960 -54880 -54935 -55604 -55946 -55242 -55701 -55406 -55248 -55140 -55368 -54755 -56244 -54353 -56317
9427e6317J722j50j455J233q1j79j18K67m44l58m68L40j66Q26j50R61o69N07j878
$$ -56317 -54595 -54745 -56200 -54967 -55048 -55227 -55345 -55078 -55522 -55880 -56348 -56008 -56174 -55348 -55498 -54537 -55206 -54699 -56577
9408e6577P46l45R96n52l14m48J820j532N73q2O36j38j560J918j217J010j0l63
$$ -56577 -55831 -56176 -55180 -55732 -56046 -56494 -54674 -56206 -55633 -55715 -55079 -55217 -56777 -54859 -56076 -55066 -55076 -55439
9390e5439o20M56l2P59K41L34j064r09j22j04J012k53J631j954J62J239j334P90
$$ -55439 -56059 -55603 -55635 -54876 -54635 -54301 -55365 -56274 -56396 -56500 -55488 -55741 -54110 -56064 -55902 -54663 -55997 -55207
9372e5207j065P76k6p37N06m27m8Q96m98L04Q19j062Q28j185l65J095m89L06M28
$$ -55207 -56272 -55496 -55522 -56259 -55753 -56180 -56228 -55332 -55830 -55526 -54707 -55769 -54941 -56126 -56491 -55396 -55885 -55579 -55151
9353e5151o93L49O19j115j73K54p84J522j36K38K22q74R52m00J9l30P92M89j541
$$ -55151 -55844 -55495 -54876 -55991 -56164 -55910 -56694 -55172 -55308 -55070 -54848 -55722 -54770 -55170 -55151 -55481 -54689 -54200 -55741
9334e5741J607j671L17l98K57J483p41L95j36j551J001J65o07P21k68M32p7N09
$$ -55741 -54134 -55805 -55488 -55886 -55629 -54146 -54887 -54492 -54628 -56179 -55178 -55013 -55620 -54899 -55167 -54735 -54812 -54303
9316e4303j666J738p77J94j49O07m97J229p61M89j150J779k026J286O33j357J070
$$ -54303 -55969 -54231 -55008 -54814 -54963 -54356 -54853 -53624 -54385 -53896 -55046 -53267 -55293 -54007 -53374 -54731 -53661
9299e3661p11J215j708O97k23R96m06n78K23N20o12O11r12P34J14M17l97l75J080
$$ -53661 -54372 -53157 -54865 -54168 -54391 -53395 -53801 -54379 -54156 -53636 -54248 -53637 -54549 -53815 -53701 -53284 -53681 -54056 -52976
9280e2976j94M32J90r94J086q42J396r04Q02N21Q19j055k55r8J099J37P8K67M67
$$ -52976 -53170 -52738 -52548 -53542 -52456 -53298 -51902 -52806 -52004 -51483 -50664 -51719 -51974 -52072 -50973 -50836 -50758 -50491 -50024
9261e0024Q52J594J286K057J209K620J655J836Q63J234N65p14m67p11k529O51
$$ -50024 -49172 -47578 -46292 -44235 -43026 -40406 -38751 -36915 -36052 -34818 -34253 -34967 -35434 -36145 -38674 -38023
9245c8023p59j973j014k568k24q62o07J9l72J188J06O40J757K99n19J03j53j231
$$ -38023 -38782 -40755 -41769 -44337 -44561 -45423 -46030 -46011 -46383 -45195 -45089 -44449 -42692 -42393 -42912 -42809 -42962 -44193
9227d4193k9k160k24j685p63L28j157n10j140O10K44j270J547p44l42j863J924
$$ -44193 -44222 -46382 -46606 -48291 -49054 -48726 -49883 -50393 -51533 -50923 -50679 -51949 -50402 -51146 -51488 -53351 -51427
9210e1427j205j058R21j560J304Pm66J020K66j617M89j186J433n41J92k012J119
$$ -51427 -52632 -53690 -52769 -54329 -53025 -53018 -53484 -52464 -52198 -53815 -53326 -54512 -53079 -53620 -53428 -55440 -54321
9193e4321j02j70P48n45q68N02k60k17j071j03j845m724K0180p845j673k018J376
$$ -54321 -54423 -54593 -53845 -54390 -55258 -54756 -55016 -55233 -56304 -56407 -58252 -62976 -42796 -50641 -52314 -54332 -52956
9176e2956l94M21r02L99r39O63m1M50j664J452L23p55l95q6O64p1L7j314R86l2
$$ -52956 -53350 -52929 -53831 -53432 -54371 -53708 -53749 -53299 -54963 -53511 -53188 -53943 -54338 -54424 -53760 -53831 -53794 -55108 -54122 -54154
9156e4154k96j80J46L28J25k55m59L46O09P2q80l54k07R4o17R36r6k73L17j343
$$ -54154 -54450 -54630 -54484 -54156 -54031 -54286 -54745 -54399 -53790 -53718 -54598 -54952 -55159 -55065 -55682 -54746 -54842 -55115 -54798 -56141
9136e6141K340m79J66N45j132N0M58P48j177n6k40p75R75N39M93j671R54J912
$$ -56141 -53801 -54280 -54114 -53569 -54701 -54651 -54193 -53445 -54622 -54678 -54918 -55693 -54718 -54179 -53686 -55357 -54403 -52491
9118e2491j974N69r32J093j241l04J150l54k58R62p44K97l68K32l89Rn69M44P30
$$ -52491 -54465 -53896 -54828 -53735 -54976 -55280 -54130 -54484 -54742 -53780 -54524 -54227 -54595 -54363 -54752 -54743 -55312 -54868 -54138
9099e4138r59J189r30P91J080m87j564J025r95P68N65j110M38r41J260j7l76o15
$$ -54138 -55097 -53908 -54838 -54047 -52967 -53454 -55018 -53993 -54988 -54220 -53655 -54765 -54327 -55268 -54008 -54025 -54401 -55016
9081e5016j08Q1M3K84R62K93k93o80j17k57R2L49p03K56q95J472j43p7l64L50
$$ -55016 -55124 -55043 -55000 -54716 -53754 -53461 -53754 -54434 -54551 -54808 -54716 -54367 -55070 -54814 -55709 -54237 -54380 -54457 -54821 -54471
9061e4471J112j073K35Pl76l64J5O2k93r72Q74J366o4l78n49p49Q44P6M37K19
$$ -54471 -53359 -54432 -54197 -54190 -54566 -54930 -54915 -54853 -55146 -56118 -55244 -53878 -53942 -54320 -54869 -55618 -54774 -54698 -54261 -54042
9041e4042L99j353l11J328q43O36L73j406J169R6l18j30M9j82l38N30n29N51M63
$$ -54042 -53643 -54996 -55307 -53979 -54822 -54186 -53813 -55219 -54050 -53954 -54272 -54402 -54353 -54535 -54873 -54343 -54872 -54321 -53858
9022e3858j97m42j73o5l9K47K56P3K5q68Q35l77M71L45k22j23k35k99P05o5j143
$$ -53858 -54055 -54497 -54670 -54735 -54774 -54527 -54271 -54198 -54173 -55041 -54206 -54583 -54112 -53767 -53989 -54112 -54347 -54646 -53941 -54006 -55149
9001e5149R29m02R54q39K19o77Q96J33o88j20m17O18O86n10l03Q14j30n54Q13
$$ -55149 -54220 -54622 -53668 -54507 -54288 -54965 -54069 -53936 -54624 -54744 -55161 -54543 -53857 -54367 -54670 -53856 -53986 -54540 -53727
8982e3727M98o68J27O36j742J588j266j63k9L98o32M21j6M09K74q85J790J91j118
$$ -53727 -53229 -53897 -53770 -53134 -54876 -53288 -54554 -54717 -54746 -54348 -54980 -54559 -54575 -54166 -53892 -54777 -52987 -52796 -53914
8963e3914o07K70k96Q89q77J393j378N15n95J211l9m33j21n73J68l40R72L50J4
$$ -53914 -54521 -54251 -54547 -53658 -54535 -53142 -54520 -54005 -54600 -53389 -53428 -53861 -53982 -54555 -54387 -54727 -53755 -53405 -53391
8944e3391j220m06K544r95j221N9J404j861R13l37J504j573l63J752p86L86j494
$$ -53391 -54611 -55017 -52473 -53468 -54689 -54630 -53226 -55087 -54174 -54511 -53007 -54580 -54943 -53191 -53977 -53591 -55085
8927e5085J327r95O25N53K14k97j212N45o7K184j188r59J061p45k21J196j70m90
$$ -55085 -53758 -54753 -54128 -53575 -53361 -53658 -54870 -54325 -54392 -52208 -53396 -54355 -53294 -54039 -54260 -53064 -53234 -53724
8909e3724j90n5k97Q83o95P1Q85p74K13j47J062j315O95n52K72L9j7m07J9j496
$$ -53724 -53914 -53969 -54266 -53383 -54078 -54007 -53122 -53896 -53683 -53830 -52768 -54083 -53388 -53940 -53668 -53629 -53646 -54053 -54034 -55530
8889e5530K576j351L23J01p8K2J094k68r50N43J105j505J06J002j045k2m3m06
$$ -55530 -52954 -54305 -53982 -53881 -53959 -53937 -52843 -53111 -54061 -53518 -52413 -53918 -53812 -52810 -53855 -53877 -53920 -54326
8871e4326J103k56m68j40O39n9J45j142Q38m89N48l46P43r03J875l67l08m12p2
$$ -54326 -53223 -53479 -53947 -54087 -53448 -53507 -53362 -54504 -53666 -54155 -53607 -53953 -53210 -54113 -52238 -52605 -52913 -53325 -53397
8852e3397j247J599m35M2p86L97K60K43l32P23j565M15J288j668O5M66M61J098
$$ -53397 -54644 -53045 -53480 -53438 -54224 -53827 -53567 -53324 -53656 -52933 -54498 -54083 -52795 -54463 -54398 -53932 -53471 -52373
8834e2373j364Q94k62r83J592k13n80N70l48p84J265o40K7m09J100q29m06L13
$$ -52373 -53737 -52843 -53105 -54088 -52496 -52709 -53289 -52719 -53067 -53851 -52586 -53226 -53199 -53608 -52508 -53337 -53743 -53430
8816e3430M84k04n07J360m93k0p80K40J00k01R71k138M60R38J069l40m09j24j450
$$ -53430 -52946 -53150 -53657 -52297 -52790 -52810 -53590 -53350 -53250 -53451 -52480 -54618 -54158 -53220 -52151 -52491 -52900 -53024 -54474
8797e4474J921j060N34q14J10Q94q16k33p43J146l27O31j469O9J32K83J087j573
$$ -54474 -52553 -53613 -53079 -53893 -53783 -52889 -53705 -53938 -54681 -53535 -53862 -53231 -54700 -54631 -54499 -54216 -53129 -54702
8779e4702J575m09L57j19R7k59J022p17N43j412J074K80j357m30J243Q27j313
$$ -54702 -53127 -53536 -53179 -53298 -53201 -53460 -52438 -53155 -52612 -54024 -52950 -52670 -54027 -54457 -53214 -52387 -53700
8762e3700l23N13l03m57R97P78q38O16j143L54N6O87r22M38N28R2j090Q36R7N08
$$ -53700 -54023 -53510 -53813 -54270 -53273 -52495 -53333 -52717 -53860 -53506 -53450 -52763 -53685 -53247 -52719 -52627 -53717 -52881 -52784 -52276
8742e2276o54k73P65N9j93l49J029j06j198J5J96l23K243j538l7N8Q02j872M50
$$ -52276 -52930 -53203 -52438 -52379 -52572 -52921 -51892 -51998 -53196 -53181 -52985 -53308 -51065 -52603 -52640 -52582 -51780 -53652 -53202
8723e3202M16J510j839R2Q58k444J695q46J224q13R81j881J409Q1m31J821j763
$$ -53202 -52786 -51276 -53115 -53023 -52165 -54609 -52914 -53760 -52536 -53349 -52368 -54249 -52840 -52759 -53190 -51369 -53132
8706e3132P03q81J172p46j14o71Q66M92j164J386k073J912j57o70J204n77j422
$$ -53132 -52429 -53310 -52138 -52884 -52998 -53669 -52803 -52311 -53475 -52089 -54162 -52250 -52407 -53077 -51873 -52450 -53872
8689e3872N34Q01j340n20J558J006j152m28P52l36M6j89K87m95M31m14o0L50Q80
$$ -53872 -53338 -52537 -53877 -54397 -52839 -51833 -52985 -53413 -52661 -52997 -52951 -53140 -52853 -53348 -52917 -53331 -53391 -53041 -52161
8670e2161o21J058q83k34m79J79k26j234J759K75r22K23m81N04R92p5r22p99R83
$$ -52161 -52782 -51724 -52607 -52841 -53320 -53141 -53367 -54601 -52842 -52567 -53489 -53266 -53747 -53243 -52251 -52326 -53248 -54047 -53064
8651e3064K66n10l0N09K51J90j231J219r60M83N44r95J067m37Q1n9n47J256j389
$$ -53064 -52798 -53308 -53338 -52829 -52578 -52388 -53619 -52400 -53360 -52877 -52333 -53328 -52261 -52698 -52617 -52676 -53223 -51967 -53356
8632e3356O44J80p87J231o02L93J60j04p39J39L76P81j991O91R16M84N15j196
$$ -53356 -52712 -52532 -53319 -52088 -52690 -52297 -52137 -52241 -52980 -52841 -52465 -51684 -53675 -52984 -52068 -51584 -51069 -52265
8614e2265K06l94R07q02J60p22P56j12j061Q21J304k80j084L38o97J86m64Q33
$$ -52265 -52059 -52453 -51546 -52348 -52188 -52910 -52154 -52266 -53327 -52506 -51202 -51482 -52566 -52228 -52925 -52739 -53203 -52370
8596e2370M6K76J27q81J190l85l33j70l91L80R03P6l65K33j208J179n18m22L84
$$ -52370 -52324 -52048 -51921 -52802 -51612 -51997 -52330 -52500 -52891 -52511 -51608 -51532 -51897 -51664 -52872 -51693 -52211 -52633 -52249
8577e2249K4m53R34m50j31Q55o8j85p71L27N29l70Q01j543O79m04J714m23j560
$$ -52249 -52225 -52678 -51744 -52194 -52325 -51470 -51538 -51723 -52494 -52167 -51638 -52008 -51207 -52750 -52071 -52475 -50761 -51184 -52744
8558e2744P42P5K02O01j056R97p81K73j89J23m47J49N98P96r50N3L16j80j336
$$ -52744 -52002 -51927 -51725 -51124 -52180 -51183 -51964 -51691 -51880 -51757 -52204 -52055 -51457 -50661 -51611 -51558 -51242 -51422 -52758
8539e2758N61N57M43j892J805j282k76q23J4m243R192j4112R641K436J083j704
$$ -52758 -52197 -51640 -51197 -53089 -51284 -52566 -52842 -53665 -53651 -57894 -48702 -62814 -53173 -50737 -49654 -51358
8523e1358M31M30n55j284O01J164n69O66j131M59K71p53R43q65M25m24J188j53
$$ -51358 -50927 -50497 -51052 -52336 -51735 -50571 -51140 -50474 -51605 -51146 -50875 -51628 -50685 -51550 -51125 -51549 -50361 -50514
8505e0514R26j685J145l10j66j149J841m60M34K77q68k08J448N34k079m94Q67
$$ -50514 -49588 -51273 -50128 -50438 -50604 -51753 -49912 -50372 -49938 -49661 -50529 -50737 -49289 -48755 -50834 -51328 -50461
8488e0461K85J242L55j289J49j06L84j284J499p3M42P47j756p30J947m48p25L61
$$ -50461 -50176 -48934 -48579 -49868 -49719 -49825 -49441 -50725 -49226 -49299 -48857 -48110 -49866 -50596 -48649 -49097 -49822 -49461
8470d9461J88p5J575j510N77O30J87r81Q34l72p3m16Q80p41p60M61q62M02l04
$$ -49461 -49273 -49348 -47773 -49283 -48706 -48076 -47889 -48870 -48036 -48408 -48481 -48897 -48017 -48758 -49518 -49057 -49919 -49517 -49821
8451d9821J829j502l64O20J266p33J3J419n85R6o87K81J525j575J137K46m33K48
$$ -49821 -47992 -49494 -49858 -49238 -47972 -48705 -48692 -47273 -47858 -47762 -48449 -48168 -46643 -48218 -47081 -46835 -47268 -47020
8433d7020M60P3J259j836k39K39K62j161J083k001J936j368j09L07P06O7O31m26
$$ -47020 -46560 -46487 -45228 -47064 -47303 -47064 -46802 -47963 -46880 -48881 -46945 -48313 -48422 -48115 -47409 -47342 -46711 -47137
8415d7137m27J190n6N41O4N25o50l49q08j253J04M82R49m84p18K15j318J3L93
$$ -47137 -47564 -46374 -46430 -45889 -45825 -45300 -45950 -46299 -47107 -48360 -48256 -47774 -46825 -47309 -48027 -47812 -49130 -49117 -48724
8396d8724p06J978j714J85J038k85K153l462L67K65j904K206j518J491M11r88
$$ -48724 -49430 -47452 -49166 -48981 -47943 -48228 -46075 -49537 -49170 -48905 -50809 -48603 -50121 -48630 -48219 -49207
8380d9207j10L98J043k450J618k2q20J089q77r20j100K008K33n09r74J446o95
$$ -49207 -49317 -48919 -47876 -50326 -48708 -48730 -49550 -48461 -49338 -50258 -51358 -49350 -49117 -49626 -50600 -49154 -49849
8363d9849Pn7J02M66O9P7Q0j77J002k74k52q81k60O59J71p00K64R90o12N00J06
$$ -49849 -49842 -49899 -49797 -49331 -49262 -49185 -49105 -49282 -48280 -48554 -48806 -49687 -49947 -49288 -49117 -49817 -49553 -48563 -49175 -48675 -48569
8342d8569R3L63M88O70n96k63M18M47J20r40l35K593j115j099m28o95N34r11K39
$$ -48569 -48476 -48113 -47625 -46955 -47551 -47814 -47396 -46949 -46829 -47769 -48104 -45511 -46626 -47725 -48153 -48848 -48314 -49225 -48986
8323d8986L11m18k78R66j739l43J597J295k362O36K76j70N69L89k83j126l11L44
$$ -48986 -48675 -49093 -49371 -48405 -50144 -50487 -48890 -47595 -49957 -49321 -49045 -49215 -48646 -48257 -48540 -49666 -49977 -49633
8305d9633J804j831J1Q18n63K45P1j134J378j773J101k08N2j514M28q51J134p09
$$ -49633 -47829 -49660 -49649 -48831 -49394 -49149 -49078 -50212 -48834 -50607 -49506 -49714 -49662 -51176 -50748 -51599 -50465 -51174
8287e1174n09J325K40M12r7N55p06K0O7N93k043J412k153K747Pk319K26K071r3
$$ -51174 -51683 -50358 -50118 -49706 -49803 -49248 -49954 -49934 -49867 -49274 -51317 -49905 -52058 -49311 -49304 -51623 -51397 -49326 -49419
8268d9419j901m49K6J8R57J295J88q21j050k14K562k095R80M24J26k94J070m11
$$ -49419 -51320 -51769 -51743 -51725 -50768 -49473 -49285 -50106 -51156 -51370 -48808 -50903 -49923 -49499 -49373 -49667 -48597 -49008
8250d9008M70j127p24K015j374r87Q27m42p16k2J037l56J520k247L043l624J74
$$ -49008 -48538 -49665 -50389 -48374 -49748 -50735 -49908 -50350 -51066 -51088 -50051 -50407 -48887 -51134 -48091 -51715 -51541
8233e1541K284l416L991j404R39p17Q79j633P92j295O52K149l000O15J923q58
$$ -51541 -49257 -52673 -48682 -50086 -49147 -49864 -48985 -50618 -49826 -51121 -50469 -48320 -51320 -50705 -48782 -49640
8217d9640L730m553J249j418J973J840p63l97m704N0M281j089L208m820K500m926
$$ -49640 -45910 -50463 -49214 -50632 -48659 -46819 -47582 -47979 -52683 -52633 -48352 -49441 -46233 -51053 -48553 -53479
8201e3479K685N213m220m34K033q162l55K4324K8716K851q4209M3138j084r694
$$ -53479 -50794 -45581 -49801 -50235 -48202 -56364 -56719 -32395 -3679 -828 -85037 -41899 -42983 -52677
8187e2677M214j830M442m062l833N358l566M988l111j710J618K850k683p82L310
$$ -52677 -48463 -50293 -45851 -49913 -53746 -48388 -51954 -46966 -50077 -51787 -50169 -47319 -50002 -50784 -47474
8172d7474k853j252k304J066N412n860o98N723m78l989K984k650n92J350k77K747
$$ -47474 -50327 -51579 -53883 -52817 -47405 -53265 -53963 -48240 -48718 -52707 -49723 -52373 -52965 -51615 -51892 -49145
8156d9145L4j736m37j846L457l321N03J269k32J068K0j085k61p23K50K510q34
$$ -49145 -49111 -50847 -51284 -53130 -49673 -52994 -52491 -51222 -51454 -50386 -50366 -51451 -51712 -52435 -52185 -49675 -50509
8139e0509k353J005M51J604q00k145K596j084L4M64j046Q65M25m09j679K023K67
$$ -50509 -52862 -51857 -51406 -49802 -50602 -52747 -50151 -51235 -51201 -50737 -51783 -50918 -50493 -50902 -52581 -50558 -50291
8122e0291r4J252q83n77j977p20K671j51M84p51P4j251L012r30j330j933L574
$$ -50291 -50385 -49133 -50016 -50593 -52570 -53290 -50619 -50770 -50286 -51037 -50963 -52214 -49202 -50132 -51462 -53395 -49821
8105d9821j894O63K16L90k57l37J405k457K430k239O70j091L162j212l05r05K443
$$ -49821 -51715 -51052 -50836 -50446 -50703 -51040 -49635 -52092 -49662 -51901 -51231 -52322 -49160 -50372 -50677 -51582 -49139
8088d9139l111P91J908L02j707o1K51O7N84q71L82p06R0j45j33K016j384N8K50
$$ -49139 -52250 -51459 -49551 -49249 -50956 -51017 -50766 -50699 -50115 -50986 -50604 -51310 -51220 -51365 -51498 -49482 -50866 -50808 -50558
8069e0558Q0j426K068k067M06J775k098K929l17j687l67J415k461M141k495R47
$$ -50558 -50478 -51904 -49836 -51903 -51497 -49722 -51820 -48891 -49208 -50895 -51262 -49847 -52308 -48167 -50662 -49715
8053d9715q11K7P08j679j11J913j606K273j469L13J375j052N07m74r57J180j607
$$ -49715 -50526 -50499 -49791 -51470 -51581 -49668 -51274 -49001 -50470 -50157 -48782 -49834 -49327 -49801 -50758 -49578 -51185
8036e1185N20J345j523J446k206J723j216k85K90J161l83o57l89N52JJ128o17
$$ -51185 -50665 -49320 -50843 -49397 -51603 -49880 -51096 -51381 -51091 -49930 -50313 -50970 -51359 -50807 -50806 -49678 -50295
8019e0295L28j218J08J226r37J824k515P01P35q40p29N43L61J029J12N59r30j7
$$ -50295 -49967 -51185 -51077 -49851 -50788 -48964 -51479 -50778 -50043 -50883 -51612 -51069 -50708 -49679 -49567 -49008 -49938 -49955
8001d9955p10P3o21J643K16k384J10j435K594k09M87p47J296k47L59M43k75j593
$$ -49955 -50665 -50592 -51213 -49570 -49354 -51738 -51628 -53063 -50469 -50678 -50191 -50938 -49642 -49889 -49530 -49087 -49362 -50955
7983e0955N49o26P58m03J182p25l16P3J265j276K44L39P92j317n2J021j683M1
$$ -50955 -50406 -51032 -50274 -50677 -49495 -50220 -50536 -50463 -49198 -50474 -50230 -49891 -49099 -50416 -50468 -49447 -51130 -51089
7965e1089J111J41K38R43j464o11J540n37l38N84j249J671j240k200J753j28O57
$$ -51089 -49978 -49837 -49599 -48656 -50120 -50731 -49191 -49728 -50066 -49482 -50731 -49060 -50300 -52500 -50747 -50875 -50218
7948e0218k89M0R2r9J115R9j044n59J524j326M48M27N61J193k023P12r30J20J397
$$ -50218 -50507 -50467 -50375 -50474 -49359 -49260 -50304 -50863 -49339 -50665 -50217 -49790 -49229 -48036 -50059 -49347 -50277 -50157 -48760
7929d8760j227L37J05q11J541j107m77J586j042j9O4J068j565Q90M13j654O4J97
$$ -48760 -49987 -49650 -49545 -50356 -48815 -49922 -50399 -48813 -49855 -49874 -49810 -48742 -50307 -49417 -49004 -50658 -50594 -50397
7911e0397K75R7J417m96q88L10Q06o49l55l72K81J140m25J92j632P26Q20P57j620
$$ -50397 -50122 -50025 -48608 -49104 -49992 -49682 -48876 -49525 -49880 -50252 -49971 -48831 -49256 -49064 -50696 -49970 -49150 -48393 -50013
7892e0013J92J132j487R15l26K46k95M21O33k26J278j864Q17N40k22j814P70N66
$$ -50013 -49821 -48689 -50176 -49261 -49587 -49341 -49636 -49215 -48582 -48808 -47530 -49394 -48577 -48037 -48259 -50073 -49303 -48737
7874d8737m76R63r43J018j104O40p32J508m51o4J435p45n94O26n75K175O03O49
$$ -48737 -49213 -48250 -49193 -48175 -49279 -48639 -49371 -47863 -48314 -48378 -46943 -47688 -48282 -47656 -48231 -46056 -45453 -44804
7856d4804K4860l0700n790K252J368P74J196Q16j225J215j36n08Q6k75M57N51
$$ -44804 -19944 -50644 -56434 -54182 -52814 -52040 -50844 -50028 -51253 -50038 -50174 -50682 -50596 -50871 -50414 -49863
7840d9863k44R42r52P85q8j036J014l70j58L77K65O6o50P57j062J85l26j07J596
$$ -49863 -50107 -49165 -50117 -49332 -49420 -50456 -49442 -49812 -49970 -49593 -49328 -49262 -49912 -49155 -50217 -50032 -50358 -50465 -48869
7821d8869r16Q96p07Q53j391r34M06L86N37O93l25n83P49K23j44r11N72M89k82
$$ -48869 -49785 -48889 -49596 -48743 -50134 -51068 -50662 -50276 -49739 -49046 -49371 -49954 -49205 -48982 -49126 -50037 -49465 -48976 -49258
7802d9258o27R6J626j432K45K21j475J702M7L2j677J892J41N5r79M44p86R12J45
$$ -49258 -49885 -49789 -48163 -49595 -49350 -49129 -50604 -48902 -48855 -48823 -50500 -48608 -48467 -48412 -49391 -48947 -49733 -48821 -48676
7783d8676K4L47j74m44K4R12q47p41o98O68L33J475j753O78l89Q33J347k350m38
$$ -48676 -48652 -48305 -48479 -48923 -48899 -47987 -48834 -49575 -50273 -49605 -49272 -47797 -49550 -48872 -49261 -48428 -47081 -49431 -49869
7764d9869J413j85L88L97r66L82J232k475J305j060L99J72J29N04Q12n53j310
$$ -49869 -48456 -48641 -48253 -47856 -48822 -48440 -47208 -49683 -48378 -49438 -49039 -48867 -48738 -48234 -47422 -47975 -49285
7747d9285P80R97m60p57j09J843j078p3R80j785qJ039n05j54M5L22l84M31J56
$$ -49285 -48505 -47508 -47968 -48725 -48834 -46991 -48069 -48142 -47162 -48947 -48955 -47916 -48421 -48575 -48530 -48208 -48592 -48161 -48005
7728d8005M79j797J466J51K9n56K14J231k392P57o48K76J928l99j987J277o13
$$ -48005 -47526 -49323 -47857 -47706 -47677 -48233 -48019 -46788 -49180 -48423 -49071 -48795 -46867 -47266 -49253 -47976 -48589
7711d8589K59J726m1k184J160p31nJ433r07k7q5O76j407J518M51j123O70j11m48
$$ -48589 -48330 -46604 -46645 -48829 -47669 -48400 -48405 -46972 -47879 -47906 -47991 -47315 -48722 -47204 -46753 -47876 -47206 -47317 -47765
7692d7765j66M7Q64k64j60l15M05j39p57K54J835j52j266p68J112m55L11J203
$$ -47765 -47931 -47884 -47020 -47284 -47444 -47759 -47354 -47493 -48250 -47996 -46161 -46313 -47579 -48347 -47235 -47690 -47379 -46176
7674d6176J42o63J239M47j416l7Q98O84p65P52n13J328m07q85O47M20J77K26o76
$$ -46176 -46034 -46697 -45458 -45011 -46427 -46464 -45566 -44882 -45647 -44895 -45408 -44080 -44487 -45372 -44725 -44305 -44128 -43902 -44578
7655d4578n06J520q90J77J214p29RJ93j04O17m57L30o53K42N25r65J157j144J432
$$ -44578 -45084 -43564 -44454 -44277 -43063 -43792 -43783 -43590 -43694 -43077 -43534 -43204 -43857 -43615 -43090 -44055 -42898 -44042 -42610
7636d2610k96p16J95O5n7Q05q53o60J212j458N25K85j101L54n91o26O7N5J86j604
$$ -42610 -42906 -43622 -43427 -43362 -43419 -42614 -43467 -44127 -42915 -44373 -43848 -43563 -44664 -44310 -44901 -45527 -45460 -45405 -45219 -46823
7616d6823J232K92J36p54K44r95J499K24m16L44l32m27M51M14K03j498J754N8
$$ -46823 -45591 -45299 -45163 -45917 -45673 -46668 -45169 -44945 -45361 -45017 -45349 -45776 -45325 -44911 -44708 -46206 -44452 -44394
7598d4394k392J482J297j228O36o02j49J129j856J854J55o52p04K301r22p36O78
$$ -44394 -46786 -45304 -44007 -45235 -44599 -45201 -45350 -44221 -46077 -44223 -44068 -44720 -45424 -43123 -44045 -44781 -44103
7581d4103Q41J0L48j07K59L50r45N66q6N66J096l35j589J392J335j283K79J037
$$ -44103 -43262 -43252 -42904 -43011 -42752 -42402 -43347 -42781 -42867 -42301 -41205 -41540 -43129 -41737 -40402 -41685 -41406 -40369
7563d0369k90q76R08J49n90K061j26q16j593J819p32M22M27q00L39j155J555m50
$$ -40369 -40659 -41535 -40627 -40478 -41068 -39007 -39133 -39949 -41542 -39723 -40455 -40033 -39606 -40406 -40067 -41222 -39667 -40117
7545d0117P28n62R6m66Q65k80k22q49O48M16n22k23J13Q31j191L37N79j329N04
$$ -40117 -39389 -39951 -39855 -40321 -39456 -39736 -39958 -40807 -40159 -39743 -40265 -40488 -40375 -39544 -40735 -40398 -39819 -41148 -40644
7526d0644O74l45o21L62O88o16P05N4M26J31n0o13N74J024j068P85m89R46j724
$$ -40644 -39970 -40315 -40936 -40574 -39886 -40502 -39797 -39743 -39317 -39186 -39236 -39849 -39275 -38251 -39319 -38534 -39023 -38077 -39801
7507c9801J4J409P56q1N54r55P67p65K20j34P37r9J15L1L47m79K78J297L6M7n3
$$ -39801 -39787 -38378 -37622 -37703 -37149 -38104 -37337 -38102 -37882 -38016 -37279 -37378 -37263 -37232 -36885 -37364 -37086 -35789 -35753 -35706 -35759
7486c5759r23P52j40L56J069N62j174o28P66R46j547M35M46P12Q03q69q7L53N40
$$ -35759 -36682 -35930 -36070 -35714 -34645 -34083 -35257 -35885 -35119 -34173 -35720 -35285 -34839 -34127 -33324 -34193 -34280 -33927 -33387
7467c3387k44l29K275p65j505O21M87N33J23J092m78m85P53R38Q2r15J765j218
$$ -33387 -33631 -33960 -31685 -32450 -33955 -33334 -32847 -32314 -32191 -31099 -31577 -32062 -31309 -30371 -30289 -31204 -29439 -30657
7449c0657K14J760L62n68n48R77O46m4J702j175N67j47L59P94L87L76k74J406
$$ -30657 -30443 -28683 -28321 -28889 -29437 -28460 -27814 -27858 -26156 -27331 -26764 -26911 -26552 -25758 -25371 -24995 -25269 -23863
7431b3863L65J073l54L75r75J313J682j68M12Q56n00P39M69Q83M51J114k20J180
$$ -23863 -23498 -22425 -22779 -22404 -23379 -22066 -20384 -20552 -20140 -19284 -19784 -19045 -18576 -17693 -17242 -16128 -16348 -15168
7413a5168k54J523J082J437J87J624n70J470J977K00J035J696N55J294O13K043
$$ -15168 -15422 -13899 -12817 -11380 -11193 -9569 -10139 -8669 -6692 -6492 -5457 -3761 -3206 -1912 -1299 744
7397G44J243K01P74J648J696J322J224K368J542J116K443L123J04J220L846K331
$$ 744 1987 2188 2962 4610 6306 7628 8852 11220 12762 13878 16321 19444 19548 20768 24614 26945
7381B6945K126J645L348L010K531L090K976M223L507L665K855M825O225M683M520
$$ 26945 29071 30716 34064 37074 39605 42695 45671 49894 53401 57066 59921 64746 70971 75654 80174
7366H0174P038P924R046Q010J2305J3322J6860K1928K3630K6969K1051J7843J3493
$$ 80174 87212 95136 104182 112192 124497 137819 154679 176607 200237 227206 248257 266100 279593
7353B79593J1313J8340K9217L9867M4535L5662J9576J031j1446j3881l40J8706
$$ 279593 290906 309246 338463 378330 422865 458527 478103 479134 467688 453807 453467 472173
7341D72173K8701K6899J1768O17j0844r841L897J4948J8545J2525O390J400Q828
$$ 472173 500874 527773 539541 540158 529314 519473 523370 538318 556863 569388 575778 577178 586006
7328E86006K5005M5933N4497L8469J1770j4283l3120l2996p032K1437L6124K0270
$$ 586006 611011 656944 711441 749910 761680 747397 714277 681281 674249 695686 731810 752080
7316G52080n614l7164o6621o9512n3867l1240j8018j6776k4248l0985m0633m0045
$$ 752080 746466 709302 642681 573169 519302 488062 470044 453268 429020 398035 357402 317357
7304C17357l2360k6848j9596j4251j2295r910q134o469n678l802k637k389j890
$$ 317357 284997 258149 238553 224302 212007 202097 193963 187494 181816 178014 175377 172988 171098
7291A71098j180r77J908n04K343K982K502L499O047M275Q192Q345J2206J4003
$$ 171098 169918 168941 170849 170345 172688 175670 178172 181671 187718 191993 200185 208530 220736 234739
7277B34739J7325K3171L1081L6991L7597K3359K0863K4313J5743J6601L5774N9029
$$ 234739 252064 275235 306316 343307 380904 404263 425126 449439 465182 481783 517557 576586
7265E76586P0651M8508J6890J1073k588l2665l2967m40K9519L8137J8217o150
$$ 576586 647237 695745 712635 723708 721120 688455 655488 655048 684567 722704 740921 734771
7253G34771n418k4502n0291m5936k9244r719K534j1942j1383M109P781J885p459
$$ 734771 729353 704851 654560 608624 579380 569661 572195 560253 548870 552979 560760 562645 555186
7240E55186j5386j1876j9840l1475k6164n134J2435J6075j758j4394j4069l0158
$$ 555186 539800 527924 508084 476609 450445 445311 457746 473821 472063 457669 443600 413442
7228D13442m8271l9790k4493j2419r001j6257j5036j3834k0676k5908k2640j6632
$$ 413442 365171 325381 300888 288469 279468 263211 248175 234341 213665 187757 165117 148485
7216A48485j4198j0685j0563o868p307n225m445n230n140m419l668m738m441o262
$$ 148485 134287 123602 113039 106171 98864 93639 89194 83964 78824 74405 70737 65999 61558 55296
7202E5296j321J281l828j265k955j587k335l158j589j604n33q07j021j772o61
$$ 55296 53975 55256 51428 50163 47208 45621 43286 40128 38539 36935 36402 35595 34574 32802 32141
7187C2141j474k715k278p71k442j489r96l87k241O2j197q22p53r62n27q17J05
$$ 32141 30667 27952 25674 24903 22461 20972 19976 19589 17348 17410 16213 15391 14638 13676 13149 12332 12437
7170A2437n60M25K91k197r71j635J7j328k078j283j742K09j436r35n0j703j07
$$ 12437 11877 12302 12593 10396 9425 7790 7807 6479 4401 3118 1376 1585 149 -786 -836 -2539 -2646
7153b646r04k94n50L39r13J15j954O05j681k64n44j560j211M92l28j237J272N07
$$ -2646 -3550 -3844 -4394 -4055 -4968 -4853 -6807 -6202 -7883 -8147 -8691 -10251 -11462 -10970 -11298 -12535 -11263 -10756
7135a0756j555P53q78Q83j040n50O08p52N3l02q81p6k90J98o39R14p70J97P21
$$ -10756 -12311 -11558 -12436 -11553 -12593 -13143 -12535 -13287 -13234 -13536 -14417 -14493 -14783 -14585 -15224 -14310 -15080 -14883 -14162
7116a4162p97m46J98J364q13J82j359j2J36J621p43q80N36o5K2Q52l74q33M46
$$ -14162 -14959 -15405 -15207 -13843 -14656 -14474 -15833 -15845 -15709 -14088 -14831 -15711 -15175 -15240 -15218 -14366 -14740 -15573 -15127
7097a5127j41L10l93j50M18j121P31j49K89o80j046J288n59n79R89m03r74l1p52
$$ -15127 -15268 -14958 -15351 -15501 -15083 -16204 -15473 -15622 -15333 -16013 -17059 -15771 -16330 -16909 -15920 -16323 -17297 -17328 -18080
7078a8080j112J55O54P4o1j180p70k024Q96n47j276n94n31p74K73j282R22j147
$$ -18080 -19192 -19037 -18383 -18309 -18370 -19550 -20320 -22344 -21448 -21995 -23271 -23865 -24396 -25170 -24897 -26179 -25257 -26404
7060b6404m26l75k00k12k67M04K06j60o69O33p22p08j397O16l48P47j485J735
$$ -26404 -26830 -27205 -27405 -27617 -27884 -27480 -27274 -27434 -28103 -27470 -28192 -28900 -30297 -29681 -30029 -29282 -30767 -29032
7042b9032m06m97J69K92l8J86P70n75l05L83J300j988P36J252n41m05Q66n44n19
$$ -29032 -29438 -29935 -29766 -29474 -29512 -29326 -28556 -29131 -29436 -29053 -27753 -29741 -29005 -27753 -28294 -28699 -27833 -28377 -28896
7023b8896l46K69N78K52q74o16P28M25j152J046lQ45q23M4j090N76J085p25J08
$$ -28896 -29242 -28973 -28395 -28143 -29017 -29633 -28905 -28480 -29632 -28586 -28589 -27744 -28567 -28523 -29613 -29037 -27952 -28677 -28569
7004b8569N29j634P63n74N36n05l92R69q55N91j334Q40j284q08P64l73J56P51
$$ -28569 -28040 -29674 -28911 -29485 -28949 -29454 -29846 -28877 -29732 -29141 -30475 -29635 -30919 -31727 -30963 -31336 -31180 -30429
6986c0429j293j04o97J192J4j183O6k41O54L6j54r69j1l94L16Q54p34m4m6n40
$$ -30429 -31722 -31826 -32523 -31331 -31317 -32500 -32434 -32675 -32021 -31985 -32139 -33108 -33119 -33513 -33197 -32343 -33077 -33121 -33167 -33707
6966c3707M75K02P2Q18K15o57pJ282j35N76j118P43K04N12q83J570n59J025l95
$$ -33707 -33232 -33030 -32958 -32140 -31925 -32582 -32589 -31307 -31442 -30866 -31984 -31241 -31037 -30525 -31408 -29838 -30397 -29372 -29767
6947b9767m15l12J122J56l38j036M19M16k4O09m50k06m72k11M31J78O54o35O99
$$ -29767 -30182 -30494 -29372 -29216 -29554 -30590 -30171 -29755 -29779 -29170 -29620 -29826 -30298 -30509 -30078 -29900 -29246 -29881 -29182
6928b9182J14R5K99J576N37l61k44L68j505L51k92j055R57j059j32N62q64k344
$$ -29182 -29068 -28973 -28674 -27098 -26561 -26922 -27166 -26798 -28303 -27952 -28244 -29299 -28342 -29401 -29533 -28971 -29835 -32179
6910c2179J818m46M97j027J216j422l57J013Q0k92O10o41K225l02N92p46q51n13
$$ -32179 -30361 -30807 -30310 -31337 -30121 -31543 -31900 -30887 -30807 -31099 -30489 -31130 -28905 -29207 -28615 -29361 -30212 -30725
6892c0725K39j006P63q12M53o56J041j472J086Q3m07j074P51j014K044o06k036
$$ -30725 -30486 -31492 -30729 -31541 -31088 -31744 -30703 -32175 -31089 -31006 -31413 -32487 -31736 -32750 -30706 -31312 -33348
6875c3348J741l94j497Q25j02k25K3M05j257J749j220K23k34Q20P00j016J131
$$ -33348 -31607 -32001 -33498 -32673 -32775 -33000 -32977 -32572 -33829 -32080 -33300 -33077 -33311 -32491 -31791 -32807 -31676
6858c1676r58n79L8Q97M83J30r3K65m57j11O69O15l26J595k264J699q7m65P66
$$ -31676 -32634 -33213 -33175 -32278 -31795 -31665 -31758 -31493 -31950 -32061 -31392 -30777 -31103 -29508 -31772 -30073 -30160 -30625 -29859
6839b9859L97m75J226o86J440l14Q03J890N61j588j638N69r90N16j743J238qN48
$$ -29859 -29462 -29937 -28711 -29397 -27957 -28271 -27468 -25578 -25017 -26605 -28243 -27674 -28664 -28148 -29891 -28653 -28661 -28113
6821b8113j159L100m23o22J092l30J946J464K718K511q04j104k137K71j405l128
$$ -28113 -29272 -26172 -26595 -27217 -26125 -26455 -24509 -23045 -20327 -17816 -18620 -19724 -21861 -21590 -22995 -26123
6805b6123J309o68j12O35K81j376J112m62J570o50J352J561Q89K235o66l19j844
$$ -26123 -24814 -25482 -25594 -24959 -24678 -26054 -24942 -25404 -23834 -24484 -23132 -21571 -20682 -18447 -19113 -19432 -21276
6788b1276j461j028k080P16j194N73j423R46k40Q35n87R14o18j20OO96o82J067
$$ -21276 -22737 -23765 -25845 -25129 -26323 -25750 -27173 -26227 -26467 -25632 -26219 -25305 -25923 -26043 -26037 -25341 -26023 -24956
6770b4956K24q03J07m66K38n60k94J42n4J897Q25l79L73l79j787m14M14n85L56
$$ -24956 -24732 -25535 -25428 -25894 -25656 -26216 -26510 -26368 -26422 -24525 -23700 -24079 -23706 -24085 -25872 -26286 -25872 -26457 -26101
6751b6101j290J105o47Q74O90k12L49j00M050j127L365k7O82j043k69k551r84
$$ -26101 -27391 -26286 -26933 -26059 -25369 -25581 -25232 -25332 -21282 -22409 -19044 -19071 -18389 -19432 -19701 -22252 -23236
6734b3236J120o59K91q73r38N92J563O84N00J54J247O11K879K000O45r71k258
$$ -23236 -22116 -22775 -22484 -23357 -24295 -23703 -22140 -21456 -20956 -20802 -19555 -18944 -16065 -14065 -13420 -14391 -16649
6717a6649J43j750J383j477P77m53J295q96R02J351l94j55M63J173J744k164J119
$$ -16649 -16506 -18256 -16873 -18350 -17573 -18026 -16731 -17627 -16725 -15374 -15768 -15923 -15460 -14287 -12543 -14707 -13588
6700a3588j458j478n85k6l53j890O71k02k13j28r28l57N51Q96j717K48M03l82
$$ -13588 -15046 -16524 -17109 -17135 -17488 -19378 -18707 -18909 -19122 -19250 -20178 -20535 -19984 -19088 -20805 -20557 -20154 -20536
6682b0536l18J3M38j73n58n10n21Q3O01R4Q01n30q02P3P22n80M88N17j177N53
$$ -20536 -20854 -20841 -20403 -20576 -21134 -21644 -22165 -22082 -21481 -21387 -20586 -21116 -21918 -21845 -21123 -21703 -21215 -20698 -21875 -21322
6662b1322N74l57L32l23O92J081j110J500p73Q75N2J433q81J265J154R21J21J563
$$ -21322 -20748 -21105 -20773 -21096 -20404 -19323 -20433 -18933 -19706 -18831 -18779 -17346 -18227 -16962 -15808 -14887 -14766 -13203
6644a3203M51M50J103R87J00o61Q91R67p39j01Q4j486o97J10p16p74p8m4j110
$$ -13203 -12752 -12302 -11199 -10212 -10112 -10773 -9882 -8915 -9654 -9755 -9671 -11157 -11854 -11744 -12460 -13234 -13312 -13356 -14466
6625a4466J051j286r97M28q22K40L41P3M87J66k45m83J528j544J454m4M50L62
$$ -14466 -13415 -14701 -15698 -15270 -16092 -15852 -15511 -15438 -14951 -14785 -15030 -15513 -13985 -15529 -14075 -14119 -13669 -13307
6607a3307L77J214j438J369j006J84K432r52J481K007M26K94R98K341J5P4L14
$$ -13307 -12930 -11716 -13154 -11785 -12791 -12607 -10175 -11127 -9646 -7639 -7213 -6919 -5921 -3580 -3565 -3491 -3177
6590c177O80m38m45j964P06L81p58j643k99j221J161p72n88m90L1p09j550J97
$$ -3177 -2497 -2935 -3380 -5344 -4638 -4257 -5015 -6658 -6957 -8178 -7017 -7789 -8377 -8867 -8836 -9545 -11095 -10898
6572a0898K19n33K34R2L96p82k24L51n27j289J40j18m92K89P89K34m91K59J072
$$ -10898 -10679 -11212 -10978 -10886 -10490 -11272 -11496 -11145 -11672 -12961 -12821 -12939 -13431 -13142 -12353 -12119 -12610 -12351 -11279
6553a1279j997J220n43L67J148M08M37k00J64j294J220O06o44n84L70J05j86n20
$$ -11279 -13276 -12056 -12599 -12232 -11084 -10676 -10239 -10439 -10275 -11569 -10349 -9743 -10387 -10971 -10601 -10496 -10682 -11202
6535a1202P05m87q84M81l01m83J2N17l68L15K06o22N64l62L85J22k61l40K27N77
$$ -11202 -10497 -10984 -11868 -11387 -11688 -12171 -12159 -11642 -12010 -11695 -11489 -12111 -11547 -11909 -11524 -11402 -11663 -12003 -11776 -11199
6515a1199j32q37P46N65n52R64l64m25P69j339n1J145m3O65j193J051N83j64L33
$$ -11199 -11331 -12168 -11422 -10857 -11409 -10445 -10809 -11234 -10465 -11804 -11855 -10710 -10753 -10088 -11281 -10230 -9647 -9811 -9478
6496i478j18o50P74n08K50q05J11Q01o46O64k84N3N74l0M96Q70p25K40K25R79
$$ -9478 -9596 -10246 -9472 -9980 -9730 -10535 -10424 -9623 -10269 -9605 -9889 -9836 -9262 -9292 -8796 -7926 -8651 -8411 -8186 -7207
6476g207j105p31R22j93O30Q9L5N69J61o92N12rO56j253J233K22m04j64j63M7
$$ -7207 -8312 -9043 -8121 -8314 -7684 -7595 -7560 -6991 -6830 -7522 -7010 -7019 -6363 -7616 -6383 -6161 -6565 -6729 -6892 -6845
6456f845J173L25l58j201J277L16l80J211j31r55J096p21J61m93J257j120J445
$$ -6845 -5672 -5347 -5705 -6906 -5629 -5313 -5693 -4482 -4613 -5568 -4472 -5193 -5032 -5525 -4268 -5388 -3943
6439c943L0J365j483l18J067o65O1N17M7l15J009k28p38R74k2K7n75O14P86n02
$$ -3943 -3913 -2548 -4031 -4349 -3282 -3947 -3886 -3369 -3322 -3637 -2628 -2856 -3594 -2620 -2642 -2615 -3190 -2576 -1790 -2292
6419b292l92K29R52l85PP9M22L68j349N99P34J83q84M68Q81J79j019P38N04m47
$$ -2292 -2684 -2455 -1503 -1888 -1881 -1802 -1380 -1012 -2361 -1762 -1028 -845 -1729 -1261 -380 -201 -1220 -482 22 -425
6399d25O21j07M45M97j648N97J291j246Q01oP14k78J476j173r90J368N7P9j12
$$ -425 196 89 534 1031 -617 -20 1271 25 826 820 1534 1256 2732 1559 569 1937 1994 2073 1961
6380A961J79M74l56M93k46j06N69p70R44m75K009j032L84L44Q59N4P95j77J63
$$ 1961 2140 2614 2258 2751 2505 2399 2968 2198 3142 2667 4676 3644 4028 4372 5231 5285 6080 5903 6066
6361F066M94K70J297J68L91J626L29L30J668K2o21j270Q11o16q72Q73J98Q97k14
$$ 6066 6560 6830 8127 8295 8686 10312 10641 10971 12639 12661 12040 10770 11581 10965 10093 10966 11164 12061 11847
6342A1847J44N18J494M22K287q87J725J35m28q97j52M62j70p80m33P18j928O12
$$ 11847 11991 12509 14003 14425 16712 15825 17550 17685 17257 16360 16208 16670 16500 15720 15287 16005 14077 14689
6324A4689L31J19J405J6o47R77P29K152R67j78r30j096p78L15p95j50Q73k87J07
$$ 14689 15020 15139 16544 16560 15913 16890 17619 19771 20738 20560 19630 18534 17756 18071 17276 17126 17999 17712 17819
6305A7819P20r15J906j294J611J433J891P80L748R93l739k588j428j550j361K83
$$ 17819 18539 17624 19530 18236 19847 21280 23171 23951 27699 28692 24953 22365 20937 19387 18026 18309
6289A8309M9r53O97J159K15n32L10J565q96K39P26m28J14Q06j80J104n99K06J426
$$ 18309 18358 17405 18102 19261 19476 18944 19254 20819 19923 20162 20888 20460 20574 21380 21200 22304 21705 21911 23337
6270B3337jP16k73J361n29J780J516j062J066J156J642K479K341M637M539L734
$$ 23337 23336 24052 23779 25140 24611 26391 27907 26845 27911 29067 30709 33188 35529 40166 44705 48439
6254D8439k032n323k884l344j237j252r41O6j290L97o74j40R80j037J834o31q2
$$ 48439 46407 41084 38200 34856 33619 32367 31426 31492 30202 30599 29925 29785 30765 29728 31562 30931 30849
6237C0849J074l45N30L46J352J317J212Q32o9R79k23p7q17m83j33M40J383p54
$$ 30849 31923 31578 32108 32454 33806 35123 36335 37167 37098 38077 37854 37777 36960 36477 36344 36784 38167 37413
6219C7413J521K67P73J075l04J231j08Q47L46N72M20P70j586M39L1o27Q63j199
$$ 37413 38934 39201 39974 41049 40745 41976 41868 42715 43061 43633 44053 44823 43237 43676 43707 43080 43943 42744
6201D2744o39L82N75N75j663J473Q44J252J140L46J994r75M0o96j87M71o8k70
$$ 42744 42105 42487 43062 43637 41974 43447 44291 45543 46683 47029 49023 48048 48088 47392 47205 47676 47608 47338
6183D7338J119J379l45K620K102J249J369L8n01j16q82q59L61N33r97J733Q00
$$ 47338 48457 49836 49491 52111 54213 55462 56831 56869 56368 56252 55370 54511 54872 55405 54408 56141 56941
6166E6941O58K356K471J88K723J762J409N03K50J617k047o81j78j578J74j122
$$ 56941 57599 59955 62426 62614 65337 67099 68508 69011 69261 70878 68831 68150 67972 66394 66568 65446
6150F5446j104j281P47J252P44j53P23J613K469Q81K773M01j080J078o26j507
$$ 65446 64342 63061 63808 65060 65804 65651 66374 67987 70456 71337 74110 74511 73431 74509 73883 72376
6134G2376k208m6j671K79K79J055o28j50L00j64K368m93J54k55N96O78P08O43
$$ 72376 70168 70122 68451 68730 69009 70064 69436 69286 69586 69422 71790 71297 71451 71196 71792 72470 73178 73821
6116G3821Q56M83J024N18J94J149m24J350J451k15L12q73J804R60j09J615j396
$$ 73821 74677 75160 76184 76702 76896 78045 77621 78971 80422 80207 80519 79646 81450 82410 82301 83916 82520
6099H2520N74j4j664O43j064k59J222K025L003M51J462K107Q36K691P11J442L230
$$ 82520 83094 83080 81416 82059 80995 80736 81958 83983 86986 87437 88899 91006 91842 94533 95244 96686 99916
6082I9916j1L002L71J056K93K831K088J529R31K210J292Q73O83L470J156J41L103
$$ 99916 99905 102907 103278 104334 104627 107458 109546 111075 112006 114216 115508 116381 117064 120534 121690 121831 124934
6065A24934J143J479K156K084K468J546K234J476K108K010Q76K637K841K284J997
$$ 124934 126077 127556 129712 131796 134264 135810 138044 139520 141628 143638 144514 147151 149992 152276 154273
6050A54273L016J976K358K504K766K758K352L029L707K282K910L921L458L599
$$ 154273 157289 159265 161623 164127 166893 169651 172003 175032 178739 181021 183931 187852 191310 194909
6036A94909L787M818M353L824L605O413L656M081M930M818M727M914M574O905
$$ 194909 198696 203514 207867 211691 215296 221709 225365 229446 234376 239194 243921 248835 253409 260314
6022B60314N255O747N550P917O594P347N066R092R567P602J0324J0482J2992J3238
$$ 260314 265569 272316 277866 285783 292377 299724 304790 313882 323449 331051 341375 351857 364849 378087
6008C78087J7850J8475K1063K4349K9534L5143M4507N3439P0594R1870J07838
$$ 378087 395937 414412 435475 459824 489358 524501 569008 622447 693041 784911 892749
5997H92749P9375q269o9468o0311l6159j3961L387K1304L4752N1076O8454O4692
$$ 892749 972124 963855 894387 834076 797917 783956 787343 808647 843399 894475 962929 1027621
5985A027621J9824j0973Q461M0503O8174N5212r541o4946n6591k6388j387J8432
$$ 1027621 1047445 1036472 1044933 1085436 1153610 1208822 1199281 1134335 1077744 1051356 1049969 1068401
5973A068401L9448K0934m1611n4506l3606j2883N447K3277M2838P4653J02281
$$ 1068401 1107849 1128783 1087172 1032666 999060 986177 991624 1014901 1057739 1132392 1234673
5962A234673O5094n9528j39197j19464q1902n9308m5894l3162k4463j7927j1800
$$ 1234673 1299767 1240239 1101042 981578 899676 840368 794474 761312 736849 718922 707122
5951G07122r028p251l563m485k588k336m213o42M84K53P71J435L842M307N140
$$ 707122 698094 690843 687280 682795 680207 677871 673658 673016 673500 673753 674524 675959 679801 684108 689248
5936F89248L779M557J706K529M847M250N302O843N637N055N623M970N237O444
$$ 689248 693027 697584 699290 701819 706666 710916 716218 723061 728698 733753 739376 744346 749583 756027
5922G56027O624P985P681P585R001O447P147O468Q058P336P336R331R215P381
$$ 756027 762651 770636 778317 785902 794903 801350 808497 814965 823023 830359 837695 847026 856241 863622
5908H63622Q603R633Q875Q949Q387Q904Q094R941R036Q839N095N843L983M135
$$ 863622 872225 881858 890733 899682 908069 916973 925067 935008 944044 952883 957978 963821 967804 971939
5894I71939O47k54L220O269J0932J4620J2988J5058J5829J6535J5010J6453J7233
$$ 971939 972586 972332 975552 981821 992753 1007373 1020361 1035419 1051248 1067783 1082793 1099246 1116479
5881A116479J7596J8001J9187J8407J8286K0322K0122K1124K2050K1887K4943
$$ 1116479 1134075 1152076 1171263 1189670 1207956 1228278 1248400 1269524 1291574 1313461 1338404
5870A338404K3792K7214K6905K3964K1291J8932K0652J8932J7085J6677J4687
$$ 1338404 1362196 1389410 1416315 1440279 1461570 1480502 1501154 1520086 1537171 1553848 1568535
5859A568535J2152J2420J2668J5358J6700J8119J8633K2310K3194K4076K3280
$$ 1568535 1580687 1593107 1605775 1621133 1637833 1655952 1674585 1696895 1720089 1744165 1767445
5848A767445K1161J5360J1839N014N011Q255J5125J6618K0993K3333K6171K7109
$$ 1767445 1788606 1803966 1815805 1820819 1825830 1834085 1849210 1865828 1886821 1910154 1936325 1963434
5836A963434K6173K6073K2114K3345K3506K6011K9077L1849L5162L6094L6015
$$ 1963434 1989607 2015680 2037794 2061139 2084645 2110656 2139733 2171582 2206744 2242838 2278853
5825B278853L7340M1614M3319M2141L6925L1784L4398L4021L6731L4367L3803
$$ 2278853 2316193 2357807 2401126 2443267 2480192 2511976 2546374 2580395 2617126 2651493 2685296
5814B685296L5935L7721L9301L9436M4968N0164N4807M9435M9968M5897M7269
$$ 2685296 2721231 2758952 2798253 2837689 2882657 2932821 2987628 3037063 3087031 3132928 3180197
5803C180197M9726N1243N3853N4103N4409N9778O2330O8307P2522P4966P5796
$$ 3180197 3229923 3281166 3335019 3389122 3443531 3503309 3565639 3633946 3706468 3781434 3857230
5792C857230P5991P9144Q1718Q6763Q8494Q9927R7629J12287J17340J23271J29232
$$ 3857230 3933221 4012365 4094083 4180846 4269340 4359267 4456896 4569183 4686523 4809794 4939026
5781D939026J37192J42088J46656J49459J55072J61430J64831J73966K12136J46836
$$ 4939026 5076218 5218306 5364962 5514421 5669493 5830923 5995754 6169720 6381856 6528692
5771F528692J74666J98240K21017K53831L07400L71851L50219K85116K62704K55724
$$ 6528692 6703358 6901598 7122615 7376446 7683846 8055697 8405916 8691032 8953736 9209460
5761I209460K61160K54779K51017K62312K64712K75093K95476L04597L10322L20731
$$ 9209460 9470620 9725399 9976416 10238728 10503440 10778533 11074009 11378606 11688928 12009659
5751A2009659L34933L46388L68871M06289M34470M62930M86519N20240N82281
$$ 12009659 12344592 12690980 13059851 13466140 13900610 14363540 14850059 15370299 15952580
5742A5952580O35457O81998P67102Q15858P90573Q06019Q58439R10824R14411
$$ 15952580 16588037 17270035 18037137 18852995 19643568 20449587 21308026 22218850 23133261
5733B3133261R61640J072560J212047J338299J490852J624505J843850J971918
$$ 23133261 24094901 25167461 26379508 27717807 29208659 30833164 32677014 34648932
5725C4648932K212437K441786K442875K581053K701036K503492K480466K966157
$$ 34648932 36861369 39303155 41746030 44327083 47028119 49531611 52012077 54978234
5717E4978234L543640M179442M893942N795587O986233Q721027J0903236J2949326
$$ 54978234 58521874 62701316 67595258 73390845 80377078 89098105 100001341 112950667
5709A12950667J4858240J7062395K0281338K2931008K5811094K6834856K7386571
$$ 112950667 127808907 144871302 165152640 188083648 213894742 240729598 268116169
5702B68116169L3173129L5178193K2730700J687619k2579708l1703350l1522267
$$ 268116169 301289298 336467491 359198191 360885810 338306102 306602752 275080485
5695B75080485k9814656k9799117k6623103k3067155j9593434j7268434j4660677
$$ 275080485 245265829 215466712 188843609 165776454 146183020 128914586 114253909
5688A14253909j2349968j0316895q588292p233674o288913n603665m865640m144225
$$ 114253909 101903941 91587046 82998754 75765080 69476167 63872502 59006862 54862637
5680E4862637l559554l114563k765498k513363k266264k080381j938161j737970
$$ 54862637 51303083 48188520 45423022 42909659 40643395 38563014 36624853 34886883
5672C4886883j552632j416672j310327j225848j135418j051417r78789r11420
$$ 34886883 33334251 31917579 30607252 29381404 28245986 27194569 26215780 25304360
5664B5304360q44837j073552j021339r00573q21300p50866o95740o53060o08746
$$ 25304360 24459523 23385971 22364632 21464059 20642759 19891893 19196153 18543093 17934347
5655A7934347n63364n25555m99479n02619n02987m78031m47258m15614l84593
$$ 17934347 17370983 16845428 16345949 15843330 15340343 14862312 14415054 13999440 13614847
5646A3614847l71981l64994l47190l23566l02794k89772k82185k73893k71267
$$ 13614847 13242866 12877872 12530682 12207116 11904322 11614550 11332365 11058472 10787205
5637A0787205k59744k47982k33902k23251k20197k14038j95450j88041k78436
$$ 10787205 10527461 10279479 10045577 9822326 9602129 9388091 9192641 9004600 8726164
5628H726164l32101l10884k82116k54422k38551k22382k02338j85058j64735j60785
$$ 8726164 8394063 8083179 7801063 7546641 7308090 7085708 6883370 6698312 6533577 6372792
5618F372792j63817j62382j52971j42478j40846j36103j37394j31245j26756j19469
$$ 6372792 6208975 6046593 5893622 5751144 5610298 5474195 5336801 5205556 5078800 4959331
5608D959331j13082j08889j06761j03472r7908r7208r2746r3420r1540q8841q6144
$$ 4959331 4846249 4737360 4630599 4527127 4429219 4332011 4239265 4145845 4054305 3965464 3879320
5597C879320q0102p9155p2955p0544o4931o2694o8306o8522o7411o3986n8291
$$ 3879320 3799218 3720063 3647108 3576564 3511633 3448939 3380633 3312111 3244700 3180714 3122423
5586C122423n6374n4517n4215n4670n5411n2715m9465m6732m3959l9348l6750
$$ 3122423 3066049 3011532 2957317 2902647 2847236 2794521 2745056 2698324 2654365 2615017 2578267
5575B578267l4250l3093l3176l4044l2574l2442l1850l6232l5019l3847l2276
$$ 2578267 2544017 2510924 2477748 2443704 2411130 2378688 2346838 2310606 2275587 2241740 2209464
5564B209464l5396l9629l8303l5827l5615l6209l3496l4744l5013m3283m6486
$$ 2209464 2174068 2134439 2096136 2060309 2024694 1988485 1954989 1920245 1885232 1841949 1795463
5553A795463m1567l7980l0562k3179j8501j9634k1181k2323k8182k8917k9915
$$ 1795463 1753896 1715916 1685354 1662175 1643674 1624040 1602859 1580536 1552354 1523437 1493522
5542A493522k9528l0940l1636k8016k5960k0471k0112j9748j7948j6745j3914
$$ 1493522 1463994 1433054 1401418 1373402 1347442 1326971 1306859 1287111 1269163 1252418 1238504
5531A238504j5363j2937j2146j4943j4894j4761j3255j3016j2979j2480j1561
$$ 1238504 1223141 1210204 1198058 1183115 1168221 1153460 1140205 1127189 1114210 1101730 1090169
5520A090169j1586j0458j1274p704j1962r871j1125j1502j1448j0342j2000j1723
$$ 1090169 1078583 1068125 1056851 1049147 1037185 1027314 1016189 1004687 993239 982897 970897 959174
5508I59174j4248j8342k0823k5764k1837j8036j4914j5358j2716j1548j0227j0367
$$ 959174 944926 926584 905761 879997 858160 840124 825210 809852 797136 785588 775361 764994
5496G64994r590q926q020q360q011p048n949o785n943o724n948l271m117k457
$$ 764994 755404 746478 738458 730098 722087 715039 709090 702305 696362 689638 683690 680419 676302 673845
5482F73845m34L536N276l92j6598j1085r284j1790r307p474q554m163n489m836
$$ 673845 673411 676947 682223 681831 665233 654148 644864 633074 623767 616293 607739 603576 598087 593251
5468E93251m967m984m618n904j973l723k900m44n62j894l54L66n05q2j502J33
$$ 593251 588284 583300 578682 572778 570805 567082 564182 563738 563176 561282 560928 561294 560789 560707 559205 559338
5452E59338j399R07L803K972O484O456Q547J0282J5312J5757K0524K8213L3910
$$ 559338 557939 558846 562649 565621 572105 578561 587108 597390 612702 628459 648983 677196 711106
5439G11106M3679N4730P3899J04708J33078J04888j9296j01408q6574n3745k9413
$$ 711106 754785 809515 883414 988122 1121200 1226088 1206792 1105384 1018810 965065 935652
5428I35652r884Q096L2143N1905N5436J1609l8766k4498L247K4375M8196O7407
$$ 935652 925768 933864 966007 1017912 1073348 1084957 1046191 1021693 1024940 1049315 1097511 1164918
5416A164918M1071l3057p2412n4120j8993M188j077m6085p1872n6628l8924k3326
$$ 1164918 1205989 1172932 1100520 1046400 1027407 1031595 1030518 984433 912561 855933 817009 793683
5404G93683o831Q872K7880N0548P0042L7806m8560j04427j00810p8466o1072m5825
$$ 793683 786852 795724 823604 874152 944194 982000 933440 829013 728203 649737 588665 542840
5392E42840l6212k8853k5609k0956j8268j6116j3945j3788j0657j2267r178q312
$$ 542840 506628 477775 452166 431210 412942 396826 382881 369093 358436 346169 336991 328679
5380C28679q639p550p185p631n913n762n125n811n649n932n128m856l530n680
$$ 328679 320040 312490 305305 297674 291761 285999 280874 275063 269414 263482 258354 253498 249968 244288
5366B44288n557l286m121m820l463k916m800m893l846l607l133m056j655l262
$$ 244288 238731 235445 231324 226504 223041 220125 215325 210432 206586 202979 199846 195790 194135 190873
5352A90873l346j858k004k603l971k597j812k469k647j433l551j688j623j604
$$ 190873 187527 185669 183665 181062 177091 174494 172682 170213 167566 166133 162582 160894 159271 157667
5338A57667k253k120j868r83j596k636m99j921j667k326r00j410j186j090J61
$$ 157667 155414 153294 151426 150443 148847 146211 145712 143791 142124 139798 138898 137488 136302 135212 135373
5323A35373r38j526k661o84n89j154K73o26q65r67k69M39n13J487m19j64l57l02
$$ 135373 134435 132909 130248 129564 128975 127821 128094 127468 126603 125636 125367 125806 125293 126780 126361 126197 125840 125538
5305A25538j62O45j561j915k328k92j828P45m90j280M99J234p7J289K77P72J342
$$ 125538 125376 126021 124460 122545 120217 119925 118097 118842 118352 117072 117571 118805 118728 120017 120294 121066 122408
5288A22408L657N99K460L788L159M587N387O685N831P457M660O744O704O773R834
$$ 122408 126065 126664 129124 132912 136071 140658 146045 152730 158561 166018 170678 177422 184126 190899 200733
5273B00733R308J2026J0001J0583J0025R533P528P290P590R085J0553J2752J1738
$$ 200733 210041 222067 232068 242651 252676 262209 269737 277027 284617 293702 304255 317007 328745
5260C28745J1424Q990L929M225N011K526L065O476Q369O450O955N954K462m76
$$ 328745 340169 349159 353088 357313 362324 364850 367915 374391 382760 389210 396165 402119 404581 404105
5246D04105K77m218J345K326M569M728N768M843R15l09l447j716k747J434M019
$$ 404105 404382 400164 401509 403835 408404 413132 418900 423743 424658 424349 420902 419186 416439 417873 421892
5231D21892O733P592O952J259l96j497m587k567O89K803O853Q611O031P19k764
$$ 421892 428625 436217 443169 444428 444032 442535 437948 435381 436070 438873 445726 454337 460368 461087 458323
5216D58323k534o174n970j095K728M723K364L994K815j787r108j0090p840n228
$$ 458323 455789 449615 443645 442550 445278 450001 452365 456359 459174 457387 448279 438189 430349 425121
5202D25121m339j997k534l482p897r925j0603j2830j5963j5743j2939j1372j0573
$$ 425121 420782 418785 416251 412769 404872 394947 384344 371514 355551 339808 326869 315497 304924
5189C04924r419j0679j4025j4971j6669j3922j3662j3873j2359j2209j0838j0353
$$ 304924 295505 284826 270801 255830 239161 225239 211577 197704 185345 173136 162298 151945
5177A51945r511q389r029r947p110p271o349m302m855l282m049l269k247l781
$$ 151945 142434 134045 125016 115069 107959 100688 94339 90037 85182 81900 77851 74582 72335 68554
5163F8554j152k568j589k984j514j306j734j296k324j722p7j629k266j992k43
$$ 68554 67402 64834 63245 60261 58747 57441 55707 54411 52087 50365 50288 48659 46393 44401 44158
5148D4158j210k436k209m12k526n41o35j537j691q55j765m88n08j033j001n99
$$ 44158 42948 40512 38303 37891 35365 34824 34189 32652 30961 30106 28341 27853 27345 26312 25311 24712
5132B4712j402n26p56j286j602j13p11n23j068k037Q2j310n39p60M7j293j22r84
$$ 24712 23310 22784 22028 20742 19140 19027 18316 17793 16725 14688 14770 13460 12921 12161 12208 10915 10793 9809
5114I809R72q44J968j198L51J486Pl84L54R66j030q23k222n70j593j310r60j545
$$ 9809 10781 9937 11905 10707 11058 12544 12551 12167 12521 13487 12457 11634 9412 8842 7249 5939 4979 3434
5096C434j01j806m38k17j321M04o84j275k14o48j017J192j274R45j390M86J437
$$ 3434 3333 1527 1089 872 -449 -45 -729 -2004 -2218 -2866 -3883 -2691 -3965 -3020 -4410 -3924 -2487
5079b487r13k80pQ65j199O23K42q75j406Q50j258o86n2j345k43K39n96j010j30
$$ -2487 -3400 -3680 -3687 -2822 -4021 -3398 -3156 -4031 -5437 -4587 -5845 -6531 -6583 -7928 -8171 -7932 -8528 -9538 -9668
5060i668L1N21j811Q36L56k199K19K52M3q44m67L84m09L9K73p27M50L38K21J12
$$ -9668 -9637 -9116 -10927 -10091 -9735 -11934 -11715 -11463 -11420 -12264 -12731 -12347 -12756 -12717 -12444 -13171 -12721 -12383 -12162 -12050
5040a2050j278J286m02NO24M24J18M6K87n11L50k65l1K98M70k00p6l74N29J139
$$ -12050 -13328 -12042 -12444 -12439 -11815 -11391 -11273 -11227 -10940 -11451 -11101 -11366 -11397 -11099 -10629 -10829 -10905 -11279 -10750 -9611
5020i611r68J089O1M40k44m46j47m73M89n4J82J12K58O58p97k49Q77r95R81o04
$$ -9611 -10579 -9490 -9429 -8989 -9233 -9679 -9826 -10299 -9810 -9864 -9682 -9570 -9312 -8654 -9451 -9700 -8823 -9818 -8837 -9441
5000i441N4q56J361N75N69j129K39k55M21L27l19J948j814j4K140J39r86J480
$$ -9441 -9387 -10243 -8882 -8307 -7738 -8867 -8628 -8883 -8462 -8135 -8454 -6506 -8320 -8334 -6194 -6055 -7041 -5561
4982e561l65R08m25N86N0Q22J507j338J275O13P16P67k52P37J628k90O20R51J879
$$ -5561 -5926 -5018 -5443 -4857 -4807 -3985 -2478 -3816 -2541 -1928 -1212 -445 -697 40 1668 1378 1998 2949 4828
4963D828R54P03Q81n58K107n97J127J287J539k05J613J399Q43J682J050K140J055
$$ 4828 5782 6485 7366 6808 8915 8318 9445 10732 12271 12066 13679 15078 15921 17603 18653 20793 21848
4946B1848K067K269P58J326l31K141J016J325K036Q30O20K627O47J294L492J035
$$ 21848 23915 26184 26942 28268 27937 30078 31094 32419 34455 35285 35905 38532 39179 40473 43965 45000
4930D5000L411L167L345L582M373M948N187P589P637J0866J1646J4737J6277J8777
$$ 45000 48411 51578 54923 58505 62878 67826 73013 80602 88239 99105 110751 125488 141765 160542
4916A60542J2285P468k056m665r914q294o848l689r7J156M415O402R295J1638
$$ 160542 172827 180295 178239 173574 163660 155366 148518 144829 144732 145888 150303 156705 166000 177638
4902A77638J6476K0219K4270K6709K3995K0390J8358J7970R088N138N10Q03o69
$$ 177638 194114 214333 238603 265312 289307 309697 328055 346025 355113 360251 360761 361564 360895
4889C60895j573m687n321r771j1744j1388p242k864N465J1778K2538L0009L6034
$$ 360895 359322 354635 349314 339543 327799 316411 309169 306305 311770 323548 346086 376095 412129
4876D12129L4685K8779K0454J3404Q656J626l16q10O62L038k519r067j3657j4543
$$ 412129 446814 475593 496047 509451 518107 519733 519417 518607 519269 522307 519788 510721 497064 482521
4862D82521j4861j2815m372N282J3121J6242J7379J9353J7650J3016J2299J6117
$$ 482521 467660 454845 450473 455755 468876 485118 502497 521850 539500 552516 564815 580932
4850E80932K1050K6559K5227J8926J2159K488j170o742J733J0443K6021M2641
$$ 580932 601982 628541 653768 672694 684853 687341 686171 679429 681162 691605 717626 760267
4838G60267N7629O9581P5716P5380P0973N3911L0442l667l3737n1459o1133o6948
$$ 760267 817896 887477 963193 1038573 1109546 1163457 1193899 1190232 1156495 1105036 1043903 976955
4826I76955o2508o5537o6434o6935o4046n8290n3269m5731l7862l1510k4966k1376
$$ 976955 914447 848910 782476 715541 651495 593205 539936 494205 456343 424833 399867 378491
4814C78491j6390j2423q286k979L402O571P742J386m120j1644j4940k3032k2223
$$ 378491 362101 349678 341392 338413 341815 348386 356128 357514 353394 341750 326810 303778 281555
4801B81555k2836j7922j6201j2690j1864j0770r014r846o516o697n810n735l785
$$ 281555 258719 240797 224596 211906 200042 189272 180258 170412 163896 157199 151389 145654 141869
4788A41869n380k697m466k722j184l571j721k054m83n28j967l28k99k483o41j095
$$ 141869 136489 133792 129326 126604 125420 121849 120128 118074 117591 117063 115096 114768 114469 111986 111345 110250
4772A10250j564j920q01q01R08j01J55K065K276J811K279M098L445N478L634L475
$$ 110250 108686 106766 105965 105164 106072 105971 106126 108191 110467 112278 114557 118655 122100 127578 131212 134687
4756A34687L426K012L593M75J283k11K599m24J337K144K982L106L260M377L691
$$ 134687 138113 140125 143718 144193 145476 145265 147864 147440 148777 150921 153903 157009 160269 164646 168337
4741A68337K661K974K577R62K868K907J413J550j57P95J338L58M13J109R14J101
$$ 168337 170998 173972 176549 177511 180379 183286 184699 186249 186092 186887 188225 188583 188996 190105 191019 192120
4725A92120K822J43L548R87L04j811j98j172j516j91j220lM04m1Q54r16Q54J77
$$ 192120 194942 195085 198633 199620 199924 198113 197915 196743 195227 195036 193816 193813 194217 194176 195030 194114 194968 195145
4707A95145j067O4R88Q96J944J880J13q18M47K723L233N329P200R092O905M625
$$ 195145 194078 194142 195130 196026 197970 199850 199963 199145 199592 202315 205548 210877 218077 227169 234074 238699
4691B38699J044K345L556P175Q489J2451J7043J5772J4564J4511J5001J7228K1314
$$ 238699 239743 242088 245644 252819 261308 273759 290802 306574 321138 335649 350650 367878 389192
4678C89192K3421K6010L0236L4763L4202L1764L1330K7654K7991K9839K8788K4818
$$ 389192 412613 438623 468859 503622 537824 569588 600918 628572 656563 686402 715190 740008
4666G40008K3114J7853J8335K0551J9553J2192O460M528Q56K450R109O108M687
$$ 740008 763122 780975 799310 819861 839414 851606 858066 862594 863450 865900 875009 881117 885804
4653H85804J013j622m178n73K919O513M493L511k373l467J482N471M244K534L383
$$ 885804 886817 885195 881017 880444 883363 889876 894369 897880 895507 892040 893522 898993 903237 905771 909154
4638I09154K271P063J8259K5390K4984Q046j2202j1628P949L0173N4044O9975
$$ 909154 911425 918488 936747 962137 987121 995167 982965 971337 979286 1009459 1063503 1133478
4626A133478P3437N7544K4200j5764l5551j2881K6824N4992N9784M8960M4761
$$ 1133478 1206915 1264459 1288659 1272895 1237344 1224463 1251287 1306279 1366063 1415023 1459784
4615A459784K7648k2409o4744o5487l4513k809J3693L4965O6219P5726J7975o7958
$$ 1459784 1487432 1465023 1400279 1334792 1300279 1297470 1311163 1346128 1412347 1488073 1506048 1438090
4603A438090j01032p7636l5244Q288N7389R6813J06430N0348l3426q7182r3968
$$ 1438090 1337058 1259422 1224178 1232466 1289855 1386668 1493098 1543446 1510020 1422838 1328870
4592A328870q1777n5937j9586K3527N1451M2880J0026l1814p2586j08830j09802
$$ 1328870 1247093 1191156 1171570 1195097 1246548 1289428 1299454 1267640 1195054 1086224 976422
4581I76422q6466n7691k9563p692K836j0147l9554n8968o0202m9585l7602k8676
$$ 976422 889956 832265 802702 795010 797846 787699 748145 689177 628975 579390 541788 513112
4569E13112k2391j6616j3361r254o377k420j331J435M739P126R779J5027J4428
$$ 513112 490721 474105 460744 451490 445113 442693 441362 442797 447536 454662 464441 479468 493896
4556D93896J9371K1261K4485K6585K8672L1718L1203L2568L0253K8992K7901K5783
$$ 493896 513267 534528 559013 585598 614270 645988 677191 709759 740012 769004 796905 822688
4544H22688K1058J8541J9097J6540J4883J4201J2873J3036M802J212L17J10m02
$$ 822688 843746 862287 881384 897924 912807 927008 939881 952917 957719 958931 959248 959358 958956
4531I58956K368J957J861k447p023q498j0751j3316j4156j8116j7990k1277k3005
$$ 958956 961324 963281 965142 962695 955672 947174 936423 923107 908951 890835 872845 851568 828563
4518H28563k5711k8145k9593l4056l2744l3881l2526l2028l2599l1458l0551k8649
$$ 828563 802852 774707 745114 711058 678314 644433 611907 579879 547280 515822 485271 456622
4506D56622k6080k5306k3123k1779k0933j8206j5982j4070j4147j2789j3803j1857
$$ 456622 430542 405236 382113 360334 339401 321195 305213 291143 276996 264207 250404 238547
4494B38547j1364q938j0023q961p663p981r027o270o996p145m832o288n435m156
$$ 238547 227183 218245 208222 199261 191598 183617 174590 168320 161324 154179 149347 143059 137624 133468
4480A33468m677l681l969l772n282k162k831m480j315l694k719j521l825j653
$$ 133468 128791 125110 121141 117369 112087 109925 107094 102614 101299 97605 94886 93365 89540 87887
4466H7887j349k647j995k172j010l658k347j246k775j250j910j163p69r59j428
$$ 87887 86538 83891 81896 79724 78714 75056 72709 71463 68688 67438 65528 64365 63596 62637 61209
4451F1209N96j186J605j044j683k254j800j349o71m82r38j320l09l75j240j39
$$ 61209 61805 60619 62224 61180 59497 57243 55443 54094 53423 52941 52003 50683 50374 49999 48759 48620
4435D8620R80j371j763r11n48j091j231j285L8j247k194k5J97k65j930o89m83
$$ 48620 49600 48229 46466 45555 45007 43916 42685 41400 41438 40191 37997 37972 38169 37904 35974 35285 34802
4418C4802J99j984k2m99j191j59o20j422R5r82P22O89J13j114J072R51m53Q40
$$ 34802 35001 33017 32995 32496 31305 31146 30526 29104 29199 28217 28939 29628 29741 28627 29699 30650 30197 31037
4400C1037J219K262K335L032l871m067k355l50k39r48N05j789J0j552q82K77k069
$$ 31037 32256 34518 36853 39885 36014 31947 29592 29242 29003 28055 28560 26771 26781 25229 24347 24624 22555
4383B2555O74k64k061O18k88j580P96r1j169N76m70n12J40j09m0o12p50P20k283
$$ 22555 23229 22965 20904 21522 21234 19654 20450 20359 19190 19766 19296 18784 18924 18815 18775 18163 17413 18133 15850
4364A5850J943m20N73m38j059R18j62m12p0p43j448K94j027P25j078k4k448Q34
$$ 15850 17793 17373 17946 17508 16449 17367 17205 16793 16723 15980 14532 14826 13799 14524 13446 13422 10974 11808
4346A1808j628o2J150L38J23J539l85k49j047J128j87Q59L25Q29k88K614o78p93
$$ 11808 10180 10118 11268 11606 11729 13268 12883 12634 11587 12715 12528 13387 13712 14541 14253 16867 16189 15396
4328A5396M76N2J78m99K97n27o10j589j71q49o43k842J179j369R99j394J250J59
$$ 15396 15872 15924 16102 15603 15900 15373 14763 13174 13003 12154 11511 8669 9848 8479 9478 8084 9334 9493
4310I493j01j050J703N27l93M94R8N90L17L010N53L51J869P22J334K77q73k37
$$ 9493 9392 8342 10045 10572 10179 10673 10771 11361 11678 14688 15241 15592 17461 18183 19517 19794 18921 18684
4292A8684M90M24k25o09J1Q9m13p1P06J639j007J41O55j8J213j393N7J000n62
$$ 18684 19174 19598 19373 18764 18775 18864 18451 18380 19086 20725 19718 19859 20514 20496 21709 20316 20373 21373 20811
4273B0811J649m16J462J67L16J878p66J498o87O64o32M34J498j44R55J077J27
$$ 20811 22460 22044 23506 23673 23989 25867 25101 26599 25912 26576 25944 26378 27876 27732 28687 29764 29891
4256B9891J679p70J843J442Q93Q86R52Q23J478J693Q10R78K147K753K444J782
$$ 29891 31570 30800 32643 34085 34978 35864 36816 37639 39117 40810 41620 42598 44745 47498 49942 51724
4240E1724J351J513K471J827j454j037Q74N74k59m16j877K14J048N30r4l97L22
$$ 51724 53075 54588 57059 58886 57432 56395 57269 57843 57584 57168 55291 55505 56553 57083 56989 56592 56914
4223E6914R47M39J88K139K938L825M246O433N887O319N874M066K674J255J685
$$ 56914 57861 58300 58488 60627 63565 67390 71636 78069 83956 90275 96149 100215 102889 104144 105829
4208A05829r8j933r94l189k024l367r23k020j351J23l245N26m00J153l22K330
$$ 105829 105731 103798 102804 99615 97591 94224 93301 91281 89930 90053 86808 87334 86934 88087 87765 90095
4192I0095J383K697K848M351M114L916M190M647M424L527L655N013N559O317M881
$$ 90095 91478 94175 97023 101374 105488 109404 113594 118241 122665 126192 129847 134860 140419 146736 151617
4177A51617L990L626P60K739J902L173N955M317N311K204J397m39r63L95L590
$$ 151617 155607 159233 159993 162732 164634 167807 173762 178079 183390 185594 186991 186552 185589 185984 189574
4162A89574K388K764Q03K03o12q81p65k358q55r10M72O83K112M623K417J555j895
$$ 189574 191962 194726 195529 195732 195120 194239 193474 191116 190261 189351 189823 190506 192618 197241 199658 201213 199318
4145A99318m502m759m733m227k221m65r86M23J867J653K720K310J929N305M219
$$ 199318 194816 190057 185324 181097 178876 178411 177425 177848 179715 181368 184088 186398 188327 193632 197851
4130A97851M244K095K108K607L065K953J947L565L333N191O031R260R165J1368
$$ 197851 202095 204190 206298 208905 211970 214923 216870 220435 223768 228959 234990 244250 253415 264783
4116B64783Q139O136L14l581k657p06J845K247J944J490K107L537J486j223o832
$$ 264783 272922 279058 279372 275791 273134 272428 274273 276520 278464 279954 282061 285598 287084 285861 279029
4101B79029p088n710m864l384n20p79K755L195K362J496K182K767L252N281O390
$$ 279029 271941 266231 261367 257983 257463 256684 259439 262634 264996 266492 268674 271441 274693 279974 286364
4086B86364O589O329O453Q367R938J2920J2779J0623J1091J1677J3189J8702K4375
$$ 286364 292953 299282 305735 314102 324040 336960 349739 360362 371453 383130 396319 415021 439396
4073D39396K8337K8758K3842K2778K1527K9277L3728L6222K8015J9313J3596J6101
$$ 439396 467733 496491 520333 543111 564638 593915 627643 663865 691880 711193 724789 740890
4061G40890K1186K0109J2233K274n575j2441j2811n545j638k670p990j6889k0735
$$ 740890 762076 782185 794418 796692 791117 778676 765865 760320 758682 756012 748022 731133 710398
4048G10398j5914j0118k891K47j124J094J844O733R576J2680J9912K7013L0150
$$ 710398 694484 684366 681475 681722 680598 681692 683536 690269 699845 712525 732437 759450 789600
4035G89600K8194K9847L8688N3392O9420P0086N4965L8320K7101L3025N0331N6137
$$ 789600 817794 847641 886329 939721 1009141 1079227 1134192 1172512 1199613 1232638 1282969 1339106
4023A339106M1349R817j6302k9371l1495j9072n465q640k6215m6850n9359n5732
$$ 1339106 1380455 1390272 1373970 1344599 1313104 1294032 1288567 1279927 1253712 1206862 1147503 1091771
4011A091771l9431k1896j2395j6209k2857j8661k938J6352L5093N8482P9859Q0569
$$ 1091771 1052340 1030444 1018049 1001840 978983 960322 957384 973736 1008829 1067311 1147170 1227739
3999A227739O1513L9072K8155K9006N7844Q6758P3556L0256j9801o7979r3810
$$ 1227739 1289252 1328324 1356479 1385485 1443329 1530087 1603643 1633899 1614098 1546119 1452309
3988A452309p5365m6425m1883n3430p1894r3806j00743q9655p0379n2310l9694
$$ 1452309 1376944 1330519 1288636 1235206 1163312 1069506 968763 879108 808729 756419 716725
3977G16725l1108k7351k4503k2822j8194j3002j1349p781m675o76L672J0347J6538
$$ 716725 685617 658266 633763 610941 592747 579745 568396 560615 555940 555264 558936 569283 585821
3964E85821K0933J8779J3801J0878Q364J4266K3768K6671J3442q25j8680k9218
$$ 585821 606754 625533 639334 650212 658576 672842 696610 723281 736723 735898 717218 688000
3952F88000k6131j4308j0331j2911j9501k9491l3420k9156k1936j5335j1835r767
$$ 688000 661869 647561 637230 624319 604818 575327 541907 512751 490815 475480 463645 453878
3940D53878r129q658o599o145m142k069J279J250J130K585L839K372N638N213
$$ 453878 444749 436091 429492 423347 419205 417136 418415 419665 420795 423380 427219 429591 435229 440442
3926D40442N480P894O818O833O078O319O546O565Q563R407J0329R883J1366J2142
$$ 440442 445922 453816 460634 467467 473545 479864 486410 492975 501538 510945 521274 531157 542523 554665
3912E54665J0264J1013J2378J1982J4153J6242J7940K1623K2006K4896K8834L1792
$$ 554665 564929 575942 588320 600302 614455 630697 648637 670260 692266 717162 745996 777788
3900G77788L6740M1420M6281M6904M5766N3448N7972M2233K6830J3860L896J2162
$$ 777788 814528 855948 902229 949133 994899 1048347 1106319 1148552 1175382 1189242 1193138 1205300
3888A205300K3697L7229L9177M0790L7695K9439J7211J444j1731k2226l1904l6452
$$ 1205300 1228997 1266226 1305403 1346193 1383888 1413327 1430538 1431982 1420251 1398025 1366121 1329669
3876A329669l3525k0690o357J1391K7206L9626N4073P0346R0011J08670J18946
$$ 1329669 1296144 1275454 1269097 1280488 1307694 1347320 1401393 1471739 1561750 1670420 1789366
3865A789366J23280J24474J27880J42197J57255J57911J29400R0105O5851M5919
$$ 1789366 1912646 2037120 2165000 2307197 2464452 2622363 2751763 2841868 2907719 2953638
3855B953638M6678N6936N6642L6907K1035J8208J386k3548l1362k3134k435J7565
$$ 2953638 3000316 3057252 3113894 3150801 3171836 3190044 3191430 3167882 3136520 3113386 3110951 3128516
3843C128516J6855o862l3347m9100n8187o3486p3478r8501j18288j16725j10686
$$ 3128516 3145371 3138509 3105162 3056062 2997875 2934389 2860911 2762410 2644122 2527397 2416711
3832B416711j24032j42432j39914j21036j08393j02868j06180j00931j02895r9983
$$ 2416711 2292679 2150247 2010333 1889297 1780904 1678036 1571856 1470925 1368030 1268047
3822A268047q7985o9904n9199o1413n4025m5990l7090l0557k2645j9362j5023
$$ 1268047 1180062 1110158 1050959 989546 935521 889531 852441 821884 799239 779877 764854
3811G64854j5848p776l284M17q10L626O878Q360J108o932q183j1916j7150j3115
$$ 764854 749006 741230 737946 738363 737553 741179 748057 756417 757525 750593 742410 730494 713344 700229
3797G00229r483j0154j3691k0142k0430k4443k8821k8497k6390k5398k3426k3948
$$ 700229 690746 680592 666901 646759 626329 601886 573065 544568 518178 492780 469354 445406
3785D45406k0441j6689j4184j0075o510m893k511L068O760P061o591k1426j8082
$$ 445406 424965 408276 394092 384017 377507 372614 370103 373171 379931 386992 380401 358975 340893
3772C40893j4363j2969j2350o916n710p366o715n203o862o639n186n779o791o340
$$ 340893 326530 313561 301211 294295 288585 281219 274504 269301 262439 255800 250614 244835 238044 231704
3758B31704n577o234l932m762l996k049p47j319J705K283J598n086r560o306m761
$$ 231704 226127 219893 215961 211199 207203 205154 204407 203088 204793 207076 208674 203588 194028 187722 182961
3743A82961l425K380J120N333K473j2963j2714j0028o411q113m025m542m156m103
$$ 182961 179536 181916 183036 188369 190842 177879 165165 155137 148726 140613 136588 132046 127890 123787
3729A23787k426l048l177l091l30j894j013k296O9o63R36J404N108N647M833p980
$$ 123787 121361 118313 115136 112045 111715 109821 108808 106512 106581 105918 106854 108258 113366 119013 123846 115866
3713A15866j2033p782o564n366m151k700k143k859k325k341j424j649j761j117
$$ 115866 103833 96051 89487 84121 79970 77270 75127 72268 69943 67602 66178 64529 62768 61651
3699F1651k650j143m94k956n39p23j127k744O5p76k117j286q14j554l94j548j308
$$ 61651 59001 57858 57364 54408 53869 53146 52019 49275 49340 48564 46447 45161 44347 42793 42399 40851 39543
3682C9543j035p77j418r32l15J69j518P48j241j335J89l45p98L17j3K45J53l20
$$ 39543 38508 37731 36313 35381 35066 35235 33717 34465 33224 31889 32078 31733 30935 31252 31239 31484 31637 31317
3664C1317P38P2O38l91M11J225J794J291J625N17rJ393J136J534L060L715M057
$$ 31317 32055 32127 32765 32374 32785 34010 35804 37095 38720 39237 39228 40621 41757 43291 46351 50066 54123
3647E4123K368m15k200k101j495k022k28k009M4n34J69jP64M23J889K180J205
$$ 54123 56491 56076 53876 51775 50280 48258 48030 46021 46065 45531 45700 45699 46463 46886 48775 50955 52160
3630E2160K476J472K314J879L50J851J376M395R08j468n78o97j796j083J677q25
$$ 52160 54636 56108 58422 60301 60651 62502 63878 68273 69181 67713 67135 66438 64642 63559 65236 64411
3614F4411j853J000K38P27l62m09N34J44L430O17L844K050K340L225J079J709
$$ 64411 62558 63558 63796 64523 64161 63752 64286 64430 67860 68477 72321 74371 76711 79936 81015 82724
3598H2724R37K137p0L04J657N58M94J874M79j48K272L22M81K292K74L639J803
$$ 82724 83661 85798 85728 86032 87689 88247 88741 90615 91094 90946 93218 93540 94021 96313 96587 100226 102029
3581A02029K816L566K040M217K779N654N095L812L397J740J025l082m112l509
$$ 102029 104845 108411 110451 114668 117447 123101 128196 132008 135405 137145 138170 135088 130976 127467
3567A27467j541j846j4P11k66j354L1q5K2p15r05r12o85K86p26M26j572k93k298
$$ 127467 125926 124080 124066 124777 124511 123157 123188 123103 123125 122410 121505 120593 119908 120194 119468 119894 118322 118029 115731
3548A15731k103k632k183l127l139l198l804j830l81k635q34k056l469k871j966
$$ 115731 113628 110996 108813 105686 102547 99349 95545 93715 93334 90699 89865 87809 84340 81469 79503
3533G9503l966m640l633l834l486m337l192m129l276j852l635q85m061j958k511
$$ 79503 75537 70897 67264 63430 59944 55607 52415 48286 45010 43158 39523 38638 34577 32619 30108
3518C0108l039r33j521k002j881j984j628j716j291j890j435q13q51j416j979
$$ 30108 27069 26136 24615 22613 20732 18748 17120 15404 14113 12223 10788 9975 9124 7708 5729
3503E729r50o06p91j585j207n2l449J493j542j287m68j057J28k265l7q80o29o58
$$ 5729 4779 4173 3382 1797 590 538 -2911 -1418 -2960 -4247 -4715 -5772 -5644 -7909 -7946 -8826 -9455 -10113
3485a0113j130M12j730k10j249J2p82p80K14j21k093J476j705j15l74j8j066k83
$$ -10113 -11243 -10831 -12561 -12771 -14020 -14008 -14790 -15570 -15356 -15477 -17570 -16094 -17799 -17914 -18288 -18306 -19372 -19655
3467a9655k65j363pK80j80k67j259N09m26L26j455r79m97l38o23j93j052p09K33
$$ -19655 -19920 -21283 -21290 -21010 -21190 -21457 -22716 -22207 -22633 -22307 -23762 -24741 -25238 -25576 -26199 -26392 -27444 -28153 -27920
3448b7920j282m99J090m52R19j879R4p33O1k8n18q55M10l88L98P09m99q37j80
$$ -27920 -29202 -29701 -28611 -29063 -28144 -30023 -29929 -30662 -30601 -30629 -31147 -32002 -31592 -31980 -31582 -30873 -31372 -32209 -32389
3429c2389r76O20j359J83m45n26M95N27q06j302P48n48J12m22N71j278K95j480
$$ -32389 -33365 -32745 -34104 -33921 -34366 -34892 -34397 -33870 -34676 -35978 -35230 -35778 -35666 -36088 -35517 -36795 -36500 -37980
3411c7980J640j433j35k33K84J047l42j31o20L52k20J080j416l54J309j671L24
$$ -37980 -36340 -37773 -37908 -38141 -37857 -36810 -37152 -37283 -37903 -37551 -37771 -36691 -38107 -38461 -37152 -38823 -38499
3394c8499J90K33j193j95N78m91M83q57n44L52N64j443O23N13j50l95p3J81j033
$$ -38499 -38309 -38076 -39269 -39464 -38886 -39377 -38894 -39751 -40295 -39943 -39379 -40822 -40199 -39686 -39836 -40231 -40304 -40123 -41156
3375d1156Q86J13q32K79m77l88J05n44L53k66P73N62m15k075R36O23j031m95J054
$$ -41156 -40270 -40157 -40989 -40710 -41187 -41575 -41470 -42014 -41661 -41927 -41154 -40592 -41007 -43082 -42146 -41523 -42554 -43049 -41995
3356d1995O9j130J206l93o01K84l59j44J396j397M72m37n48K10J535k529P01N67
$$ -41995 -41926 -43056 -41850 -42243 -42844 -42560 -42919 -43063 -41667 -43064 -42592 -43029 -43577 -43367 -41832 -44361 -43660 -43093
3338d3093n95N56J57M51m36q22n17P29Q99j042j58M52q2l00J260k175M83Q69m98
$$ -43093 -43688 -43132 -42975 -42524 -42960 -43782 -44299 -43570 -42671 -43713 -43871 -43419 -43501 -43801 -42541 -44716 -44233 -43364 -43862
3319d3862k31J408j51p09m03L05L51j044m3k48m1P11r46J285p94K79O16n14p26
$$ -43862 -44093 -42685 -42836 -43545 -43948 -43643 -43292 -44336 -44379 -44627 -44668 -43957 -44903 -43618 -44412 -44133 -43517 -44031 -44757
3300d4757J8O38j424K076l85j464M6P1N83n36J49M74n57J30n87P46L70j108j56
$$ -44757 -44739 -44101 -45525 -43449 -43834 -45298 -45252 -45181 -44598 -45134 -44985 -44511 -45068 -44938 -45525 -44779 -44409 -45517 -45673
3281d5673N00m43P73j255O47j031Q22K67kj11J66p79k47J53l37M78j41R2K89q19
$$ -45673 -45173 -45616 -44843 -46098 -45451 -46482 -45660 -45393 -45395 -45506 -45340 -46119 -46366 -46213 -46550 -46072 -46213 -46121 -45832 -46651
3261d6651J007J213j042o93k25K58O89Q1k061P65O78j29K88k81J15M29o96K83
$$ -46651 -45644 -44431 -45473 -46166 -46391 -46133 -45444 -45363 -47424 -46659 -45981 -46110 -45822 -46103 -45988 -45559 -46255 -45972
3243d5972k54R5r15M50j41oj7k29m96L78Q94n11l12l71J54j35K46O75p7P7j28
$$ -45972 -46226 -46131 -47046 -46596 -46737 -46743 -46760 -46989 -47485 -47107 -46213 -46724 -47036 -47407 -47253 -47388 -47142 -46467 -46544 -46467 -46595
3222d6595j224j95J258k23o0Q61j056p26o83N49Q74n60J110J268P55j891L9k681
$$ -46595 -47819 -48014 -46756 -46979 -47039 -46178 -47234 -47960 -48643 -48094 -47220 -47780 -46670 -45402 -44647 -46538 -46499 -49180
3204d9180R17L04P57K096j349O98k139r16Q81R77l22p76J244j65j272N28J015
$$ -49180 -48263 -47959 -47202 -45106 -46455 -45757 -47896 -48812 -47931 -46954 -47276 -48052 -46808 -46973 -48245 -47717 -46702
3187d6702j907P41q58J976j822M85P06l63l32O10L91nK33p40m48l57J023p3j10
$$ -46702 -48609 -47868 -48726 -46750 -48572 -48087 -47381 -47744 -48076 -47466 -47075 -47080 -46847 -47587 -48035 -48392 -47369 -47442 -47552
3168d7552N05r52J88n24Q0N83p12K33Q01k23Q10n66Q70n86r96l70J298j048J009
$$ -47552 -47047 -47999 -47811 -48335 -48255 -47672 -48384 -48151 -47350 -47573 -46763 -47329 -46459 -47045 -48041 -48411 -47113 -48161 -47152
3149d7152j172l28M70q26J049j7P59q1j609J466n21P37p18L59M80j305N57K57
$$ -47152 -48324 -48652 -48182 -49008 -47959 -47976 -47217 -47298 -48907 -47441 -47962 -47225 -47943 -47584 -47104 -48409 -47852 -47595
3131d7595L16l09M73j288J76J83L7J9P09J3l93m33J75M07n60l3J225q51P54j372
$$ -47595 -47279 -47588 -47115 -48403 -48227 -48044 -48007 -47988 -47279 -47266 -47659 -48092 -47917 -47510 -48070 -48103 -46878 -47729 -46975 -48347
3111d8347J411j13m10L17q82P52O73j020n40J26L36K79m40l53K71N24k85o24L06
$$ -48347 -46936 -47049 -47459 -47142 -48024 -47272 -46599 -47619 -48159 -48033 -47697 -47418 -47858 -48211 -47940 -47416 -47701 -48325 -48019
3092d8019N4j26M65O40j095P42K10m39K43l02o6k9R10q65L97n14O10J55j53j191
$$ -48019 -47965 -48091 -47626 -46986 -48081 -47339 -47129 -47568 -47325 -47627 -47693 -47722 -46812 -47677 -47280 -47794 -47184 -47029 -47182 -48373
3072d8373J83R61M51o63k1o67j17q89K317O12j863N47k25L87j073OK342j581L86
$$ -48373 -48190 -47229 -46778 -47441 -47462 -48129 -48246 -49135 -46818 -46206 -48069 -47522 -47747 -47360 -48433 -48427 -46085 -47666 -47280
3053d7280M57p76j15o44L17L47n48J223P1n10J11o32K05K41r5o25R04M23j134
$$ -47280 -46823 -47599 -47714 -48358 -48041 -47694 -48242 -47019 -46948 -47458 -47347 -47979 -47774 -47533 -47628 -48253 -47349 -46926 -48060
3034d8060M05l87k26P04r87J017K39J4M7p67J319M09n48j055K94K47K00q45M03
$$ -48060 -47655 -48042 -48268 -47564 -48551 -47534 -47295 -47281 -47234 -48001 -46682 -46273 -46821 -47876 -47582 -47335 -47135 -47980 -47577
3015d7577K17k33k2N01j90K85q59J133r57P18o86O26q26Q49n75P86l97M6J04M22
$$ -47577 -47360 -47593 -47615 -47114 -47304 -47019 -47878 -46745 -47702 -46984 -47670 -47044 -47870 -47021 -47596 -46810 -47207 -47161 -47057 -46635
2995d6635p93J440j248R35o69R13o09R24p82M77m82m7K22J337j310J175J46O47
$$ -46635 -47428 -45988 -47236 -46301 -46970 -46057 -46666 -45742 -46524 -46047 -46529 -46576 -46354 -45017 -46327 -45152 -45006 -44359
2977d4359j285R51J55o02M49J609j004N01n05l01J076j011J150K42J019JJ598
$$ -44359 -45644 -44693 -44538 -45140 -44691 -43082 -44086 -43585 -44090 -44391 -43315 -44326 -43176 -42934 -41915 -41914 -40316
2960d0316j693J144J21J138P77K6J107Q71K46K474j068K730K523K011L041L895
$$ -40316 -42009 -40865 -40744 -39606 -38829 -38803 -37696 -36825 -36579 -34105 -35173 -32443 -29920 -27909 -24868 -20973
2944b0973K852K731N542Q192J0358R603N769q82p203r952r441p433o537o164k023
$$ -20973 -18121 -15390 -9848 -1656 8702 18305 24074 23192 15989 6037 -3404 -10837 -17374 -23538 -25561
2929b5561l109k083j447j865k82n11r54j85j690j152j81K25k34m83j58P50j00
$$ -25561 -28670 -30753 -32200 -34065 -34347 -34858 -35812 -35997 -37687 -38839 -39020 -38795 -39029 -39512 -39670 -38920 -39020
2912c9020L83l59j170o86o73nj682j5q65Q36j435K41l74l39k17O79k95M18n31
$$ -39020 -38637 -38996 -40166 -40852 -41525 -41530 -43212 -43227 -44092 -43256 -44691 -44450 -44824 -45163 -45380 -44701 -44996 -44578 -45109
2893d5109O1q30J166p83M90o68Qj93K26L93L18q93o37J003j228m06Q11j22K25
$$ -45109 -45048 -45878 -44712 -45495 -45005 -45673 -45665 -45858 -45632 -45239 -44921 -45814 -46451 -45448 -46676 -47082 -46271 -46393 -46168
2874d6168J13N77j424J133K78o36M42o51p74J8M82L90j14p23k12k07j0R72q9r65
$$ -46168 -46055 -45478 -46902 -45769 -45491 -46127 -45685 -46336 -47110 -47092 -46610 -46220 -46334 -47057 -47269 -47476 -47486 -46514 -46603 -47568
2854d7568l65R38k20O96p44O5P39q48M14P24j544P97l11n6L63Jj41o18J83m77
$$ -47568 -47933 -46995 -47215 -46519 -47263 -47198 -46459 -47307 -46893 -46169 -47713 -46916 -47227 -47283 -46920 -46919 -47060 -47678 -47495 -47972
2834d7972P40J60m18j98L32O76m05L56j672J676q31R37l99n43M24J77n99K53n8
$$ -47972 -47232 -47072 -47490 -47688 -47356 -46680 -47085 -46729 -48401 -46725 -47556 -46619 -47018 -47561 -47137 -46960 -47559 -47306 -47364
2815d7364j054J126j013R05l59j20q4q04J158k87J841j277j00q57R26k22p47J47
$$ -47364 -48418 -47292 -48305 -47400 -47759 -47879 -47963 -48767 -47609 -47896 -46055 -47332 -47432 -48289 -47363 -47585 -48332 -48185
2797d8185j331J272L29n86M93K58J62L98k001J438O86J6o4o19J62q52K383j391
$$ -48185 -49516 -48244 -47915 -48501 -48008 -47750 -47588 -47190 -49191 -47753 -47067 -47051 -47115 -47734 -47572 -48424 -46041 -47432
2779d7432o23M97M2n35J009j068K6k69J538j224R29r35J616j273j048Q77j16l82
$$ -47432 -48055 -47558 -47516 -48051 -47042 -48110 -48084 -48353 -46815 -48039 -47110 -48045 -46429 -47702 -48750 -47873 -47989 -48371
2761d8371O62K44j79R7n69j03r0K50L72P38j74n87n13Q11l47Q14m08m54RJ82j398
$$ -48371 -47709 -47465 -47644 -47547 -48116 -48219 -48309 -48059 -47687 -46949 -47123 -47710 -48223 -47412 -47759 -46945 -47353 -47807 -47798 -47616 -49014
2740d9014P75q54J129O80l00k95m50l96M07J30J250j7n82j47o67P53k36l28J489
$$ -49014 -48239 -49093 -47964 -47284 -47584 -47879 -48329 -48725 -48318 -48188 -46938 -46955 -47537 -47684 -48351 -47598 -47834 -48162 -46673
2721d6673m67j186K38Q72o29m1Q29p35k01J5O03j51K49M4j125J52J69J58J62M88
$$ -46673 -47140 -48326 -48088 -47216 -47845 -47886 -47057 -47792 -47993 -47978 -47375 -47526 -47277 -47233 -48358 -48206 -48037 -47879 -47717 -47229
2701d7229n63M17P1o34K42L3p12n65M67N37j45J7r33J256K10m20r85J292L63j29
$$ -47229 -47792 -47375 -47304 -47938 -47696 -47663 -48375 -48940 -48473 -47936 -48081 -48064 -48997 -47741 -47531 -47951 -48936 -47644 -47281 -47410
2681d7410K7j599J258q70P85l7o55K82l61P11p13O98k9l16m34O68J20L11j42K04
$$ -47410 -47383 -48982 -47724 -48594 -47809 -47846 -48501 -48219 -48580 -47869 -48582 -47884 -47913 -48229 -48663 -47995 -47875 -47564 -47706 -47502
2661d7502n75J53j31O02M80p12k58P55j010L95n24j42L27j89N19k68l97L12k77
$$ -47502 -48077 -47924 -48055 -47453 -46973 -47685 -47943 -47188 -48198 -47803 -48327 -48469 -48142 -48331 -47812 -48080 -48477 -48165 -48442
2642d8442J745j237n70R53m42J41K50m78Q4q3K40j38N07L1J59J63j00l23l41K34
$$ -48442 -46697 -47934 -48504 -47551 -47993 -47852 -47602 -48080 -47996 -48079 -47839 -47977 -47470 -47439 -47280 -47117 -47217 -47540 -47881 -47647
2622d7647K19j007P3Q0N15M31k58k03K10L54q93N23p27P21o87R23n64n52Q40m40
$$ -47647 -47428 -48435 -48362 -48282 -47767 -47336 -47594 -47797 -47587 -47233 -48126 -47603 -48330 -47609 -48296 -47373 -47937 -48489 -47649 -48089
2602d8089q7J98O01p80n85J063M54o56K4L45K17p39J64n18J112j505K18L6J42
$$ -48089 -48176 -47978 -47377 -48157 -48742 -47679 -47225 -47881 -47857 -47512 -47295 -48034 -47870 -48388 -47276 -48781 -48563 -48527 -48385
2583d8385L83J46R2K80l80m95l08Q72k45r1q8k89Q63j439N59O04k16n92K76J290
$$ -48385 -48002 -47856 -47764 -47484 -47864 -48359 -48667 -47795 -48040 -48131 -48219 -48508 -47645 -49084 -48525 -47921 -48137 -48729 -48453 -47163
2563d7163p91m90K60M87p61m19L44j03j75N73Q3p78J580m44K49m86K28k9o72m58
$$ -47163 -47954 -48444 -48184 -47697 -48458 -48877 -48533 -48636 -48811 -48238 -48155 -48933 -47353 -47797 -47548 -48034 -47806 -47835 -48507 -48965
2543d8965Q39J42k94K82n55O70R89j343k0M51r14O04P44p74q05M69j60O08P56
$$ -48965 -48126 -47984 -48278 -47996 -48551 -47881 -46892 -48235 -48255 -47804 -48718 -48114 -47370 -48144 -48949 -48480 -48640 -48032 -47276
2524d7276J63l89N35j814J848n3q86j50O55p13N0n8m61P42l84k62O87j84L41J37
$$ -47276 -47113 -47502 -46967 -48781 -46933 -46986 -47872 -48022 -47367 -48080 -48030 -48088 -48549 -47807 -48191 -48453 -47766 -47950 -47609 -47472
2504d7472n94O81q37K70k04M95K01J83k64k2j083J193l23p45j07J132j219O11
$$ -47472 -48066 -47385 -48222 -47952 -48156 -47661 -47460 -47277 -47541 -47563 -48646 -47453 -47776 -48521 -48628 -47496 -48715 -48104
2486d8104N73K31p90o28R40L39m00m9l69J496l71k34n66l64O37M65K65j100N98
$$ -48104 -47531 -47300 -48090 -48718 -47778 -47439 -47839 -47888 -48257 -46761 -47132 -47366 -47932 -48296 -47659 -47194 -46929 -48029 -47431
2467d7431j03N3q05J216o32O23q18P72o7k48j69m42P22r97p2K70N20k85J29N97
$$ -47431 -47534 -47481 -48286 -47070 -47702 -47079 -47897 -47125 -47192 -47440 -47609 -48051 -47329 -48326 -48398 -48128 -47608 -47893 -47764 -47167
2447d7167n48o82J495o24l90Q13j807R13k09O79r74R51n58P05L56q46N9L79n70
$$ -47167 -47715 -48397 -46902 -47526 -47916 -47103 -48910 -47997 -48206 -47527 -48501 -47550 -48108 -47403 -47047 -47893 -47834 -47455 -48025
2428d8025j15m45N71L7N38m59P32n30p31L60N45J049j597P17l05k23K20N22j314
$$ -48025 -48140 -48585 -48014 -47977 -47439 -47898 -47166 -47696 -48427 -48067 -47522 -46473 -48070 -47353 -47658 -47881 -47661 -47139 -48453
2409d8453N70J43k21J35Q49j040m8P19j590Q97J6M05r7O5K7j11P47j068N8P38
$$ -48453 -47883 -47740 -47961 -47826 -46977 -48017 -48065 -47346 -48936 -48039 -48023 -47618 -47715 -47650 -47623 -47734 -46987 -48055 -47997 -47259
2389d7259p70O59m92m9L71L86r16P04j34k62m16J24m00Q38j392J620q27Q4O80
$$ -47259 -48029 -47370 -47862 -47911 -47540 -47154 -48070 -47366 -47500 -47762 -48178 -48054 -48454 -47616 -49008 -47388 -48215 -48131 -47451
2370d7451L27j250m39N55J580k078j43J806j34o35M88o44K79Qj74K71n40l15M99
$$ -47451 -47124 -48374 -48813 -48258 -46678 -48756 -48899 -47093 -47227 -47862 -47374 -48018 -47739 -47731 -47905 -47634 -48174 -48489 -47990
2351d7990k42J189r67O16m4j723J009L28J05j012M01P20N61j158L02N21k86M43
$$ -47990 -48232 -47043 -48010 -47394 -47438 -49161 -48152 -47824 -47719 -48731 -48330 -47610 -47049 -48207 -47905 -47384 -47670 -47227
2333d7227m86j25L35q56P99q80O54O98j073J2Q29p15j57J66K79l9P39p76MN54
$$ -47227 -47713 -47838 -47503 -48359 -47560 -48440 -47786 -47088 -48161 -48149 -47320 -48035 -48192 -48026 -47747 -47786 -47047 -47823 -47819 -47265
2313d7265k56n37O3j60J95L41l00m61L47n81J788m44J78j49j606J543L91q23J41
$$ -47265 -47521 -48058 -47995 -48155 -47960 -47619 -47919 -48380 -48033 -48614 -46826 -47270 -47092 -47241 -48847 -47304 -46913 -47736 -47595
2294d7595K99J26j051L97qP14j550R50l02k77K73P2k11k36K25P48j249J273m05
$$ -47595 -47296 -47170 -48221 -47824 -47832 -47118 -48668 -47718 -48020 -48297 -48024 -47952 -48163 -48399 -48174 -47426 -48675 -47402 -47807
2275d7807R5o54N23L56j851K087J88m06l48O93Q03q24K57r05L4K71r10J542j078
$$ -47807 -47712 -48366 -47843 -47487 -49338 -47251 -47063 -47469 -47817 -47124 -46321 -47145 -46888 -47793 -47759 -47488 -48398 -46856 -47934
2256d7934J61N08q24N22n50l91Q85M39j22J21o2l24Q35n44M46JR38j432k03k79
$$ -47934 -47773 -47265 -48089 -47567 -48117 -48508 -47623 -47184 -47306 -47185 -47247 -47571 -46736 -47280 -46834 -46833 -45895 -47327 -47530 -47809
2236d7809J020p22m86o4m91r47J661J74m07M47j47Q62j51r55J607K19j211J088
$$ -47809 -46789 -47511 -47997 -48061 -48552 -49499 -47838 -47664 -48071 -47624 -47771 -46909 -47060 -48015 -46408 -46189 -47400 -46312
2218d6312r90J46l61r4O3J072j138K124j490p04n45J488k25O23j741P18m21M67
$$ -46312 -47302 -47156 -47517 -47611 -47548 -46476 -47614 -45490 -46980 -47684 -48229 -46741 -46966 -46343 -48084 -47366 -47787 -47320
2200d7320J7j106O73o4L52P39p96R13k310J49J150L32o37l14l42M58N31j99J77
$$ -47320 -47303 -48409 -47736 -47800 -47448 -46709 -47505 -46592 -48902 -48753 -47603 -47271 -47908 -48222 -48564 -48106 -47575 -47774 -47597
2181d7597K74j040J031p32R91p41J54p08J568l34K07q22j30J70j30L20K04r18
$$ -47597 -47323 -48363 -47332 -48064 -47073 -47814 -47660 -48368 -46800 -47134 -46927 -47749 -47879 -47709 -47839 -47519 -47315 -48233
2163d8233Q68N60j956K025j233L9J412j281q0J121o12j372J042P25n03j99m31
$$ -48233 -47365 -46805 -48761 -46736 -47969 -47930 -46518 -47799 -47879 -46758 -47370 -48742 -47700 -46975 -47478 -47677 -48108
2146d8108N55m90m83j21R36L05j88l89p87J391L00n44q41K31O12n05N5O64p13
$$ -48108 -47553 -48043 -48526 -48647 -47711 -47406 -47594 -47983 -48770 -47379 -47079 -47623 -48464 -48233 -47621 -48126 -48071 -47407 -48120
2127d8120k36O02M18p48O05N87j653J610j58Q8l78j40M69j092O40K72K81n1l54
$$ -48120 -48356 -47754 -47336 -48084 -47479 -46892 -48545 -46935 -47093 -47005 -47383 -47523 -47054 -48146 -47506 -47234 -46953 -47004 -47358
2108d7358J3o02N63l40J02m54O73M1j353J014k69L23p1l27Q27l15Q5J88o22K68
$$ -47358 -47345 -47947 -47384 -47724 -47622 -48076 -47403 -47362 -48715 -47701 -47970 -47647 -47718 -48045 -47218 -47533 -47448 -47260 -47882 -47614
2088d7614l50N74j477Q41K19N35j318J348j36J97K22q8k60q73O57J30M92r31R59
$$ -47614 -47964 -47390 -48867 -48026 -47807 -47272 -48590 -47242 -47378 -47181 -46959 -47047 -47307 -48180 -47523 -47393 -46901 -47832 -46873
2069d6873O36j812J590j060K6J142K21j264k95Q60n11J01J012j422L48Q27r8j616
$$ -46873 -46237 -48049 -46459 -47519 -47493 -46351 -46130 -47394 -47689 -46829 -47340 -47239 -46227 -47649 -47301 -46474 -46572 -48188
2051d8188N45L59l25P08m05K49j64j50M06j846R20O41q68J509m51o74K72O52r97
$$ -48188 -47643 -47284 -47609 -46901 -47306 -47057 -47221 -47371 -46965 -48811 -47891 -47250 -48118 -46609 -47060 -47734 -47462 -46810 -47807
2032d7807N49P40L61k139O96J270n95M56p09l94J45K45J64J32J49K7k84O6k94
$$ -47807 -47258 -46518 -46157 -48296 -47600 -46330 -46925 -46469 -47178 -47572 -47427 -47182 -47018 -46886 -46737 -46710 -46994 -46928 -47222
2013d7222J331j720R07k46n83K40M54l69K34o18K05N38J073p12j064k26N59j503
$$ -47222 -45891 -47611 -46704 -46950 -47533 -47293 -46839 -47208 -46974 -47592 -47387 -46849 -45776 -46488 -47552 -47778 -47219 -48722
1995d8722J945N49j070PJ58k6m56M13M67k65j049J085k01l89J080p78l82j72L10
$$ -48722 -46777 -46228 -47298 -47291 -47133 -47159 -47615 -47202 -46735 -47000 -48049 -46964 -47165 -47554 -46474 -47252 -47634 -47806 -47496
1976d7496n09K1K07l03J51L25k18m41K66j57M33m23R37r78O68j70k06O14k11J36
$$ -47496 -48005 -47984 -47777 -48080 -47929 -47604 -47822 -48263 -47997 -48154 -47721 -48144 -47207 -48185 -47517 -47687 -47893 -47279 -47490 -47354
1956d7354k0o35K09Q61q29k82J433l41m76P13o23k87N85J1o98k04P80o89J226
$$ -47354 -47374 -48009 -47800 -46939 -47768 -48050 -46617 -46958 -47434 -46721 -47344 -47631 -47046 -47035 -47733 -47937 -47157 -47846 -46620
1937d6620l07m21L06p67O58j99K07r19OJ003j159J076q89R41rq67R45o30L82p65
$$ -46620 -46927 -47348 -47042 -47809 -47151 -47350 -47143 -48062 -48056 -47053 -48212 -47136 -48025 -47084 -47093 -47960 -47015 -47645 -47263 -48028
1917d8028Q77l41Q74l50k81qK75O80j928J009j181O15N05P14m82l57K62Q09n77
$$ -48028 -47151 -47492 -46618 -46968 -47249 -47257 -46982 -46302 -48230 -47221 -48402 -47787 -47282 -46568 -47050 -47407 -47145 -46336 -46913
1898d6913k01j66m06J6k98R67o39o79K68J021J76j054J43J041j863N55M84J26
$$ -46913 -47114 -47280 -47686 -47670 -47968 -47001 -47640 -48319 -48051 -47030 -46854 -47908 -47765 -46724 -48587 -48032 -47548 -47422
$$ [...]
##END NTUPLES=NMR SPECTRUM
##END=
