##TITLE=abcd
##JCAMPDX= 6.0         $$ Bruker NMR JCAMP-DX V2.0
##DATA TYPE= NMR SPECTRUM
##DATA CLASS= NTUPLES
##ORIGIN= UXNMR, Bruker Analytische Messtechnik GmbH
##OWNER= root
$$ XWIN-NMR		Version 3.5
$$ Wed Apr 13 09:08:49 2022 Russian Standard Time (UT+4h)  servis@DPX200
##.OBSERVE FREQUENCY= 200.131235884673
##.OBSERVE NUCLEUS= ^1H
##.ACQUISITION MODE= SIMULTANEOUS
##.ACQUISITION SCHEME= undefined
##.AVERAGES= 32
##.DIGITISER RES= 18
##SPECTROMETER/DATA SYSTEM= spect
##.PULSE SEQUENCE= zg
##.SOLVENT NAME= CDCl3
##.SHIFT REFERENCE= (INTERNAL, CDCl3, 0, 16.4885)
##AUDIT TRAIL= $$ (NUMBER, WHEN, WHO, WHERE, WHAT)
$$ ##TITLE= Audit trail, XWIN-NMR		Version 3.5
$$ ##JCAMPDX= 5.01
$$ ##ORIGIN= Bruker BioSpin GmbH
$$ ##OWNER= servis
$$ F:\spectra/data/av/nmr/H1/1/pdata/1/auditp.txt
$$ ##AUDIT TRAIL=  $$ (NUMBER, WHEN, WHO, WHERE, WHAT)
(   1,<2022-04-13 09:07:36.59 +0400>,<servis>,<DPX200>,
      <created by zg, POWCHK disabled, PULCHK disabled
       terminated by command 'halt'
       configuration hash MD5:
       00 E9 B6 7A A2 85 ED C7 34 08 36 98 17 FE 4E 26
       data hash MD5: 32K
       0C CC E0 E4 3E B4 31 DF 40 55 64 BC C0 CB 61 53>)
(   2,<2022-04-13 09:07:38.84 +0400>,<servis>,<DPX200>,
      <Start of raw data processing
       efp BC_mod = 2 LB = 0.05 FT_mod = 6 PKNL = 1 PHC0 = -103.6262 PHC1 = 3.701452 SI = 16K 
       data hash MD5: 16K
       60 EA 67 D2 7D 23 BD 93 B7 45 48 3E B5 16 BA EF>)
$$ ##END=
$$ 
$$ hash MD5
$$ A7 4B 81 64 23 D6 A1 FA 7F 9C 83 07 9E E8 C0 18
##$RELAX= 
##$RELAX= 
##$RELAX= 
##$RELAX= 
##$RELAX= 
##$RELAX= 
##$RELAX= 
##$RELAX= 
$$ Bruker specific parameters
$$ --------------------------
##$DU= <F:\spectra>
##$EXPNO= 1
##$NAME= <H1>
##$PROCNO= 1
##$TYPE= <nmr>
##$USER= <av>
##$AMP= (0..31)
100 100 100 100 100 100 100 100 100 100 100 100 100 100 100 100 100 100 
100 100 100 100 100 100 100 100 100 100 100 100 100 100 
##$AQSEQ= 0
##$AQ_mod= 1
##$AUNM= <au_zg>
##$AUTOPOS= <>
##$BF1= 200.13
##$BF2= 200.13
##$BF3= 200.13
##$BF4= 200.13
##$BF5= 500.13
##$BF6= 500.13
##$BF7= 500.13
##$BF8= 500.13
##$BYTORDA= 1
##$CFDGTYP= 0
##$CFRGTYP= 5
##$CHEMSTR= <none>
##$CNST= (0..31)
1 1 145 1 1 1 1 1 1 1 1 1 1 1 1 1 1 1 1 1 1 1 1 1 1 1 1 1 1 1 1 1 
##$CPDPRG= <>
##$CPDPRG1= <>
##$CPDPRG2= <>
##$CPDPRG3= <>
##$CPDPRG4= <mlev>
##$CPDPRG5= <mlev>
##$CPDPRG6= <mlev>
##$CPDPRG7= <mlev>
##$CPDPRG8= <mlev>
##$CPDPRGB= <>
##$CPDPRGT= <>
##$D= (0..31)
0 2 0 0 0 0 0 0 0 0.06 0 0 0 0 0 0 0.0002 0 0 0 0 0 0 0 0 0 0 0 0 0 0 
0 
##$DATE= 1649826456
##$DBL= (0..7)
120 120 120 120 120 120 120 120 
##$DBP= (0..7)
150 150 150 150 150 150 150 150 
##$DBP07= 0
##$DBPNAM0= <>
##$DBPNAM1= <>
##$DBPNAM2= <>
##$DBPNAM3= <>
##$DBPNAM4= <>
##$DBPNAM5= <>
##$DBPNAM6= <>
##$DBPNAM7= <>
##$DBPOAL= (0..7)
0.5 0.5 0.5 0.5 0.5 0.5 0.5 0.5 
##$DBPOFFS= (0..7)
0 0 0 0 0 0 0 0 
##$DE= 6
##$DECBNUC= <off>
##$DECIM= 32
##$DECNUC= <off>
##$DECSTAT= 4
##$DIGMOD= 1
##$DIGTYP= 9
##$DL= (0..7)
0 120 120 120 120 120 120 120 
##$DP= (0..7)
$$ [...]
##$SUBNAM4= <"">
##$SUBNAM5= <"">
##$SUBNAM6= <"">
##$SUBNAM7= <"">
##$SUBNAM8= <"">
##$SUBNAM9= <"">
##$SW= 20.6817932712277
##$SWIBOX= (0..15)
0 0 3 0 0 0 0 0 0 0 0 0 0 0 0 0 
##$SW_h= 4139.07284768212
##$TD= 32768
##$TD0= 1
##$TE= 0
##$TE2= 300
##$TE3= 300
##$TEG= 300
##$TL= (0..7)
0 120 120 120 120 120 120 120 
##$TP= (0..7)
150 150 150 150 150 150 150 150 
##$TP07= 0
##$TPNAME0= <>
##$TPNAME1= <>
##$TPNAME2= <>
##$TPNAME3= <>
##$TPNAME4= <>
##$TPNAME5= <>
##$TPNAME6= <>
##$TPNAME7= <>
##$TPOAL= (0..7)
0.5 0.5 0.5 0.5 0.5 0.5 0.5 0.5 
##$TPOFFS= (0..7)
0 0 0 0 0 0 0 0 
##$TUNHIN= 0
##$TUNHOUT= 0
##$TUNXOUT= 0
##$USERA1= <user>
##$USERA2= <user>
##$USERA3= <user>
##$USERA4= <user>
##$USERA5= <user>
##$V9= 5
##$VALIST= <valist>
##$VCLIST= <CCCCCCCCCCCCCCC>
##$VD= 0
##$VDLIST= <DDDDDDDDDDDDDDD>
##$VPLIST= <PPPPPPPPPPPPPPP>
##$VTLIST= <TTTTTTTTTTTTTTT>
##$WBST= 1024
##$WBSW= 30
##$XGAIN= (0..3)
0 0 0 0 
##$XL= 0
##$YL= 0
##$YMAX_a= 2213477
##$YMIN_a= -2114541
##$ZGOPTNS= <>
##$ZL1= 120
##$ZL2= 120
##$ZL3= 120
##$ZL4= 120
##$ABSF1= 0
##$ABSF2= 0
##$ABSG= 0
##$ABSL= 0
##$ALPHA= 0
##$AQORDER= 0
##$ASSFAC= 0
##$ASSFACI= 0
##$ASSFACX= 0
##$ASSWID= 0
##$AUNMP= <proc_1d>
##$AZFE= 0.1
##$AZFW= 0.1
##$BCFW= 0
##$BC_mod= 2
##$BYTORDP= 0
##$COROFFS= 0
##$CY= 18.4799938201904
##$DATMOD= 1
##$DC= 0
##$DFILT= <>
##$DTYPP= 0
##$F1P= 9.9274215381318
##$F2P= -0.165520771350173
##$FCOR= 1
##$FTSIZE= 16384
##$FT_mod= 6
##$GAMMA= 0
##$GB= 0
##$INTBC= 1
##$INTSCL= 4.127829e-11
##$ISEN= 128
##$LB= 0.05
##$LEV0= 0
##$LPBIN= 0
##$MAXI= 10000
##$MC2= 0
##$MEAN= 0
##$ME_mod= 0
##$MI= 50
##$NCOEF= 0
##$NC_proc= -1
##$NLEV= 6
##$NOISF1= 3.799351
##$NOISF2= 2.8
##$NSP= 0
##$NTH_PI= 0
##$NZP= 0
##$OFFSET= 16.48848
##$PC= 4
##$PHC0= -103.6262
##$PHC1= 3.701452
##$PH_mod= 1
##$PKNL= yes
##$PPARMOD= 0
##$PSCAL= 4
##$PSIGN= 0
##$REVERSE= no
##$SF= 200.130005582386
##$SI= 16384
##$SIGF1= 3
##$SIGF2= 2
##$SINO= 400
##$SIOLD= 16384
##$SREGLST= <1H.CDCl3>
##$SSB= 0
##$STSI= 16384
##$STSR= 0
##$SW_p= 4139.07284768211
##$SYMM= 0
##$S_DEV= 0
##$TDeff= 32768
##$TDoff= 0
##$TI= <>
##$TILT= no
##$TM1= 0
##$TM2= 0
##$TOPLEV= 0
##$USERP1= <user>
##$USERP2= <user>
##$USERP3= <user>
##$USERP4= <user>
##$USERP5= <user>
##$WDW= 1
##$XDIM= 16384
##$YMAX_p= 363647594
##$YMIN_p= -95346
$$ End of Bruker specific parameters
$$ ---------------------------------
##NTUPLES= NMR SPECTRUM
##VAR_NAME=  FREQUENCY,     SPECTRUM/REAL,   SPECTRUM/IMAG
##SYMBOL=    X,             R,               I
##VAR_TYPE=  INDEPENDENT,   DEPENDENT,       DEPENDENT
##VAR_FORM=  AFFN,          ASDF,            ASDF
##VAR_DIM=   16384,         16384,           16384
##UNITS=     HZ,            ARBITRARY UNITS, ARBITRARY UNITS
##FACTOR=    0.252644378177508, 1,           1
##FIRST=     3299.83951724647, 0,            0
##LAST=      -839.233330435636, 0,           0
##MIN=       -839.233330435636, -95346,      0
##MAX=       3299.83951724647, 363647594,    0
$$ Real data points
##PAGE= N=1
##DATA TABLE= (X++(R..R)), XYDATA
$$ [...]
9639f1501l93O81j287J949j130L31j349K85J586l89Np80P1j50Q63k40O2l95M21
$$ -61501 -61894 -61213 -62500 -60551 -61681 -61350 -62699 -62414 -60828 -61217 -61212 -61992 -61921 -62071 -61208 -61448 -61386 -61781 -61360
9620f1360n22l37j46O05O02o94k10N29k85J321p05O45k45n28l03J16L97l0o19
$$ -61360 -61882 -62219 -62365 -61760 -61158 -61852 -62062 -61533 -61818 -60497 -61202 -60557 -60802 -61330 -61633 -61517 -61120 -61150 -61769
9601f1769O82j078P51m99L79k5m84M17R28k68L12r95N94p35Q46l2q76Q06J21l19
$$ -61769 -61087 -62165 -61414 -61913 -61534 -61559 -62043 -61626 -60698 -60966 -60654 -61649 -61055 -61790 -60944 -60976 -61852 -61046 -60925 -61244
9581f1244p09J084n49K142k473j32N77J52K50J136j144l14j24o80J387N96p25
$$ -61244 -61953 -60869 -61418 -59276 -61749 -61881 -61304 -61152 -60902 -59766 -60910 -61224 -61348 -62028 -60641 -60045 -60770
9564f0770r1n6j089R04M03P95q91K51m13m07P85o28J41O9Q90j034P97N89n18o83
$$ -60770 -60861 -60917 -62006 -61102 -60699 -59904 -60795 -60544 -60957 -61364 -60579 -61207 -61066 -60997 -60107 -61141 -60344 -59755 -60273 -60956
9544f0956J223K1o11l70P7n81J829p8j264M22L04j022J000N44m39M63K10K19p8
$$ -60956 -59733 -59712 -60323 -60693 -60616 -61197 -59368 -59446 -60710 -60288 -59984 -61006 -60006 -59462 -59901 -59438 -59228 -59009 -59087
9525e9087j57j118J459n68j124J419N47Q61j589L34M91L69J84N61L98Q78P88O13
$$ -59087 -59244 -60362 -58903 -59471 -60595 -59176 -58629 -57768 -59357 -59023 -58532 -58163 -57979 -57418 -57020 -56142 -55354 -54741
9507e4741L24J973q38r28L47K004l08J627M21N61R16q89J41l17M59o96r59m65
$$ -54741 -54417 -52444 -53282 -54210 -53863 -51859 -52167 -50540 -50119 -49558 -48642 -49531 -49390 -49707 -49248 -49944 -50903 -51368
9489e1368P9j648j011o48L4K33R68j499j27N98J58j662J136K406K0O75P55J321
$$ -51368 -51289 -52937 -53948 -54596 -54562 -54329 -53361 -54860 -54987 -54389 -54231 -55893 -54757 -52351 -52331 -51656 -50901 -49580
9471d9580K011M5l96M34q15N96k99j240r13Q92j041p59k85j783j621o27j280K180
$$ -49580 -47569 -47524 -47920 -47486 -48301 -47705 -48004 -49244 -50157 -49265 -50306 -51065 -51350 -53133 -54754 -55381 -56661 -54481
9453e4481k33k359K87K96l98M06p5n03j38R4l2O02m13Q4L20n72m24J312k85o52
$$ -54481 -54714 -57073 -56786 -56490 -56888 -56482 -56557 -57060 -57198 -57104 -57136 -56534 -56947 -56863 -56543 -57115 -57539 -56227 -56512 -57164
9433e7164P03K82k35K77m53q6m68J352q15J418j316n9O75m24p83J488k63o61O95
$$ -57164 -56461 -56179 -56414 -56137 -56590 -56676 -57144 -55792 -56607 -55189 -56505 -56564 -55889 -56313 -57096 -55608 -55871 -56532 -55837
9414e5837m10N0N28m4J7O14n95J488p70j08M85L68j062J403K8j54o56R61p54J575
$$ -55837 -56247 -56197 -55669 -55713 -55696 -55082 -55677 -54189 -54959 -55067 -54582 -54214 -55276 -53873 -53845 -53999 -54655 -53694 -54448 -52873
9394e2873r69J39o89J421k74J28k24q47J64Q86m8P23j17N36j99k46j122M83J344
$$ -52873 -53842 -53703 -54392 -52971 -53245 -53117 -53341 -54188 -54024 -53138 -53186 -52463 -52580 -52044 -52243 -52489 -53611 -53128 -51784
9375e1784j506J159r78J640n23M62J370r40L75L83o97K6K45L0K37j6J853q30m06
$$ -51784 -53290 -52131 -53109 -51469 -51992 -51530 -50160 -51100 -50725 -50342 -51039 -51013 -50768 -50738 -50501 -50517 -48664 -49494 -49900
9356d9900N85L8M02J45J36r38K27L89N90J147m11l24P65k7P28M31j65m1j8K33
$$ -49900 -49315 -49277 -48875 -48730 -48594 -49532 -49305 -48916 -48326 -47179 -47590 -47914 -47149 -47176 -46448 -46017 -46182 -46223 -46241 -46008
9336d6008R22k66M92R27q38J080PO69o52q53R99L37R99p10k94R51M46n65R96R05
$$ -46008 -45086 -45352 -44860 -43933 -44771 -43691 -43684 -43015 -43667 -44520 -43521 -43184 -42185 -42895 -43189 -42238 -41792 -42357 -41361 -40456
9316d0456O94j098J079m66J574Q71n43k47J497j83j01J013N31k58J176l99L98
$$ -40456 -39762 -40860 -39781 -40247 -38673 -37802 -38345 -38592 -37095 -37278 -37379 -36366 -35835 -36093 -34917 -35316 -34918
9299c4918N85R57r14K027q32O86k23P60o43J064M15J405j99K92N29J379P54O2
$$ -34918 -34333 -33376 -34290 -32263 -33095 -32409 -32632 -31872 -32515 -31451 -31036 -29631 -29830 -29538 -29009 -27630 -26876 -26814
9281b6814l41Q83J193J367j14K013K66P09M72M40J911l41J660J484J501O17J785
$$ -26814 -27155 -26272 -25079 -23712 -23826 -21813 -21547 -20838 -20366 -19926 -18015 -18356 -16696 -15212 -13711 -13094 -11309
9264a1309J926J146J334L220K428K222L765L574L982J345K216L078J092J710q18
$$ -11309 -9383 -8237 -6903 -3683 -1255 967 4732 8306 12288 13633 15849 18927 20019 21729 20911
9249B0911J170J558J479J307K578K252L07Q03J016J784J905K422K073K793L076
$$ 20911 22081 23639 25118 26425 29003 31255 31562 32365 33381 35165 37070 39492 41565 44358 47434
9234D7434L241M333L111L062L787K435K255L858K059M762K811M377L638N461M692
$$ 47434 50675 55008 58119 61181 64968 67403 69658 73516 75575 80337 83148 87525 91163 96624 101316
9219A01316N279M818O960M336P833O741Q708P080P552P987R572J0492J0126J1957
$$ 101316 106595 111413 118373 122709 130542 137283 145991 153071 160623 168610 178182 188674 198800 210757
9205B10757J2929J3816J4171J7574K0710K3088K6881L1243L8423M2130M7291L6509
$$ 210757 223686 237502 251673 269247 289957 313045 339926 371169 409592 451722 499013 535522
9193E35522L0739M2280O2219Q8190J14705J59007J89695K49536J93473K4729J6060
$$ 535522 566261 608541 670760 758950 873655 1032662 1222357 1471893 1665366 1690095 1706155
9182A706155P2297R2396J14165k5351k00069j54140j23557r1986m0868j5387j19508
$$ 1706155 1778452 1870848 1985013 1959662 1759593 1605453 1481896 1389910 1349042 1333655 1214147
9171A214147j46014j00047o2235l6296j1132J1834L2090N1199O8484P9710L6175
$$ 1214147 1068133 968086 905851 869555 858423 870257 902347 953546 1022030 1101740 1137915
9160A137915J7458N4710J13379J64513K26171K13972K37610J24301j44101j84043
$$ 1137915 1155373 1210083 1323462 1487975 1714146 1928118 2165728 2290029 2145928 1961885
9150A961885j37121l9442L8536J14110p0567k32190k42096k36652j90335j42258
$$ 1961885 1824764 1785322 1823858 1937968 1867401 1635211 1393115 1156463 966128 823870
9140H23870j05046q0877o3680n1372m4050l6567l1037k7090k2247k2873j9147
$$ 823870 718824 637947 574267 522895 478845 442278 411241 384151 361904 339031 319884
9129C19884j8371j5685j4560j3831j1273j2000j1235q786r146q298o804o490p536
$$ 319884 301513 285828 271268 257437 246164 234164 222929 214143 204997 196699 189895 183405 175869
9116A75869r018p071m505q654o107m581n729o198n073n140m279n831l955l797
$$ 175869 166851 159780 155275 146621 140514 135933 130204 124006 118933 113793 109514 103683 99728 95931
9102I5931l734n740m590l853k988k579k900j111k444k640j447l775j485k760n383
$$ 95931 92197 86457 81867 78014 75026 72447 69547 68436 65992 63352 61905 58130 56645 53885 48502
9087D8502j114j283k554p00j159k867k675j723k229k213l833o64m770k171k452
$$ 48502 47388 46105 43551 42851 41692 38825 36150 34427 32198 29985 26152 25488 20718 18547 16095
9072A6095j894k919j843j641j132j309O90k593k740l32o16j440j225M65q92R32
$$ 16095 14201 11282 9439 7798 6666 5357 6047 3454 714 382 -234 -1674 -2899 -2434 -3326 -2394
9056b394j777k22q89k362K8k095j014K70r15k09j264o95k4k585p87j381J487j677
$$ -2394 -4171 -4393 -5282 -7644 -7616 -9711 -10725 -10455 -11370 -11579 -12843 -13538 -13562 -16147 -16934 -18315 -16828 -18505
9038a8505j226q3N51j520j110n1j670K136n86j217o41k68K23M66R9m63q97r5k76
$$ -18505 -19731 -19814 -19263 -20783 -21893 -21944 -23614 -21478 -22064 -23281 -23922 -24190 -23967 -23501 -23402 -23865 -24762 -24857 -25133
9019b5133p82K80J26j907J748l33j258N01m91j22M60m18r59N49K98m54o21l7n63
$$ -25133 -25915 -25635 -25509 -27416 -25668 -26001 -27259 -26758 -27249 -27371 -26911 -27329 -28288 -27739 -27441 -27895 -28516 -28553 -29116
9000b9116K07q0j12Q74j289L57J35P29m10r82K39O59QO47l03n64l61J420P3l64
$$ -29116 -28909 -28989 -29101 -28227 -29516 -29159 -29024 -28295 -28705 -29687 -29448 -28789 -28781 -28134 -28437 -29001 -29362 -27942 -27869 -28233
8980b8233L79M7j14J407j704K94P67j78N1L8J006n9j204R99K06l85K91O90O60
$$ -28233 -27854 -27807 -27921 -26514 -28218 -27924 -27157 -27335 -27284 -27246 -26240 -26299 -27503 -26504 -26298 -26683 -26392 -25702 -25042
8961b5042r60J038n64J313j44Q87l2Q95k20J86J665L79n04J023l11P73R38L38
$$ -25042 -26002 -24964 -25528 -24215 -24359 -23472 -23504 -22609 -22829 -22643 -20978 -20599 -21103 -20080 -20391 -19618 -18680 -18342
8943a8342O04L70J78m62J466J29J978k42Q82M09J361k27O21O75j27J791J300L81
$$ -18342 -17738 -17368 -17190 -17652 -16186 -16057 -14079 -14321 -13439 -13030 -11669 -11896 -11275 -10600 -10727 -8936 -7636 -7255
8925g255J177O51m8K232J375O33P44Q61J997J690J02J622J440O78K551K131L75
$$ -7255 -6078 -5427 -5475 -3243 -1868 -1235 -491 370 2367 4057 4159 5781 7221 7899 10450 12581 12956
8908A2956K115P17L241Q35K380J378K730J124K497K884K521J564M965J955J624
$$ 12956 15071 15788 19029 19864 22244 23622 26352 27476 29973 32857 35378 36942 41907 43862 45486
8893D5486L377M139N070L750M112O647N814M499Q656O925J0484J2613J5336J8979
$$ 45486 48863 53002 58072 61822 65934 72581 78395 82894 91550 98475 108959 121572 136908 155887
8879A55887K0939K7456J5428N097J4496K5349L0202L3953j2528k3988r873L096
$$ 155887 176826 204282 219710 224807 239303 264652 294854 328807 316279 292291 282418 285514
8867B85514R044R970j6914j6219r081K104Q222J3835J8622K1781K6747N294o509
$$ 285514 294558 304528 287614 271395 262314 264418 272640 286475 305097 326878 353625 358919 352410
8854C52410j007Q564J5981K4331L7567N3565P0257R5681J08444J08391J20741
$$ 352410 351403 359967 375948 400279 437846 491411 561668 657349 765793 874184 994925
8843I94925P5761l9067j02248j27170r8108o1932l2721j4244M416J7650L1854
$$ 994925 1070686 1031619 929371 802201 704093 642161 609440 595196 599612 617262 649116
8832F49116O714l4768k5367o962Q183K4097M0173N6695P9023R5662J16944L3247
$$ 649116 655830 621062 595695 588733 596916 621013 661186 717881 796904 892566 1009510 1042757
8820A042757j9517J4249P0478R8840J41834K6762j37197j21812o3220j7797J1301
$$ 1042757 1023240 1037489 1107967 1206807 1348641 1375403 1238206 1116394 1053174 1035377 1046678
8809A046678K8274m3046o6652l6620j162K2344M6818M0420M1430P4669J28190
$$ 1046678 1074952 1031906 965254 928634 927472 949816 996634 1037054 1078484 1153153 1281343
8798A281343J71835K25076J95968P8293R2786M5994j96107k47854j57123p9879
$$ 1281343 1453178 1678254 1874222 1952515 2045301 2091295 1895188 1647334 1490211 1410332
8788A410332l8707q7771j39731j24024q0066n5534l8845k2907o925N492K2316
$$ 1410332 1371625 1283854 1144123 1020099 940033 884499 845654 822747 815822 821314 843630
8777H43630M1477O2394R2461J11024J44840J14247L4199N4190L0064M3088J10304
$$ 843630 885107 947501 1039962 1150986 1295826 1410073 1444272 1498462 1528526 1571614 1681918
8766A681918J80867K41679O6054j42413j29910j66960k60398k07579j37509q5015
$$ 1681918 1862785 2104464 2170518 2028105 1898195 1731235 1470837 1263258 1125749 1040734
8756A040734q0571p4188p5916p4349n4269l9813k9220j4898n919N023J4701K8848
$$ 1040734 960163 885975 810059 735710 681441 641628 612408 597510 591591 596614 611315 640163
8744F40163K4814j0421r067J7420L8422O0085P1708Q268m9510r0679o5686l0333
$$ 640163 664977 654556 645489 662909 701331 761416 833124 841392 791882 701203 635517 605184
8732F05184p674J1771M016n4314p8208o9143m9612l7388l0057k3886k0930j7258
$$ 605184 597510 609281 613297 558983 480775 411632 362020 324632 294575 270689 249759 232501
8720B32501j4480j2321j1769r791q834q350p573o518o993l801p012m187n238o999
$$ 232501 218021 205700 193931 184140 175306 166956 159383 152865 145872 142071 135059 130872 125634 118635
8706A18635l566m125l231l984k785k887n539l792l423n404l520k716l054k884
$$ 118635 115069 110944 107713 103729 100944 98057 92518 88726 85303 79899 76379 73663 70609 67725
8692F7725l217k462k018k341j460j423r00l11j300p10J60M55J98k01O18J766P77
$$ 67725 64508 62046 60028 57687 56227 54804 53904 53593 52293 51583 51743 52198 52396 52195 52813 54579 55356
8675E5356p66j344k759o18j14j023q03k807j817m036j292l734k663p50p87m021
$$ 55356 54590 53246 50487 49869 49755 48732 47929 45122 43305 39269 37977 34243 31580 30830 30043 26022
8659B6022l696m750l645l124k178r19q78m033o45j632q25o61n86p31j71O62P49
$$ 26022 22326 17576 13931 10807 8629 7710 6832 2799 2154 522 -303 -964 -1550 -2281 -2452 -1790 -1041
8642a041J210J087j67L482J062K372j196K367J099n362n139l297l064p70j736
$$ -1041 169 1256 1089 4571 5633 8005 6809 9176 10275 4913 -226 -3523 -6587 -7357 -9093
8627i093j140o34j406m114K95j581j273j601o91p43M57R74j498m39J218L84J75
$$ -9093 -10233 -10867 -12273 -16387 -16092 -17673 -18946 -20547 -21238 -21981 -21524 -20550 -22048 -22487 -21269 -20885 -20710
8610b0710R21r07O92P65R79q91J25k25j797l043j904j458j041K30n65k53q14O81
$$ -20710 -19789 -20696 -20004 -19239 -18260 -19151 -19026 -19251 -21048 -24091 -25995 -27453 -28494 -28264 -28829 -29082 -29896 -29215
8592b9215j422m00J397J361j439J847j840l25R16J398J304L70R82q24j484k354
$$ -29215 -30637 -31037 -29640 -28279 -29718 -27871 -29711 -30036 -29120 -27722 -26418 -26048 -25066 -25890 -27374 -29728
8576b9728q77p07l09K81j589m98j219O81j785%J020k210Q86k048J99O32n49N96
$$ -29728 -30605 -31312 -31621 -31340 -32929 -33427 -34646 -33965 -35750 -35750 -34730 -36940 -36054 -38102 -37903 -37271 -37820 -37224
8558c7224J402L90K497K04J602j405Q24k89l071m20r29p86m99j183r57j43L4q23
$$ -37224 -35822 -35432 -32935 -32731 -31129 -32534 -31710 -31999 -35070 -35490 -36419 -37205 -37704 -38887 -39844 -39987 -39953 -40776
8540d0776n35K01j146j380K75j071M36k021j85k261j096k3054N3875j6545j817
$$ -40776 -41311 -41110 -42256 -43636 -43361 -44432 -43996 -46017 -46202 -48463 -49559 -72613 -18738 -35283 -37100
8525c7100k055J46j272J076K7k87p58N95m40l45k175l43L98p87j693J49j292O48
$$ -37100 -39155 -39009 -40281 -39205 -39178 -39465 -40223 -39628 -40068 -40413 -42588 -42931 -42533 -43320 -45013 -44864 -46156 -45508
8507d5508j232N58r47L48J61p67M31P97q27n08r4K39n95N40r79J54K89J007J31
$$ -45508 -46740 -46182 -47129 -46781 -46620 -47387 -46956 -46159 -46986 -47494 -47588 -47349 -47944 -47404 -48383 -48229 -47940 -46933 -46802
8488d6802P68J85M45j119Q90j246J775J97j749R84N42M86J212k288p8l23k561
$$ -46802 -46034 -45849 -45404 -46523 -45633 -46879 -45104 -44907 -46656 -45672 -45130 -44644 -43432 -45720 -45798 -46121 -48682
8471d8682r14J033j105K69n28J364j780J675j541M91Q10j281j618K190J044J162
$$ -48682 -49596 -48563 -49668 -49399 -49927 -48563 -50343 -48668 -50209 -49718 -48908 -50189 -51807 -49617 -48573 -47411
8455d7411p83K217j481L021qN96N93J75n8j28j332j040k333J363m65q45j979O15
$$ -47411 -48194 -45977 -47458 -44437 -44445 -43849 -43256 -43081 -43139 -43267 -44599 -45639 -47972 -46609 -47074 -47919 -49898 -49283
8437d9283k94k062j92m8l10n52o42L88P71n38J7K510j748N74K23n48n84O88Q06
$$ -49283 -49577 -51639 -51831 -51879 -52189 -52741 -53383 -52995 -52224 -52762 -52745 -50235 -51983 -51409 -51186 -51734 -52318 -51630 -50824
8418e0824p54k0m00M20q01O81r90P01m35k355p08K27q03R48n23o84l1P86j718
$$ -50824 -51578 -51598 -51998 -51578 -52379 -51698 -52688 -51987 -52422 -54777 -55485 -55258 -56061 -55113 -55636 -56320 -56351 -55565 -57283
8399e7283J503J14j557J415L93k161P90R96j301L247l780J86O41M22m93j289J569
$$ -57283 -55780 -55666 -57223 -55808 -55415 -57576 -56786 -55790 -57091 -53844 -57624 -57438 -56797 -56375 -56868 -58157 -56588
8382e6588o7m03j118J074m41M56n79J16q77L33M71p10J968j662k56R62J80j720
$$ -56588 -56655 -57058 -58176 -57102 -57543 -57087 -57666 -57550 -58427 -58094 -57623 -58333 -56365 -58027 -58283 -57321 -57141 -58861
8364e8861J909j228J773r19j82O07j002k0j231J323P57q66J39j206K96R3P9n82
$$ -58861 -56952 -58180 -56407 -57326 -57508 -56901 -57903 -57923 -59154 -57831 -57074 -57940 -57801 -59007 -58711 -58618 -58539 -59121
8346e9121J461j151L53o3o92K35n3J773k00J78j571K863l109J086l49K10p9l93
$$ -59121 -57660 -58811 -58458 -58521 -59213 -58978 -59031 -57258 -57458 -57280 -58851 -55988 -59097 -58011 -58360 -58150 -58229 -58622
8328e8622l62l00J046q34o21L87J15o70J79M10j063O33J120j074K098j945N90
$$ -58622 -58984 -59284 -58238 -59072 -59693 -59306 -59191 -59861 -59682 -59272 -60335 -59702 -58582 -59656 -57558 -59503 -58913
8311e8913l22Q50o74o01q14q03K169n37j204P82n4o3j225J508Q79M15o6j871P71
$$ -58913 -59235 -58385 -59059 -59660 -60474 -61277 -59108 -59645 -60849 -60067 -60121 -60184 -61409 -59901 -59022 -58607 -58673 -60544 -59773
8292e9773k55p75J620j61j855J035J641j286J304k971J854q04n97J306j570k90
$$ -59773 -60028 -60803 -59183 -59344 -61199 -60164 -58523 -59809 -58505 -61476 -59622 -60426 -61023 -59717 -61287 -61577
8276f1577J609n59J238m60Q46l610K259R73j00j304O42j170K182j653J56K513
$$ -61577 -59968 -60527 -59289 -59749 -58903 -62513 -60254 -59281 -59381 -60685 -60043 -61213 -59031 -60684 -60528 -58015
8260e8015k511Q70P43k19j048J220k180R97J786r84o44J87M69J778o02j246l537
$$ -58015 -60526 -59656 -58913 -59132 -60180 -58960 -61140 -60143 -58357 -59341 -59985 -59798 -59329 -57551 -58153 -59399 -62936
8243f2936J845L398k171l79J590K84m21j380J791k56J109k072M00j552K138J49
$$ -62936 -61091 -57693 -59864 -60243 -58653 -58369 -58790 -60170 -58379 -58635 -57526 -59598 -59198 -60750 -58612 -58463
8227e8463j992J95J27J767l109K403N86l23K01p65R06j424k362L867o06j0k523
$$ -58463 -60455 -60260 -60133 -58366 -61475 -59072 -58486 -58809 -58608 -59373 -58467 -59891 -62253 -58386 -58992 -59002 -61525
8210f1525jj65K29K576J723J426k901K56K544o255O528J272k857N373j17r769
$$ -61525 -61526 -61691 -61462 -58886 -57163 -55737 -58638 -58382 -55838 -62093 -55565 -54293 -57150 -51777 -51894 -61663
8194f1663J4781K8852m0215l7101J4358J0266Q007k035o40l392R301p224K90L558
$$ -61663 -46882 -18030 -58245 -95346 -80988 -70722 -62715 -64750 -65390 -68782 -59481 -66705 -66415 -62857
8180f2857n16J979k283K01j320M808K010n016K424q96j956k67K013m5j185k13
$$ -62857 -63373 -61394 -63677 -63476 -64796 -59988 -57978 -62994 -60570 -61466 -63422 -63689 -61676 -61721 -62906 -63119
8164f3119K667j705n84J515j265O94L40N98k058q1O64K4J159j742J923r13j43
$$ -63119 -60452 -62157 -62741 -61226 -62491 -61797 -61457 -60859 -62917 -62998 -62334 -62310 -61151 -62893 -60970 -61883 -62026
8147f2026l496L339J688k387j145K245j395L39J450r72J479n32J078J346m473
$$ -62026 -65522 -62183 -60495 -62882 -64027 -61782 -63177 -62838 -61388 -62360 -60881 -61413 -60335 -58989 -63462
8132f3462L099j657Q81p21K7j52j487L209l420K108L41k833R38K598j070J701
$$ -63462 -60363 -62020 -61139 -61860 -61833 -61985 -63472 -60263 -63683 -61575 -61234 -64067 -63129 -60531 -61601 -59900
8116e9900j995r9M06n89j000J669L12k0o38J310j859lk55n97K906j873j008M89
$$ -59900 -61895 -61994 -61588 -62177 -63177 -61508 -61196 -61216 -61854 -60544 -62403 -62406 -62661 -63258 -60352 -62225 -63233 -62744
8098f2744J244k75J526p09l85k103j217K530M00j468K151n10K07m75K75J21K577
$$ -62744 -61500 -61775 -60249 -60958 -61343 -63446 -64663 -62133 -61733 -63201 -61050 -61560 -61353 -61828 -61553 -61432 -58855
8081e8855l556K65N68q92L04J310n32j145O67q15J019N10o05Q75p78j397J449
$$ -58855 -62411 -62146 -61578 -62470 -62166 -60856 -61388 -62533 -61866 -62681 -61662 -61152 -61757 -60882 -61660 -63057 -61608
8064f1608m83o90J302m33j71K67o84Q95q98l3J549j350m67K07R10j981J576P6
$$ -61608 -62091 -62781 -61479 -61912 -62083 -61816 -62500 -61605 -62503 -62536 -60987 -62337 -62804 -62597 -61687 -63668 -62092 -62016
8046f2016q66J147q18O36j866K583L22j420N00M8L5j515J956m06j250P63O28l61
$$ -62016 -62882 -61735 -62553 -61917 -63783 -61200 -60878 -62298 -61798 -61750 -61715 -63230 -61274 -61680 -62930 -62167 -61539 -61900
8028f1900J50n74p50J216n41J146j39N12k411J883j339o78J109l44J611q30J94
$$ -61900 -61750 -62324 -63074 -61858 -62399 -61253 -61392 -60880 -63291 -61408 -62747 -63425 -62316 -62660 -61049 -61879 -61685
8011f1685j81M05K35M0r74K50j28k43n4j39r73K230R1j571j852J209J003j289
$$ -61685 -61866 -61461 -61226 -61186 -62160 -61910 -62038 -62281 -62335 -62474 -63447 -61217 -61126 -62697 -64549 -63340 -62337 -63626
7993f3626K848m61j612J53Q80k006K159J92K73k129J72M67J141j806J965j372
$$ -63626 -60778 -61239 -62851 -62698 -61818 -63824 -61665 -61473 -61200 -63329 -63157 -62690 -61549 -63355 -61390 -62762
7977f2762m69J456p19L51j024Q92J096r23M26l41l26m31k0Q8N17RK26m64L59K55
$$ -62762 -63231 -61775 -62494 -62143 -63167 -62275 -61179 -62102 -61676 -62017 -62343 -62774 -62794 -62706 -62189 -62180 -61954 -62418 -62059 -61804
7957f1804m55j77J630j414L50k37K58p78k01J768j261k30J090q38N45PP25j485
$$ -61804 -62259 -62436 -60806 -62220 -61870 -62107 -61849 -62627 -62828 -61060 -62321 -62551 -61461 -62299 -61754 -61747 -61022 -62507
7939f2507J045n58o36N65j2j090L24j73R99n56J982j218r37M20k23J37K48N42
$$ -62507 -61462 -62020 -62656 -62091 -62103 -63193 -62869 -63042 -62043 -62599 -60617 -61835 -62772 -62352 -62575 -62438 -62190 -61648
7921f1648n71O73M69j466r94J503q16L05L54j54k87J615j323q04J477o07k68j1
$$ -61648 -62219 -61546 -61077 -62543 -63537 -62034 -62850 -62545 -62191 -62345 -62632 -61017 -62340 -63144 -61667 -62274 -62542 -62553
7903f2553K80l69P49r75j3k69N94Q49j62Q20r52O71n14j72r26O16M64q71j97J977
$$ -62553 -62273 -62642 -61893 -62868 -62881 -63150 -62556 -61707 -61869 -61049 -62001 -61330 -61844 -62016 -62942 -62326 -61862 -62733 -62930 -60953
7883f0953j193N49L43l69l68K9j11M92p04J37J29R29j516K37O83M09K83L95q64
$$ -60953 -62146 -61597 -61254 -61623 -61991 -61962 -62073 -61581 -62285 -62148 -62019 -61090 -62606 -62369 -61686 -61277 -60994 -60599 -61463
7864f1463R16L54j70R17k98K7J724M331k983K4257m1035M896J180K658o42j20
$$ -61463 -60547 -60193 -60363 -59446 -59744 -59717 -57993 -53662 -56645 -32388 -73423 -68527 -67347 -64689 -65331 -65451
7848f5451q6J780j202M18O42L39R82r96k43J21K96K38J273M94r37j172Q61o07
$$ -65451 -65537 -63757 -64959 -64541 -63899 -63560 -62578 -63574 -63817 -63696 -63400 -63162 -61889 -61395 -62332 -63504 -62643 -63250
7830f3250n77J497j727k1R27q26J029l46J79l53N50K11J86M65m21p40L75l97J419
$$ -63250 -63827 -62330 -64057 -64078 -63151 -63977 -62948 -63294 -63115 -63468 -62918 -62707 -62521 -62056 -62477 -63217 -62842 -63239 -61820
7811f1820j533R38r1J56l65J192j141L59l3j523J369M63l41M13p13J981j767q99
$$ -61820 -63353 -62415 -62506 -62350 -62715 -61523 -62664 -62305 -62338 -63861 -62492 -62029 -62370 -61957 -62670 -60689 -62456 -63355
7793f3355O46N08j68j53J319j456P7j18R40M56l52r30l53J215j449J148L24P82
$$ -63355 -62709 -62201 -62369 -62522 -61203 -62659 -62582 -62700 -61760 -61304 -61656 -62586 -62939 -61724 -63173 -62025 -61701 -60919
7775f0919j719N43m9j048j311R15P05Q56K37j834M13Q87j73R72k34L40k043K79
$$ -60919 -62638 -62095 -62144 -63192 -64503 -63588 -62883 -62027 -61790 -63624 -63211 -62324 -62497 -61525 -61759 -61419 -63462 -63183
7757f3183P91j601K690k666J571j68J158j89k761K663j838K20M06J550j057j41
$$ -63183 -62392 -63993 -61303 -63969 -62398 -62566 -61408 -61597 -64358 -61695 -63533 -63313 -62907 -61357 -62414 -62555
7741f2555R5m53j34l62N88q9m7l68P41P90q90L67M0j279K586k153L58M93P6l10
$$ -62555 -62460 -62913 -63047 -63409 -62821 -62910 -62957 -63325 -62584 -61794 -62684 -62317 -62277 -63556 -60970 -63123 -62765 -62272 -62196 -62506
7721f2506K82L36m60j432J370L7J92L26j227R11l87N70j205J232m11K44L21j584
$$ -62506 -62224 -61888 -62348 -63780 -62410 -62373 -62181 -61855 -63082 -62171 -62558 -61988 -63193 -61961 -62372 -62128 -61807 -63391
7703f3391J600m18j852K424j481J596j440Q70O43r18P18j31j080n69J179p33M82
$$ -63391 -61791 -62209 -64061 -61637 -63118 -61522 -62962 -62092 -61449 -62367 -61649 -61780 -62860 -63429 -62250 -62983 -62501
7686f2501M23r0r82Q18L41O4p05k68P69L35L17m67n56jR77o8j356P87q5n12O86
$$ -62501 -62078 -62168 -63150 -62332 -61991 -61927 -62632 -62900 -62131 -61796 -61479 -61946 -62502 -62503 -61526 -61594 -62950 -62163 -62248 -62760 -62074
7665f2074q60Q30N3j79P27j104j70J77m02L74P44n7k5n51J213j896M55O87q2N82
$$ -62074 -62934 -62104 -62051 -62230 -61503 -62607 -62777 -62600 -63002 -62628 -61884 -61941 -61966 -62517 -61304 -63200 -62745 -62058 -62140 -61558
7645f1558k341J193P01j159J51n52J39N59J360j077j56J887k244Q39q90O82N02
$$ -61558 -63899 -62706 -62005 -63164 -63013 -63565 -63426 -62867 -61507 -62584 -62740 -60853 -63097 -62258 -63148 -62466 -61964
7628f1964k89p6J18L8q20M87M44p46J77M63R50j184n54l24J07R17l51p47K09P60
$$ -61964 -62253 -62329 -62211 -62173 -62993 -62506 -62062 -62808 -62631 -62168 -61218 -62402 -62956 -63280 -63173 -62256 -62607 -63354 -63145 -62385
7608f2385q1m93M15q4p70R66J133j600J172M79n559K346R92q29J296K1q60J383
$$ -62385 -62466 -62959 -62544 -62628 -63398 -62432 -61299 -62899 -61727 -61248 -66807 -64461 -63469 -64298 -63002 -62981 -63841 -62458
7590f2458K78k99n2p0L50l05N76m59L87o46L99k05o2O95Q97K20J010j276m11J020
$$ -62458 -62180 -62479 -62531 -62601 -62251 -62556 -61980 -62439 -62052 -62698 -62299 -62504 -62566 -61871 -60974 -60754 -59744 -61020 -61431 -60411
7570f0411Q0j057O29o71l90M7r85O93r72K8J237m72r81J342r97N30N78p86j19
$$ -60411 -60331 -61388 -60759 -61430 -61820 -61773 -62758 -62065 -63037 -63009 -61772 -62244 -63225 -61883 -62880 -62350 -61772 -62558 -62677
7551f2677o58j84Q11o84P70N29j91Q8q49j98J338k311L755k160l44M77K52p68
$$ -62677 -63335 -63519 -62708 -63392 -62622 -62093 -62284 -62196 -63045 -63243 -61905 -64216 -60461 -62621 -62965 -62488 -62236 -63004
7533f3004L19K94k52p95J994p59j02J16J57J03k63K20l39o1R42r75l7O52N83q16
$$ -63004 -62685 -62391 -62643 -63438 -61444 -62203 -62305 -62189 -62032 -61929 -62192 -61972 -62311 -62372 -61430 -62405 -62442 -61790 -61207 -62023
7513f2023p51Q49J285J38j025J845j860k77J423n30L32n51l94M77L2J41j65l29
$$ -62023 -62774 -61925 -60640 -60502 -61527 -59682 -61542 -61819 -60396 -60926 -60594 -61145 -61539 -61062 -61030 -60889 -61054 -61383
7495f1383j02j866J989k46n28N51o88o33q3J146O48j392k49M59J86O84m43L22
$$ -61383 -61485 -63351 -61362 -61608 -62136 -61585 -62273 -62906 -62989 -61843 -61195 -62587 -62836 -62377 -62191 -61507 -61950 -61628
7477f1628j191O40k43K39K58J61o38l74J037o78o52J679o32K04K8q14R48R13j000
$$ -61628 -62819 -62179 -62422 -62183 -61925 -61764 -62402 -62776 -61739 -62417 -63069 -61390 -62022 -61818 -61790 -62604 -61656 -60743 -61743
7458f1743q7J110j755J501j456j52J964j716N24k58m01O25J150o25J69K43j711
$$ -61743 -61830 -60720 -62475 -60974 -62430 -62582 -60618 -62334 -61810 -62068 -62469 -61844 -60694 -61319 -61150 -60907 -62618
7441f2618J62N05R6o63N70p59O15m36rJ206j8j287P22k20M42o39M81n01Q16o69
$$ -62618 -62456 -61951 -61855 -62518 -61948 -62707 -62092 -62528 -62537 -61331 -61349 -62636 -61914 -62134 -61692 -62331 -61850 -62351 -61535 -62204
7421f2204p37M07L62N98Q07j622K169j499M9K30J086k022K62R65r80N9R90p27
$$ -62204 -62941 -62534 -62172 -61574 -60767 -62389 -60220 -61719 -61670 -61440 -60354 -62376 -62114 -61149 -62129 -62070 -61080 -61807
7403f1807L80o18l22n65J139l37K60O07j092J82r16l8J103M39M72n70o47l09j36
$$ -61807 -61427 -62045 -62367 -62932 -61793 -62130 -61870 -61263 -62355 -62173 -63089 -63127 -62024 -61585 -61113 -61683 -62330 -62639 -62775
7384f2775p44K554k05j11p44m79K95j95j83J968K35j432N3r73n43R0J158O82N92
$$ -62775 -63519 -60965 -61170 -61281 -62025 -62504 -62209 -62404 -62587 -60619 -60384 -61816 -61763 -62736 -63279 -63189 -62031 -61349 -60757
7365f0757j526j32m70l07J877R25j764J500p72j535j194K228j47k06Q62n68M62
$$ -60757 -62283 -62415 -62885 -63192 -61315 -60390 -62154 -60654 -61426 -62961 -64155 -61927 -62074 -62280 -61418 -61986 -61524
7348f1524j295K65Q91p99J284o81o7p21J717j021j785Q60K61J002L54q70l51J331
$$ -61524 -62819 -62554 -61663 -62462 -61178 -61859 -61926 -62647 -60930 -61951 -63736 -62876 -62615 -61613 -61259 -62129 -62480 -61149
7330f1149j895m6J020O52P62j036J36p16J87J10j38R16J315k114j82j443J334
$$ -61149 -63044 -63090 -62070 -61418 -60656 -61692 -61556 -62272 -62085 -61975 -62113 -61197 -59882 -61996 -62178 -63621 -62287
7313f2287m47J673j00M4k187P45J66k14N24J731P1k429O7J137j601J860q66J076
$$ -62287 -62734 -61061 -61161 -61117 -63304 -62559 -62393 -62607 -62083 -60352 -60281 -62710 -62643 -61506 -63107 -61247 -62113 -61037
7295f1037N07o96l01r6l33J90N86J45m48o34L17N85j76L99r20O55l71L00o97Q70
$$ -61037 -60530 -61226 -61527 -61623 -61956 -61766 -61180 -61035 -61483 -62117 -61800 -61215 -61391 -60992 -61912 -61257 -61628 -61328 -62025 -61155
7275f1155O0L16J44q78M25K68m42o97J11N57j481J322m27M98O94j115J65P2J56
$$ -61155 -61095 -60779 -60635 -61513 -61088 -60820 -61262 -61959 -61848 -61291 -62772 -61450 -61877 -61379 -60685 -61800 -61635 -61563 -61407
7256f1407j07n5N45P1r99l67P47K74p82P41J91M36l23j135J418m65r94J623l29
$$ -61407 -61514 -61569 -61024 -60953 -61952 -62319 -61572 -61298 -62080 -61339 -61148 -60712 -61035 -62170 -60752 -61217 -62211 -60588 -60917
7237f0917k03O23j296J288o96k31m21J14j61J49N3n12M12O9J87J14j213N66J7
$$ -60917 -61120 -60497 -61793 -60505 -61201 -61432 -61853 -61739 -61900 -61751 -61698 -62210 -61798 -61729 -61542 -61428 -62641 -62075 -62058
7218f2058J185o51K28L53o1r56j12m28J493L07n06L12p60J175o37J820q305M425
$$ -62058 -60873 -61524 -61296 -60943 -61004 -61960 -62072 -62500 -61007 -60700 -61206 -60894 -61654 -60479 -61116 -59296 -67601 -63176
7200f3176J515M53j296L9J178J41p49lM87k3Nj64K01K30q83L73J9m99l57J097
$$ -63176 -61661 -61208 -62504 -62465 -61287 -61146 -61895 -61898 -61411 -61434 -61429 -61593 -61392 -61162 -62045 -61672 -61653 -62152 -62509 -61412
7180f1412K32L58j112O74K54r66L39n56J085K05m64p08l77Q21P79j142L10R29
$$ -61412 -61180 -60822 -61934 -61260 -61006 -61972 -61633 -62189 -61104 -60899 -61363 -62071 -62448 -61627 -60848 -61990 -61680 -60751
7162f0751j580P97O28k23K55j0n13P2j006M83K90k22Q7P57m69J60o32J113j287
$$ -60751 -62331 -61534 -60906 -61129 -60874 -60884 -61397 -61325 -62331 -61848 -61558 -61780 -61693 -60936 -61405 -61245 -61877 -60764 -62051
7143f2051M22R20m04n47P71l28K02L11j145P28r71M26Q24j479J227p79R06j0l81
$$ -62051 -61629 -60709 -61113 -61660 -60889 -61217 -61015 -60704 -61849 -61121 -62092 -61666 -60842 -62321 -61094 -61873 -60967 -60977 -61358
7124f1358Q28m83j019J866j600L04k43Q98L24o01J0M76Rk32K03m83K57n1o6m34
$$ -61358 -60530 -61013 -62032 -60166 -61766 -61462 -61705 -60807 -60483 -61084 -61074 -60598 -60589 -60821 -60618 -61101 -60844 -60895 -60961 -61395
7104f1395K00P46n71J14P68p69J46N19k19j122J765j265L98L39l76j353J070J266
$$ -61395 -61195 -60449 -61020 -60906 -60138 -60907 -60761 -60242 -60461 -61583 -59818 -61083 -60685 -60346 -60722 -62075 -61005 -59739
7086e9739j791R46j094J901o27P81j405P79m61K35J543o16j960J201R1K89K44
$$ -59739 -61530 -60584 -61678 -59777 -60404 -59623 -61028 -60249 -60710 -60475 -58932 -59548 -61508 -60307 -60216 -59927 -59683
7069e9683p55o04J380P5k48J51o59q69Q23J06r70L97Q01n55J459o76q06j2l84
$$ -59683 -60438 -61042 -59662 -59587 -59835 -59684 -60343 -61212 -60389 -60283 -61253 -60856 -60055 -60610 -59151 -59827 -60633 -60645 -61029
7050f1029L36L03j51m81L95p13J762l29j078M02N96k36P62j019O64j402P08q46
$$ -61029 -60693 -60390 -60541 -61022 -60627 -61340 -59578 -59907 -60985 -60583 -59987 -60223 -59461 -60480 -59816 -61218 -60510 -61356
7032f1356Q21o19J394q0m61Q22p42N1O68q29Q92p42J077k49l34M4N89p54J51Q95
$$ -61356 -60535 -61154 -59760 -59840 -60301 -59479 -60221 -60170 -59502 -60331 -59439 -60181 -59104 -59353 -59687 -59643 -59054 -59808 -59657 -58762
7012e8762K07o16KJ018jj27O7k37K386j656J277J412p13j61P89n73j935L91l46
$$ -58762 -58555 -59171 -59169 -58151 -58152 -58279 -58212 -58449 -56063 -57719 -56442 -55030 -55743 -55904 -55115 -55688 -57623 -57232 -57578
6993e7578q21J39k63N39j058N02o05M17N58j93R68l59L37K68L78J314M23J45P76
$$ -57578 -58399 -58260 -58523 -57984 -59042 -58540 -59145 -58728 -58170 -58363 -57395 -57754 -57417 -57149 -56771 -55457 -55034 -54889 -54113
6974e4113M7j527M88j068m21l41o22N08j242l07J068j470L70O48j060O99j809
$$ -54113 -54066 -55593 -55105 -56173 -56594 -56935 -57557 -57049 -58291 -58598 -57530 -59000 -58630 -57982 -59042 -58343 -60152
6957f0152j03J659N6j117N93O81j313o6J57L96K92r55J92R0j3L78j468K69J031
$$ -60152 -60255 -58596 -58540 -59657 -59064 -58383 -59696 -59762 -59605 -59209 -58917 -59872 -59680 -59590 -59603 -59225 -60693 -60424 -59393
6938e9393n43LN61J28M38q66l25j03N69N01l43o9q65J207r9q47P80m84N62k143
$$ -59393 -59936 -59933 -59372 -59244 -58806 -59672 -59997 -60100 -59531 -59030 -59373 -59442 -60307 -59100 -59199 -60046 -59266 -59750 -59188 -61331
6918f1331P57Q87n81k62L48K4P98o31R49k00r24J669o51p16K34J084j098J6N74
$$ -61331 -60574 -59687 -60268 -60530 -60182 -60158 -59360 -59991 -59042 -59242 -60166 -58497 -59148 -59864 -59630 -58546 -59644 -59628 -59054
6899e9054k22J1k79m38N19P21j230J170l31n99J461j390K04L56K58l19J55J117
$$ -59054 -59276 -59265 -59544 -59982 -59463 -58742 -59972 -58802 -59133 -59732 -58271 -59661 -59457 -59101 -58843 -59162 -59007 -57890
6881e7890n34J26r82J513j022L48q47r3j74l71O17j29P07m71J331j673M38Q35
$$ -57890 -58424 -58298 -59280 -57767 -58789 -58441 -59288 -59381 -59555 -59926 -59309 -59438 -58731 -59202 -57871 -59544 -59106 -58271
6863e8271k23l86J16r15j30J371q29N47K97o24Q68RO11j015O85n29m51j6J156
$$ -58271 -58494 -58880 -58764 -59679 -59809 -58438 -59267 -58720 -58423 -59047 -58179 -58170 -57559 -58574 -57889 -58418 -58869 -58885 -57729
6844e7729r11O2J275j043J294n01q2j91m71j55J962L76L12O46L65L77K335j026
$$ -57729 -58640 -58578 -57303 -58346 -57052 -57553 -57635 -57826 -58297 -58452 -56490 -56114 -55802 -55156 -54791 -54414 -52079 -53105
6826e3105R99j941j32L2j944L37p8o28J685j005J591j161J361j74K536J629Q69
$$ -53105 -52106 -54047 -54179 -54147 -56091 -55754 -55832 -56460 -54775 -55780 -54189 -55350 -53989 -54163 -51627 -49998 -49129
6809d9129J714L80P17J153l336o98l784R53m50n6k16m67J54j569O83P82J32N51
$$ -49129 -47415 -47035 -46318 -45165 -48501 -49199 -52983 -52030 -52480 -52536 -52752 -53219 -53065 -54634 -53951 -53169 -53037 -52486
6791e2486J085J081J480J560O12j313j282j496j334j95j434K68j091j43K20K00
$$ -52486 -51401 -50320 -48840 -47280 -46668 -47981 -49263 -50759 -52093 -52288 -53722 -53454 -54545 -54688 -54468 -54268
6775e4268j472j08L82O50p37J026Q99l17N07J12k61k083k08Q16p92R03n67L63
$$ -54268 -55740 -55848 -55466 -54816 -55553 -54527 -53628 -53945 -53438 -53326 -53587 -55670 -55878 -55062 -55854 -54951 -55518 -55155
6757e5155O59r60J155l08O63j143P41m42R7k50o84j36R0M12m30P14l30k06L12
$$ -55155 -54496 -55456 -54301 -54609 -53946 -55089 -54348 -54790 -54693 -54943 -55627 -55763 -55673 -55261 -55691 -54977 -55307 -55513 -55201
6738e5201J372R3Q74J184J233K722m19j285k057r65k95n83p12M66p69M18j27l09
$$ -55201 -53829 -53736 -52862 -51678 -50445 -47723 -48142 -49427 -51484 -52449 -52744 -53327 -54039 -53573 -54342 -53924 -54051 -54360
6720e4360J271r07O84J273Q11J115K965Q37q60l835o81p35r69P61m91p54n25L46
$$ -54360 -53089 -53996 -53312 -52039 -51228 -50113 -47148 -46311 -47171 -51006 -51687 -52422 -53391 -52630 -53121 -53875 -54400 -54054
6702e4054j87R64n19N47J98k4qP77Q85n75L87j134k22l0k45Q82L9K76O26O8J482
$$ -54054 -54241 -53277 -53796 -53249 -53051 -53075 -53083 -52306 -51421 -51996 -51609 -52743 -52965 -52995 -53240 -52358 -52319 -52043 -51417 -51349 -49867
6681d9867j660K245K52m41J61q7j062J96Q0K24j235m55o61J163M97q10Q74j293
$$ -49867 -51527 -49282 -49030 -49471 -49310 -49397 -50459 -50263 -50183 -49959 -51194 -51649 -52310 -51147 -50650 -51460 -50586 -51879
6663e1879M88L67J001l01L64Q69M15r40k63M78P08J295J88P26l10J64Q7q7Q3o0
$$ -51879 -51391 -51024 -50023 -50324 -49960 -49091 -48676 -49616 -49879 -49401 -48693 -47398 -47210 -46484 -46794 -46630 -46543 -46630 -46547 -46607
6643d6607%L00r74J266M0N77p4K76q59J53K47j154J163j86L29J345p18N11L46
$$ -46607 -46607 -46307 -47281 -46015 -45975 -45398 -45472 -45196 -46055 -45902 -45655 -46809 -45646 -45832 -45503 -44158 -44876 -44365 -44019
6624d4019j208J140k47K32j34R5Q3n08P98L03P88O78m54q65Q06k04j121M94q17
$$ -44019 -45227 -44087 -44334 -44102 -44236 -44141 -44058 -44566 -43768 -43465 -42677 -41999 -42453 -43318 -42512 -42716 -43837 -43343 -44160
6605d4160l82j04r44P27j054J933j12j98j771o39L95q31J32J83j81K95n6r0J278
$$ -44160 -44542 -44646 -45590 -44863 -45917 -43984 -44096 -44294 -46065 -46704 -46309 -47140 -47008 -46825 -47006 -46711 -46767 -46857 -45579
6586d5579r59M24O0M12q94n20j80J045j318k48Q24J33o53N59j761q0r27l19K807
$$ -45579 -46538 -46114 -46054 -45642 -46536 -47056 -47236 -46191 -47509 -47757 -46933 -46800 -47453 -46894 -48655 -48735 -49662 -49981 -47174
6567d7174j729J88L96j510m45m39R43N27N15J242j082j906j287J498j25R71N40
$$ -47174 -48903 -48715 -48319 -49829 -50274 -50713 -49770 -49243 -48728 -47486 -48568 -50474 -51761 -50263 -50388 -49417 -48877
6550d8877O20j686j619j114j5J749K416J88k847j272j064QN23M652J936k866j497
$$ -48877 -48257 -49943 -51562 -52676 -52691 -50942 -48526 -48338 -51185 -52457 -53521 -53513 -52990 -48338 -46402 -49268 -50765
6533e0765k882l332K167M826M173j320j221j752p366j726N129J086L970O487m845
$$ -50765 -53647 -56979 -54812 -49986 -45813 -47133 -48354 -50106 -57472 -59198 -54069 -52983 -49013 -42526 -47371
6518d7371r103L863K792M055q29J386m941m288j360J456N182L105M14N08k771
$$ -47371 -56474 -52611 -49819 -45764 -46593 -45207 -50148 -54436 -55796 -54340 -49158 -46053 -45639 -45131 -47902
6503d7902m981j624K299L496K029J280j395k571l171K96K555K136J958j686m5
$$ -47902 -52883 -54507 -52208 -48712 -46683 -45403 -46798 -49369 -52540 -52244 -49689 -47553 -45595 -47281 -47326
6488d7326j506p18k75K672Q86J049j84j317j347J498J58J45J540r78n67j640L12
$$ -47326 -48832 -49550 -49825 -47153 -46267 -45218 -45402 -46719 -48066 -46568 -46410 -46265 -44725 -45703 -46270 -47910 -47598
6471d7598J755r56L01P31n93M0j614P54K29O4Q77R01j552K017j267k16Q05j393
$$ -47598 -45843 -46799 -46498 -45767 -46360 -46320 -47934 -47180 -46951 -46887 -46010 -45109 -46661 -44644 -45911 -46127 -45322 -46715
6453d6715L08J10J49n19k98l12J842k86k78n01k37L51L15J424k579K009J57j098
$$ -46715 -46407 -46297 -46148 -46667 -46965 -47277 -45435 -45721 -45999 -46500 -46737 -46386 -46071 -44647 -47226 -45217 -45060 -46158
6435d6158Q19N74j279J220j62O32n47r7Q05L12l96k14J98P21j262J423P85l01
$$ -46158 -45339 -44765 -46044 -44824 -44986 -44354 -44901 -44998 -44193 -43881 -44277 -44491 -44293 -43572 -44834 -43411 -42626 -42927
6417d2927j177K21m39K62J56J368J922n837L355j94o70P32Q96l58M12q59L41J28
$$ -42927 -44104 -43883 -44322 -44060 -43904 -42536 -40614 -46451 -43096 -43290 -43960 -43228 -42332 -42690 -42278 -43137 -42796 -42668
6399d2668O45L69p51k91J674m1k68k64l37Q74l93R44j274m9Q67q95N72K79J4N85
$$ -42668 -42023 -41654 -42405 -42696 -41022 -41063 -41331 -41595 -41932 -41058 -41451 -40507 -41781 -41830 -40963 -41858 -41286 -41007 -40993 -40408
6379d0408O58j104J54j052J706K95j432k46L34J99L5o0j45n07O86P45l54K65R56
$$ -40408 -39750 -40854 -40700 -41752 -40046 -39751 -41183 -41429 -41095 -40896 -40861 -40921 -41066 -41573 -40887 -40142 -40496 -40231 -39275
6360c9275N62p56N93N57l63J8j98N26n79R78J181N40QK628Q99J004J665j136j341
$$ -39275 -38713 -39469 -38876 -38319 -38682 -38664 -38862 -38336 -38915 -37937 -36756 -36216 -36208 -33580 -32681 -31677 -30012 -31148 -32489
6341c2489q71p49L44p55l2L53J572L89k58L86K349N05N80J164O62K094j153j471
$$ -32489 -33360 -34109 -33765 -34520 -34552 -34199 -32627 -32238 -32496 -32110 -29761 -29256 -28676 -27512 -26850 -24756 -25909 -27380
6323b7380j087j265K82O96q54n70j023J398j137j97P44L62J784P56J154J141J773
$$ -27380 -28467 -29732 -29450 -28754 -29608 -30178 -31201 -29803 -30940 -31137 -30393 -30031 -28247 -27491 -26337 -25196 -23423
6306b3423k798l48j144j473P0R9J43J413l40M10J096J604L61K532K083M095p82
$$ -23423 -26221 -26569 -27713 -29186 -29116 -29017 -28874 -27461 -27801 -27391 -26295 -24691 -24330 -21798 -19715 -15620 -16402
6289a6402n470m722j823l323k947O50n23j028o43J516M95L97j17J352K87j198
$$ -16402 -21872 -26594 -28417 -31740 -34687 -34037 -34560 -35588 -36231 -34715 -34220 -33823 -33940 -32588 -32301 -33499
6273c3499R22l21J36Q21P64o90J35M52J41J163n45J658m30J650l39l2R08R72P59
$$ -33499 -32577 -32898 -32762 -31941 -31177 -31867 -31732 -31280 -31139 -29976 -30521 -28863 -29293 -27643 -27982 -28014 -27106 -26134 -25375
6254b5375O32K845J481K617L819N488N608M226j592p328n426l444k586j511j169
$$ -25375 -24743 -21898 -20417 -17800 -13981 -8493 -2885 1341 -251 -7579 -13005 -16449 -19035 -20546 -21715
6239b1715j893n95N08Q3r89P61K74j566R77N15m62Q00L58L55J107K587j185J340
$$ -21715 -23608 -24203 -23695 -23612 -24601 -23840 -23566 -25132 -24155 -23640 -24102 -23302 -22944 -22589 -21482 -18895 -20080 -18740
6221a8740n97J73K65j295n36M67k1K2N38R31l36K629l16K70J070J404k14M83J294
$$ -18740 -19337 -19164 -18899 -20194 -20730 -20263 -20284 -20262 -19724 -18793 -19129 -16500 -16816 -16546 -15476 -14072 -14286 -13803 -12509
6202a2509j197n73l89m42o96r4p7r72K71J7K19j367J008J172M06K615J177k54
$$ -12509 -13706 -14279 -14668 -15110 -15806 -15900 -15977 -16949 -16678 -16661 -16442 -17809 -16801 -15629 -15223 -12608 -11431 -11685
6184a1685Q26m80j037m3q4J346j791J256Q56O34M21J462n01L27M23k76o6P32K70
$$ -11685 -10859 -11339 -12376 -12419 -12503 -11157 -12948 -11692 -10836 -10202 -9781 -8319 -8820 -8493 -8070 -8346 -8412 -7680 -7410
6165g410p3j3J008m32J189J489Q70J33R23M60k46p43O58L87j434J47j7J70L1l13
$$ -7410 -7483 -7496 -6488 -6920 -5731 -4242 -3372 -3239 -2316 -1856 -2102 -2845 -2187 -1800 -3234 -3087 -3104 -2934 -2903 -3216
6145c216O86r87J103m81M70o66N64r85P37m82q23k71j677M18j464K84j335M87
$$ -3216 -2530 -3517 -2414 -2895 -2425 -3091 -2527 -3512 -2775 -3257 -4080 -4351 -6028 -5610 -7074 -6790 -8125 -7638
6127g638r4N85r02J115k85N76p00J057o02J688M6R80J31j197Q92J325O11N44J89
$$ -7638 -7732 -7147 -8049 -6934 -7219 -6643 -7343 -6286 -6888 -5200 -5154 -4174 -4043 -5240 -4348 -3023 -2412 -1868 -1679
6108a679K33n5P71J568r50J099o0O90R10N00P30j66J163K39L78J039R43J348J606
$$ -1679 -1446 -1501 -730 838 -112 987 927 1617 2527 3027 3757 3591 4754 4993 5371 6410 7353 8701 10307
6089A0307L31K531L045L74M11J753K00M2J584m32J081k19K24P53P81Q08l59J270
$$ 10307 10638 13169 16214 16588 16999 18752 18952 18994 20578 20146 21227 21008 21232 21985 22766 23574 23215 24485
6071B4485M91J436J634N66J716P40J076K316J382J264L56K479J354R35J677N27
$$ 24485 24976 26412 28046 28612 30328 31068 32144 34460 35842 37106 37462 39941 41295 42230 43907 44434
6055D4434K065K456L82K196J454J693L281J357K669J109J455K153K511J752J158
$$ 44434 46499 48955 49337 51533 52987 54680 57961 59318 61987 63096 64551 66704 69215 70967 72125
6040G2125J662K237J249K379K205L026K454L609J841L485K273N174K044L622L853
$$ 72125 73787 76024 77273 79652 81857 84883 87337 90946 92787 96272 98545 103719 105763 109385 113238
6025A13238N359M301M399N945M700O195M016L470L448M707O93P886M740N358N611
$$ 113238 118597 122898 127297 133242 137942 144137 148153 151623 155071 159778 160471 168357 173097 178455 184066
6010A84066O119P067P950P869Q114Q317R655J1890J2456J3525J6232J5809J9866
$$ 184066 190185 197252 205202 213071 221185 229502 239157 251047 263503 277028 293260 309069 328935
5997C28935K2552K5953L4469M3499N7144P1770Q6087R9021Q1184K804o5974o5052
$$ 328935 351487 377440 411909 455408 512552 584322 670409 769430 850614 853418 787444 722392
5985G22392l3970j6195L406J9899L4808N0057N9677O6128K9116o085Q043L4869
$$ 722392 688422 672227 675633 695532 730340 780397 840074 906202 935318 929233 937276 972145
5973I72145N8392N6531j604o0651n9243k8086l239J2621L1089K7632l3423n4689
$$ 972145 1030537 1087068 1085464 1024813 965570 937484 934245 946866 977955 1005587 972164 917475
5961I17475l8415j4839Q535K4794M5609O7978Q7369P1345l9830j33541j20101
$$ 917475 879060 864221 872756 897550 943159 1011137 1098506 1169851 1130021 996480 876379
5950H76379q5621n9261m4630l3184k3715j7811j3062r397p074o098k027l674j946
$$ 876379 790758 731497 686867 653683 629968 612157 599095 589698 582624 576526 574499 570825 568879
5937E68879l476j600k53K0L056K187J147K526L483L625L890J038P37L367L548
$$ 568879 565403 563803 563550 563570 566626 568813 569960 572486 575969 579594 583484 584522 585259 588626 592174
5922E92174K694M271N650L505O161M580N393N959P456Q336N243Q608P040Q293
$$ 592174 594868 599139 604789 608294 614455 619035 624428 630387 637843 646179 651422 660030 667070 675363
5908F75363N777M914O467N004O061Q167P413O833R076Q498P824J0102R271J0495
$$ 675363 681140 686054 692521 697525 703586 711753 719166 725999 735075 743573 751397 761499 770770 781265
5894G81265Q433J0639R609J1279J0888J2640J1831J1196J2642R863J1126R072
$$ 781265 789698 800337 809946 821225 832113 844753 856584 867780 880422 890285 901411 910483
5882I10483J0802J3125J1318J1776J1609J2251J0911J1777J1547J1621J2084J3216
$$ 910483 921285 934410 945728 957504 969113 981364 992275 1004052 1015599 1027220 1039304 1052520
5870A052520J3756J2950J4388J3644J5876J5216J4633J3494J6596J6254J7441
$$ 1052520 1066276 1079226 1093614 1107258 1123134 1138350 1152983 1166477 1183073 1199327 1216768
5859A216768J9256K1041K1226K2410K3843K4066K3026K2045K4113K1559K3578
$$ 1216768 1236024 1257065 1278291 1300701 1324544 1348610 1371636 1393681 1417794 1439353 1462931
5848A462931K3738K7545K3856K0983K2728K3990K3917K2820J9910K2711K1891
$$ 1462931 1486669 1514214 1538070 1559053 1581781 1605771 1629688 1652508 1672418 1695129 1717020
5837A717020J7144O357n410l638J329J1262J5296J8634K4796K8127L1041L2529
$$ 1717020 1734164 1740521 1735111 1731473 1732802 1744064 1759360 1777994 1802790 1830917 1861958 1894487
5825A894487L1906L1886L0193K8615L0477L0223L4015L2515L2973K9273K9604
$$ 1894487 1926393 1958279 1988472 2017087 2047564 2077787 2111802 2144317 2177290 2206563 2236167
5814B236167L1829L2165L1835K8910K8223L1407L4335L7629L8994L8572L9546
$$ 2236167 2267996 2300161 2331996 2360906 2389129 2420536 2454871 2492500 2531494 2570066 2609612
5803B609612L7496M1996M2665M6081M8869M9850M9270N2163N2877N5550N6644
$$ 2609612 2647108 2689104 2731769 2777850 2826719 2876569 2925839 2978002 3030879 3086429 3143073
5792C143073O0603O5733O7429O9413P2919P6680P8198P4794P8852Q0380Q3890
$$ 3143073 3203676 3269409 3336838 3406251 3479170 3555850 3634048 3708842 3787694 3868074 3951964
5781C951964Q7423R0666R3165J02753J09947J19776J21469J23780J30669J37832
$$ 3951964 4039387 4130053 4223218 4325971 4435918 4555694 4677163 4800943 4931612 5069444
5771E069444J42505J50960J54460J61072J70880J86202K07782K49697J78681K18126
$$ 5069444 5211949 5362909 5517369 5678441 5849321 6035523 6243305 6493002 6671683 6889809
5761F889809K60922L13966L51779K97756K51622K31221K31405K31091K32688K31948
$$ 6889809 7150731 7464697 7816476 8114232 8365854 8597075 8828480 9059571 9292259 9524207
5751I524207K40292K49894K59456K74615K82561K90019K93850L04593L09266L17220
$$ 9524207 9764499 10014393 10273849 10548464 10831025 11121044 11414894 11719487 12028753 12345973
5741A2345973L41234L67562L99211M32617M76066N28704N81680O48473P25616
$$ 12345973 12687207 13054769 13453980 13886597 14362663 14891367 15473047 16121520 16847136
5732A6847136Q39921Q70546Q45501Q10169P92642P90327Q29363R28133J046628
$$ 16847136 17687057 18557603 19403104 20213273 21005915 21796242 22625605 23553738 24600366
5723B4600366J142465J261105J339638J372582J449648J550278J713109J776563
$$ 24600366 25742831 27003936 28343574 29716156 31165804 32716082 34429191 36205754
5715C6205754J931091K274064K682274K996267L266656L556279L895576M560308
$$ 36205754 38136845 40410909 43093183 46089450 49356106 52912385 56807961 61368269
5707F1368269N416844O481889P177871Q540367J0611930J1455651J3086675J5709550
$$ 61368269 66785113 73267002 80444873 88985240 99597170 111052821 124139496 139849046
5699A39849046J9087359K3290185K7488996K9314994L1254840L2190276K7327184
$$ 139849046 158936405 182226590 209715586 239030580 270285420 302475696 329802880
5692C29802880L0164475L680239j8544197k7985839l5357349k8079961l0519036
$$ 329802880 359967355 363647594 345103397 317117558 281760209 253680248 223161212
5685B23161212k9144291k4786122k0809410j8180618j5014427j2552401j0448492
$$ 223161212 194016921 169230799 148421389 130240771 115226344 102673943 92225451
5678I2225451q664293p233691o167330n411420m757741m150391l583791l105272
$$ 92225451 83561158 76327467 70160137 64748717 59990976 55840585 52256794 49151522
5670D9151522k742009k531050k341256k116066j915068j744023j589695j458015
$$ 49151522 46409513 43878463 41537207 39421141 37506073 35762050 34172355 32714340
5662C2714340j393846j303413j178600j076818r91986r14028q50284r20438j096095
$$ 32714340 31320494 30017081 28838481 27761663 26769677 25855649 25005365 24084927 22988832
5653B2988832r29061q21787p51493o94683o46594o04216n68248n38637n10004
$$ 22988832 22059771 21237984 20486491 19791808 19145214 18540998 17972750 17434113 16924109
5644A6924109m81606m94315m61841m63193m94268m72443m41673m16483l86011
$$ 16924109 16442503 15948188 15486347 15023154 14528886 14056443 13614770 13198287 12812276
5635A2812276l62253l38239l20505l08463k94671k81687k67533k54124k38668
$$ 12812276 12450023 12111784 11791279 11482816 11188145 10906458 10638925 10384801 10146133
5626A0146133k26300k18667k07967k05503k00672k12524k06931k80982l12107
$$ 10146133 9919833 9701166 9493199 9287696 9087024 8874500 8667569 8386587 8074480
5617H074480k78959k51996k29522k05553j78135j75785j68530j68837j71500j67048
$$ 8074480 7795521 7543525 7314003 7108450 6930315 6754530 6586000 6417163 6245663 6078615
5607F078615j53707j49439j44116j39736j36718j29349j27310j19238j13526j07297
$$ 6078615 5924908 5775469 5631353 5491617 5354899 5225550 5098240 4979002 4865476 4758179
5597D758179j04922r8218r2553q9229q2915p9353p6671p4199o9399o5371o1891
$$ 4758179 4653257 4555039 4462486 4373257 4290342 4210989 4134318 4060119 3990720 3925349 3863458
5586C863458o0780o0462n9142n6340o3096p0043p2507o9459o5887o1040n9078
$$ 3863458 3802678 3742216 3683074 3626734 3563638 3493595 3421088 3351629 3285742 3224702 3165624
5575C165624n8250o0106n7399n8367n1162n1437m7967m5379m5709m2612m0398
$$ 3165624 3107374 3047268 2989869 2931502 2880340 2828903 2780936 2735557 2689848 2647236 2606838
5564B606838l5351l4486l5563l9385l6826l4233l1266k6733k5582k8182l1728
$$ 2606838 2571487 2537001 2501438 2462053 2425227 2390994 2359728 2332995 2307413 2279231 2247503
5553B247503l5639l8296l8548m2857m3831n1642n4406m5951l8274l0114l0543
$$ 2247503 2211864 2173568 2135020 2092163 2048332 1996690 1942284 1896333 1858059 1827945 1797402
5542A797402k9176k8417k9748k3486k2256k3835k1254j8595j9249j9507k0044
$$ 1797402 1768226 1739809 1710061 1686575 1664319 1640484 1619230 1600635 1581386 1561879 1541835
5531A541835j9067j8620k0509j9846j8848j8217j8990j6582j7811j8563j7346
$$ 1541835 1522768 1504148 1483639 1463793 1444945 1426728 1407738 1391156 1373345 1354782 1337436
5520A337436j8206j7056j7562j8632j6680j5625j7158j5917j6523j6291j5857
$$ 1337436 1319230 1302174 1284612 1265980 1249300 1233675 1216517 1200600 1184077 1167786 1151929
5509A151929j5911j8105j5730j4632j5835j4945j3287j3711j1866j2348j3291
$$ 1151929 1136018 1117913 1102183 1087551 1071716 1056771 1043484 1029773 1017907 1005559 992268
5498I92268j5079j1365r543j0421r310j0739r783r198r656r567r627q364q598
$$ 992268 977189 965824 956281 945860 936550 925811 916028 906830 897174 887607 877980 869616 861018
5485H61018q320q129p076p540o934o860o996n734o288n812n737k482m711j144
$$ 861018 852698 844569 837493 829953 823019 816159 809163 803429 797141 791329 785592 783110 778399 777255
5471G77255j34K824N277P027q791j8397j5106j2217r864j1268o792o874p762o077
$$ 777255 777121 779945 785222 792249 783458 765061 749955 737738 727874 716606 709814 702940 695178 689101
5457F89101o201l891o673m224m935m046k609k759k403j208j166j131o55j530J63
$$ 689101 682900 679009 672336 668112 663177 659131 656522 653763 651360 650152 648986 647855 647200 645670 645833
5442F45833Q09K334M611N188O792J0551J2134J4655J8174K2726L2214M0554N5984
$$ 645833 646642 648976 653587 658775 665567 676118 688252 702907 721081 743807 776021 816575 872559
5429H72559P3670R4227J12032J18394K9213q4355r7309o2275l2713j6818K233
$$ 872559 946229 1040456 1152488 1270882 1300095 1215740 1118431 1056156 1023443 1006625 1008858
5418A008858K4570L7179N0776K9840k7330l2447m020K2415L9219N3104N2029o018
$$ 1008858 1033428 1070607 1121383 1151223 1123893 1091446 1087426 1109841 1149060 1202164 1254193 1248175
5406A248175o0835n9369k6985k606N056k9100o8208o4326m4465k7731j1038N509
$$ 1248175 1187340 1127971 1100986 1098380 1103436 1074336 1006128 941802 897337 869606 858568 864077
5394H64077K5654M3726N5531N1359j5999r1703j05132q4508o2997n0579l9002
$$ 864077 889731 933457 988988 1040347 1024348 932645 827513 743005 680008 629429 590427
5383E90427l2144k4392k2095j7543j8189j5413j4178j3282j0569r525j0646p600
$$ 590427 558283 533891 511796 494253 476064 460651 446473 433191 422622 413097 402451 394851
5371C94851q650p636p975o938o951m438p014n567o119m235m772o312l789m781
$$ 394851 386201 378565 370590 363652 356701 352263 345249 339682 333563 329328 324556 318244 314455 309674
5357C09674m731n075k937n471m298l978n404l175l265m061k295k250m607j674
$$ 309674 304943 299868 296931 291460 287162 283184 277780 274605 271340 267279 264984 262734 258127 256453
5343B56453m927l715m058k340k377n233k159j578l610k188k938k582j314l231
$$ 256453 251526 247811 243753 241413 239036 233803 231644 230066 226456 224268 221330 218748 217434 214203
5329B14203k539j899r52l767k582j997k308j230k987j582k114p49k541j658j791
$$ 214203 211664 209765 208813 205046 202464 200467 198159 196929 193942 192360 190246 189497 186956 185298 183507
5314A83507j850j967k936l087j479j933j781q85j821l077j244k848j632k002j505
$$ 183507 181657 179690 176754 173667 172188 170255 168474 167589 165768 162691 161447 158599 156967 154965 153460
5299A53460k610k454j236j154l54j225l24l00p18j163p40j109r62k578R5q86j579
$$ 153460 150850 148396 147160 146006 145652 144427 144103 143803 143085 141922 141182 140073 139111 136533 136628 135742 134163
5282A34163j544j060j080j08k161p74j180k137q10n15j589o61l63k748k28p98
$$ 134163 132619 131559 130479 130371 128210 127436 126256 124119 123309 122794 121205 120544 120181 117433 117205 116407
5266A16407o1k181m99l50l60k916p89l0j495j758l47j048j071k66j562j740J122
$$ 116407 116346 114165 113666 113316 112956 110040 109251 109221 107726 105968 105621 104573 103502 103236 101674 99934 101056
5249A01056k270j373m10n65j010j265q43k65l53o63j303p3j615m83j205k9n83
$$ 101056 98786 97413 97003 96438 95428 94163 93320 93055 92702 92039 90736 90663 89048 88565 87360 87331 86748
5232H6748k177l3l71j264r94M1j28j453Lj250j242N87m39j554Q55j311j032L67
$$ 86748 84571 84538 84167 82903 81909 81950 81822 80369 80372 79122 77880 78467 78028 76474 77329 76018 74986 75353
5214G5353r39n03K9j851J04M33q41r17j236l36q8p14m84p63m68o34j99j575M59
$$ 75353 74414 73911 73940 72089 72193 72626 71785 70868 69632 69296 69208 68494 68010 67247 66779 66145 65946 64371 64830
5195F4830R9j85m39k026K19J585k738R5l68k68p84K88j443j64j014Q79j540M95
$$ 64830 64929 64744 64305 62279 62498 64083 61345 61440 61072 60804 60020 60308 58865 58701 57687 58566 57026 57521
5177E7521q29l54p43m82k19Q33r98n40m00n76m86JK51J06P59k081k40N66n06O79
$$ 57521 56692 56338 55595 55113 54894 55727 54729 54189 53789 53213 52727 52728 52979 53085 53844 51763 51523 52089 51583 52262
5157E2262j193J439k591J90k98Q80J95j153r76J527q7o43n36N11k40R47j69l59
$$ 52262 51069 52508 49917 50107 49809 50689 50884 49731 48755 50282 50195 49552 49016 49527 49287 50234 50065 49706
5139D9706K68J123q75k83J343m15k76M85J822j284J275R17kJ148J116J955J937
$$ 49706 49974 51097 50222 49939 51282 50867 50591 51076 52898 51614 52889 53806 53804 54952 56068 58023 59960
5122E9960K728M614N619Q371Q240J3007Q420j2966j2483q685p268n241l255k114
$$ 59960 62688 67302 72921 81292 89532 102539 110959 97993 85510 76825 69557 64316 61061 58947
5108E8947r11p08r81j332m90J350j932K47j686J326j302N27k623j74k545n5o57
$$ 58947 58036 57328 56347 55015 54525 55875 53943 54190 52504 53830 52528 53055 50432 50258 47713 47658 47001
5091D7001l85j230K58N08n37j005M46p60M60N03r65P65J291p87q3k42m14j038
$$ 47001 46616 45386 45644 46152 45615 44610 45056 44296 44756 45259 44294 45059 46350 45563 45480 45238 44824 43786
5073D3786K170j70J89j79k56L78l29J147o68O35m22O90L20N16p93k00Q91m63J494
$$ 43786 45956 45786 45975 45796 45540 45918 45589 46736 46068 46703 46281 46971 47291 47807 47014 46814 47705 47242 48736
5054D8736o16J471n78k10k61P29k11J402l63Q89Q55r27O35k62J484P30K00O59
$$ 48736 48120 49591 49013 48803 48542 49271 49060 50462 50099 50988 51843 50916 51551 51289 52773 53503 53703 54362
5036E4362k34J039R05M01M99L85Q29J868O91K14P36P62J459P28M92J434j65P69
$$ 54362 54128 55167 56072 56473 56972 57357 58186 60054 60745 60959 61695 62457 63916 64644 65136 66570 66405 67174
5018F7174K732r58J526O26R35K758o49K271k71k82m3o7K215J305J805R45J971
$$ 67174 69906 68948 70474 71100 72035 74793 74144 76415 76144 75862 75819 75752 77967 79272 81077 82022 83993
5001H3993K173K715J790K213K410J514K795K965J242L373K093K348K920K200K983
$$ 83993 86166 88881 90671 92884 95294 96808 99603 102568 103810 107183 109276 111624 114544 116744 119727
4986A19727K088L201J079L362K264K814N356L468K654J725M523M363L765M099
$$ 119727 121815 125016 126095 129457 131721 134535 139891 143359 146013 147738 152261 156624 160389 164488
4972A64488M234N698M019N750M395P328M865R193O683P730O862Q371R126Q175
$$ 164488 168722 174420 178439 184189 188584 195912 200777 209970 216653 224383 231245 239616 248742 256917
4958B56917R405R056J0612J0668J3037J2503J3311J5296J6292J4952J8419K0906
$$ 256917 266322 275378 285990 296658 309695 322198 335509 350805 367097 382049 400468 421374
4946D21374K2915K5319K8045L0205L3779L8358M4172N0107N6989O4708P5563Q7220
$$ 421374 444289 469608 497653 527858 561637 599995 644167 694274 751263 815971 891534 978754
4934I78754J03160J18381J35219J49775J63420J63625J48657J07431M2535l4966
$$ 978754 1081914 1200295 1335514 1485289 1648709 1812334 1960991 2068422 2110957 2075991
4924B075991r9754j43005j54247j50434j39485j22414j02631r0037p4597o3118
$$ 2075991 1976237 1833232 1678985 1528551 1389066 1266652 1164021 1073984 999387 936269
4914I36269n4992m3045l7650l1074k4604j9161j4801r955p383m525k587j272o31
$$ 936269 881277 838232 800582 769508 744904 725743 710942 700987 693604 689079 686492 685220 684589
4901F84589J906K364M195N360Q247J2091J3549J6225J8369J6763J7593J5893J9595
$$ 684589 686495 688859 693054 698414 706661 718752 732301 748526 766895 783658 801251 817144 836739
4888H36739K6017L5157M1921M6037M5542M9571N8124P2414R6718J04604J32536
$$ 836739 862756 897913 939834 985871 1031413 1080984 1139108 1211522 1308240 1412844 1545380
4877A545380J61538J51040J68490K27591L15238M45700O54668Q78717J192499
$$ 1545380 1706918 1857958 2026448 2254039 2569277 3014977 3669645 4548362 5740861
4868E740861J647893J798766K630132l63850k829784k138953j367360r72437p55647
$$ 5740861 7388754 9187520 11817652 11453802 8624018 6485065 5117705 4145268 3389621
4859C389621n44937l80193k99396k28413j81717j40453j23845j22753j06267q3791
$$ 3389621 2844684 2464491 2165095 1936682 1754965 1614512 1490667 1367914 1261647 1177856
4849A177856p0644o6077n8500m9610m8179m3298l8634l3440k7749k7390k8649
$$ 1177856 1107212 1041135 982635 933025 884846 841548 802914 769474 741725 714335 685686
4838F85686k6950k4861k4627k1499j8825j9329j7726j6807j6975k0340j9360j6643
$$ 685686 658736 633875 609248 587749 568924 549595 531869 515062 498087 477747 458387 441744
4826D41744j3723j4647j3692j2193j1625j1598r755r509q520j0665q451j0828
$$ 441744 428021 413374 399682 387489 375864 364266 354511 345002 336482 325817 317366 306538
4814C06538j0630r218q139p949q027p268p139o194p024n669n667n952o256k570
$$ 306538 295908 286690 278551 270602 262575 255307 248168 241974 234950 229281 223614 217662 211406 208836
4800B08836o022l322n880l873n005m937l598p441o307n760n967m862m832l724
$$ 208836 202814 199492 193612 189739 184734 179797 176199 168758 162451 156691 150724 145862 141030 137306
4786A37306k520k622m298m094m158l404k491k255k587l426k743k556l252j552
$$ 137306 134786 132164 127866 123772 119614 116210 113719 111464 108877 105451 102708 100152 96900 95348
4772I5348m214j516l162j387j712j528j327r70j598k641j068j530j750k282n46
$$ 95348 91134 89618 86456 85069 83357 81829 80502 79532 77934 75293 74225 72695 70945 68663 68117
4757F8117j249k181p70k344m96j191k355m99q30j856j795j341o30j042l32j621
$$ 68117 66868 64687 63917 61573 61077 59886 57531 57032 56202 54346 52551 51210 50580 49538 49206 47585
4741D7585q78j802o64k37k196o38j299K60k035n56r60J052j217p75o18n22r73
$$ 47585 46707 44905 44241 44004 41808 41170 39871 40131 38096 37540 36580 37632 36415 35640 35022 34500 33527
4724C3527o24q08k627k874n58n7j120m1K84j200j478q23M66j461j553L02m22j914
$$ 33527 32903 32095 29468 26594 26036 25979 24859 24818 25102 23902 22424 21601 22067 20606 19053 19355 18933 17019
4706A7019k56l82q23p91j917r7Q71J011o31j7m09r72J471q64K77j099j64K06j758
$$ 17019 16763 16381 15558 14767 12850 12753 13624 14635 14004 13987 13578 12606 14077 13213 13490 12391 12227 12433 10675
4687A0675J124q76j114M44m64r70O27L57j085J142j56j22j627J32Rj119N4m02
$$ 10675 11799 10923 9809 10253 9789 8819 9446 9803 8718 9860 9704 9582 7955 8087 8096 6977 7031 6629
4669F629N26j208P70n35p00M41N34j989K5J185m26L41l42j039k59M40o68r60K38
$$ 6629 7155 5947 6717 6182 5482 5923 6457 4468 4493 5678 5252 5593 5251 4212 3953 4393 3725 2765 3003
4650C003L15k43Q97n01j20j70k47J4n13P70l52M22j033k31R33m49M07P11j516
$$ 3003 3318 3075 3972 3471 3351 3181 2934 2948 2435 3205 2853 3275 2242 2011 2944 2495 2902 3613 2097
4631B097R45r38J149J09M69K11J108L84k00J152J080J458K224L201L566O092P869
$$ 2097 3042 2104 3253 3362 3831 4042 5150 5534 5334 6486 7566 9024 11248 14449 18015 24107 31976
4614C1976R481J3767L018j4573j1542q585p269m334l189j889j753j887p54q01
$$ 31976 41457 55224 58242 43669 32127 23542 16273 11939 8750 6861 5108 3221 2467 1666
4600A666j226l67r00q72m79j049l89L9K87j366J79l55j04j239Q58n82K29j526
$$ 1666 440 73 -827 -1699 -2178 -3227 -3616 -3577 -3290 -4656 -4477 -4832 -4936 -6175 -5317 -5899 -5670 -7196
4582g196k0j36N06j095L20p81j51j48k87J44l48N29jj605N39p9n70N13J34p90
$$ -7196 -7216 -7352 -6846 -7941 -7621 -8402 -8553 -8701 -8988 -8844 -9192 -8663 -8664 -10269 -9730 -9809 -10379 -9866 -9732 -10522
4562a0522j01J56O01j518l32P98q32M1l78r4O09p79L31L38j477Q90j20m69M40
$$ -10522 -10623 -10467 -9866 -11384 -11716 -10918 -11750 -11709 -12087 -12181 -11572 -12351 -12020 -11682 -13159 -12269 -12389 -12858 -12418
4543a2418o02L6j99Q5m18n2k95K59P37m59L27J35J6m08K95r21K77Q50l04o23k83
$$ -12418 -13020 -12984 -13183 -13098 -13516 -13568 -13863 -13604 -12867 -13326 -12999 -12864 -12848 -13256 -12961 -13882 -13605 -12755 -13059 -13682 -13965
4522a3965l76J925p30p88O74j49k4j131R20J217l21J424q74J727j68J313J490
$$ -13965 -14341 -12416 -13146 -13934 -13260 -13409 -13433 -14564 -13644 -12427 -12748 -11324 -12198 -10471 -10639 -9326 -7836
4505g836J586o05j360o94j386q18N81q77P4j052j77L50p91Q28n31j454Q81l21
$$ -7836 -6250 -6855 -8215 -8909 -10295 -11113 -10532 -11409 -11335 -12387 -12564 -12214 -13005 -12177 -12708 -14162 -13281 -13602
4487a3602P64j153N65n01r21J099m14j60j047L14l80l79Q54J218j02o27Q64k182
$$ -13602 -12838 -13991 -13426 -13927 -14848 -13749 -14163 -14323 -15370 -15056 -15436 -15815 -14961 -13743 -13845 -14472 -13608 -15790
4469a5790O05L87r04J99o18j281J211M31l42n54o06J073M10k148K469r28q5n97
$$ -15790 -15185 -14798 -15702 -15503 -16121 -17402 -16191 -15760 -16102 -16656 -17262 -16189 -15779 -17927 -15458 -16386 -16471 -17068
4451a7068l90O45J74j1J080j268K471m26J930R52O78r87j427j425q43o35J66q39
$$ -17068 -17458 -16813 -16639 -16650 -15570 -16838 -14367 -14793 -12863 -11911 -11233 -12220 -13647 -15072 -15915 -16550 -16384 -17223
4433a7223N42m72q05J55M40o31o82P62p28j43Q01l7q7j049J06K93M36nm69J054
$$ -17223 -16681 -17153 -17958 -17803 -17363 -17994 -18676 -17914 -18642 -18785 -17984 -18021 -18108 -19157 -19051 -18758 -18322 -18327 -18796 -17742
4413a7742j543N50M9M14N85r37O11M84J1L32j43P99q79Q69J060J528R31K427K334
$$ -17742 -19285 -18735 -18686 -18272 -17687 -18624 -18013 -17529 -17518 -17186 -17329 -16530 -17409 -16540 -15480 -13952 -13021 -10594 -8260
4394h260M052j899l568k245p21l169n39L07j971j01J51J75j655M81l32J47o67
$$ -8260 -4208 -6107 -9675 -11920 -12641 -15810 -16349 -16042 -18013 -18114 -17963 -17788 -19443 -18962 -19294 -19147 -19814
4377a9814R05q19k48o31J138j171P72j98P49n97J020j609m21M57J00m81L23M16
$$ -19814 -18909 -19728 -19976 -20607 -19469 -20640 -19868 -20066 -19317 -19914 -18894 -20503 -20924 -20467 -20367 -20848 -20525 -20109
4359b0109r1Q29j514M41j35k78o86N01L16K88Q10n46N22p05k4n77O00n25J93j50
$$ -20109 -20200 -19371 -20885 -20444 -20579 -20857 -21543 -21042 -20726 -20438 -19628 -20174 -19652 -20357 -20381 -20958 -20358 -20883 -20690 -20840
4339b0840o43Q54Q9jl98r26N15O94L12o49P04P8j080n78K030n10p64L56J122p86
$$ -20840 -21483 -20629 -20540 -20541 -20939 -21865 -21350 -20656 -20344 -20993 -20289 -20211 -21291 -21869 -19839 -20349 -21113 -20757 -19635 -20421
4319b0421l20n23O56J57k45J61K36l73j70M34k98r00J390j31l2M09M9ko25P22
$$ -20421 -20741 -21264 -20608 -20451 -20696 -20535 -20299 -20672 -20842 -20408 -20706 -21606 -20216 -20347 -20379 -19970 -19921 -19923 -20548 -19826
4299a9826K46N38l44p00n73j128J521O70L03k036R03N51k20L29N63n37K80n32
$$ -19826 -19580 -19042 -19386 -20086 -20659 -21787 -20266 -19596 -19293 -21329 -20426 -19875 -20095 -19766 -19203 -19740 -19460 -19992
4281a9992n63N04L90P67J93p54j22L54l48K23M33M07L74j585J300k07r20N01k8
$$ -19992 -20555 -20051 -19661 -18894 -18701 -19455 -19577 -19223 -19571 -19348 -18915 -18508 -18134 -19719 -18419 -18626 -19546 -19045 -19073
4262a9073L73J139j725J159r47K51P20m56q0j51M06J260r48N99J42o64l81K25
$$ -19073 -18700 -17561 -19286 -18127 -19074 -18823 -18103 -18559 -18639 -18790 -18384 -17124 -18072 -17473 -17331 -17995 -18376 -18151
4244a8151l39J028o71p62J985m42r29K79l80J376p80J23j53l27k44J191n99J290
$$ -18151 -18490 -17462 -18133 -18895 -16910 -17352 -18281 -18002 -18382 -17006 -17786 -17663 -17816 -18143 -18387 -17196 -17795 -16505
4226a6505q93l78m83J232n61K73OR5o7M80j296j50N26R14o74J4K7N29J13o02R46
$$ -16505 -17398 -17776 -18259 -17027 -17588 -17315 -17309 -17214 -17281 -16801 -18097 -18247 -17721 -16807 -17481 -17467 -17440 -16911 -16798 -17400 -16454
4205a6454n15K89k37J7j054O94k3J42N28j364J020M14r21O20L07o16J71J421j159
$$ -16454 -16969 -16680 -16917 -16900 -17954 -17260 -17283 -17141 -16613 -17977 -16957 -16543 -17464 -16844 -16537 -17153 -16982 -15561 -16720
4186a6720m1J03P27j845M56N69J49J058j183l85J692j957R48N63q94J121q76P06
$$ -16720 -16761 -16658 -15931 -17776 -17320 -16751 -16602 -15544 -16727 -17112 -15420 -17377 -16429 -15866 -16760 -15639 -16515 -15809
4168a5809R2p64L54j186J065k99j1n0j42R58K17j098O23L42l55P13j154Q20P25
$$ -15809 -15717 -16481 -16127 -17313 -16248 -16547 -16558 -16608 -16750 -15792 -15575 -16673 -16050 -15708 -16063 -15350 -16504 -15684 -14959
4149a4959p34J80O80k9K72L14n82J167j25J0j576N21O95l87P00L38p58L07l65
$$ -14959 -15693 -15513 -14833 -14862 -14590 -14276 -14858 -13691 -13816 -13806 -15382 -14861 -14166 -14553 -13853 -13515 -14273 -13966 -14331
4130a4331O92K66K24M85j72l42J602p65k48j38K36J410n58N93o52l06O27J17j99
$$ -14331 -13639 -13373 -13149 -12664 -12836 -13178 -11576 -12341 -12589 -12727 -12491 -11081 -11639 -11046 -11698 -12004 -11377 -11260 -11459
4111a1459R13r18Nm41j345M58J026o26Q73p46Q27j68j00Q71L02O1P95R2l68r11
$$ -11459 -10546 -11464 -11459 -11900 -13245 -12787 -11761 -12387 -11514 -12260 -11433 -11601 -11701 -10830 -10528 -10467 -9672 -9580 -9948 -10859
4091a0859p27L42Q55N54J193j847k16j091J108o88J634Q18J06r24j423p89J698
$$ -10859 -11586 -11244 -10389 -9835 -8642 -10489 -10705 -11796 -10688 -11376 -9742 -8924 -8818 -9742 -11165 -11954 -10256
4074a0256m71J550J10j650j376P23p81K391P6J148l34p63j448r0J054p1K686j246
$$ -10256 -10727 -9177 -9067 -10717 -12093 -11370 -12151 -9760 -9684 -8536 -8870 -9633 -11081 -11171 -10117 -10188 -7502 -8748
4056h748p73L00k066M56J883Q40j60m31j551k78Q89m35Q27O43R30k323N52O53
$$ -8748 -9521 -9221 -11287 -10831 -8948 -8108 -8268 -8699 -10250 -10528 -9639 -10074 -9247 -8604 -7674 -9997 -9445 -8792
4038h792Q0Q45j047m32j51O99L60M78R1N24n91j303l32J531J613p33K72j74MQ08
$$ -8792 -8712 -7867 -8914 -9346 -9497 -8798 -8438 -7960 -7869 -7345 -7936 -9239 -9571 -8040 -6427 -7160 -6888 -7062 -7058 -6250
4018f250j184L022Q76k59k307R27j43O70L21N1O13n93j340L56M56J391M98k91
$$ -6250 -7434 -4412 -3536 -3795 -6102 -5175 -5318 -4648 -4327 -4276 -3663 -4256 -5596 -5240 -4784 -3393 -2895 -3186
4000c186o62M87p2J061J104k13J582O12n80j1O6J461O70Q61N1K49J278j605J062
$$ -3186 -3848 -3361 -3433 -2372 -1268 -1481 101 713 133 122 188 1649 2319 3180 3231 3480 4758 3153 4215
3981D215M24R44R98r9J124J019q96J932J911J011R48K146K860K208L446M165M603
$$ 4215 4639 5583 6581 6482 7606 8625 7729 9661 11572 12583 13531 15677 18537 20745 24191 28356 32959
3964C2959P420R134J0536J4372J0661o527j3206j2104p690n964m576j676k380
$$ 32959 40379 49513 60049 74421 85082 78555 65349 53245 45555 39591 35015 33339 30959
3951C0959j652m01j28J423p1P42P09k16K694J646N315M218N606P391R887J1395
$$ 30959 29307 28906 28778 30201 30130 30872 31581 31365 34059 35705 41020 45238 50844 58235 68122 79517
3935G9517J3117L792j1311j3170j0786o101m663m293j535j404j188l04j145K80
$$ 79517 92634 96426 85115 71945 61159 55058 50395 46102 44567 43163 41975 41671 40526 40806
3921D0806k03j339J730R44J844J06L74P55J606Q38O06J309J815J644O43kK037
$$ 40806 40603 39264 40994 41938 43782 43888 44262 45017 46623 47461 48067 49376 51191 52835 53478 53476 55513
3904E5513J755K787N46K404J703K165N30M092J673L628L052K301L832N233M487
$$ 55513 57268 60055 60601 63005 64708 66873 67403 71495 73168 76796 79848 82149 85981 91214 95701
3889I5701M400M439N966N879Q045P718R313R583J1418J4910J7623J9277K2290
$$ 95701 100101 104540 110506 116385 124430 132148 141461 151044 162462 177372 194995 214272 236562
3876B36562K7985K9802L4992K9892J4301j029k3068l4101l4187l1400k5679j9398
$$ 236562 264547 294349 329341 359233 373534 372505 349437 315336 281149 249749 224070 204672
3864B04672j6370j2713r982q003m820l370j756J374M454O383M632l837m417l463
$$ 204672 188302 175589 165607 157604 152784 149414 147658 149032 153486 159869 164501 160664 156247 152784
3850A52784j0258j1543j0802p848o235m958m408o485p951l653n410k423m013k889
$$ 152784 142526 130983 120181 112333 106098 101140 96732 90247 82296 78643 73233 70810 66797 63908
3836F3908j977k111j415o91j804j314j280K77o53R4j796O97j378n88k209k023
$$ 63908 61931 59820 58405 57714 55910 54596 53316 53593 52940 53034 51238 51935 50557 49969 47760 45737
3820D5737j730j666q7j265k645j575r37j028j288q94r82M4l53j203R81N39m69
$$ 45737 44007 42341 42254 40989 38344 36769 35832 34804 33516 32622 31640 31684 31331 30128 31109 31648 31179
3803C1179J18j224O20l92J431Q77L451L981M725N221M089l683o545o332l232l624
$$ 31179 31297 30073 30693 30301 31732 32609 36060 40041 44766 49987 54076 50393 43848 37516 34284 30660
3787C0660k170q30j343k14k530m2m89L17M74j243J422q3J907R79K19J710L400
$$ 30660 28490 27660 26317 26103 23573 23531 23042 23359 23833 22590 24012 23929 25836 26815 27034 28744 32144
3770C2144N007P556J0256R364J2577L796j1941j3970j0832n634n662l661j634
$$ 32144 37151 44707 54963 64327 76904 80700 68759 54789 43957 38323 32661 29000 27366
3757B7366k739k098j837P67r03n99m82l5M84Q87J498J549J31M275L673M450O583
$$ 27366 24627 22529 20692 21459 20556 19957 19475 19440 19924 20811 22309 23858 23989 28264 31937 36387 42970
3740D2970J0588R664J4292j716j6582j4030p286p300m111l031l021r07k390l5
$$ 42970 53558 63222 77514 75798 59216 45186 37900 30600 26489 23458 20437 19530 17140 17105
3726A7105j522j227J31j21P88j488O54J569K792K934N159M211P476M7r125p711
$$ 17105 15583 14356 14487 14366 15154 13666 14320 15889 18681 21615 26774 30985 38461 38508 29383 21672
3710B1672m932l036l209k702r70j436o37j39j592r65m77j258q56j090M85j125
$$ 21672 16740 13704 10495 7793 6823 5387 4750 4611 3019 2054 1577 319 -537 -1627 -1142 -2267
3694b267j84p88j490L02r63J239p85q26m91j257P85RJ05r55J15K27p13j09K72
$$ -2267 -2451 -3239 -4729 -4427 -5390 -4151 -4936 -5762 -6253 -7510 -6725 -6716 -6611 -7566 -7451 -7224 -7937 -8046 -7774
3675g774j20j248J132q46o58J051j092M04m82o69l97K64R11j592J121kj44k2j8
$$ -7774 -7894 -9142 -8010 -8856 -9514 -8463 -9555 -9151 -9633 -10302 -10699 -10435 -9524 -11116 -9995 -9997 -10141 -10163 -10181
3656a0181J180j378M40J412j484K50q95J050k11J301Rk10n71L04K51K85J107p50
$$ -10181 -9001 -10379 -9939 -8527 -10011 -9761 -10656 -9606 -9817 -8516 -8507 -8717 -9288 -8984 -8733 -8448 -7341 -8091
3638h091J2N14j94L64O29L81l80P75j08l85Q35K00%n94K590j297K333r68O80J67
$$ -8091 -8079 -7565 -7759 -7395 -6766 -6385 -6765 -5990 -6098 -6483 -5648 -5448 -5448 -6042 -3452 -4749 -2416 -3384 -2704 -2537
3618b537J548k63P98j612J15J046J12J2N95J237O53N1J470N41O80J660r06M45
$$ -2537 -989 -1252 -454 -2066 -1951 -905 -793 -781 -186 1051 1704 1755 3225 3766 4446 6106 5200 5645
3600E645M86q5J203q51K423k16Q21J989J608L34K956P65J033n59J229O75K95j012
$$ 5645 6131 6046 7249 6398 8821 8605 9426 11415 13023 13357 16313 17078 18111 17552 18781 19456 19751 18739
3582A8739J520O46J692J078J170J750K999K301J543K057L57J90J438J992K198
$$ 18739 20259 20905 22597 23675 24845 26595 29594 31895 33438 35495 35852 36042 37480 39472 41670
3567D1670K826K797K255K188J970J428K60k376j254m26j426j996l06m83o7j819
$$ 41670 44496 47293 49548 51736 53706 55134 55394 53018 51764 51338 49912 47916 47610 47127 47060 45241
3551D5241k88p31J52l13Rr7J20J098L63m32O13j877K98j638j050n93j004j122
$$ 45241 44953 44222 44374 44061 44070 43973 44093 45191 45554 45122 45735 43858 44156 42518 41468 40875 39871 38749
3533C8749o02j289j651j638j386k182j949j210k145k347j887k361j936r35j922
$$ 38749 38147 36858 35207 33569 32183 30001 28052 26842 24697 22350 20463 18102 16166 15231 13309
3518A3309l222j148J62j971j290j172j198k99j419m95j982p65n03q04M1j800k17
$$ 13309 10087 8939 9101 7130 5840 4668 3470 3171 1752 1257 -725 -1490 -1993 -2797 -2756 -4556 -4773
3501d773k48j915r45l33N3q92p70R19j141r47k28p85J714k526R26j678m85j260
$$ -4773 -5021 -6936 -7881 -8214 -8161 -9053 -9823 -8904 -10045 -10992 -11220 -12005 -10291 -12817 -11891 -13569 -14054 -15314
3483a5314J012k086N54k39j062O23k21j060o66j85o4q04M91q19Q5n4j066J80k95
$$ -15314 -14302 -16388 -15834 -16073 -17135 -16512 -16733 -17793 -18459 -18644 -18708 -19512 -19021 -19840 -19755 -19809 -20875 -20695 -20990
3464b0990J71j062J82O9M80j165l90q24Q09n09q10J212j268m01k43P7k95k47K42
$$ -20990 -20819 -21881 -21699 -21630 -21150 -22315 -22705 -23529 -22720 -23229 -24039 -22827 -24095 -24496 -24739 -24662 -24957 -25204 -24962
3445b4962j018M34j387R81j73r33N50j680J583r51L27l3m6n72L41j45q12N24n94
$$ -24962 -25980 -25546 -26933 -25952 -26125 -27058 -26508 -28188 -26605 -27556 -27229 -27262 -27308 -27880 -27539 -27684 -28496 -27972 -28566
3426b8566P27j328Q36J83k40k23N34q44n05M18j57o36J075j096M95p03O17m12
$$ -28566 -27839 -29167 -28331 -28148 -28388 -28611 -28077 -28921 -29426 -29008 -29165 -29801 -28726 -29822 -29327 -30030 -29413 -29825
3408b9825J44K5j060R12j00N6l11L0r0j64M7j7o97J311j315P12L76j076m63N24
$$ -29825 -29681 -29656 -30716 -29804 -29904 -29848 -30159 -30129 -30219 -30383 -30336 -30353 -31050 -29739 -31054 -30342 -29966 -31042 -31505 -30981
3388c0981n68M28l33j008J946o43o77l88J35n58j10J251K5o75L5K89n99j75P22
$$ -30981 -31549 -31121 -31454 -32462 -30516 -31159 -31836 -32224 -32089 -32647 -32757 -31506 -31481 -32156 -32121 -31832 -32431 -32606 -31884
3369c1884o54O96m0p57k85L47J224j165N66k40P77m81p67k01N69p81o85J638r90
$$ -31884 -32538 -31842 -31882 -32639 -32924 -32577 -31353 -32518 -31952 -32192 -31415 -31896 -32663 -32864 -32295 -33076 -33761 -32123 -33113
3350c3113J71J59k54K73L7N03q58L32l89o47M73p61L4R0J87N02J86M30m78k10
$$ -33113 -32942 -32783 -33037 -32764 -32727 -32224 -33082 -32750 -33139 -33786 -33313 -34074 -34040 -33950 -33763 -33261 -33075 -32645 -33123 -33333
3330c3333j72p01j83J556O16n95q55R14J56l27J6o26N23o46M90r41J122j763K006
$$ -33333 -33505 -34206 -34389 -32833 -32217 -32812 -33667 -32753 -32597 -32924 -32908 -33534 -33011 -33657 -33167 -34108 -32986 -34749 -32743
3311c2743j320o4K63J62K82N34j023P32o12P6p08Q02N1K78n44k22q51J32N07m14
$$ -32743 -34063 -34127 -33864 -33702 -33420 -32886 -33909 -33177 -33789 -33713 -34421 -33619 -33568 -33290 -33834 -34056 -34907 -34775 -34268 -34682
3291c4682K96M00L32p72N88r68l3J019O8J0k30q00n75N1Q02k28j85P37n55j359
$$ -34682 -34386 -33986 -33654 -34426 -33838 -34806 -34839 -33820 -33752 -33742 -33972 -34772 -35347 -35296 -34494 -34722 -34907 -34170 -34725 -36084
3271c6084k4J433O64j90J92l70O59j240P76K69j172J027L51j495K66l67m52R59
$$ -36084 -36108 -34675 -34011 -34201 -34009 -34379 -33720 -34960 -34184 -33915 -35087 -34060 -33709 -35204 -34938 -35305 -35757 -34798
3253c4798P50J9Kj175l55J176k74M83N66m47m08J58l18L04Q5n57J3j417O71O91
$$ -34798 -34048 -34029 -34027 -35202 -35557 -34381 -34655 -34172 -33606 -34053 -34461 -34303 -34621 -34317 -34232 -34789 -34776 -36193 -35522 -34831
3233c4831K70p61M96K35o28J50R0m41J539j858M79J57Q61j118K80k17m23N42O19
$$ -34831 -34561 -35322 -34826 -34591 -35219 -35069 -34979 -35420 -33881 -35739 -35260 -35103 -34242 -35360 -35080 -35297 -35720 -35178 -34559
3214c4559k32r51K7K48R1Q84n92Q5L7j266P29o91Q08M11J37j43N11q90m75R6j7
$$ -34559 -34791 -35742 -35715 -35467 -35376 -34492 -35084 -34999 -34962 -36228 -35499 -36190 -35382 -34971 -34834 -34977 -34466 -35356 -35831 -35735 -35752
3193c5752m3N21J286K74q53r65o13K63J525q13K61J47l49j97P20j056M53M83m42
$$ -35752 -35795 -35274 -33988 -33714 -34567 -35532 -36145 -35882 -34357 -35170 -34909 -34762 -35111 -35308 -34588 -35644 -35191 -34708 -35150
3174c5150P58m55L60k72J88j107Q72j586o2J165m52j89l9L46n25M12M89o83R2
$$ -35150 -34392 -34847 -34487 -34759 -34571 -35678 -34806 -36392 -36454 -35289 -35741 -35930 -35969 -35623 -36148 -35736 -35247 -35930 -35838
3155c5838J36L95k41j320J632l20j33R69j830N06m33O50L15k8k98K11j82j16l6
$$ -35838 -35702 -35307 -35548 -36868 -35236 -35556 -35689 -34720 -36550 -36044 -36477 -35827 -35512 -35540 -35838 -35627 -35809 -35925 -35961
3136c5961P89K73j161Q23p29p60J54Q53m41k37O13R69j693O18r15J048j57j057
$$ -35961 -35172 -34899 -36060 -35237 -35966 -36726 -36572 -35719 -36160 -36397 -35784 -34815 -36508 -35890 -36805 -35757 -35914 -36971
3118c6971Q91L87J315j514L60j084Q55N76N75p52J76j001J013r61K45N71o52J180
$$ -36971 -36080 -35693 -34378 -35892 -35532 -36616 -35761 -35185 -34610 -35362 -35186 -36187 -35174 -36135 -35890 -35319 -35971 -34791
3100c4791r49p23N78lJ44J051j586O07l31k48p02M6J437Q07j809O61r38J418l96
$$ -34791 -35740 -36463 -35885 -35888 -35744 -34693 -36279 -35672 -36003 -36251 -36953 -36907 -35470 -34663 -36472 -35811 -36749 -35331 -35727
3081c5727m98J165L13l34q01o29o6Q74q43K161j366Q3p93j29N46j99q80J043P43
$$ -35727 -36225 -35060 -34747 -35081 -35882 -36511 -36577 -35703 -36546 -34385 -35751 -35668 -36461 -36590 -36044 -36243 -37123 -36080 -35337
3062c5337p66L75j07o02Q49L6n93M7J13j30n47J887j114j424M95Q91k80l12r65
$$ -35337 -36103 -35728 -35835 -36437 -35588 -35552 -36145 -36098 -35985 -36115 -36662 -34775 -35889 -37313 -36818 -35927 -36207 -36519 -37484
3043c7484J464j018J226o86j35Q49o96O24m65P88l23j434P33M48K15n69K28l21
$$ -37484 -36020 -37038 -35812 -36498 -36633 -35784 -36480 -35856 -36321 -35533 -35856 -37290 -36557 -36109 -35894 -36463 -36235 -36556
3025c6556R74j256M59L14j023J060Q28l94j145J271q09Q88m71M91k14n55M82Q72
$$ -36556 -35582 -36838 -36379 -36065 -37088 -36028 -35200 -35594 -36739 -35468 -36277 -35389 -35860 -35369 -35583 -36138 -35656 -34784
3007c4784j159J96J6P41l82K76n93J39M10n02m7O10j308N30q35P21p68J049J16
$$ -34784 -35943 -35747 -35731 -34990 -35372 -35096 -35689 -35550 -35140 -35642 -35689 -35079 -36387 -35857 -36692 -35971 -36739 -35690 -35574
2988c5574L35p48p59J187j12n9J262j129l19N10J77L3n98k4L66J37m09P29N47
$$ -35574 -35239 -35987 -36746 -35559 -35671 -35730 -34468 -35597 -35916 -35406 -35229 -35196 -35794 -35818 -35452 -35315 -35724 -34995 -34448
2969c4448N9k84K02O16m6n23O16O94q30M43P77m21j1K58l10J118J11K92J042k3
$$ -34448 -34389 -34673 -34471 -33855 -33901 -34424 -33808 -33114 -33944 -33501 -32724 -33145 -33156 -32898 -33208 -32090 -31979 -31687 -30645 -30668
2949c0668J570J756K785K705M009J101Q9l437k174k709k019j464j046r35j005
$$ -30668 -29098 -27342 -24557 -21852 -17843 -16742 -16653 -20090 -22264 -24973 -26992 -28456 -29502 -30437 -31442
2934c1442j28p05k15o09L82j103N32o54o73J91J140q35o24l31Q31p74J208q34
$$ -31442 -31570 -32275 -32490 -33099 -32717 -33820 -33288 -33942 -34615 -34424 -33284 -34119 -34743 -35074 -34243 -35017 -33809 -34643
2916c4643Q67q59j18k4j243J457K70o74o23M96r94Q87q42J94K86n29K59l83K70
$$ -34643 -33776 -34635 -34753 -34777 -36020 -34563 -34293 -34967 -35590 -35094 -36088 -35201 -36043 -35849 -35563 -36092 -35833 -36216 -35946
2897c5946p02Q13P53j673J319m56p72J090q12L52K83l09q69M82M78j036K73N65
$$ -35946 -36648 -35835 -35082 -36755 -35436 -35892 -36664 -35574 -36386 -36034 -35751 -36060 -36929 -36447 -35969 -37005 -36732 -36167
2879c6167l25o77Q35q99r6N00J72M74J16L77q77l75P81q61p80J851q17m42Q24
$$ -36167 -36492 -37169 -36334 -37233 -37329 -36829 -36657 -36183 -36067 -35690 -36567 -36942 -36161 -37022 -37802 -35951 -36768 -37210 -36386
2860c6386j071k53J046o65p30J434k68r57O40N12N94j470J624j239r2l02N54m10
$$ -36386 -37457 -37710 -36664 -37329 -38059 -36625 -36893 -37850 -37210 -36698 -36104 -37574 -35950 -37189 -37281 -37583 -37029 -37439
2842c7439Q68L02j047O55L09J05k47j102Q71j076J056M02j49l83M06j269J871
$$ -37439 -36571 -36269 -37316 -36661 -36352 -36247 -36494 -37596 -36725 -37801 -36745 -36343 -36492 -36875 -36469 -37738 -35867
2825c5867j598j96O72L4K42l33l48N0L04M14N8j84L61o08K72j42j45Q6q56J61
$$ -35867 -37465 -37661 -36989 -36955 -36713 -37046 -37394 -37344 -37040 -36626 -36568 -36752 -36391 -36999 -36727 -36869 -37014 -36928 -37784 -37623
2805c7623L98q85K99J050j662J266K17j049J022j55M38j081J00J120j059q7P16
$$ -37623 -37225 -38110 -37811 -36761 -38423 -37157 -36940 -37989 -36967 -37122 -36684 -37765 -37665 -36545 -37604 -37691 -36975
2788c6975j98O24l81j62J78J196j562K05r64J391o75N97m2j285M86m11M13M14
$$ -36975 -37173 -36549 -36930 -37092 -36914 -35718 -37280 -37075 -38039 -36648 -37323 -36726 -36768 -38053 -37567 -37978 -37565 -37151
2770c7151J54k89k40N82J36r50M39N22p61K72N38p56K78M52n92om42Q85k32O47
$$ -37151 -36997 -37286 -37526 -36944 -36808 -37758 -37319 -36797 -37558 -37286 -36748 -37504 -37226 -36774 -37366 -37372 -37814 -36929 -37161 -36514
2750c6514j534J115j089J118o05L74n44M4k81l5J03O68m17n79Q01J165q62l66
$$ -36514 -38048 -36933 -38022 -36904 -37509 -37135 -37679 -37635 -37916 -37951 -37848 -37180 -37597 -38176 -37375 -36210 -37072 -37438
2732c7438L98N27k59p67N2n84L56k19k34L65N43o54k90O67K52o05J18M11k91q93
$$ -37438 -37040 -36513 -36772 -37539 -37487 -38071 -37715 -37934 -38168 -37803 -37260 -37914 -38204 -37537 -37285 -37890 -37772 -37361 -37652 -38545
2712c8545L32P34L36o56M62l08P9J74k19RO25p27J87O81n55L00j103J404j283
$$ -38545 -38213 -37479 -37143 -37799 -37337 -37645 -37566 -37392 -37611 -37602 -36977 -37704 -37517 -36836 -37391 -37091 -38194 -36790 -38073
2693c8073j59O91q1j54q92j68p3O31K76Q64k41l47L25m2p40J76K16l04J131n25
$$ -38073 -38232 -37541 -37622 -37776 -38668 -38836 -38909 -38278 -38002 -37138 -37379 -37726 -37401 -37443 -38183 -38007 -37791 -38095 -36964 -37489
2673c7489p31R28j120M59m78L8k50J1K19L9J41L29p99L08N8L88l97M61j016P44
$$ -37489 -38220 -37292 -38412 -37953 -38431 -38393 -38643 -38632 -38413 -38374 -38233 -37904 -38703 -38395 -38337 -37949 -38346 -37885 -38901 -38157
2653c8157n43K70K27M89j82K36P3j458M99J74Q8K62M78j089j42Q62j200J310q95
$$ -38157 -38700 -38430 -38203 -37714 -37896 -37660 -37587 -39045 -38546 -38372 -38284 -38022 -37544 -38633 -38775 -37913 -39113 -37803 -38698
2634c8698K54q3o32J273O52j085J64k84J74o11Q31J45j675J685L42j596O28Q93
$$ -38698 -38444 -38527 -39159 -37886 -37234 -38319 -38155 -38439 -38265 -38876 -38045 -37900 -39575 -37890 -37548 -39144 -38516 -37623
2616c7623M76o70j195N03K09q91J069N75p22M49N3j46r48L68N69P41n63L64o09
$$ -37623 -37147 -37817 -39012 -38509 -38300 -39191 -38122 -37547 -38269 -37820 -37767 -37913 -38861 -38493 -37924 -37183 -37746 -37382 -37991
2597c7991o78K85p89R22J078o0j230L18N84o80J549j145q2J16j219k09O99O33
$$ -37991 -38669 -38384 -39173 -38251 -37173 -37233 -38463 -38145 -37561 -38241 -36692 -37837 -37919 -37803 -39022 -39231 -38532 -37899
2579c7899n48J428k37r74m23k84L96J018R7K21l99j679M62J28J125l63k49M41
$$ -37899 -38447 -37019 -37256 -38230 -38653 -38937 -38541 -37523 -37426 -37205 -37604 -39283 -38821 -38693 -37568 -37931 -38180 -37739
2561c7739n54O73r89K21K34N99k37j245J666m17J26L44p35n61M66j476K032K73
$$ -37739 -38293 -37620 -38609 -38388 -38154 -37555 -37792 -39037 -37371 -37788 -37662 -37318 -38053 -38614 -38148 -39624 -37592 -37319
2543c7319M26j778P67O14j16k49j76J05l18l33j71k72O84M14j34n6L98n90P29
$$ -37319 -36893 -38671 -37904 -37290 -37406 -37655 -37831 -37726 -38044 -38377 -38548 -38820 -38136 -37722 -37856 -37912 -37514 -38104 -37375
2524c7375J63r56L19Q54o58J41N17n16L99L50l52l86p66J117j548L54m4J094J94
$$ -37375 -37212 -38168 -37849 -36995 -37653 -37512 -36995 -37511 -37112 -36762 -37114 -37500 -38266 -37149 -38697 -38343 -38387 -37293 -37099
2505c7099r4O48j381j34J029o4r70O39K0n51L30j383J046m9L74K31j201J46l7
$$ -37099 -37193 -36545 -37926 -38060 -37031 -37095 -38065 -37426 -37406 -37957 -37627 -39010 -37964 -38013 -37639 -37408 -38609 -38463 -38500
2486c8500O58J125l13k66p89K61L22p03J55J73R81j057L62M27l0n35l85J029j255
$$ -38500 -37842 -36717 -37030 -37296 -38085 -37824 -37502 -38205 -38050 -37877 -36896 -37953 -37591 -37164 -37194 -37729 -38114 -37085 -38340
2467c8340L57k5K73m84J153L68r70n9M59M73j147j59J019k03p07m39J080j286
$$ -38340 -37983 -38008 -37735 -38219 -37066 -36698 -37668 -37727 -37268 -36795 -37942 -38101 -37082 -37285 -37992 -38431 -37351 -38637
2449c8637N47N42O48j276J219r67m42L67K38J191j819N98l04M00L56n17Q68R0
$$ -38637 -38090 -37548 -36900 -38176 -36957 -37924 -38366 -37999 -37761 -36570 -38389 -37791 -38095 -37695 -37339 -37856 -36988 -36898
2431c6898r53J21M56k07n60J1N14j033L06M52Q90q29J51L83l85M6o90n6q96R76
$$ -36898 -37851 -37730 -37274 -37481 -38041 -38030 -37516 -38549 -38243 -37791 -36901 -37730 -37579 -37196 -37581 -37535 -38225 -38281 -39177 -38201
2411c8201L63j55M2J88K10M59r21L28J03r90P83L83j048Q78k51m09M8j05j81K76
$$ -38201 -37838 -37993 -37951 -37763 -37553 -37094 -38015 -37687 -37584 -38574 -37791 -37408 -38456 -37578 -37829 -38238 -38190 -38295 -38476 -38200
2391c8200M20o08J572k150J020K67k56O46p38k77M28k3o10O71J16n66L39O01l13
$$ -38200 -37780 -38388 -36816 -38966 -37946 -37679 -37935 -37289 -38027 -38304 -37876 -37899 -38509 -37838 -37722 -38288 -37949 -37348 -37661
2372c7661p36p43J527n86Mr3P91j999J948l93p60N79J112l31j259J058l56l72
$$ -37661 -38397 -39140 -37613 -38199 -38195 -38288 -37497 -39496 -37548 -37941 -38701 -38122 -37010 -37341 -38600 -37542 -37898 -38270
2354c8270M23N97j337J02Q26j402J179P69r12j90k63N34O64j141r07J449p01P43
$$ -38270 -37847 -37250 -38587 -38485 -37659 -39061 -37882 -37113 -38025 -38215 -38478 -37944 -37280 -38421 -39328 -37879 -38580 -37837
2336c7837q61L29M82j255J477m61M76k31n12J73j94l81P8l27R13p82M67p6l44
$$ -37837 -38698 -38369 -37887 -39142 -37665 -38126 -37650 -37881 -38393 -38220 -38414 -38795 -38717 -39044 -38131 -38913 -38446 -38522 -38866
2317c8866P76J52n73L65j120L92R28n48j336K141j294N18j59j24l40K62Qn31J220
$$ -38866 -38090 -37938 -38511 -38146 -39266 -38874 -37946 -38494 -39830 -37689 -38983 -38465 -38624 -38748 -39088 -38826 -38818 -39349 -38129
2298c8129L31j4J00q68M34n98j79j94M1J247o0j212J006k76N21j525J068j29M06
$$ -38129 -37798 -37812 -37712 -38580 -38146 -38744 -38923 -39117 -39076 -37829 -37889 -39101 -38095 -38371 -37850 -39375 -38307 -38436 -38030
2279c8030o1k19M35m14j06N37l2j462Q79n79J69l76J165j89m19m71J594Q7j456
$$ -38030 -38091 -38310 -37875 -38289 -38395 -37858 -37890 -39352 -38473 -39052 -38883 -39259 -38094 -38283 -38702 -39173 -37579 -37492 -38948
2260c8948O41r9k36k1J006O55q12o37k1q02Q52J22J530o27j382l96J34k44O69
$$ -38948 -38307 -38406 -38642 -38663 -37657 -37002 -37814 -38451 -38472 -39274 -38422 -38300 -36770 -37397 -38779 -39175 -39041 -39285 -38616
2241c8616k94O67l54l54j027P61J63Q83j41r1j50p55j13Q67Q30n6j803Q98K31
$$ -38616 -38910 -38243 -38597 -38951 -39978 -39217 -39054 -38171 -38312 -38403 -38553 -39308 -39421 -38554 -37724 -37780 -39583 -38685 -38454
2222c8454j297O97N87N57m57m37R22o61n72Q39n34Q44m10K48q08n94P46K38j100
$$ -38454 -39751 -39054 -38467 -37910 -38367 -38804 -37882 -38543 -39115 -38276 -38810 -37966 -38376 -38128 -38936 -39530 -38784 -38546 -39646
2203c9646Q45P54o8n73J396j596k3n91R94M04M20j480J234n48O77J18j186l54
$$ -39646 -38801 -38047 -38115 -38688 -37292 -38888 -38911 -39502 -38508 -38104 -37684 -39164 -37930 -38478 -37801 -37683 -38869 -39223
2185c9223R41N85j121j43R30n50J750j734Q82j008K25o96J193o17J409p59o44
$$ -39223 -38282 -37697 -38818 -38961 -38031 -38581 -36831 -38565 -37683 -38691 -38466 -39162 -37969 -38586 -37177 -37936 -38580
2168c8580J081q26M05n00q74J407p1j009l8Q53J71l08K47P56k84m75o78J53m79
$$ -38580 -37499 -38325 -37920 -38420 -39294 -37887 -37958 -38967 -39005 -38152 -37981 -38289 -38042 -37286 -37570 -38045 -38723 -38570 -39049
2149c9049J468pj81m93J44Q72j194K24n99Q03o84l75J026oo14N72o39J145j58
$$ -39049 -37581 -37588 -37769 -38262 -38118 -37246 -38440 -38216 -38815 -38012 -38696 -39071 -38045 -38051 -38665 -38093 -38732 -37587 -37745
2130c7745p23j037J164P04p87O53j345Q66o77r1r9N95J129j274O65L06r35J87
$$ -37745 -38468 -39505 -38341 -37637 -38424 -37771 -39116 -38250 -38927 -39018 -39117 -38522 -37393 -38667 -38002 -37696 -38631 -38444
2112c8444l29M26P70j472M76n4M39l44L69j130l03L78M62j94J89P1O69r26K22
$$ -38444 -38773 -38347 -37577 -39049 -38573 -38627 -38188 -38532 -38163 -39293 -39596 -39218 -38756 -38950 -38761 -38690 -38021 -38947 -38725
2093c8725m55N60k43R20o71P53o81N07n36N52q8q4L4o27q0Q49j439J128q10K095
$$ -38725 -39180 -38620 -38863 -37943 -38614 -37861 -38542 -38035 -38571 -38019 -38107 -38191 -38157 -38784 -38864 -38015 -39454 -38326 -39136 -37041
2073c7041j954J290j133Q17n69p5n34J406n27M85M48j680Q56l09K51p80N07M42
$$ -37041 -38995 -37705 -38838 -38021 -38590 -38665 -39199 -37793 -38320 -37835 -37387 -39067 -38211 -38520 -38269 -39049 -38542 -38100
2055c8100n68Q50Q0oq79J44O14q27R66K49m71j205O18j52J294n67n72k35O07P1
$$ -38100 -38668 -37818 -37738 -37744 -38623 -38479 -37865 -38692 -37726 -37477 -37948 -39153 -38535 -38687 -37393 -37960 -38532 -38767 -38160 -38089
2035c8089j276K053o59m61l28N35p01m30J595q05N57j097l0J472p30k40J84Q81
$$ -38089 -39365 -37312 -37971 -38432 -38760 -38225 -38926 -39356 -37761 -38566 -38009 -39106 -39136 -37664 -38394 -38634 -38450 -37569
2017c7569m40k35k06K42l72N50j99M8P57n64q26Q97r01J748j748m62M14J325q89
$$ -37569 -38009 -38244 -38450 -38208 -38580 -38030 -38229 -38181 -37424 -37988 -38814 -37917 -38818 -37070 -38818 -39280 -38866 -37541 -38430
1998c8430q37N80M00o79K18p76J754r91l27P8n36K24K39Q20M50Q3J81j31k74j204
$$ -38430 -39267 -38687 -38287 -38966 -38748 -39524 -37770 -38761 -39088 -39010 -39546 -39322 -39083 -38263 -37813 -37730 -37549 -37680 -37954 -39158
1978c9158K87K6NJ219j396J38k52J048j366K81MP27K00k56J11n38L08n43o99J708
$$ -39158 -38871 -38845 -38840 -37621 -39017 -38879 -39131 -38083 -39449 -39168 -39164 -38437 -38237 -38493 -38382 -38920 -38612 -39155 -39854 -38146
1958c8146r98N87N35l54m76L51q37K18p4N24p73N39O7k35J128Q5K92j772M65K44
$$ -38146 -39144 -38557 -38022 -38376 -38852 -38501 -39338 -39120 -39194 -38670 -39443 -38904 -38837 -39072 -37944 -37859 -37567 -39339 -38874 -38630
1938c8630k69N47j172J76Q07o98O95n71M16J48j38q27J215m58J078j975J042j04
$$ -38630 -38899 -38352 -39524 -39348 -38541 -39239 -38544 -39115 -38699 -38551 -38689 -39516 -38301 -38759 -37681 -39656 -38614 -38718
1920c8718O28K50m65j24m79O71J54j053P44O9j069J732j152J85m86L38L95N50
$$ -38718 -38090 -37840 -38305 -38429 -38908 -38237 -38083 -39136 -38392 -38323 -39392 -37660 -38812 -38627 -39113 -38775 -38380 -37830
1902c7830n70m29l63k4L33L23n25N56p25L66Q46K34j025J32K94Q6O3L2l95n9j51
$$ -37830 -38400 -38829 -39192 -39216 -38883 -38560 -39085 -38529 -39254 -38888 -38042 -37808 -38833 -38701 -38407 -38321 -38258 -38226 -38621 -38680 -38831
1881c8831P5q18R88m06L98l06j308J289l53J79o93N56L91k06nL02l37Q05m02j27
$$ -38831 -38756 -39574 -38586 -38992 -38594 -38900 -40208 -38919 -39272 -39093 -39786 -39230 -38839 -39045 -39050 -38748 -39085 -38280 -38682 -38809
1861c8809R41j348J166q06L73q49N24k01J33l91n93J080m46k00P17n54J404p60
$$ -38809 -37868 -39216 -38050 -38856 -38483 -39332 -38808 -39009 -38876 -39267 -39860 -38780 -39226 -39426 -38709 -39263 -37859 -38619
1843c8619N8pm2p78N19R14P59j848r79J237J190r93l19N72j113l12K19P84l10
$$ -38619 -38561 -38568 -38610 -39388 -38869 -37955 -37196 -39044 -40023 -38786 -37596 -38589 -38908 -38336 -39449 -39761 -39542 -38758 -39068
1824c9068O4M17O14r57l64L73R84n93m66O51n30n56J428l15l94K9n15M7j627J633
$$ -39068 -39004 -38587 -37973 -38930 -39294 -38921 -37937 -38530 -38996 -38345 -38875 -39431 -38003 -38318 -38712 -38683 -39198 -39151 -40778 -39145
1804c9145q1J589j159k4r6p48M25L91K90M2j756J153j7o71Q24O7r7J07o67L58
$$ -39145 -39226 -37637 -38796 -38820 -38916 -39664 -39239 -38848 -38558 -38516 -40272 -39119 -39136 -39807 -38983 -38916 -39013 -38906 -39573 -39215
1784c9215j203J391N25j553R95j28j76k01p60J864P5o25n13J87o35O26J051m38
$$ -39215 -40418 -39027 -38502 -40055 -39060 -39188 -39364 -39565 -40325 -38461 -38386 -39011 -39524 -39337 -39972 -39346 -38295 -38733
1766c8733k52j066J511L08o81Q99K9j657J21L49J76k15j13N68m85M27J25m43J46
$$ -38733 -38985 -40051 -38540 -38232 -38913 -38014 -37985 -39642 -39521 -39172 -38996 -39211 -39324 -38756 -39241 -38814 -38689 -39132 -38986
1747c8986M26j15k75p39q54J347o44J049o18M22J733k345J534j395L20O54O43
$$ -38986 -38560 -38675 -38950 -39689 -40543 -39196 -39840 -38791 -39409 -38987 -37254 -39599 -38065 -39460 -39140 -38486 -37843
1730c7843j295M27j331N29l88P20O39j471J364j315J00k60J659r82OK70q44M48
$$ -37843 -39138 -38711 -40042 -39513 -39901 -39181 -38542 -40013 -38649 -39964 -39864 -40124 -38465 -39447 -39441 -39171 -40015 -39567
1712c9567l41P48j216R75J033p98l02j52j37N83L01K46j410J133Kj054J367o66
$$ -39567 -39908 -39160 -40376 -39401 -38368 -39166 -39468 -39620 -39757 -39174 -38873 -38627 -40037 -38904 -38902 -39956 -38589 -39255
1694c9255j36L7M85K14k69K7M7k84M79q96R34Q25j917K008j023L60o66l45J041
$$ -39255 -39391 -39354 -38869 -38655 -38924 -38897 -38850 -39134 -38655 -39551 -38617 -37792 -39709 -37701 -38724 -38364 -39030 -39375 -38334
1675c8334k5p50P28j275M45L5J080j306M06l29n23O89M05r73O99k5O84j504L55
$$ -38334 -38359 -39109 -38381 -39656 -39211 -39176 -38096 -39402 -38996 -39325 -39848 -39159 -38754 -39727 -39028 -39053 -38369 -39873 -39518
1656c9518L59O48j65n77k48n4L0K82o08P9O29Q1o35K83K39M18j093N29Q63j80
$$ -39518 -39159 -38511 -38676 -39253 -39501 -39555 -39525 -39243 -39851 -39772 -39143 -39062 -39697 -39414 -39175 -38757 -39850 -39321 -38458 -38638
$$ [...]
##END NTUPLES=NMR SPECTRUM
##END=
