##TITLE=C13_AM_nV75
 CDCl3, 22100 sc

 30.10.2023
##JCAMPDX= 6.0         $$ Bruker NMR JCAMP-DX V2.0
##DATA TYPE= NMR SPECTRUM
##DATA CLASS= NTUPLES
##ORIGIN= UXNMR, Bruker Analytische Messtechnik GmbH
##OWNER= root
$$ XWIN-NMR		Version 3.5
$$ Tue Oct 31 13:46:05 2023 Russian Standard Time (UT+4h)  she@DPX200
##.OBSERVE FREQUENCY= 50.327896
##.OBSERVE NUCLEUS= ^13C
##.ACQUISITION MODE= SIMULTANEOUS
##.ACQUISITION SCHEME= undefined
##.AVERAGES= 22101
##.DIGITISER RES= 17
##SPECTROMETER/DATA SYSTEM= spect
##.PULSE SEQUENCE= zgpg30
##.SOLVENT NAME= CDCl3
##.SHIFT REFERENCE= (INTERNAL, CDCl3, 0, 222.624)
##AUDIT TRAIL= $$ (NUMBER, WHEN, WHO, WHERE, WHAT)
$$ ##TITLE= Audit trail, XWIN-NMR		Version 3.5
$$ ##JCAMPDX= 5.01
$$ ##ORIGIN= Bruker BioSpin GmbH
$$ ##OWNER= she
$$ F:/spectra/data/she/nmr/c13/1/pdata/1/auditp.txt
$$ ##AUDIT TRAIL=  $$ (NUMBER, WHEN, WHO, WHERE, WHAT)
(   1,<2023-10-31 13:43:54.23 +0400>,<she>,<DPX200>,
      <created by zg, POWCHK disabled, PULCHK disabled
       terminated by command 'halt'
       configuration hash MD5:
       00 E9 B6 7A A2 85 ED C7 34 08 36 98 17 FE 4E 26
       data hash MD5: 32K
       17 CC ED C2 37 44 7C 1B 1D E6 39 55 66 6B 38 56>)
(   2,<2023-10-31 13:44:41.75 +0400>,<she>,<DPX200>,
      <Start of raw data processing
       efp BC_mod = 2 LB = 2 FT_mod = 6 PKNL = 1 PHC0 = -366.5357 PHC1 = 32.53753 SI = 32K 
       data hash MD5: 32K
       7A DA 34 C8 C1 CC 34 AB 59 A8 66 49 3F B1 4C 3D>)
(   3,<2023-10-31 13:44:48.56 +0400>,<she>,<DPX200>,
      <abs ABSG = 5 
       data hash MD5: 32K
       80 F9 0D C9 E8 D4 47 12 4D 22 4A FB 06 9C 44 7E>)
(   4,<2023-10-31 13:45:11.71 +0400>,<she>,<DPX200>,
      <pk PHC0 = 6.965158 PHC1 = -5.400001 
       data hash MD5: 32K
       E7 BE CD 2F DC E2 A4 43 68 18 87 F3 2C 38 12 D8>)
(   5,<2023-10-31 13:45:15.12 +0400>,<she>,<DPX200>,
      <abs ABSG = 5 
       data hash MD5: 32K
       8B 64 57 B3 08 E4 EC 6D 2B FF C2 89 AD 10 AB 1D>)
$$ ##END=
$$ 
$$ hash MD5
$$ 25 99 F6 8C 08 FE A2 02 90 C4 D8 35 20 BA 19 D7
##$RELAX= 
##$RELAX= 
##$RELAX= 
##$RELAX= 
##$RELAX= 
##$RELAX= 
##$RELAX= 
##$RELAX= 
$$ Bruker specific parameters
$$ --------------------------
##$DU= <F:/spectra>
##$EXPNO= 1
##$NAME= <c13>
##$PROCNO= 1
##$TYPE= <nmr>
##$USER= <she>
##$AMP= (0..31)
100 100 100 100 100 100 100 100 100 100 100 100 100 100 100 100 100 100 
100 100 100 100 100 100 100 100 100 100 100 100 100 100 
##$AQSEQ= 0
##$AQ_mod= 1
##$AUNM= <au_zg>
##$AUTOPOS= <>
##$BF1= 50.322709
##$BF2= 200.13
##$BF3= 50.322709
##$BF4= 500.13
##$BF5= 500.13
##$BF6= 500.13
##$BF7= 500.13
##$BF8= 500.13
##$BYTORDA= 1
##$CFDGTYP= 0
##$CFRGTYP= 5
##$CHEMSTR= <none>
##$CNST= (0..31)
1 1 145 1 1 1 1 1 1 1 1 1 1 1 1 1 1 1 1 1 1 1 1 1 1 1 1 1 1 1 1 1 
##$CPDPRG= <waltz16>
##$CPDPRG1= <>
##$CPDPRG2= <waltz16>
##$CPDPRG3= <>
##$CPDPRG4= <mlev>
##$CPDPRG5= <mlev>
##$CPDPRG6= <mlev>
##$CPDPRG7= <mlev>
##$CPDPRG8= <mlev>
##$CPDPRGB= <>
##$CPDPRGT= <>
##$D= (0..31)
$$ [...]
##$SUBNAM4= <"">
##$SUBNAM5= <"">
##$SUBNAM6= <"">
##$SUBNAM7= <"">
##$SUBNAM8= <"">
##$SUBNAM9= <"">
##$SW= 239.972175391363
##$SWIBOX= (0..15)
0 1 3 0 0 0 0 0 0 0 0 0 0 0 0 0 
##$SW_h= 12077.2946859903
##$TD= 32768
##$TD0= 1
##$TE= 0
##$TE2= 300
##$TE3= 300
##$TEG= 300
##$TL= (0..7)
120 120 120 120 120 120 120 120 
##$TP= (0..7)
150 150 150 150 150 150 150 150 
##$TP07= 0
##$TPNAME0= <>
##$TPNAME1= <>
##$TPNAME2= <>
##$TPNAME3= <>
##$TPNAME4= <>
##$TPNAME5= <>
##$TPNAME6= <>
##$TPNAME7= <>
##$TPOAL= (0..7)
0.5 0.5 0.5 0.5 0.5 0.5 0.5 0.5 
##$TPOFFS= (0..7)
0 0 0 0 0 0 0 0 
##$TUNHIN= 0
##$TUNHOUT= 0
##$TUNXOUT= 0
##$USERA1= <user>
##$USERA2= <user>
##$USERA3= <user>
##$USERA4= <user>
##$USERA5= <user>
##$V9= 5
##$VALIST= <valist>
##$VCLIST= <CCCCCCCCCCCCCCC>
##$VD= 0
##$VDLIST= <DDDDDDDDDDDDDDD>
##$VPLIST= <PPPPPPPPPPPPPPP>
##$VTLIST= <TTTTTTTTTTTTTTT>
##$WBST= 1024
##$WBSW= 4
##$XGAIN= (0..3)
0 0 0 0 
##$XL= 0
##$YL= 0
##$YMAX_a= 89080605
##$YMIN_a= -64442540
##$ZGOPTNS= <>
##$ZL1= 120
##$ZL2= 120
##$ZL3= 120
##$ZL4= 120
##$ABSF1= 222.624
##$ABSF2= -17.3728
##$ABSG= 5
##$ABSL= 3
##$ALPHA= 0
##$AQORDER= 0
##$ASSFAC= 0
##$ASSFACI= 0
##$ASSFACX= 0
##$ASSWID= 0
##$AUNMP= <proc_1d>
##$AZFE= 0.1
##$AZFW= 0.5
##$BCFW= 0
##$BC_mod= 2
##$BYTORDP= 0
##$COROFFS= 0
##$CY= -3
##$DATMOD= 1
##$DC= 0
##$DFILT= <>
##$DTYPP= 0
##$F1P= 0
##$F2P= 0
##$FCOR= 0.5
##$FTSIZE= 32768
##$FT_mod= 6
##$GAMMA= 0
##$GB= 0
##$INTBC= 1
##$INTSCL= 4.134877e-10
##$ISEN= 128
##$LB= 2
##$LEV0= 0
##$LPBIN= 0
##$MAXI= 10000
##$MC2= 0
##$MEAN= 0
##$ME_mod= 0
##$MI= 0.1934396
##$NCOEF= 0
##$NC_proc= 3
##$NLEV= 6
##$NOISF1= 120.0001
##$NOISF2= 80.00006
##$NSP= 0
##$NTH_PI= 0
##$NZP= 0
##$OFFSET= 222.624
##$PC= 1.4
##$PHC0= -359.5706
##$PHC1= 27.13753
##$PH_mod= 1
##$PKNL= yes
##$PPARMOD= 0
##$PSCAL= 0
##$PSIGN= 0
##$REVERSE= no
##$SF= 50.3227315983092
##$SI= 32768
##$SIGF1= 140
##$SIGF2= 120
##$SINO= 11.81781
##$SIOLD= 32768
##$SREGLST= <13C.CDCl3>
##$SSB= 0
##$STSI= 32768
##$STSR= 0
##$SW_p= 12077.2946859903
##$SYMM= 0
##$S_DEV= 0
##$TDeff= 32768
##$TDoff= 0
##$TI= <>
##$TILT= no
##$TM1= 0
##$TM2= 0
##$TOPLEV= 0
##$USERP1= <user>
##$USERP2= <user>
##$USERP3= <user>
##$USERP4= <user>
##$USERP5= <user>
##$WDW= 1
##$XDIM= 32768
##$YMAX_p= 313234916
##$YMIN_p= -937791
$$ End of Bruker specific parameters
$$ ---------------------------------
##NTUPLES= NMR SPECTRUM
##VAR_NAME=  FREQUENCY,     SPECTRUM/REAL,   SPECTRUM/IMAG
##SYMBOL=    X,             R,               I
##VAR_TYPE=  INDEPENDENT,   DEPENDENT,       DEPENDENT
##VAR_FORM=  AFFN,          ASDF,            ASDF
##VAR_DIM=   32768,         32768,           32768
##UNITS=     HZ,            ARBITRARY UNITS, ARBITRARY UNITS
##FACTOR=    0.368581032318806, 1,           1
##FIRST=     11203.0474430531, 0,            0
##LAST=      -874.247242937185, 0,           0
##MIN=       -874.247242937185, -937791,     0
##MAX=       11203.0474430531, 313234916,    0
$$ Real data points
##PAGE= N=1
##DATA TABLE= (X++(R..R)), XYDATA
$$ [...]
$$ plain form
10181 134765 170749 197070 198516 165887 116885 65110 15572 -34180 -77045 -78509 -20191 68694
10169 68694 154501 227751 268126 273269 267490 273747 291899 301761 310719 322560 301027 218453 100698
10156 100698 21606 36052 116593 200900 287369 379369 414934 371268 296539 229573 174953
10145 174953 136220 121597 136855 153492 139997 106701 76654 72487 115244 196301 289906 371975
10133 371975 431559 462839 461569 430567 387697 347376 300544 232592 135171 34635 -22062
10122 -22062 -28018 1612 47218 93165 146023 227404 350372 477821 557484 603599 655317
10111 655317 703725 729292 743969 754271 730696 670785 616975 593379 608238 671083 756982
10100 756982 810849 823891 828745 838412 856015 897377 939877 963744 1006419 1076128 1143823 1227963
$$ packed form
10181A34765L5984K6321J446l2629m9002n1775m9538m9752m2865j464N8318Q8885
10169F8694Q5807P3250M0375N143n779O257J8152R862Q958J1841k1533q2574j17755
10156A00698p9092J4446Q0541Q4307Q6469R2000L5565m3666p4729o6966n4620
10145A74953l8733j4623J5258J6637j3495l3296l0047m167M2757Q1057R3605Q2069
10133C71975N9584L1280j270l1002m2870m0321m6832o7952r7421j00536n6697
10122b2062n956K9630M5606M5947N2858Q1381J22968J27449P9663M6115N1718
10111F55317M8408K5567J4677J0302k3575n9911n3810k3596J4859O2845Q5899
10100G56982N3867J3042M854R667J7603M1362M2500K3867M2675O9709O7695Q4140
$$ plain form
10088 1227963 1353752 1507724 1679344 1840685 1941504 1970233 1956447 1951935 1986100 2058358
10078 2058358 2182741 2368163 2585761 2804310 3046061 3349520 3722490 4171383 4701995
10069 4701995 5296083 5951787 6684608 7506539 8387855 9266308 10111879 10895892 11593664
10060 11593664 12213175 12790825 13425529 14191803 14984294 15523105 15506084 14750257 13295096
10051 13295096 11465540 9656234 8080561 6790965 5766551 4984051 4432777 4040254
10043 4040254 3691248 3328466 2960681 2597673 2237022 1929124 1740131 1659421 1631976 1602217
10033 1602217 1536885 1442347 1331683 1205314 1070016 948416 860117 802944 767727 740591
10023 740591 704931 645817 568654 494285 436869 392127 342215 307094 316814 351735 370517 391171
$$ packed form
10088A227963J25789J53972J71620J61341J00819K8729j3786m512L4165P2258
10078B058358J24383J85422K17598K18549K41751L03459L72970M48893N30612
10069D701995N94088O55704P32821Q21931Q81316Q78453Q45571P84013O97772
10060A1593664O19511N77650O34704P66274P92491N38811j7021p55827j455161
10051A3295096j829556j809306j575673j289596j024414p82500n51274l92523
10043D040254l49006l62782l67785l63008l60651l07898j88993q0710k7445k9759
10033A602217o5332r4538j10664j26369j35298j21600q8299n7173l5217k7136
10023G40591l5660n9114p7163p4369n7416m4742m9912l5121R720L4921J8782K0654
$$ plain form
10011 391171 436900 469413 453626 400553 344794 303023 276857 261994 262369 280566 301026 298365
9999 298365 253959 168269 79899 58486 137054 249914 325009 355000 355161 355720 364597 365381 340875
9986 340875 279967 192281 111844 68310 52829 52235 71720 103839 118626 110988 92293 63172
9974 63172 29860 10252 23079 44221 40700 19922 24066 78208 147349 199003 215661 193970
9962 193970 173261 194536 251515 302403 335302 372521 423086 467417 478860 429567 326168
9951 326168 226741 200097 260234 340097 370260 356572 317014 259571 219597 202972 179656 165555
9939 165555 169042 174767 200994 248472 273698 237892 164252 100310 67752 72583 118935 182449
9927 182449 207391 195821 199274 238322 288181 314450 299727 276550 270998 249315 186205 112073
$$ packed form
10011C91171M5729L2513j5787n3073n5759m1771k6166j4863L75J8197K0460k661
9999B98365m4406q5690q8370k1413P8568J12860P5095K9991J61N59Q877P84k4506
9986C40875o0908q7686q0437m3534j5481n94J9485L2119J4787p638j8695k9121
9974F3172l3312j9608J2827K1142l521k0778M144N4142O9141N1654J6658k1691
9962A93970k0709K1275N6979N0888L2899L7219N0565M4331J1443m9293j03399
9951C26168r9427k6644O0137P9863L0163j3688l9558n7443l9974j6625k3316j4101
9939A65555L487N725K6227M7478K5226l5806p3640o3942l2558M831M6352O3514
9927A82449K4942j1570L453L9048M9859K6269j4723k3177n552k1683o3110p4132
$$ plain form
9915 112073 56304 40227 39278 -2140 -58423 -58656 24063 149464 265101 349489 377697 333892
9903 333892 243484 159118 100550 53352 19826 11723 73015 225041 414164 556897 600195
9892 600195 572181 540378 545671 587207 656121 742985 816825 853312 840958 810177 816837 863024
9880 863024 908745 939527 950958 937114 896284 843700 814595 788291 757640 752263 757296 760939
9868 760939 755343 721437 682804 683426 733245 791724 805394 767665 723265 710424 730434 775179
9856 775179 830326 871051 882956 849880 788703 738789 697672 660592 625453 569760 489876 404018
9844 404018 326820 282150 278626 322958 405545 492374 560550 585933 565640 541363 544069 573705
9832 573705 616050 653289 674165 679744 672999 647300 599203 521449 398143 248001 109988
$$ packed form
9915A12073n5769j6077r49m1418n6283k33Q2719J25401J15637Q4388K8208m3805
9903C33892r0408q4366n8568m7198l3526q103O1292J52026J89123J42733M3298
9892F00195k8014l1803N293M1536O8914Q6864P3840L6487j2354l0781O660M6187
9880H63024M5721L0782J1431j3844m0830n2584k9105k6304l0651n377N033L643
9868G60939n596l3906l8633O22M9819N8479J3670l7729m4400j2841K0010M4745
9856G75179N5147M0725J1905l3076o1177m9914m1117l7080l5139n5693p9884q5858
9844D04018p7198m4670l524M4332Q2587Q6829O8176K5383k0293k4277K706K9636
9832E73705M2345L7239K0876N579o745k5699m8097p7754j23306j50142j38013
$$ plain form
9821 109988 -16842 -153705 -296012 -392606 -389282 -324582 -298904 -320580 -343847 -359126 -364244
9810 -364244 -350285 -330812 -326872 -339642 -356198 -340056 -277800 -192044 -116149 -68253 -67328 -127410
9798 -127410 -210627 -236479 -197434 -139154 -95967 -89255 -118236 -166365 -228225 -317119 -435271 -554920
9786 -554920 -640333 -667695 -664960 -641675 -584188 -513144 -438254 -373636 -348019 -357650 -339490 -277120
9774 -277120 -211655 -135549 -31757 56761 80328 54686 30407 25052 45487 96995 161361 219132
9762 219132 286435 382256 475719 537489 570368 569991 530425 452484 375928 338774 340551 378573
9750 378573 432184 493948 543605 546741 489721 391293 286134 204001 170914 204257 291358 373626
9738 373626 415143 419281 419771 452522 487979 494275 478392 457711 468573 518028 564058 579370
$$ packed form
9821A09988j26830j36863j42307r6594L324O4700K5678k1676k3267j5279n118
9810c64244J3959J9473L940j2770j6556J6142O2256Q5756P5895M7896R25o0082
9798a27410q3217k5852L9045N8280M3187O712k8981m8129o1860q8894j18152j19649
9786e54920q5413k7362K735K3285N7487P1044P4890O4618K5617r631J8160O2370
9774b77120O5465P6106J03792Q8518K3567k5642k4279n355K0435N1508O4366N7771
9762B19132O7303R5821R3463O1770L2879l77l9566p7941p6556l7154J777L8022
9750C78573N3611O1764M9657L136n7020r8428j05159q2133l3087L3343Q7101Q2268
9738C73626M1517M138M90L2751L5457O296j5883k0681J0862M9455M6030J5312
$$ plain form
9726 579370 579885 594959 623414 632180 605593 545558 467796 404605 387998 400732 396243 368189
9714 368189 356058 376107 416163 465019 490011 457336 411846 406612 416411 402632 400649 471160
9702 471160 599405 712169 766249 762887 723466 676234 640794 603391 572937 580043 631626 699563
9690 699563 724669 688293 637761 624057 667657 753103 851858 916369 903898 835313 753294 673842
9678 673842 600193 551860 538489 555493 594265 631033 650716 668011 682117 667980 616713 561356
9666 561356 539538 528766 493582 430554 353538 293106 285036 334309 416250 489747 512898 503764
9654 503764 524962 587510 647440 680006 704480 740141 767808 734732 619486 479883 409309
9643 409309 422088 456604 473079 460073 435184 433097 458885 472800 476444 517365 593515 665150
$$ packed form
9726E79370N15J5074K8455Q766k6587o0035p7762o3191j6607J2734m489k8054
9714C68189j2131K0049M0056M8856K4992l2675m5490n234R799j3779j983P0511
9702D71160J28245J12764N4080l362l9421m7232l5440l7403l0454P106N1583O7937
9690F99563K5106l6376n0532j3704M3600Q5446R8755O4511j2471o8585q2019p9452
9678F73842p3649m8333j3371J7004L8772L6768J9683J7295J4106j4137n1267n5357
9666E61356k1818j0772l5184o3028p7016o0432q070M9273Q1941P3497K3151r134
9654E03764K1198O2548N9930L2566K4474L5661K7667l3076j15246j39603p0574
9643D09309J2779L4516J6475j3006k4889k087K5788J3915L644M0921P6150P1635
$$ plain form
9631 665150 719404 777800 861907 945221 1007797 1039758 1019306 968178 944659 957291 969668 948663
9619 948663 905909 881505 882009 873918 835758 792541 766948 754855 759342 786937 850620 942868
9607 942868 1031431 1105772 1180203 1249004 1271149 1252356 1231897 1219503 1198206 1152519 1104590 1092706
9595 1092706 1131976 1197568 1248445 1263714 1244352 1227003 1253803 1317034 1377393 1398336 1398582 1422866
9583 1422866 1452206 1460676 1469653 1504907 1551532 1589808 1629230 1682171 1762842 1889962 2015896
9572 2015896 2078886 2080701 2035441 1971866 1940601 1938921 1946449 1977665 2048992 2134308 2181861 2176577
9560 2176577 2135632 2125258 2208250 2369951 2571142 2773247 2931659 3035014 3099369 3173453
9550 3173453 3297731 3472686 3681829 3915722 4182081 4454793 4687211 4876549 5048666 5168096
$$ packed form
9631F65150N4254N8396Q4107Q3314O2576L1961k0452n1128k3519J2632J2377k1005
9619I48663m2754k4404N04q091l8160m3217k5593j2093M487K7595O3683R2248
9607I42868Q8563P4341P4431O8801K2145j8793k0459j2394k1297m5687m7929j1884
9595A092706L9270O5592N0877J5269j9362j7349K6800O3231O0359K0943K46K4284
9583A422866K9340Q470Q977L5254M6625L8276L9422N2941Q0671J27120J25934
9572B015896O2990J815m5260o3575l1265j680P528L1216P1327Q5316M7553n284
9560B176577m0945j0374Q2992J61701K01191K02105J58412J03355O4355P4084
9550C173453J24278J74955K09143K33893K66359K72712K32418J89338J72117J19430
$$ plain form
9540 5168096 5185069 5124054 5049001 5016128 5062119 5201157 5408886 5634262 5882833 6199352
9530 6199352 6593169 7050231 7546536 8064293 8594821 9165684 9839013 10617661 11460998 12345599
9520 12345599 13282950 14322877 15513353 16873345 18433179 20243950 22329259 24686093
9512 24686093 27307085 30196105 33399031 37028936 41282906 46394455 52492649 59578603
9504 59578603 67605378 76435588 85845196 95675091 106006707 117258757 130083791 144939052
9496 144939052 161516354 178722818 195264408 209799254 220448522 224987413 221672839
9489 221672839 209721636 189564768 163894313 137412364 113972534 94937275 80008870
9482 80008870 68369543 59165980 51704588 45500479 40213115 35603037 31552563 28049542
$$ packed form
9540E168096J6973o1015p5053l2873M5991J39038K07729K25376K48571L16519
9530F199352L93817M57062M96305N17757N30528N70863O73329P78648Q43337Q84601
9520A2345599R37351J039927J190476J359992J559834J810771K085309K356834
9512B4686093K620992K889020L202926L629905M253970N111549O098194P085954
9504E9578603Q026775Q830210R409608R829895J0331616J1252050J2825034J4855261
9496A44939052J6577302J7206464J6541590J4534846J0649268M538891l314574
9489B21672839j1951203k0156868k5670455k6481949k3439830j9035259j4928405
9482H0008870j1639327r203563p461392o204109n287364m610078m050474l503021
$$ plain form
9474 28049542 25113407 22714671 20749591 19115494 17748229 16626462 15717493 14941180
9466 14941180 14259096 13676943 13160262 12674200 12241515 11877017 11545365 11191198 10796811
9457 10796811 10343097 9778561 9146899 8551032 8024232 7577575 7222015 6932838 6682722
9448 6682722 6486486 6351757 6222565 6064265 5899096 5733128 5556372 5346029 5092585 4822975
9438 4822975 4548978 4282137 4054411 3898270 3813565 3754520 3674667 3563888 3437248 3321586
9428 3321586 3247677 3216578 3208187 3234585 3302404 3375007 3427075 3460987 3499381 3569674 3664093 3740992
9416 3740992 3779601 3812031 3867743 3949412 4065166 4218244 4396116 4594793 4816877 5072941
9406 5072941 5363465 5668475 6004256 6394182 6791240 7151516 7524504 7993900 8569576 9194767
$$ packed form
9474B8049542k936135k398736j965080j634097j367265j121767r08969p76313
9466A4941180o82084n82153n16681m86062m32685l64498l31652l54167l94387
9457A0796811m53714n64536o31662n95867n26800m46657l55560k89177k50116
9448F682722j96236j34729j29192j58300j65169j65968j76756k10343k53444k69610
9438D822975k73997k66841k27726j56141q4705n9045p9853j10779j26640j15662
9428C321586p3909l1099q391K6398O7819P2603N2068L3912L8394P0293R4419P6899
9416C740992L8609L2430N5712Q1669J15754J53078J77872J98677K22084K56064
9406E072941K90524L05010L35781L89926L97058L60276L72988M69396N75676O25191
$$ plain form
9396 9194767 9862729 10602616 11432632 12359523 13401768 14627105 16134005 18019199 20372619
9387 20372619 23278088 26871659 31367178 37032158 44178916 53123031 64232965 78019691
9379 78019691 95070951 115804893 140079745 166749996 193468500 216982541 234208958
9372 234208958 243044173 241969276 230172998 209264800 183811342 158969900 137917723
9365 137917723 121355266 108485114 98074729 88976408 80259134 71355791 62259979 53461981
9357 53461981 45526321 38744638 33139459 28573837 24820657 21671635 19035705 16870667
9349 16870667 15099339 13638735 12434793 11437602 10596916 9859612 9182999 8548148 7961178
9340 7961178 7449325 7018532 6655204 6337539 6045718 5756820 5470214 5213410 5004240 4834286
$$ packed form
9396I194767O67962P39887Q30016R26891J042245J225337J506900J885194K353420
9387B0372619K905469L593571M495519N664980P146758Q944115J1109934J3786726
9379G8019691J7051260K0733942K4274852K6670251K6718504K3514041J7226417
9372B34208958Q835215j074897j1796278k0908198k5453458k4841442k1052177
9365A37917723j6562457j2870152j0410385r098321q717274q903343r095812q797998
9357E3461981p935660o781683n605179m565622l753180l149022k635930k165038
9349A6870667j771328j460604j203942r97191q40686p37304o76613o34851n86970
9340G961178n11853m30793l63328l17665k91821k88898k86606k56804k09170j69954
$$ plain form
9330 4834286 4675316 4510455 4350594 4227650 4151566 4102836 4082227 4096033 4114329 4099241 4073663
9319 4073663 4062533 4024791 3927071 3781988 3628921 3513051 3452385 3418864 3403274 3437313 3523876
9308 3523876 3615639 3667967 3680642 3688052 3698011 3672317 3574817 3408258 3216668 3067592 2983550
9297 2983550 2929759 2886904 2851493 2810413 2791963 2843358 2953311 3086642 3219584 3334614 3438845
9286 3438845 3533080 3601403 3626757 3616306 3621275 3687809 3818606 3964175 4074600 4146824 4218393
9275 4218393 4320340 4458196 4606302 4761256 4928066 5077242 5203375 5351607 5559491 5816513
9265 5816513 6092608 6392849 6718525 7027397 7331356 7673012 8047581 8442610 8877881 9395555
9255 9395555 10026500 10793741 11730397 12859906 14186283 15707901 17475176 19596280 22191727
$$ packed form
9330D834286j58970j64861j59861j22944p6084m8730k0609J3806J8296j5088k5578
9319D073663j1130l7742r7720j45083j53067j15870o0666l3521j5590L4039Q6563
9308C523876R1763N2328J2675P410R959k5694r7500j66559j91590j49076q4042
9297B983550n3791m2855l5411m1080j8450N1395J09953J33331J32942J15030J04231
9286C438845R4235O8323K5354j0451M969O6534J30797J45569J10425P2224P1569
9275D218393J01947J37856J48106J54954J66810J49176J26133J48232K07884K57022
9265E816513K76095L00241L25676L08872L03959L41656L74569L95029M35271N17674
9255I395555O30945P67241R36656J129509J326377J521618J767275K121104K595447
$$ plain form
9246 22191727 25419614 29471426 34531023 40836059 48726467 58660916 71162244 86733535
9238 86733535 105904897 129248621 157138404 189124604 223089356 255038164 279951738
9231 279951738 293790473 294378547 280423834 252713932 216527639 179499587 146997458
9224 146997458 120788964 100457909 84902425 73043264 63997384 57082714 51826903
9217 51826903 47942001 45296535 43869040 43696281 44825259 47333456 51394126 57219759
9209 57219759 65027204 75097007 87753781 103126499 120679689 138921849 155520232
9202 155520232 168100784 175056591 175253938 168191780 155213117 139138837 122341233 105923611
9194 105923611 90399890 76355683 64260529 54213830 46068029 39538639 34332535
$$ packed form
9246B2191727L227887M051812N059597O305036P890408R934449J2501328J5571291
9238H6733535J9171362K3343724K7889783L1986200L3964752L1948808K4913574
9231B79951738J3838735N88074j3954713k7709902l6186293l7028052l2502129
9224A46997458k6208494k0331055j5555484j1859161r045880o914670n255811
9217E1826903l884902k645466j427495j72759J128978K508197M060670N825633
9209E7219759P807445J0069803J2656774J5372718J7553190J8242160J6598383
9202A55520232J2580552O955807J97347p062158j2978663j6074280j6797604j6417622
9194A05923611j5523721j4044207j2095154j0046699q145801o529390n206104
$$ plain form
9187 34332535 30230771 27039484 24541342 22541399 20962931 19775723 18943772 18454694
9179 18454694 18297567 18450327 18839017 19301095 19679203 19872553 19779294 19336901 18572178 17594159
9169 17594159 16520936 15404677 14222631 12975678 11748968 10639951 9666544 8796839
9161 8796839 8016941 7371420 6860438 6414745 6012216 5666530 5366191 5091490 4846696 4642969
9151 4642969 4497690 4422966 4432950 4530322 4690478 4918636 5240711 5669074 6211987 6883596
9141 6883596 7662478 8472416 9242556 9968187 10675729 11358223 11968654 12488557 12938100 13310590
9131 13310590 13606289 13839103 13921354 13682340 13012481 11927361 10584145 9201951 7947677
9122 7947677 6919012 6107888 5460126 4939564 4501324 4114123 3774544 3473466 3205415
$$ packed form
9187C4332535m101764l191287k498142j999943j578468j187208q31951m89078
9179A8454694j57127J52760L88690M62078L78108J93350r3259m42393p64723r78019
9169A7594159j073223j116259j182046j246953j226710j109017r73407q69705
9161H796839p79898o45521n10982m45693m02529l45686l00339k74701k44794k03727
9151D642969j45279p4724R984R7372J60156K28158L22075M28363N42913O71609
9141F883596P78882Q09938P70140P25631P07542O82494O10431N19903M49543L72490
9131A3310590K95699K32814Q2251k39014o69859j085120j343216j382194j254274
9122G947677j028665q11124o47762n20562m38240l87201l39579l01078k68051
$$ plain form
9113 3205415 2968701 2771515 2649009 2595699 2551112 2503644 2495737 2530668 2549063 2506727 2432228
9102 2432228 2368442 2330084 2320655 2338456 2363733 2382657 2405887 2440253 2478429 2534277 2647568
9091 2647568 2824529 3032721 3250978 3475667 3712540 4004357 4394488 4868503 5410871 6043833
9081 6043833 6839653 7880041 9197711 10842745 12875979 15365988 18440561 22276327
9073 22276327 26979701 32407288 37966528 42543066 44918522 44494501 41657574 37411296
9065 37411296 32719312 28215336 24216364 20793441 17883494 15378347 13191943 11296131
9057 11296131 9697477 8372024 7263662 6318625 5516439 4854720 4318119 3872584 3485627
9048 3485627 3134255 2809840 2510033 2239742 1979826 1714099 1471034 1290036 1185004 1132396
$$ packed form
9113C205415k36714j97186j22506n3310m4587m7468p907L4931J8395m2336p4499
9102B432228o3786l8358r429J7801K5277J8924K3230L4366L8176N5848J13291
9091B647568J76961K08192K18257K24689K36873K91817L90131M74015N42368O32962
9081F043833P95820J040388J317670J645034K033234K490009L074573L835766
9073B2276327M703374N427587N559240M576538K375456m24021k836927m246278
9065C7411296m691984m503976l998972l422923k909947k505147k186404j895812
9057A1296131j598654j325453j108362r45037q02186o61719n36601m45535l86957
9048C485627l51372l24415k99807k70291k59916k65727k43065j80998j05032n2608
$$ plain form
9038 1132396 1095512 1070300 1050157 1024171 1001338 983177 952222 899703 854760 842339 845497 839560
9026 839560 806905 751130 702103 676366 677900 733487 843507 972084 1073552 1074227 981543 886653
9014 886653 819762 771235 740093 760127 822697 860638 866158 884623 909516 895201 829723 746473
9002 746473 695740 689291 708060 701161 643708 556483 467020 397458 365558 383435 430141 463144
8990 463144 471916 474718 470496 443385 390100 333467 309060 338024 400542 450214 468579 472273
8978 472273 444126 356058 264187 220900 186026 133691 110409 139774 183603 216846 273588 383456
8966 383456 482972 501478 450433 373252 301941 274043 330790 442484 523382 544192 537190 550398
8954 550398 579629 574387 528046 468221 406912 364080 348094 336832 332670 356340 397827 446021
$$ packed form
9038A132396l6884k5212k0143k5986k2833j8161l0955n2519m4943j2421L158n937
9026H39560l2655n5775m9027k5737J534N5587J10020J28577J01468O75r2684r4890
9014H86653o6891m8527l1142K0034O2570L7941N520J8465K4893j4315o5478q3250
9002G46473n0733o449J8769o899n7453q7225q9463o9562l1900J7877M6706L3003
8990D63144Q772K802m222k7111n3285n6633k4407K8964O2518M9672J8365L694
8978D72273k8147q8068r1871m3287l4874n2335k3282K9365M3829L3243N6742J09868
8966C83456R9516J8506n1045p7181p1311k7898N6747J11694Q0898K0810p002J3208
8954E50398K9231n242m6341n9825o1309m2832j5986j1262m162K3670M1487M8194
$$ plain form
8942 446021 493789 536253 576152 607161 639528 663078 650973 589081 486244 368071 260602
8931 260602 176737 127599 109768 97450 83104 74630 90524 154164 255389 354515 415039 428457
8919 428457 420093 423311 454353 497618 526896 551512 594232 644457 669404 631645 511001 316059
8907 316059 116094 7117 9266 65111 108950 126685 152529 191618 207983 208371 233783 286463
8895 286463 328809 340019 352977 396104 460223 535096 622736 717944 799215 830855 791388 693733
8883 693733 580392 499938 475610 488762 511731 538337 537286 487110 409010 343022 315217 317976
8871 317976 320811 299096 252705 199726 163643 155712 170592 191458 195594 166063 112704 47218
8859 47218 -9021 -21968 8678 74696 157506 215835 235832 237576 240387 256429 276554 273109
$$ packed form
8942D46021M7768M2464L9899L1009L2367K3550j2105o1892j02837j18173j07469
8931B60602q3865m9138j7831j2318j4346q474J5894O3640J01225R9126O0524J3418
8919D28457q364L218L1042M3265K9278K4616M2720N0225K4947l7759j20644j94942
8907C16059j99965j08977K149N5845M3839J7735K5844L9089J6365L88K5412N2680
8895B86463M2346J1210J2958M3127O4119P4873Q7640R5208Q1271L1640l9467r7655
8883F93733j13341q0454k4328J3152K2969K6606j051n0176p8100o5988k7805K759
8871C17976K835k1715m6391n2979l6083p931J4880K0866M136k9531n3359o5486
8859D7218n6239j2947L0646O6018Q2810N8329J9997J744K811J6042K0125l445
$$ plain form
8847 273109 224038 126230 4644 -127878 -262280 -377142 -451857 -472444 -449145 -411022 -376810
8836 -376810 -361140 -376063 -402269 -383689 -296417 -183289 -94089 -56073 -73789 -126087 -153910
8825 -153910 -122954 -74315 -30701 21082 73463 118454 129835 85432 18247 -33044 -93141 -179448
8813 -179448 -237015 -239377 -211159 -171982 -140995 -124228 -94539 -61043 -48905 -26021 36889 105888
8801 105888 120441 80659 60752 91664 138686 195546 271696 362617 450696 515317 550259 554501
8789 554501 515896 455178 409472 379288 354357 323865 283639 244728 221355 224547 255986 292382
8777 292382 301433 282994 258504 223472 151962 57045 -35191 -110817 -134817 -75820 12589 45372
8765 45372 13226 -30525 -29361 19598 80351 119875 138839 158794 189367 208565 193162 149971
$$ packed form
8847B73109m9071r7808j21586j32522j34402j14862p4715k0587K3299L8123L4212
8836c76810J5670j4923k6206J8580Q7272J13128Q9200L8016j7716n2298k7823
8825a53910L0956M8639M3614N1783N2381M4991J1381m4403o7185n1291o0097q6307
8813a79448n7567k362K8218L9177L0987J6767K9689L3496J2138K2884O2910O8999
8801A05888J4553l9782j9907L0912M7022N6860P6150R0921Q8079O4621L4942M242
8789E54501l8605o0718m5706l0184k4931l0492m0226l8911k3373L192L1439L6396
8777B92382R051j8439k4490l5032p1510r4917r2236p5626k4000N8997Q8409L2783
8765D5372l2146m3751J164M8959O0753L9524J8964J9955L0573J9198j5403m3191
$$ plain form
8753 149971 87744 30657 11661 28131 70435 144188 254599 378682 449504 442867 388115
8742 388115 309680 237546 222295 279568 359130 397691 382629 328936 247267 162950 93878 46832
8730 46832 60978 144915 238373 305261 341615 330049 278610 227639 175763 95410 169 -82129
8718 -82129 -155348 -228349 -281201 -294595 -268242 -205475 -122264 -42143 35678 110807 175831 231820
8706 231820 255778 237920 225483 267243 347773 400051 393292 345346 283958 220853 174660 167417
8694 167417 193835 226850 249406 264650 268984 269488 270783 262856 215340 124222 58000 60728 90032
8681 90032 101352 116924 149707 172147 158754 109674 60776 19385 -44557 -118483 -146958 -104759
8669 -104759 -21095 41918 37154 -2467 -19233 -6174 25880 38978 -4497 -76725 -112499 -104917
$$ packed form
8753A49971o2227n7087j8996J6470M2304P3753J10411J24083P0822o637n4752
8742C88115p8435p2134j5251N7273P9562L8561j5062n3693q1669q4317o9072m7046
8730D6832J4146Q3937R3458O6888L6354j1566n1439n0971n1876q0353r5241q2298
8718h2129p3219p3001n2852j3394K6353O2767Q3211Q0121P7821P5129O5024N5989
8706B31820K3958j7858j2437M1760Q0530N2278o759m7946o1388o3105m6193p243
8694A67417K6418L3015K2556J5244M334N04J295p927m7516r1118o6222K728K9304
8681I0032J1320J5572L2783K2440j3393m9080m8898m1391o3942p3926k8475M2199
8669a04759Q3664O3013m764l9621j6766J3059L2054J3098m3475p2228l5774P582
$$ plain form
8657 -104917 -72291 -416 119753 242731 300087 295606 274572 253874 225990 187207 143458
8646 143458 96699 49386 -10122 -92615 -153954 -167232 -148943 -94302 -26899 -18700 -80180 -148010
8634 -148010 -162391 -129699 -78427 -28407 -2193 15411 50330 90457 105520 107137 131931 187425
8622 187425 263350 336789 375069 372071 349349 315549 279296 240933 180727 111999 55664 30340
8610 30340 64122 132378 165536 152869 130349 126091 161915 249895 374304 510247 632984
8599 632984 724695 794847 852179 881763 861273 809799 773023 758208 734438 694178 670838 691981
8587 691981 736467 773983 786158 785500 812218 868047 910792 921948 937778 986441 1093491 1262171
8575 1262171 1456632 1672241 1925713 2210751 2527784 2915331 3414134 4008504 4600354 5060393
$$ packed form
8657a04917L2626P1875J20169J22978N7356m481k1034k0698k7884l8783m3749
8646A43458m6759m7313n9508q2493o1339j3278J8289N4641O7403Q199o1480o7830
8634a48010j4381L2692N1272N0020K6214J7604L4919M0127J5063J617K4794N5494
8622A87425P5925P3439L8280k998k2722l3800l6253l8363o0206o8728n6335k5324
8610C0340L3782O8256L3158j2667k2520m258L5824Q7980J24409J35943J22737
8599F32984R1711P0152N7332K9584k0490n1474l6776j4815k3770m0260k3340K1143
8587F91981M4486L7516J2175o58K6718N5829M2745J1156J5830M8663J07050J68680
8575A262171J94461K15609K53472K85038L17033L87547M98803N94370N91850M60039
$$ plain form
8565 5060393 5294338 5286094 5074058 4707150 4267499 3820437 3365694 2925525 2546334 2242172
8555 2242172 2014099 1851736 1747053 1687649 1655064 1644690 1647643 1632519 1561935 1453661 1397895
8544 1397895 1454757 1586187 1724358 1831040 1887495 1899314 1896249 1881158 1846733 1816328 1851142
8533 1851142 1961263 2081548 2171131 2254708 2373648 2524553 2669087 2781765 2866094 2929133
8523 2929133 2970941 3013892 3119609 3319722 3574917 3840411 4071520 4203038 4208601 4133598
8513 4133598 4071416 4094529 4213823 4378916 4553396 4751223 4996477 5290708 5624742 6005455
8503 6005455 6401168 6766827 7108633 7457804 7868341 8410439 9112010 9948065 10913332 12029691
8493 12029691 13309460 14778121 16483698 18497995 20868746 23606823 26722292 30221224
$$ packed form
8565E060393K33945q244k12036l66908m39651m47062m54743m40169l79191l04162
8555B242172k28073j62363j04683n9404l2585j0374K953j5124p0584j08274n5766
8544A397895N6862J31430J38171J06682N6455J1819l065j5091l4425l0405L4814
8533A851142J10121J20285Q9583Q3577J18940J50905J44534J12678Q4329O3039
8523B929133M1808M2951J05717K00113K55195K65494K31109J31518N563p5003
8513D133598o2182K3113J19294J65093J74480J97827K45254K94231L34034L80713
8503F005455L95713L65659L41806L49171M10537N42098P01571Q36055R65267J116359
8493A2029691J279769J468661J705577K014297K370751K738077L115469L498932
$$ plain form
8485 30221224 34029802 37882323 41407867 44377787 46934134 49644719 53305993 58643539
8477 58643539 66169869 76268504 89321794 105731778 125892639 150208999 178995144
8470 178995144 212134912 248201189 282793220 307573564 313234916 295564700 259300392
8463 259300392 215746819 174992968 141341796 114901482 94345762 78293896 65627254
8456 65627254 55532353 47407918 40781360 35307714 30800527 27139557 24149606 21628513
8448 21628513 19446756 17527946 15805987 14249693 12878332 11700452 10688329 9810320
8440 9810320 9028691 8308889 7644221 7046321 6521362 6051960 5642208 5297753 5000923 4741318
8430 4741318 4532583 4381751 4259707 4135837 4006533 3889336 3798876 3732162 3690556 3689711 3757904
$$ packed form
8485C0221224L808578L852521L525544K969920K556347K710585L661274N337546
8477E8643539P526330J0098635J3053290J6409984K0160861K4316360K8786145
8470A78995144L3139768L6066277L4592031K4780344N661352j7670216l6264308
8463B59300392m3553573m0753851l3651172k6440314k0555720j6051866j2666642
8456F5627254j0094901q124435o626558n473646m507187l660970k989951k521093
8448B1628513k181757j918810j721959j556294j371361j177880j012123q78009
8440I810320p81629p19802o64668n97900n24959m69402m09752l44455k96830k59605
8430D741318k08735j50832j22044j23870j29304j17197r0460o6714m1606q45O8193
$$ plain form
8419 3757904 3890056 4013259 4028987 3884894 3595791 3227591 2871969 2579395 2352588 2170996
8409 2170996 2025423 1926137 1854731 1775091 1694333 1627754 1560878 1477080 1362839 1207085 1034138
8398 1034138 888845 789139 740547 731342 736524 738146 731651 723229 717588 702323 670999 628094
8386 628094 598562 601982 610835 596175 526898 386310 218460 88355 53680 120844 242089
8375 242089 367027 446599 461647 448151 434755 439785 475612 530925 574631 574514 547340 529168
8363 529168 514358 505445 537074 607466 690751 768325 787703 701559 550592 420202 334661
8352 334661 289102 266691 213996 95551 -30168 -97298 -118833 -123559 -102683 -59018 -41813
8341 -41813 -76784 -135638 -172763 -157727 -88157 -13038 14876 1606 -7182 3185 27941 74077
$$ packed form
8419C757904J32152J23203J5728j44093k89103l68200l55622k92574k26807j81592
8409B170996j45573r9286p1406p9640q0758o6579o6876q3798j14241j55754j72947
8398A034138j45293r9706m8592r205N182J622o495q422n641j5265l1324m2905
8386F28094k9532L420Q853j4660o9277j40588j67850j30105l4675O7164J21245
8375B42089J24938P9572J5048j3496j3396N030L5827N5313M3706j17k7174j8172
8363E29168j4810q913L1629P0392Q3285P7574J9378q6144j50967j30390q5541
8352C34661m5559k2411n2695j18445j25719o7130k1535m726K0876M3665J7205
8341d1813l4971n8854l7125J5036O9570P5119K7914j3270q788J0367K4756M6136
$$ plain form
8329 74077 130450 148738 96285 11515 -56694 -112282 -177375 -251886 -324536 -405221 -491235 -541283
8317 -541283 -531280 -483562 -439460 -401773 -350753 -288217 -206358 -102219 22236 149734 245652
8306 245652 318402 386022 439351 460904 438187 380259 327284 327742 387451 478391 552484 550353
8294 550353 463409 347390 253598 201908 218730 293762 378445 435600 451409 420243 333911
8283 333911 212419 120854 99536 132978 169046 159604 108686 43429 -37987 -112934 -142273 -132497
8271 -132497 -112549 -92302 -71883 -41784 -6537 18836 32606 51351 73300 46670 -58939
8260 -58939 -200823 -321823 -386720 -387872 -346409 -283713 -216118 -153427 -83862 2504 52707 13830
8248 13830 -64411 -106944 -82840 14295 110239 140208 129083 98481 43572 -30105 -86978 -93337
$$ packed form
8329G4077N6373J8288n2453q4770o8209n5588o5093p4511p2650q0685q6014n0048
8317e41283J0003M7718M4102L7687N1020O2536Q1859J04139J24455J27498R5918
8306B45652P2750O7620N3329K1553k2717n7928n2975M58N9709R0940P4093k131
8294E50353q6944j16019r3792n1690J6822P5032Q4683N7155J5809l1166q6332
8283C33911j21492r1565k1318L3442L6068r442n0918o5257q1416p4947k9339R776
8271a32497J9948K0247K0419L0099L5247K5373J3770J8745K1949k6630j05609
8260e8939j41884j21000o4897j152M1463O2696O7595O2691O9565Q6366N0203l8877
8248A3830p8241m2533K4104R7135R5944K9969j1125l0602n4909p3677n6873o359
$$ plain form
8236 -93337 -47584 28256 115444 177419 190999 187033 196960 205004 177019 105865 33630 8693
8224 8693 16208 25206 9590 -37016 -108372 -188682 -236932 -235245 -191783 -110593 -7147 104527
8212 104527 195923 249107 260212 213690 124424 39841 -3925 -858 47374 128182 200987 226407
8200 226407 203765 157366 103884 69178 78179 102416 116762 138634 167880 180879 174734 173261
8188 173261 186800 227851 304991 397169 485676 539798 527363 449621 336925 232980 167438
8177 167438 172382 244784 326789 356487 340822 330381 334988 331752 302647 241618 153713 74731
8165 74731 45144 72305 111529 114103 92859 97594 137920 189132 237867 259813 237754 190374
8153 190374 152457 129220 96834 60310 35973 13265 -41879 -135805 -216445 -257719 -279411 -272128
$$ packed form
8236i3337M5753P5840Q7188O1975J3580l966R927Q044k7985p1154p2235k4937
8224H693P515Q998j5616m6606p1356q0310m8250J687M3462Q1190J03446J11674
8212A04527R1396N3184J1105m6522q9266q4583m3766L067M8232Q0808P2805K5420
8200B26407k2642m6399n3482l4706R001K4237J4346K1872K9246J2999o145j473
8188A73261J3539M1051P7140R2178Q8507N4122j2435p7742j12696j03945o5542
8177A67438M944P2402Q2005K9698j5665j0441M607l236k9105o1029q7905p8982
8165G4731k9587K7161L9224K574k1244M735M0326N1212M8735K1946k2059m7380
8153A90374l7917k3237l2386l6524k4337k2708n5144r3926q0640m1274k1692P283
$$ plain form
8141 -272128 -229176 -187609 -171825 -169937 -188808 -226705 -242579 -219197 -164730 -90285 14716 147483
8129 147483 259959 330975 378089 409773 430299 426468 364902 251855 131976 63992 81449
8118 81449 156224 212678 204195 167283 163056 195301 244654 311591 377268 395013 349942 265698
8106 265698 172974 89893 31469 5843 -1770 8934 36416 38661 -14805 -83686 -114178 -89677
8094 -89677 -32216 8356 3377 -30825 -59417 -72779 -69117 -45596 -19692 -15035 -25187 -25254 -6251
8081 -6251 25290 42671 48180 83996 143721 209237 297851 416080 541943 654144 721361 731806
8069 731806 699812 642392 585813 537142 479830 390603 300899 284799 360695 458698 534828 599921
8057 599921 649471 668506 650638 612439 579481 565630 558719 530670 488879 463012 462446 496546
$$ packed form
8141b72128M2952M1567J5784J888j8871l7897j5874K3382N4467P4445J05001J32767
8129A47483J12476P1016M7114L1684K0526l831o1566j13047j19879o7984J7457
8118H1449P4775N6454q483l6912m227L2245M9353O6937O5677J7745m5071q4244
8106B65698r2724q3081n8424k5626p613J0704K7482K245n3466o8881l0492K4501
8094h9677N7461M0572m979l4202k8592j3362L662K3521K5904M657j0152o7J9003
8081f251L1541J7381N509L5816N9725O5516Q8614J18229J25863J12201O7217J0445
8069G31806l1994n7420n6579m8671n7312q9227q9704j6100P5896R8003P6130O5093
8057E99921M9550J9035j7868l8199l2958j3851o911k8049m1791k5867n66L4100
$$ plain form
8045 496546 542682 548250 526395 526659 557826 588271 583671 559801 554547 596347 700741 845588
8033 845588 996458 1110912 1161550 1162575 1152189 1183327 1278103 1417142 1600961 1844976 2154462
8022 2154462 2524849 2916952 3269123 3545447 3737092 3836899 3820530 3662707 3381875 3020627
8012 3020627 2600960 2173302 1799565 1498977 1250720 1046390 888649 773969 698097 635031
8002 635031 537567 404630 291370 225975 178157 107194 20274 -52464 -89218 -79932 -36453
7991 -36453 14028 41853 37171 20252 22771 45265 61069 49037 -5639 -89421 -156600 -162103
7979 -162103 -88788 35502 157287 231576 220439 133118 37233 -989 50458 153836 244689
7968 244689 308588 333847 300727 223911 130057 37777 -61590 -150845 -188742 -177753 -141375 -87852
$$ packed form
8045D96546M6136N568k1855K64L1167L0445m600k3870n254M1800J04394J44847
8033H45588J50870J14454N0638J025j0386L1138R4776J39039J83819K44015L09486
8022B154462L70387L92103L52171K76324J91645R9807j6369j57823k80832l61248
8012C020627m19667m27658l73737l00588k48257k04330j57741j14680p5872o3066
8002F35031r7464j32937j13260o5395m7818p0963q6920p2738l6754R286M3479
7991c6453N0481K7825m682j6919K519K2494J5804j2032n4676q3782o7179n503
7979a62103P3315J24290J21785P4289j1137q7321r5885l8222N1447J03378R0853
7968B44689O3899K5259l3120p6816r3854r2280r9367q9255l7897J0989L6378N3523
$$ plain form
7956 -87852 -42179 -27444 -44642 -80646 -105389 -97813 -87615 -94006 -82266 -32575 21633 41507
7944 41507 29939 20781 35291 44763 19531 -10760 -12776 1591 1559 -27977 -57792 -50031 -12213
7931 -12213 39428 86777 118759 150962 168326 132947 51102 -45857 -123021 -138224 -90022 -20343
7919 -20343 38779 67495 62971 47044 34083 22968 -13058 -75909 -133305 -170562 -177328 -159844
7907 -159844 -139681 -114950 -69107 -11184 33332 51327 41838 33208 46518 60240 63943 78830
7895 78830 86455 58263 20267 -13336 -63695 -130849 -188703 -218871 -229078 -217588 -190591 -179714
7883 -179714 -204654 -258508 -330591 -391972 -412757 -398597 -366631 -340236 -310471 -249110 -148903
7872 -148903 -18651 111461 203298 227205 179328 102993 39425 -30469 -145237 -291972 -423945
$$ packed form
7956h7852M5673J4735j7198l6004k4743P576J0198o391J1740M9691N4208J9874
7944D1507j1568r158J4510R472k5232l0291k016J4367l2k9536k9815P761L7818
7931a2213N1641M7349L1982L2203J7364l5379q1845r6959p7164j5203M8202O9679
7919b0343N9122K8716m524j5927j2961j1115l6026o2851n7396l7257o766J7484
7907a59844K0163K4731M5843N7923M4516J7995r489q630J3310J3722L703J4887
7895G8830P625k8192l7996l3603n0359o7154n7854l0168j0207J1490K6997J0877
7883a79714k4940n3854p2083o1381k0785J4160L1966K6395K9765O1361J00207
7872a48903J30252J30112R1837K3907m7877p6335o3568o9894j14768j46735j31973
$$ plain form
7861 -423945 -527512 -596126 -618762 -598440 -540686 -472669 -434728 -425931 -444359 -489487 -541483 -587091
7849 -587091 -618744 -646161 -660936 -631137 -563486 -489440 -421491 -339000 -223006 -90559 13232
7838 13232 63936 82192 110125 157125 195317 193132 135151 47127 -40642 -138398 -263685 -383531
7826 -383531 -436622 -409969 -332405 -226013 -101486 18387 100867 132321 141453 153227 165085
7815 165085 183615 214573 239741 260325 283296 303005 314358 273704 167329 38405 -67817
7804 -67817 -124322 -126229 -112500 -124331 -134863 -122091 -92204 -72884 -80188 -96202 -75470 -533
7792 -533 59630 47686 -4571 -53746 -83566 -88907 -70183 -25413 46712 154003 279604 359040
7780 359040 363956 339181 316781 264532 178878 115684 86200 41912 -42460 -134456 -202155 -253053
$$ packed form
7861d23945j03567o8614k2636K0322N7754O8017L7941Q797j8428m5128n1996m5608
7849e87091l1653k7417j4775K9799O7651P4046O7949Q2491J15994J32447J03791
7838A3232N0704J8256K7933M7000L8192k185n7981q8024q7769r7756j25287j19846
7826c83531n3091K6653P7564J06392J24527J19873Q2480L1454R132J1774J1858
7815A65085J8530L0958K5168K0584K2971J9709J1353m0654j06375j28924j06222
7804f7817n6505j907J3729j1831j0532J2772K9887J9320p304j6014K0732P4937
7792e33O0163j1944n2257m9175k9820n341J8724M4770P2125J07291J25601P9436
7780C59040M916k4775k2400n2249q5654o3194k9484m4288q4372r1996o7699n0898
$$ plain form
7768 -253053 -290485 -281265 -215835 -139309 -65104 29273 137023 231847 287399 306654 313172 311870
7756 311870 295977 252669 200776 182225 198348 220614 217178 189424 161898 151227 154564 152285
7744 152285 135431 113036 75412 8974 -86633 -183479 -235669 -225147 -165145 -90171 -30704 15827
7732 15827 37087 27703 28727 47215 47702 -3070 -77878 -95619 -48707 18267 89009 144827 163737
7719 163737 131518 55114 -27569 -73734 -60726 15119 116995 204328 279653 353230 399559
7708 399559 398057 365830 309463 218866 101866 8823 -19402 822 33584 63762 88081 103659
7696 103659 129877 176521 217405 244354 293283 362120 410443 418430 394999 371662 359872 326412
7684 326412 247742 166315 126834 142076 191292 223365 207517 170023 140774 136490 169133 226501
$$ packed form
7768b53053l7432R220O5430P6526P4205R4377J07750R4824N5552J9255O518j302
7756C11870j5893m3308n1893j8551J6123K2266l436k7754k7526j0671L337k279
7744A52285j6854k2395l7624o6438r5607r6846n2190J0522O0002P4974N9467M6531
7732A5827K1260r384J024J8488M87n0772p4808j7741M6912O6974P0742N5818J8910
7719A63737l2219p6404q2683m6165J3008P5845J01876Q7333P5325P3577M6329
7708C99559j502l2227n6367r0597j17000r3043k8225K0224L2762L0178K4319J5578
7696A03659K6218M6644M0884K6949M8929O8837M8323P987k3431k3337j1790l3460
7684C26412p8670q1427l9481J5242M9216L2073j5848l7494k9249m284L2643N7368
$$ plain form
7672 226501 272510 258678 185843 114017 65782 24871 -21929 -80180 -116586 -87737 2045 135975
7660 135975 284819 384269 403072 346146 241420 138457 66615 21390 -29393 -81156 -107496
7649 -107496 -110298 -111219 -119812 -139087 -170945 -192742 -192797 -190188 -182305 -171935 -159533 -115698 -39883
7636 -39883 16983 18828 -7125 -26204 -42221 -64986 -74223 -56814 -35697 -55607 -104648 -115311
7624 -115311 -80897 -44740 -24858 -12665 -3491 -10357 -27698 -42177 -77524 -150310 -223686 -259066
7612 -259066 -259567 -233420 -183982 -115797 -51264 -46706 -120545 -207382 -243249 -245489 -228938 -181870
7600 -181870 -109072 -45291 -20001 -6916 12699 26964 29949 14797 -25972 -73483 -78272 -26470
7588 -26470 30947 47204 29529 3164 -6728 -13396 -67590 -159529 -216788 -194982 -117552 -40863
$$ packed form
7672B26501M6009j3832p2835p1826m8235m0911m6800n8251l6406K8849Q9782J33930
7660A35975J48844R9450J8803n6926j04726j02963p1842m5225n0783n1763k6340
7649a07496k802r21q593j9275l1858k1797n5K609P883J0370J2402M3835P5815
7636c9883N6866J845k5953j9079j6017k2765r237J7409K1117j9910m9041j0663
7624a15311L4414L6157J9882J2193R174o866j7341j4479l5347p2786p3376l5380
7612b59066n01K6147M9438O8185O4533M558p3839q6837l5867k240J6551M7068
7600a81870P2798O3781K5290J3085J9615J4265K985j5152m0769m7511m789N1802
7588b6470N7417J6257j7675k6365r892o668n4194r1939n7259K1806P7430P6689
$$ plain form
7576 -40863 -16088 -67271 -165368 -250787 -275757 -233891 -175676 -144242 -120415 -71740 3702 89390
7564 89390 194822 304721 359519 329658 256925 223265 262200 335197 410658 476889 529276
7553 529276 602445 700866 773887 802149 790761 728958 654099 613905 595029 578237 575148 581863
7541 581863 566801 514916 434901 364208 341421 345650 334075 301299 285844 294250 282289 242612
7529 242612 199423 161184 144875 175509 262164 403780 585071 748439 827680 803224 718739
7518 718739 645428 623258 623766 589428 510471 427902 337834 208869 70956 -16177 -53324 -61452
7506 -61452 -16448 83199 172424 209362 214514 198811 174949 169091 184059 201369 189269 131503
7494 131503 50978 -8516 -4242 69180 139470 167893 198059 230496 210107 136882 62440 18993
$$ packed form
7576d0863K4775n1183r8097q5419k4970M1866N8215L1434K3827M8675P5442Q5688
7564H9390J05432J09899N4798k9861p2733l3660L8935P2997P5461O6231N2387
7553E29276P3169R8421P3021K8262j1388o1803p4859m0194j8876j6792l089O715
7541E81863j5062n1885q0015p0693k2787M229j1575l2776j5455Q406j1961l9677
7529B42612m3189l8239j6309L0634Q6655J41616J81291J63368P9241k4456q4485
7518G18739p3311k2170N08l4338p8957q2569r0068j28965j37913q7133l7147q128
7506f1452M5004R9647Q9225L6938N152j5703k3862n858J4968J7310j2100n7766
7494A31503q0525n9494M274P3422P0290K8423L0166L2437k0389p3225p4442m3447
$$ plain form
7482 18993 -1347 -20152 -50154 -78653 -90188 -113287 -181034 -270780 -345840 -412706 -484791 -529106
7470 -529106 -517324 -488400 -467253 -439396 -400174 -367370 -343903 -296121 -202926 -84430 19458
7459 19458 68652 80541 98519 114138 100121 44113 -36821 -95063 -116497 -125122 -136536 -150025
7447 -150025 -182378 -250114 -309548 -272068 -139774 -9815 63985 84524 57725 3676 -43941
7436 -43941 -77277 -90833 -84823 -85766 -117805 -153666 -165420 -162325 -128770 -72779 -21313 19022 51410
7423 51410 90749 138061 190096 238565 254785 218007 149923 74102 3402 -67483 -136606 -159494
7411 -159494 -125586 -81380 -43999 8203 74923 135122 150045 95373 6877 -56689 -84501 -98902
7399 -98902 -108715 -86895 -7517 106445 218126 313897 354377 319024 255370 204557 163061 129599
$$ packed form
7482A8993k0340j8805l0002k8499j1535k3099o7747q9746p5060o6866p2085m4315
7470e29106J1782K8924K1147K7857L9222L2804K3467M7782R3195J18496J03888
7459A9458M9194J1889J7978J5619j4017n6008q0934n8242k1434q625j1414j3489
7447a50025l2353o7736n9434L7480J32294J29959P3800K0539k6799n4049m7617
7436d3941l3336j3556O010r43l2039l5861j1754L095L3555N5991N1466M0335L2388
7423E1410L9339M7312N2035M8469J6220l6778o8084p5821p0700p0885o9123k2888
7411a59494L3908M4206L7381N2202O6720O0199J4923n4672q8496o3566k7812j4401
7399i8902r813K1820P9378J13962J11681R5771M0480l5353o3654n0813m1496l3462
$$ plain form
7387 129599 114679 99208 39876 -47645 -118679 -145443 -135283 -127391 -134635 -144610 -131582 -89563
7375 -89563 -41268 7019 56825 98788 124783 130081 137053 164539 174821 148045 109182 82980
7363 82980 115188 205771 281442 321784 339986 321492 272208 229955 216768 223756 224992 209361
7351 209361 180115 168272 212306 287751 325642 292476 219808 176363 215547 312210 395887 428827
7339 428827 407034 349872 284209 233799 205813 200864 207815 220164 250999 285885 267714 174580
7327 174580 59800 -17047 -37969 -35965 -48761 -81455 -117037 -148731 -175094 -183095 -143126 -79123
7315 -79123 -32169 -2318 20423 49892 77475 76911 47415 14775 1287 7881 28050 51375
7303 51375 80251 134809 214271 265224 249287 204156 157273 103041 49775 29456 66044 130578
$$ packed form
7387A29599j4920j5471n9332q7521p1034k6764J0160P892p244r975J3028M2019
7375h9563M8295M8287M9806M1963K5995N298O972K7486J0282k6776l8863k6202
7363H2980L2208R0583P5671M0342J8202j8494m9284m2253j3187O988J236j5631
7351B09361k9246j1843M4034P5445L7891l3166p2668m3445L9184R6663Q3677L2940
7339D28827k1793n7162o5663n0410k7986m949O951J2349L0835L4886j8171r3134
7327A74580j14780p6847k0922K004j2796l2694l5582l1694k6363q001L9969O4003
7315g9123M6954K9851K2741K9469K7583n64k9496l2640j3488O594K0169K3325
7303E1375K8876N4558P9462N0953j5937m5131m6883n4232n3266k0319L6588O4534
$$ plain form
7291 130578 194236 243113 258551 258845 307569 400177 447786 414207 334194 247195 204526 229619
7279 229619 285929 332514 352622 348936 328244 307962 294129 273238 256392 241872 201875 158842
7267 158842 132875 100061 58418 43938 75248 140138 219387 280606 308230 320509 324914 312424
7255 312424 285767 257158 234923 218579 209406 197855 169562 151200 168854 220994 297137 384809
7243 384809 489442 616382 744786 850971 940972 1059083 1237942 1460657 1680154 1878406
7233 1878406 2067820 2225735 2338038 2442400 2580833 2758726 2959606 3169595 3378086 3565549
7223 3565549 3722120 3838774 3904455 3889819 3746991 3465960 3088306 2695789 2331912 1991316
7213 1991316 1707160 1491627 1298391 1111354 950248 821275 724630 656263 596959 525985
$$ packed form
7291A30578O3658M8877J5438K94M8724R2608M7609l3579q0013q6999m2669K5093
7279B29619N6310M6585K0108l686k0692k0282j3833k0891j6846j4520l9997m3033
7267A58842k5967l2814m1643j4480L1310O4890P9249O1219K7624J2279M405j2490
7255C12424k6657k8609k2235j6344r173j1551k8293j8362J7654N2140P6143Q7672
7243C84809J04633J26940J28404J06185R0001J18111J78859K22715K19497J98252
7233A878406J89414J57915J12303J04362J38433J77893K00880K09989K08491J87463
7223C565549J56571J16654O5681j4636j42828k81031l77654l92517l63877l40596
7213A991316k84156k15533j93236j87037j61106j28973r6645o8367n9304p0974
$$ plain form
7203 525985 450350 418440 463426 571204 677120 715395 682789 629901 620581 656357 681874
7192 681874 662048 599124 513828 452192 440098 468640 540690 624269 669527 698727 735571 754708
7180 754708 764834 776390 774788 771271 766245 724911 646748 590910 587280 601643 587039 536780
7168 536780 496042 498099 526772 554154 573295 604143 645570 698385 738190 721540 666008 610488
7156 610488 574717 584503 638592 712380 806381 909501 982746 1020687 1062626 1145814 1265097
7145 1265097 1378605 1481841 1599721 1750076 1931912 2135248 2354437 2577258 2780076 2918101
7135 2918101 2942118 2842371 2654532 2437352 2249001 2104128 1985661 1890621 1821985 1778465
7125 1778465 1754118 1745885 1752437 1764496 1780437 1823519 1897023 1994811 2141176 2327038 2516174
$$ packed form
7203E25985p5635l1910M4986J07778J05916L8275l2606n2888r320L5776K5517
7192F81874j9826o2924q5296o1636j2094K8542P2050Q3579M5258K9200L6844J9137
7180G54708J0126J1556j602l517n026m1334p8163n5838l630J4363j4604n0259
7168E36780m0738K057K8673K7382J9141L0848M1427N2815L9805j6650n5532n5520
7156F10488l5771R786N4089P3788R4001J03120P3245L7941M1939Q3188J19283
7145A265097J13508J03236J17880J50355J81836K03336K19189K22821K02818J38025
7135B918101K4017r9747j87839k17180j88351j44873j18467r5040o8636m3520
7125A778465k4347q233O552J2059J5941M3082P3504R7788J46365J85862J89136
$$ plain form
7114 2516174 2688267 2853207 3045990 3293583 3586681 3912313 4280611 4622926 4813513 4797161
7104 4797161 4646570 4474388 4312576 4161687 4081727 4089001 4118685 4157561 4244958 4386146 4567753
7093 4567753 4778013 5001637 5260345 5587903 5969723 6378238 6818495 7332537 7957713 8706560
7083 8706560 9552093 10446561 11410110 12538263 13929074 15627473 17670389 20121766 23093639
7074 23093639 26759064 31324475 37020051 44169957 53216460 64674952 79055566 96845610
7066 96845610 118632118 145110176 176599784 211940208 247187274 275494021 289583758
7059 289583758 285225263 262944993 228589115 190902212 156444859 127704664 104633639
7052 104633639 86352254 71897918 60416450 51226669 43815387 37755671 32733700 28558266
$$ packed form
7114B516174J72093J64940J92783K47593K93098L25632L68298L42315J90587j6352
7104D797161j50591j72182j61812j50889p9960P274K9684L8876Q7397J41188J81607
7093D567753K10260K23624K58708L27558L81820M08515M40257N14042O25176P48847
7083H706560Q45533Q94468R63549J128153J390811J698399K042916K451377K971873
7074B3093639L665425M565411N695576P149906R046503J1458492J4380614J7790044
7066I6845610K1786508K6478058L1489608L5340424L5247066K8306747J4089737
7059B89583758m358495k2280270l4355878l7686903l4457353k8740195k3071025
7052A04633639j8281385j4454336j1481468r189781p411282o059716n021971m175434
$$ plain form
7044 28558266 25090965 22224743 19839399 17783737 15974355 14384852 12989536 11768601
7036 11768601 10717331 9796630 8946544 8153270 7434586 6802935 6250637 5751457 5289046
7027 5289046 4880504 4546744 4281704 4036577 3793830 3590407 3431568 3285968 3147424 3023736
7017 3023736 2932394 2878129 2833913 2799834 2798180 2834928 2910277 3003403 3087032 3127558 3088956 2973576
7005 2973576 2815383 2634268 2450665 2290992 2165509 2057861 1949491 1863005 1807857 1759654
6995 1759654 1711655 1664509 1597607 1501484 1426651 1413086 1403694 1367040 1366410 1465690 1651055 1870204
6983 1870204 2102036 2319366 2488596 2591834 2622499 2570495 2437702 2252760 2047508 1863762
6973 1863762 1733855 1667418 1654153 1658071 1634872 1573098 1488460 1404909 1330561 1251730 1167900
$$ packed form
7044B8558266l467301k866222k385344k055662j809382j589503j395316j220935
7036A1768601j051270r20701q50086p93274p18684o31651n52298m99180m62411
7027E289046m08542l33760k65040k45127k42747k03423j58839j45600j38544j23688
7017C023736r1342n4265m4216l4079j654L6748P5349R3126Q3629M0526l8602j15380
7005B973576j58193j81115j83603j59673j25483j07648j08370q6486n5148m8203
6995A759654m7999m7146o6902r6123p4833j3565r392l6654o30R9280J85365K19149
6983A870204K31832K17330J69230J03238L0665n2004j32793j84942k05252j83746
6973A863762j29907o6437j3265L918k3199o1774q4638q3551p4348p8831q3830
$$ plain form
6962 1167900 1094500 1049279 1037191 1037811 1032478 1013749 966548 893198 838526 836508 861183 864251
6950 864251 844921 835737 826329 794495 756526 740580 757800 779414 775546 768659 783592 805264
6938 805264 820135 835241 828563 766898 664397 561898 491679 461455 477719 539343 580820
6927 580820 528575 409911 297180 212157 132158 38837 -35552 -32003 39934 131409 215977
6916 215977 280670 314861 306065 272811 237323 218083 250372 324911 396580 448548 485982 526312
6904 526312 581317 613227 575896 479641 356940 216845 79863 -13657 -49828 -31685 39763
6893 39763 131358 178275 167111 151819 163835 182948 189552 188836 198247 217537 234942 236966 253109
6880 253109 329409 448726 558339 636349 692214 731530 742498 720560 680315 624720 563857
$$ packed form
6962A167900p3400m5221j2088O20n333j8729m7201p3350n4672k018K4675L068
6950H64251j9330r184r408l1834l7969j5946J7220K1614l868o887J4933K1672
6938H05264J4871J5106o678o1665j02501j02499p0219l0224J6264O1624M1477
6927E80820n2245j18664j12731q5023p9999r3321p4389L549P1937R1475Q4568
6916B15977O4693L4191q796l3254l5488j9240L2289P4539P1669N1968L7434M0330
6904E26312N5005L1910l7331r6255j22701j40095j36982r3520l6171J8143P1448
6893C9763R1595M6917j1164j5292J2016J9113O604p16R411J9290J7405K024J6143
6880B53109P6300J19317J09613P8010N5865L9316J0968k1938m0245n5595o0863
$$ plain form
6869 563857 521427 507482 493135 437503 337232 220932 149265 160819 215600 266341 293360
6858 293360 303608 293367 261962 248731 263670 279297 292541 304134 294186 266827 255471 255036
6846 255036 220252 142417 92660 123777 200434 278871 346824 416314 487887 551518 619639 716939
6834 716939 849968 968743 1007404 987694 961377 932704 896620 884727 942358 1073951 1227124
6823 1227124 1333467 1385891 1424589 1501929 1632606 1751223 1789230 1784509 1837890 1983299 2201235
6812 2201235 2461032 2742586 3058982 3454123 3949179 4554673 5290078 6193335 7312613
6803 7312613 8675653 10341859 12422031 15026024 18288475 22357089 27145345 32146157
6795 32146157 36489968 39260152 39909340 38518012 35656684 31936016 27858130 23857422
$$ packed form
6869E63857m2430j3945j4347n5632j00271j16300p1667J1554N4781N0741K7019
6858B93360J0248j0241l1405j3231J4939J5627J3244J1593r948k7359j1356m35
6846B55036l4784p7835m9757L1117P6657P8437O7953O9490P1573O3631O8121R7300
6834G16939J33029J18775L8661j9710k6317k8673l6084j1893N7631J31593J53173
6823A227124J06343N2424L8698P7340J30677J18617L8007m721N3381J45409K17936
6812B201235K59797K81554L16396L95141M95056O05494P35405R03257J119278
6803G312613J363040J666206K080172K603993L262451M068614M788256N000812
6795C2146157M343811K770184O49188j391328k861328l720668m077886m000708
$$ plain form
6787 23857422 20241809 17137178 14531346 12348896 10521196 9032899 7856530 6907223
6779 6907223 6122800 5489523 4948797 4434117 3956037 3542099 3175630 2857543 2620480 2457696
6769 2457696 2321944 2189370 2051718 1897357 1718609 1524660 1337764 1179210 1063468 986574
6759 986574 932271 889133 855533 812017 745383 677818 630794 602802 595803 586030 526016 424197
6747 424197 326929 273897 276468 337192 441329 542967 598293 610295 589749 546712 509140
6736 509140 470477 424256 373388 311051 272119 287509 327259 343207 318167 279714 253292 236371
6724 236371 231943 252063 290298 345265 418599 474578 502906 532109 566512 602894 638745 655924
6712 655924 629991 577121 521911 469791 439011 415546 386230 362739 353737 373561 410533 427905
$$ packed form
6787B3857422l615613l104631k605832k182450j827700j488297j176369r49307
6779F907223p84423o33277n40726n14680m78080m13938l66469l18087k37063j62784
6769B457696j35752j32574j37652j54361j78748j93949j86896j58554j15742p6894
6759I86574n4303m3138l3600m3516o6634o7565m7024k7992o999r773o0014j01819
6747D24197r7268n3032K571O0724J04137J01638N5326J2002k0546m3037l7572
6736E09140l8663m6221n0868o2337l8932J5390L9750J5948k5040l8453k6422j6921
6724B36371m428K0120L8235N4967P3334N5979K8328K9203L4403L6382L5851J7179
6712F55924k5933n2870n5210n2120l0780k3465k9316k3491r002J9824L6972J7372
$$ plain form
6700 427905 404865 348214 262674 151854 47810 -37111 -110549 -147463 -126893 -90258 -81571
6689 -81571 -69851 -17839 43385 47456 -2863 -57853 -84036 -59640 31 55979 78513 75324
6677 75324 82253 113224 128590 76326 -22402 -98428 -119081 -117904 -132581 -149474 -156616 -170383
6665 -170383 -179811 -144945 -53010 55998 144476 211458 263974 280390 237821 155598 75426 16593
6653 16593 -31421 -69022 -82262 -57899 -8596 16894 -19305 -98107 -147647 -136726 -113753 -133746
6641 -133746 -181804 -213304 -186226 -119126 -64587 -25846 -167 21643 44469 37541 -19691 -99220
6629 -99220 -192799 -320288 -432261 -455209 -397858 -326441 -294102 -307322 -353198 -389164 -389216 -372082
6617 -372082 -322805 -225302 -142786 -140562 -228080 -355115 -444177 -462887 -440725 -411689 -351747 -247105
$$ packed form
6700D27905k3040n6651q5540j10820j04044q4921p3438l6914K0570L6635Q687
6689h1571J1720N2012O1224M071n0319n4990k6183K4396N9671N5948K2534l189
6677G5324O929L0971J5366n2264r8728p6026k0653J177j4677j6893p142j3767
6665a70383r428L4866R1935J09008Q8478O6982N2516J6416m2569q2223q0172n8833
6653A6593m8014l7601j3240K4363M9303K5490l6199p8802m9540J0921K2973j9993
6641a33746m8058l1500K7078O7100N4539L8741K5679K1810K2826o928n7232p9529
6629i9220r3579j27489j11973k2948N7351P1417L2339j3220m5876l5966n2J7134
6617c72082M9277R7503Q2516K224q7518j27035q9062j8710K2162K9036N9942J04642
$$ plain form
6605 -247105 -138827 -77574 -67682 -80846 -97553 -138862 -202750 -244282 -248020 -222913 -191443 -192679
6593 -192679 -235087 -292628 -324036 -312076 -273278 -229330 -194663 -202938 -251838 -282958 -269326 -231913
6581 -231913 -186525 -124597 -40675 35673 42271 -37607 -135483 -191925 -213216 -207767 -171149 -123441
6569 -123441 -107974 -149088 -217652 -271106 -306379 -329207 -327045 -301478 -268534 -229733 -168092 -80034
6557 -80034 3213 66819 102848 109276 106735 111732 104438 82817 62209 35475 -1391 -36193 -72673
6544 -72673 -134670 -203345 -242296 -234015 -182666 -122879 -69253 -25951 -6763 -24524 -60573 -83123
6532 -83123 -83935 -69131 -31317 31620 83140 93753 53369 -17447 -64027 -58522 -50993 -86785 -144387
6519 -144387 -195460 -229737 -235588 -199717 -127634 -61360 -40736 -43430 -28893 -33551 -108250 -224842
$$ packed form
6605b47105J08278O1253R892j3164j6707m1309o3888m1532l738K5107L1470j236
6593a92679m2408n7541l1408J1960L8798M3948L4667q275m8900l1120J3632L7413
6581b31913M5388O1928Q3922P6348O598p9878r7876n6442k1291N449L6618M7708
6569a23441J5467m1114o8564n3454l5273k2828K162K5567L2944L8801O1641Q8058
6557h0034Q3247O3606L6029O428k541M997p294k1621k0608k6734l6866l4802l6480
6544g2673o1997o8675l8951Q281N1349N9787N3626M3302J9188j7761l6049k2550
6532h3123q12J4804L7814O2937N1520J0613m0384p0816m6580N505P529l5792n7602
6519a44387n1073l4277n851L5871P2083O6274K0624k694J4537m658p4699j16592
$$ plain form
6507 -224842 -330754 -393788 -408507 -383318 -345824 -307336 -278381 -279323 -305825 -307386 -254065 -184405
6495 -184405 -153606 -177772 -235706 -312726 -375759 -389292 -355623 -293746 -235229 -217975 -227718 -227929
6483 -227929 -216285 -207163 -217412 -258678 -328898 -388580 -404906 -384511 -345679 -314270 -294520 -288041
6471 -288041 -297384 -305268 -311734 -333301 -376376 -404557 -382099 -324199 -254298 -173614 -88826 -29587
6459 -29587 -32941 -81369 -130486 -149843 -144759 -151521 -175020 -193887 -200475 -211320 -243510 -269749 -250938
6446 -250938 -190785 -128031 -74680 -27662 985 -17937 -93332 -172809 -216091 -214166 -165899 -109231
6434 -109231 -71453 -59902 -74503 -97443 -109716 -95394 -51550 3596 54061 95524 128859 137561
6422 137561 92789 14613 -37600 -42929 -25220 -2237 8082 -11506 -63987 -116944 -119892 -35216
$$ packed form
6507b24842j05912o3034j4719K5189L7494L8488K8955r42k6502j561N3321O9660
6495a84405L0799k4166n7934p7020o3033j3533L3669O1877N8517J7254r743k11
6483b27929J1644R122j0249m1266p0220n9682j6326K0395L8832L1409J9750O479
6471b88041r343p884o466k1567m3075k8181K2458N7900O9901Q0684Q4788N9239
6459b9587l354m8428m9117j9357N084o762k3499j8867o588j0845l2190k6239J8811
6446b50938O0153O2754N3351M7018K8647j8922p5395p9477m3282J925M8267N6668
6434a09231L7778J1551j4601k2940j2273J4322M3844N5146N0465M1463L3335Q702
6422A37561m4772p8176n2213n329J7709K2983J0319j9588n2481n2957k948Q4676
$$ plain form
6410 -35216 128763 288890 362753 363445 344633 332459 353202 428559 531989 612743 640316 610025
6398 610025 525564 404718 284512 188009 118520 97345 131790 191091 237177 247283 215490
6387 215490 161184 116973 95128 100979 167867 301386 444998 538531 575866 581930 585727 607610
6375 607610 626529 623027 619325 621285 612013 590834 549458 479724 394250 305854 211362 134435
6363 134435 122931 167585 237293 334663 447363 532443 578011 599886 584626 531733 483077
6352 483077 466905 477610 473264 453555 460779 476383 455548 426865 433948 469423 500662 496676
6340 496676 448746 357179 247537 203878 279361 414258 519383 556422 529549 450140 320523
6329 320523 175350 86600 64167 44574 -12991 -106920 -217618 -316103 -380781 -406947 -410086
$$ packed form
6410c5216J63979J60127P3863O92j8812j2174K0743P5357J03430Q0754K7573l0291
6398F10025q4461j20846j20206r6503o9489k1175L4445N9301M6086J0106l1793
6387B15490n4306m4211k1845N851O6888J33519J43612R3533L7335O064L797K1883
6375F07610J8919l502l702J960r272k1179m1376o9734q5474q8396r4492p6927
6363A34435j1504M4654O9708R7370J12700Q5080M5568K1875j5260n2893m8656
6352D83077j6172J0705m346j9709P224J5604k0835k8683P083L5475L1239l986
6340D96676m7930r1567j09642m3659P5483J34897J05125L7039k6873p9409j29617
6329C20523j45173q8750k2433j9593n7565r3929j10698r8485o4678k6166l139
$$ plain form
6318 -410086 -393649 -348789 -288055 -231404 -182768 -144436 -110039 -74566 -50049 -24268 1653 10348
6306 10348 16604 26327 31726 31515 12175 -15646 -42157 -60209 -44508 23130 116715 181578 182689
6293 182689 148496 118746 99830 86538 91023 124604 168156 194403 187142 154345 99038 20664
6281 20664 -56409 -100467 -97780 -68291 -48564 -56481 -97389 -123102 -104842 -63892 -20857 -11052
6269 -11052 -46130 -96777 -145290 -202454 -269306 -333862 -371777 -386644 -416097 -452660 -440073 -359654
6257 -359654 -264547 -202588 -155484 -120103 -115722 -120993 -94237 -23964 79081 193650 275311 320206
6245 320206 344474 344699 305279 233993 170918 135100 118592 94479 32485 -63281 -145094 -178163
6233 -178163 -176035 -156938 -132482 -102003 -56873 -38186 -79097 -144896 -196923 -232825 -248979 -243849
$$ packed form
6318d10086J6437M4860O0734N6651M8636L8332L4397L5473K4517K5781K5921Q695
6306A0348O256R723N399k11j9340k7821k6511j8052J5701O7638R3585O4863J111
6293A82689l4193k9750j8916j3292M485L3581M3552K6247p261l2797n5307p8374
6281B0664p7073m4058K687K9489J9727p917m0908k5713J8260M0950M3035R805
6269a1052l5078n0647m8513n7164o6852o4556l7915j4867k9453l6563J2587Q0419
6257c59654R5107O1959M7104L5381M381n271K6756P0273J03045J14569Q1661M4895
6245C20206K4268K25l9420p1286o3075l5818j6508k4113o1994r5766q1813l3069
6233a78163K128J9097K4456L0479M5130J8687m0911o5799n2027l5902j6154N130
$$ plain form
6221 -243849 -226472 -179211 -89735 16425 105499 165579 206234 220629 169700 54312 -42869
6210 -42869 -25384 127118 333210 507899 590034 556892 440272 302612 197459 132840 73391
6199 73391 6557 -44339 -62935 -36507 23895 68603 87211 98721 103242 87602 58501 35396
6187 35396 8788 -32899 -69634 -83593 -76037 -48068 -17093 29294 103857 168077 175059 131367
6175 131367 86592 54813 -4717 -97933 -185632 -236113 -257166 -269817 -291444 -341585 -427837 -515633
6163 -515633 -564842 -559606 -472813 -319009 -167371 -52801 24856 85480 138618 172273 169632
6152 169632 144455 125056 120261 138940 188719 239806 249723 204918 134350 66462 10623 -11935
6140 -11935 6432 56372 138865 221080 260651 247373 198029 157005 154037 180955 226022 280360
$$ packed form
6221b43849J7377M7261Q9476J06160Q9074O0080M0655J4395n0929j15388r7181
6210d2869J7485J52502K06092J74689Q2135l3142j16620j37660j05153o4619n9449
6199G3391o6834n0896j8596K6428O0402M4708J8608J1510M521j5640k9101k3105
6187C5396k6608m1687l6735j3959P556K7969L0975M6387P4563O4220O982m3692
6175A31367m4775l1779n9530r3216q7699n0481k1053j2651k1627n0141q6252q7796
6163e15633m9209N236Q6793J53804J51638J14570P7657O0624N3138L3655k641
6152A69632k5177j9399m795J8679M9779N1087R917m4805p0568o7888n5839k2558
6140a1935J8367M9940Q2493Q2215L9571j3278m9344m1024k968K6918M5067N4338
$$ plain form
6128 280360 352478 448110 547849 624897 636368 582874 499327 415177 355685 306341 264182 228853
6116 228853 182230 109046 10704 -86013 -157533 -185029 -166586 -145436 -159760 -200738 -237989 -239961
6104 -239961 -210646 -195709 -215327 -231480 -233713 -230770 -220125 -230361 -277700 -345088 -409398 -440864
6092 -440864 -417470 -371554 -376853 -423589 -451048 -468938 -518385 -567982 -571067 -537009 -484732 -408709
6080 -408709 -321596 -250157 -207995 -205198 -225868 -240324 -231557 -198425 -136200 -58362 31695 143451
6068 143451 265096 377435 448762 480802 482140 462453 467682 539219 664418 773143 814952
6057 814952 843320 923168 1026944 1107118 1183032 1304248 1473937 1646172 1799477 1964157
6047 1964157 2167584 2389854 2627402 2925794 3349024 3906351 4590196 5433244 6432637 7512631
$$ packed form
6128B80360P2118R5632R9739P7048J1471n3494q3547q4150n9492m9344m2159l5329
6116B28853m6623p3184r8342r6717p1520k7496J8443K1150j4324m0978l7251j972
6104b39961K9315J4937j9618j6153k233K943J0645j0236m7339o7388o4310l1466
6092d40864K3394M5916n299m6736k7459j7890m9447m9597l085L4058N2277P6023
6080d08709Q7113P1439M2162K797k0670j4456Q767L3132O2225P7838R0057J11756
6068A43451J21645J12339P1327L2040J338j9687N229P1537J25199J08725M1809
6057H14952K8368P9848J03776Q0174P5914J21216J69689J72235J53305J64680
6047A964157K03427K22270K37548K98392M23230N57327O83845Q43048R99393J079994
$$ plain form
6037 7512631 8534049 9310711 9668355 9530703 8954398 8112517 7241837 6546388 6081353
6028 6081353 5787669 5639990 5671077 5913783 6358354 6966720 7736358 8644892 9517727 10033781
6018 10033781 9941308 9195844 8001087 6686623 5484631 4457824 3597833 2918005 2418039
6009 2418039 2058278 1776507 1537716 1345433 1193456 1062057 926036 771187 637641 558386
5999 558386 503451 453621 416864 388690 376052 377278 372599 394454 477679 615154 766437 875508
5987 875508 911308 867724 769862 688187 662681 667893 682926 703745 720802 719756 700341 675272
5975 675272 646184 625680 622900 608991 585633 560819 509525 432892 344550 254017 181171 128338
5963 128338 101077 90805 68726 43231 29739 25887 31924 48756 59627 63311 61555 43917
$$ packed form
6037G512631J021418P76662L57644j37652n76305q41881q70680o95449m65035
6028F081353k93684j47679L1087K42706M44571O08366P69638R08534Q72835N16054
6018A0033781r2473p45464j194757j314464j201992j026807q59991o79828m99966
6009B418039l59761k81771k38791j92283j51977j31399j36021j54849j33546p9255
5999E58386n4935m9830l6757k8174j2638J226m679K1855Q3225J37475J51283J09071
5987H75508L5800m3584r7862q1675k5506N212J5033K0819J7057j046j9415k5069
5975F75272k9088k0504k780j3909k3358k4814n1294p6633q8342r0533p2846n2833
5963A28338k7261j0272k2079k5495j3492l852O037J6832J0871L684j756j7638
$$ plain form
5951 43917 23083 7607 -25165 -116576 -228960 -271675 -244087 -200090 -152475 -80493 5215 52293
5939 52293 49640 24833 -5017 -39989 -83328 -124478 -152370 -164387 -173815 -192812 -207348 -200945
5927 -200945 -173261 -129263 -95696 -92029 -119718 -187023 -263399 -291597 -252182 -157691 -20301 136800
5915 136800 272496 363905 396366 375527 331558 269380 196035 143707 116487 92678 69536
5904 69536 67626 110202 193334 271671 316711 326178 311824 279708 229652 162391 76400 -20214
5892 -20214 -97457 -155523 -180887 -140797 -56397 15366 56037 77338 55807 -8443 -79020 -125562
5880 -125562 -129504 -94220 -27825 66406 172852 269346 366105 460900 479232 381782 217899
5869 217899 52985 -75256 -158345 -218263 -263022 -256736 -181918 -72562 34968 111744 157773
$$ packed form
5951D3917k0834j5476l2772r1411j12384m2715K7588M3997M7615P1982Q5708M7078
5939E2293k653k4807k9850l4972m3339m1150k7892j2017r428j8997j4536O403
5927b00945K7684M3998L3567L667k7689o7305p6376k8198L9415R4491J37390J57101
5915A36800J35696R1409L2461k0839m3969o2178p3345n2328k7220k3809k3142
5904F9536j910M2576Q3132P8337M5040R467j4354l2116n0056o7261q5991r6614
5892b0214p7243n8066k5364M0090Q4400P1763M0671K1301k1531o4250p0577m6542
5880a25562l942L5284O6395R4231J06446R6494R6759R4795J8332r7450j63883
5869B17899j64914j28241q3089n9918m4759O286P4818J09356J07530P6776M6029
$$ plain form
5858 157773 200222 252883 300556 302303 252022 185928 125973 82250 75856 113700 160331 188102
5846 188102 181074 123834 32009 -50571 -86955 -81818 -65072 -46492 -2409 61902 105659 114651
5834 114651 117116 149479 219913 311164 401518 481354 546478 596111 620256 610888 564292 472789
5822 472789 358307 256874 175501 118302 81602 60527 65302 80848 60655 14169 -6428
5811 -6428 23244 75042 111769 132741 148847 178410 215160 231113 223726 209111 189749 145022
5799 145022 74322 2003 -48871 -73142 -64039 -37421 -44439 -111547 -201786 -267676 -287798 -261626
5787 -261626 -202143 -122142 -46176 23919 86235 105104 52233 -42578 -103636 -94273 -56893 -16983
5775 -16983 47839 124963 179087 180486 130862 67206 21651 -7411 -27684 -27113 -6496 6748
$$ packed form
5858A57773M2449N2661M7673J747n0281o6094n9955m3723o394L7844M6631K7771
5846A88102p028n7240r1825q2580l6384N137J6746J8580M4083O4311M3757Q992
5834A14651K465L2363P0434R1251R0354P9836O5124M9633K4145r368m6596r1503
5822D72789j14482j01433q1373n7199l6700k1075M775J5546k0193m6486k0597
5811f428K9672N1798L6727K0972J6106K9563L6750J5953p387j4615j9362m4727
5799A45022p0700p2319n0874k4271R103K6618p018o7108r0239o5890k0122K6172
5787b61626N9483Q0001P5966P0095O2316J8869n2871r4811o1058R363L7380L9910
5775a6983O4822P7124N4124J399m9624o3656m5555k9062k0273N71K0617J3244
$$ plain form
5763 6748 7556 -11877 -71251 -156305 -253420 -336460 -346414 -243255 -69518 86258 187310 249221
5751 249221 303373 373940 450430 498235 480909 400849 296587 195084 105181 27515 -31049
5740 -31049 -60778 -77715 -88976 -59886 33860 138118 185603 190378 187267 197194 217412 223354
5728 223354 203939 162949 99689 22764 -25507 -31510 -15309 21527 69789 106367 109433 79385
5716 79385 44173 23362 14639 -6442 -67796 -145862 -182723 -164309 -128184 -115401 -123399 -139862
5704 -139862 -153574 -145166 -116332 -54068 59743 189821 285547 323060 295140 232726 157533
5693 157533 76202 11332 -16350 -12641 6551 20398 47976 106939 147214 143211 125001 135583
5681 135583 197662 280852 343906 376270 393277 403137 399810 378985 334364 303154 337192 418605
$$ packed form
5763F748Q08j9433n9374q5054r7115q3040r954J03159J73737J55776J01052O1911
5751B49221N4152P0567P6490M7805j7326q0060j04262j01503q9903p7666n8564
5740c1049k9729j6937j1261K9090R3746J04258M7485M775l111R927K0218N942
5728B23354j9415m0990o3260p6925m8271o003J6201L6836M8262L6578L066l0048
5716G9385l5212k0811q723k1081o1354p8066l6861J8414L6125J2783p998j6463
5704a39862j3712Q408K8834O2264J13811J30078R5726L7513k7920o2414p5193
5693A57533q1331o4870k7682L709J9192J3847K7578N8963M0275m003j8210J0582
5681A35583O2079Q3190O3054L2364J7007R860l327k0825m4621l1210L4038Q1413
$$ plain form
5669 418605 495196 541224 557837 568408 610901 675598 691531 611869 456977 304993 229088
5658 229088 235809 269694 291372 295633 298245 317189 358572 446203 571374 692302 793708 882241
5646 882241 953187 976676 945846 895468 873525 885086 880165 845646 795684 711729 611679 537669
5634 537669 509942 556693 662586 761759 838661 909826 989379 1076496 1175506 1277858 1348286
5623 1348286 1376202 1386212 1416813 1470746 1518811 1567076 1605694 1610277 1577415 1503592 1431275 1411647
5611 1411647 1414706 1371151 1295647 1263378 1304282 1398912 1490806 1553692 1592573 1608076 1604901 1559089
5599 1559089 1468985 1375791 1310696 1294140 1302743 1278871 1207551 1128120 1089566 1092407 1084436 1043685
5587 1043685 989538 938418 904211 900982 930316 979110 1039507 1096138 1146521 1225528 1324694 1378359
$$ packed form
5669D18605P6591M6028J6613J0571M2493O4697J5933p9662j54892j51984p5905
5658B29088O721L3885K1678M261K612J8944M1383Q7631J25171J20928J01406Q8533
5646H82241P0946K3489l0830n0378k1943J1561m921l4519m9962q3955j00050p4010
5634E37669k7727M6751J05893R9173P6902P1165P9553Q7117R9010J02352P0428
5623A348286K7916J0010L0601N3933M8065M8265L8618M583l2862p3823p2317j9628
5611A411647L059m3555p5504l2269M0904R4630R1894O2886L8881J5503l175m5812
5599A559089r0104r3194o5095j6556Q603k3872p1320p9431l8554K841p971m0751
5587A043685n4147n1120l4207l229K9334M8794O0397N6631N0383P9007R9166N3665
$$ plain form
5575 1378359 1371356 1358299 1388858 1452613 1521142 1608938 1703111 1776803 1838885 1899859 1951792 1974107
5563 1974107 1973985 1981316 2004798 2023173 2004979 1979324 2020188 2163095 2367914 2558010 2709625
5552 2709625 2850386 2989745 3126368 3276187 3454978 3653033 3847102 4024482 4187869 4341359
5542 4341359 4512619 4730469 4980860 5246261 5525026 5844016 6246998 6708211 7147871 7541851
5532 7541851 7913989 8270098 8599810 8923112 9293761 9768067 10383473 11182500 12214196
5523 12214196 13505782 15075595 16947664 19121523 21576542 24261458 26994771 29496387
5515 29496387 31541778 33062141 34250194 35532502 37386497 40215877 44314054 49891811
5507 49891811 57151263 66351239 77722548 91288410 106578951 122136368 135267154
$$ packed form
5575A378359p003j3057L0559O3755O8529Q7796R4173P3692O2082O0974N1933K2315
5563A974107j22P331K3482J8375j8194k5655M0864J42907K04819J90096J51615
5552B709625J40761J39359J36623J49819J78791J98055J94069J77380J63387J53490
5542D341359J71260K17850K50391K65401K78765L18990M02982M61213M39660L93980
5532G541851L72138L56109L29712L23302L70649M74306O15406P99027J031696
5523A2214196J291586J569813J872069K173859K455019K684916K733313K501616
5515B9496387K045391J520363J188053J282308J853995K829380M098177N577757
5507D9891811P259452R199976J1371309J3565862J5290541J5557417J3130786
$$ plain form
5500 135267154 142877179 143143117 136768546 126932941 117560227 111308308 109257265 111679695
5492 111679695 118697641 130428715 146565991 165271020 182116334 191072512 187726141
5485 187726141 172003108 148613500 123972963 102114602 84145095 69790741 58448364
5478 58448364 49513918 42439632 36765987 32142826 28343583 25211888 22627532 20515171
5470 20515171 18794511 17349996 16068402 14896740 13787500 12696061 11637040 10664769
5462 10664769 9808477 9068168 8434504 7905366 7447797 7026909 6632782 6288548 6022651
5453 6022651 5842858 5721194 5608101 5467176 5284071 5084678 4929013 4866302 4846607 4791365
5443 4791365 4695835 4563732 4396157 4212234 4019493 3841971 3702937 3570458 3400195 3163297
$$ packed form
5500A35267154P610025K65938o374571r835605r372714o251919k051043K422430
5492A11679695P017946J1731074J6137276J8705029J6845314Q956178l346371
5485A87726141j5723033k3389608k4640537k1858361j7969507j4354354j1342377
5478E8448364q934446p074286n673645m623161l799243l131695k584356k112361
5470B0515171j720660j444515j281594j171662j109240j091439j059021r72271
5462A0664769q56292p40309o33664n29138m57569m20888l94127l44234k65897
5453F022651j79793j21664j13093j40925j83105j99393j55665o2711j9695n5242
5443D791365r5530j32103j67575j83923j92741j77522j39034j32479j70263k36898
$$ plain form
5433 3163297 2874458 2605891 2402022 2250991 2129266 2036708 1991099 1962947 1902137 1801186
5423 1801186 1670755 1549646 1464507 1374248 1247391 1082076 917268 810206 769559 763042
5413 763042 767176 755733 693071 600176 541199 534037 523493 481765 425627 362672 312442 310905
5401 310905 356956 415133 466328 521463 571983 597422 607471 620892 643402 663340 673759 689625
5389 689625 714380 757676 833889 905468 944891 966620 965879 916877 841652 781485 721558 651070
5377 651070 603073 584245 578471 585034 600120 614537 624248 609429 563178 535494 541583 560515
5365 560515 565272 543744 486599 396295 315166 283916 310745 379033 433208 412772 341664 309325
5353 309325 368624 466859 536579 552384 502158 415159 342561 293260 259225 240742 247351 296861
$$ packed form
5433C163297k88839k68567k03869j51031j21725r2558m5609k8152o0810j00951
5423A801186j30431j21109q5139r0259j26857j65315j64808j07062m0647o517
5413G63042M134j1443o2662r2895n8977p162j0544m1728n6138o2955n0230j537
5401C10905M6051N8177N1195N5135N0520K5439J0049J3421K2510J9938J0419J5866
5389F89625K4755M3296P6213P1579L9423K1729p41m9002p5225o0167n9927p0488
5377F51070m7997j8828n774O563J5086J4417R711j4819m6251k7684O089J8932
5365E60515M757k1528n7145r0304q1129l1250K6829O8288N4175k0436p1108l2339
5353C09325N9299R8235O9720J5805n0226q6999p2598m9301l4035j8483O609M9510
$$ plain form
5341 296861 369275 403513 379439 339533 306952 282279 279239 284642 247503 165638 101162 67212
5329 67212 47482 34808 16363 -1198 -5743 -16934 -28365 -10114 27738 61206 81843 89787
5317 89787 99378 115974 137182 170559 216089 258829 298355 341471 366912 385709 435893 512524
5305 512524 586883 634377 632579 564899 453267 364599 322688 290243 241938 184083 145808 141492
5293 141492 151062 143627 96447 27367 -27531 -46624 -7712 81508 177469 243646 249700 194472
5281 194472 142946 149672 189336 198290 122951 -8687 -111690 -141939 -98892 -15959 59866 110765
5269 110765 155344 215962 283509 315655 292856 252106 234322 220924 187686 159359 149562 106563
5257 106563 -8878 -141774 -210860 -209456 -180608 -141648 -83348 -34308 -19369 -9541 23392 72642
$$ packed form
5341B96861P2414L4238k4074l9906l2581k4673l040N403l7139q1865o4476l3950
5329F7212j9730j2674j8445j7561m545j1191j1431J8251L7852L3468K0637P944
5317H9787R591J6596K1208L3377M5530M2740L9526M3116K5441J8797N0184P6631
5305E12524P4359M7494j798o7680j11632q8668m1911l2445m8305n7855l8275m316
5293A41492R570p435m7180o9080n4898j9093L8912Q9220R5961O6177O054n5228
5281A94472n1526O726L9664Q954p5339j31638j03003l0249M3047Q2933P5825N0899
5269A10765M4579O0618O7547L2146k2799m0750j7784j3398l3238k8327r797m2999
5257A06563j15441j32896o9086J404K8848L8960N8300M9040J4939R828L2933M9250
$$ plain form
5245 72642 110008 142078 181953 225466 249739 240901 223454 202369 178691 170772 162481 142950
5233 142950 103557 43788 -13898 -56119 -100825 -166170 -213871 -209927 -174077 -132711 -60220 62467
5221 62467 190104 287626 362152 423665 458730 440504 361651 260201 194190 165277 149772
5210 149772 128658 103046 74897 50115 49797 104568 208033 291026 305006 266403 210644 154472
5198 154472 94334 36871 20156 79255 192774 300219 380898 427924 436029 432658 449291 492574
5186 492574 543807 565101 545326 520942 527225 553190 558080 550026 574000 624161 668858 687225
5174 687225 691278 709450 727229 694526 587613 434379 312926 277812 292175 296936 294222 308764
5162 308764 311652 272270 204893 133518 81721 57293 45288 30937 3988 -2233 42783 95016
$$ packed form
5245G2642L7366L2070L9875M3513K4273q838j7447k1085k3678p919q291j9531
5233A42950l9393n9769n7686m2221m4706o5345m7701L944L5850M1366P2491J22687
5221F2467J27637R7522P4526O1513L5065j8226p8853j01450o6011k8913j5505
5210A49772k1114k5612k8149k4782l18N4771J03465Q2993J3980l8603n5759n6172
5198A54472o0138n7463j6715N9099J13519J07445Q0679M7026Q105l371J6633M3283
5186D92574N1233K1294j9775k4384O283K5965M890q054K3974N0161M4697J8367
5174F87225M053J8172J7779l2703j06913j53234j21453l5114J4363M761k714J4542
5162C08764K888l9382o7377p1375n1797k4428j2005j4351k6949o221M5016N2233
$$ plain form
5150 95016 99934 74543 82885 144665 244613 349756 433980 498189 564300 650235 737591 803064
5138 803064 831049 836034 847796 880837 955544 1105854 1331660 1611241 1927948 2239532 2505588
5127 2505588 2702458 2856097 3033795 3268347 3556341 3871978 4211962 4605335 5072895 5657925
5117 5657925 6402096 7301228 8333463 9443355 10471199 11216438 11555919 11517786 11294247
5108 11294247 11132172 11209060 11649653 12520415 13752305 15079844 16010163 15987584 14835753
5099 14835753 12928343 10836081 8942166 7370363 6114948 5120493 4320324 3672189 3165849
5090 3165849 2780183 2450284 2134078 1823010 1532003 1304288 1168250 1123319 1130078 1131021 1091895
5079 1091895 1013404 913863 806581 715609 641951 557260 455222 373352 345196 357576 366173
$$ packed form
5150I5016M918k5391Q342O1780R9948J05143Q4224O4209O6111Q5935Q7356O5473
5138H03064K7985M985J1762L3041P4707J50310K25806K79581L16707L11584K66056
5127B505588J96870J53639J77698K34552K87994L15637L39984L93373M67560N85030
5117E657925P44171Q99132J032235J109892J027844P45239L39481l8133k23539
5108A1294247j62075P6888M40593Q70762J231890J327539R30319k2579j151831
5099A4835753j907410k092262j893915j571803j255415r94455q00169o48135n06340
5090C165849l85666l29899l16206l11068k91007k27715j36038m4931O759R43l9126
5079A091895p8491r9541j07282r0972p3658q4691j02038q1870k8156J2380Q597
$$ plain form
5068 366173 347397 297353 211778 110974 23492 -39269 -70510 -69393 -40313 -7713 15229 54195
5056 54195 136531 249230 347513 397519 389347 330041 255100 208608 194691 172596 114335 73071
5044 73071 92555 138502 146228 101219 62838 50821 42210 44528 81448 156401 240282 295796
5032 295796 320760 318056 289671 269377 282194 301350 288553 251930 212807 160817 100156 59847
5020 59847 64313 103640 116527 103404 108905 142308 198877 272736 325403 324870 287285 245721 222526
5007 222526 231730 266492 296526 324029 363458 370553 281206 108959 -59455 -175129 -242225
4996 -242225 -281300 -287088 -220565 -104258 3341 68644 53214 -47041 -187126 -316575 -376947
4985 -376947 -347969 -292568 -268831 -273692 -274164 -267176 -258606 -243668 -213975 -140097 -17310 100371
$$ packed form
5068C66173j8776n0044q5575j00804q7482o2761l1241J117K9080L2600K2942L8966
5056E4195Q2336J12699R8283N0006q172n9306p4941m6492j3917k2095n8261m1264
5044G3071J9484M5947P726m5009l8381j2017q611K318L6920P4953Q3881N5514
5032B95796K4964k704k8385k0294J2817J9156j2797l6623l9123n1990o0661m0309
5020E9847M466L9327J2887j3123N501L3403N6569P3859N2667n33l7585m1564k3195
5007B22526R204L4762L0034K7503L9429P095q9347j72247j68414j15674o7096
4996b42225l9075n788O6523J16307J07599O5303j5430j00255j40085j29449o0372
4985c76947K8978N5401K3737m861m72O988Q570J4938K9693P3878J22787J17681
$$ plain form
4973 100371 162444 167593 143064 101599 46204 511 -20949 -40235 -99880 -198471 -312612 -406570
4961 -406570 -413141 -330687 -231781 -158798 -96468 -40114 -21488 -32950 -33774 -10494 11441 29592
4949 29592 70090 117835 145069 135431 94200 7271 -147526 -316611 -411405 -409979 -354970 -285256
4937 -285256 -219101 -140547 -47389 3675 -14440 -49922 -24836 78789 205086 299810 321681
4926 321681 252532 158315 98997 64108 27969 -18987 -53992 -50719 -29029 -27527 -28380 -2922
4914 -2922 44982 117944 188563 212032 175966 92744 -12098 -127824 -228177 -277991 -256859
4903 -256859 -168662 -46018 71830 162361 245379 338434 422337 477716 503832 515314 531144
4892 531144 547491 547997 514016 463488 430424 433090 463005 471844 433938 371967 306788 267051
$$ packed form
4973A00371O2073N149k4529m1465n5395m5693k1460j9286n9645r8591j14141r3958
4961d06570o571Q2454R8906P2983O2330N6354J8626j1462q24K3280K1935J8151
4949B9592M0498M7745K7234r638m1231q6929j54797j69085r4794J426N5009O9714
4937b85256O6155P8554R3158N1064j8115l5482K5086J03625J26297R4724K1871
4926C21681o9149r4217n9318l4889l6139m6956l5005L273K1690J502q53K5458
4914b922M7904P2962P0619K3469l6066q3222j04842j15726j00353m9814K1132
4903b56859Q8197J22644J17848R0531Q3018R3055Q3903N5379K6116J1482J5830
4892E31144J6347N06l3981n0528l3064K666K9915Q839l7906o1971o5179l9737
$$ plain form
4880 267051 260578 256670 247238 239540 217180 174217 122533 88527 104581 146892 169358 168591 145921
4867 145921 118645 117164 137934 145251 100228 -8952 -153689 -265655 -322065 -375613 -477229
4856 -477229 -605971 -718166 -794169 -836418 -854496 -840115 -779621 -685313 -597733 -522228 -423086
4845 -423086 -295289 -205341 -210948 -281029 -340712 -342520 -292996 -211583 -125106 -81253 -111647 -197674
4833 -197674 -290006 -357422 -408291 -434728 -433705 -422564 -408046 -428363 -497932 -545256 -545087 -523317
4821 -523317 -481857 -422480 -364122 -323355 -284843 -242750 -213681 -204139 -194830 -166753 -127389 -95909
4809 -95909 -91661 -109111 -106846 -41080 70594 169957 230819 270186 302262 320717 344656 388998
4797 388998 432693 449585 425218 347637 231317 137549 103499 93145 57150 -11240 -85475
$$ packed form
4880B67051o473l908r432p698k2360m2963n1684l4006J6054M2311K2466p67k2670
4867A45921k7276j481K0770P317m5023j09180j44737j11966n6410n3548j01616
4856d77229j28742j12195p6003m2249j8078J4381O0494R4308Q7580P5505R9142
4845d23086J27797Q9948n607p0081n9683j808M9524Q1413Q6477M3853l0394q6027
4833a97674r2332o7416n0869k6437J023J1141J4518k0317o9569m7324J69K1770
4821e23317M1460N9377N8358M0767L8512M2093K9069R542R309K8077L9364L1480
4809i5909M248j7450K265O5766J11674R9363O0862L9367L2076J8455K3939M4342
4797C88998M3695J6892k4367p7581j16320r3768l4050j0354l5995o8390p4235
$$ plain form
4786 -85475 -122921 -114361 -103150 -117907 -138416 -142110 -139860 -142353 -143557 -146130 -165063 -198515 -223935
4773 -223935 -233218 -228746 -200332 -152857 -105363 -78571 -65857 -49170 -35278 -33695 -31341 -4898
4761 -4898 50827 109202 136595 101834 24087 -65704 -149662 -215588 -255975 -280217 -313339 -354036
4749 -354036 -386133 -395833 -368203 -305525 -221096 -129748 -43507 40343 103682 141095 170125 189259
4737 189259 178328 152401 156758 199716 265747 325651 333856 293565 257674 247064 223317 176140
4725 176140 117589 56533 15059 -12827 -51549 -110586 -185940 -259763 -295453 -285736 -277636 -326979
4713 -326979 -428846 -523823 -592709 -651285 -705861 -742100 -760094 -761558 -735926 -685657 -638351 -603371
4701 -603371 -554967 -476301 -373100 -266000 -177042 -121938 -90940 -65986 -48825 -41745 -41879 -56149
$$ packed form
4786h5475l7446Q560J1211j4757k0509l694K250k493j204k573j8933l3452k5420
4773b23935r283M472K8414M7475M7494K6792J2714J6687J3892J583K354K6443
4761d898N5725N8375K7393l4761p7747q9791q3958o5926m0387k4242l3122m0697
4749c54036l2097r700K7630O2678Q4429R1348Q6241Q3850O3339L7413K9030J9134
4737A89259j0931k5927M357M2958O6031N9904Q205m0291l5891j0610k3747m7177
4725A76140n8551o1056m1474k7886l8722n9037p5354p3823l5690R717Q100m9343
4713c26979j01867r4977o8886n8576n4576l6239j7994j464K5632N0269M7306L4980
4701f03371M8404P8666J03201J07100Q8958N5104L0998K4954J7161P080j34j4270
$$ plain form
4689 -56149 -90262 -142410 -224440 -345076 -478264 -565806 -579650 -541787 -480321 -433220 -440890 -486128
4677 -486128 -513238 -510074 -475810 -423984 -373268 -322544 -291616 -293452 -321623 -371010 -417085 -433522
4665 -433522 -417690 -379573 -320675 -253426 -228516 -285687 -398655 -502978 -533982 -500754 -461012
4654 -461012 -424264 -392388 -386100 -410327 -462343 -535793 -605670 -635915 -598414 -489550 -317658
4643 -317658 -135786 -11813 46265 88595 123973 114715 67460 32656 1630 -71494 -165614
4632 -165614 -234236 -263635 -279632 -319613 -361715 -361821 -322998 -276741 -249119 -241009 -222006 -154348
4620 -154348 -46114 69420 162658 199879 175818 129694 107346 107348 108025 109470 107219 104112 118302
4607 118302 156398 189493 188454 163618 153185 152186 149611 158991 167624 152672 104097 49338 6469
$$ packed form
4689e6149l4113n2148q2030j20636j33188q7542j3844L7863O1466M7101p670m5238
4677d86128k7110L164L4264N1826N0716N0724L0928j836k8171m9387m6075j6437
4665d33522J5832L8117N8898O7249K4910n7171j12968j04323l1004L3228L9742
4654d61012L6748L1876O288k4227n2016p3450o9877l0245L7501J08864J71892
4643c17658J81872J23973N8078M2330L5378r258m7255l4804l1026p3124r4120
4632a65614o8622k9399j5997l9981m2102j06L8823M6257K7622Q110J9003O7658
4620a54348J08234J15534R3238L7221k4061m6124k2348KO77J445k251l107J4190
4607A18302L8096L3095j039k4836j0433r99k575R380Q633j4952m8575n4759m2869
$$ plain form
4594 6469 -32543 -62772 -84616 -121830 -195350 -291681 -358445 -352316 -284938 -203176 -142002 -98848
4582 -98848 -48339 15926 93021 174245 248792 308951 356868 375019 347122 283205 213144 196877
4570 196877 262954 368203 464743 532369 537156 448419 293764 145817 32484 -69422 -171960
4559 -171960 -263721 -322100 -332867 -291761 -231812 -203876 -219131 -262053 -295135 -295869 -268517 -226146
4547 -226146 -183530 -162994 -190416 -272206 -371179 -432050 -420491 -362607 -318792 -308969 -307273 -284963
4535 -284963 -246137 -213080 -184003 -140577 -68012 20228 73856 69417 16946 -85130 -215758
4524 -215758 -302911 -297712 -238357 -201500 -202222 -199805 -166377 -123211 -116626 -142858 -169146 -173974 -152926
4511 -152926 -120542 -71313 4129 84387 120588 95267 51398 45985 86068 137499 179784 190310
$$ packed form
4594F469l9012l0229k1844l7214p3520r6331o6764O129O7378Q1762O1174M3154
4582i8848N0509O4265P7095Q1224P4547O0159M7917J8151k7897o3917p0061j6267
4570A96877O6077J05249R6540O7626M787q8737j54655j47947j13333j01906j02538
4559a71960r1761n8379j0767M1106N9949K7936j5255m2922l3082p34K7352M2371
4547b26146M2616K0536k7422q1790r8973o0871J1559N7884M3815R823J696K2310
4535b84963L8826L3057K9077M3426P2565Q8240N3628m439n2471j02076j30628
4524b15758q7153N199N9355L6857p22K417L3428M3166O585k6232k6288m828K1048
4511a52926L2384M9229P5442Q0258L6201k5321m3869n413M0083N1431M2285J0526
$$ plain form
4499 190310 150776 68449 -27264 -89492 -122288 -158953 -193677 -197930 -162384 -100481 -21537 41970
4487 41970 42745 -18255 -85839 -123838 -124902 -96094 -70006 -92445 -174788 -270570 -341549 -374397
4475 -374397 -360403 -311888 -260273 -218850 -171834 -110906 -69931 -79171 -100290 -66386 5989 51375
4463 51375 63682 40801 -18782 -69629 -64150 6001 111612 197882 212305 164487 102669 41369
4451 41369 -21469 -94193 -179101 -256115 -318437 -377405 -417367 -423512 -410385 -407278 -397398 -350511
4439 -350511 -265738 -145921 -45603 -20608 -46856 -88377 -135641 -172858 -187537 -193344 -201210 -210702
4427 -210702 -220374 -205970 -151950 -69691 14683 51366 21934 -46750 -124662 -195461 -266543 -340596
4415 -340596 -407007 -445730 -439693 -402542 -366913 -344735 -340818 -349170 -325319 -239851 -135488 -93014
$$ packed form
4499A90310l9534q2327r5713o2228l2796l6665l4724m253L5546O1903P8944O3507
4487D1970P75o1000o7584l7999j064K8808K6088k2439q2343r5782p0979l2848
4475c74397J3994M8515N1615M1423M7016O0928M0975r240k1119L3904P2375M5386
4463E1375J2307k2881n9583n0847N479P0151J05611Q6270J4423m7818o1818o1300
4451D1369o2838p2724q4908p7014o2322n8968l9962o145J3127L107R880M6887
4439c50511Q4773J19817J00318K4995k6248m1521m7264l7217j4679n807p866r492
4427b10702r672J4404N4020Q2259Q4374L6683k9432o8684p7912p0799p1082p4053
4415c40596o6411l8723O037L7151L5629K2178L917q352K3851Q5468J04363M2474
$$ plain form
4403 -93014 -129247 -186603 -215126 -196573 -162654 -160070 -191446 -233544 -285878 -350266 -403216 -431434
4391 -431434 -437205 -448453 -483303 -511976 -488020 -395214 -282541 -202994 -180607 -216663 -280297 -340343
4379 -340343 -390436 -414044 -408810 -402063 -408551 -425309 -406567 -329882 -239648 -174487 -152945 -157886
4367 -157886 -153740 -139285 -111175 -72393 -45176 -17272 28482 70452 93993 121401 190703 271769
4355 271769 277814 172116 15480 -128761 -232102 -264616 -225808 -151624 -85895 -51579 -38353
4344 -38353 -18559 10862 27718 18527 -21534 -63217 -80302 -92258 -117563 -163538 -225030 -267015
4332 -267015 -253681 -199184 -138469 -78483 -12957 37710 42376 5866 -22178 -39065 -101239 -189822
4320 -189822 -236262 -236247 -230268 -231021 -227978 -227819 -223451 -212773 -196734 -150138 -68281 20663 87429 108387
$$ packed form
4403i3014l6233n7356k8523J8553L3919K584l1376m2098n2334o4388n2950k8218
4391d31434n771j1248l4850k8673K3956R2806J12673P9547K2387l6056o3634o0046
4379c40343n0093k3608N234O747o488j6758J8742P6685R0234O5161K1542m941
4367a57886M146J4455K8110L8782K7217K7904M5754M1970K3541K7408O9302Q1066
4355B71769O045j05698j56636j44241j03341l2514L8808P4184O5729L4316J3226
4344c8353J9794K9421J6856r191m0061m1683j7085j1956k5305m5975o1492m1985
4332b67015J3334N4497O0715N9986O5526N0667M666l6510k8044j6887o2174q8583
4320a89822m6440J5N979p53L043J59M368J0678J6039M6596Q1857Q8944O6766K0958
$$ plain form
4306 108387 86742 33857 -36100 -86655 -108414 -116414 -109566 -96208 -88312 -81847 -71934 -38107 29469
4293 29469 91777 109986 91728 90377 133666 185744 230563 291109 370503 432536 435659 360283
4281 360283 255053 206015 213761 227365 241217 266560 280234 274989 263913 219299 134247 50924
4269 50924 4892 -10525 -13838 -2276 13622 31287 65117 87793 78777 73311 90724 91340 54134
4256 54134 17634 3749 -4320 -15801 -21935 -30350 -53501 -87381 -125608 -135522 -86407 -14128 11361
4243 11361 -29430 -110956 -202413 -289593 -349049 -348875 -301561 -251222 -234705 -265297 -313862 -317039
4231 -317039 -261022 -191374 -139788 -98082 -58675 -39800 -68503 -153621 -274504 -394419 -462218
4220 -462218 -452206 -389843 -309912 -239066 -196653 -167641 -115841 -52128 -12018 122 5428 25246
$$ packed form
4306A08387k1645n2885o9957n0555k1759q000O848J3358P896O465R913L3827O7576
4293B9469O2308J8209j8258j351M3289N2078M4819O0546P9394O2033L123p5376
4281C60283j05230m9038P746J3604J3852K5343J3674n245j1076m4614q5052q3323
4269E0924m6032j5417l313J1562J5898J7665L3830K2676r016n466J7413O16l7206
4256E4134l6500j3885q069j1481o134q415k3151l3880l8227r914M9115P2279K5489
4243A1361m0791q1526r1457q7180n9456J74M7314N0339J6517l0592m8565l177
4231c17039N6017O9648N1586M1706L9407J8875k8703q5118j20883j19915o7799
4220d62218J0012O2363P9931P0846M2413K9012N1800O3713M0110J2140N306J9818
$$ plain form
4208 25246 41863 37694 36989 67482 124164 174140 174981 120831 63458 40564 53396 64414 31415
4195 31415 -22830 -70082 -133930 -205525 -251194 -267972 -251740 -212605 -177057 -155771 -146360 -140272
4183 -140272 -125165 -98608 -75696 -64035 -63670 -78060 -108897 -138781 -131055 -73895 11526 103384
4171 103384 187955 250161 274696 280489 277488 252805 216667 179259 128263 76163 36646 12472
4159 12472 12484 23713 15849 -16997 -42753 -79428 -165205 -260457 -307588 -312282 -302507 -252881 -152951
4146 -152951 -40421 50926 111342 145554 162807 188700 227291 239490 208620 175680 168197 152269
4134 152269 99574 27643 -40394 -104072 -162740 -192445 -179181 -151959 -148514 -176041 -206443 -211674
4122 -211674 -169945 -87410 9324 113054 202774 220046 148555 58655 13706 19153 45800 61367
$$ packed form
4208B5246J6617m169p05L0493N6682M9976Q41n4150n7373k2894J2832J1018l2999
4195C1415n4245m7252o3848p1595m5669j6778J6232L9135L5548K1286R411O088
4183a40272J5107K6557K2912J1661L65j4390l0837k9884P726N7160Q5421R1858
4171A03384Q4571O2206K4535N793l001k4683l6138l7408n0996n2100l9517k4174
4159A2472J2J1229p864l2846k5756l6675q5777r5252m7131m694R775M9626R9930
4146a52951J12530R1347O0416L4212J7253K5893L8591J2199l0870l2940p483j5928
4134A52269n2695p1931o8037o3678n8668k9705J3264K7222L445k7527l0402n231
4122b11674M1729Q2535R6734J03730Q9720J7272p1491q9900m4949N447K6647J5567
$$ plain form
4110 61367 73681 119134 195382 275216 334344 356402 348836 314571 228823 56314 -168822 -343264
4098 -343264 -420260 -399056 -306239 -213546 -164044 -132002 -98695 -66164 -44837 -45426 -61929 -86126
4086 -86126 -116370 -147644 -148545 -93575 -25651 -1791 -29794 -84824 -143230 -200278 -247397 -276137
4074 -276137 -282652 -252234 -194342 -130685 -73144 -30017 -1059 26071 43216 56740 96901 150881
4062 150881 167703 123152 30147 -52686 -72988 -57150 -57394 -83766 -99255 -83926 -79403 -103873
4050 -103873 -125371 -129955 -117551 -89604 -56254 -9100 77129 164466 203911 207883 192794 150409
4038 150409 82921 4986 -60308 -96725 -100807 -54202 57379 182749 254195 267652 254061
4027 254061 220054 159814 100704 68410 64272 82000 112702 153310 199637 223999 188299 91010
$$ packed form
4110F1367J2314M5453P6248P9834N9128K2058p566l4265q5748j72509k25136j74442
4098c43264p6996K1204R2817R2693M9502L2042L3307L2531K1327n89j6503k4197
4086h6126l0244l1274r01N4970O7924K3860k8003n5030n8406n7048m7119k8740
4074b76137o515L0418N7892O3657N7541M3127K8958K7130J7145J3524M0161N3980
4062A50881J6822m4551r3005q2833k0302J5838k44k6372j5489J5329M523k4470
4050a03873k1498m584J2404K7947L3350M7154Q6229Q7337L9445L972j5089m2385
4038A50409o7488p7935o5294l6417m082M6605J11581J25370P1446J3457j3591
4027B54061l4007o0240n9110l2294m138J7728L0702M0608M6327K4362l5700r7289
$$ plain form
4015 91010 -29855 -120289 -151319 -135588 -95258 -44937 -20479 -51563 -106710 -139903 -160464 -169107
4003 -169107 -135712 -54009 46778 125617 147432 116836 68481 10373 -61353 -114867 -125668
3992 -125668 -111906 -94763 -76665 -43386 -11231 -28915 -94172 -167972 -251112 -365972 -491292
3981 -491292 -579637 -625709 -644237 -654791 -675299 -684997 -673341 -650028 -610193 -556515 -501824 -461336
3969 -461336 -426407 -376107 -318598 -276949 -264147 -263860 -249017 -215535 -173109 -144494 -157955 -204265
3957 -204265 -242143 -240451 -184113 -108233 -37496 22515 50023 45225 27264 9497 -3649 -15104
3945 -15104 -16765 -12647 -10141 -11068 -12712 -4425 -76 -19707 -37796 -16352 33629 99029 167711
3932 167711 219626 244339 244044 226442 194252 139618 75310 22785 -32197 -103066 -184161 -248384
$$ packed form
4015I1010j20865r0434l1030J5731M0330N0321K4458l1084n5147l3193k0561q643
4003a69107L3395Q1703J00787P8839K1815l0596m8355n8108p1726n3514j0801
3992a25668J3762J7143J8098L3279L2155j7684o5257p3800q3140j14860j25320
3981d91292q8345m6072j8528j0554k0508r698J1656K3313L9835N3678N4691M0488
3969d61336L4929N0300N7509M1649J2802K87J4843L3482M2426K8615j3461m6310
3957b04265l7878J692N6338P5880P0737O0011K7508m798j7961j7767j3146j1455
3945a5104j661M118K506r27j644Q287M349j9631j8089K1444M9981O5400O8682
3932A67711N1915K4713k95j7602l2190n4634o4308n2525n4982p0869q1095o4223
$$ plain form
3920 -248384 -245628 -156998 -18431 104664 157117 133195 57635 -45469 -147611 -221040 -254628
3909 -254628 -231642 -164468 -108959 -102265 -139226 -192991 -234376 -215490 -118968 1628 93109 148908
3897 148908 174801 162451 121432 99209 122687 178359 234762 267111 274027 266842 257809 238613
3885 238613 194825 130558 63532 -1659 -59588 -106096 -147514 -188741 -219540 -222463 -197740 -153429
3873 -153429 -92683 -43482 -27587 -22096 3867 52760 111936 191932 285452 395520 513504
3862 513504 606678 659655 648766 583670 541312 561619 606824 645833 682537 716613 733520 731082
3850 731082 719266 720109 722597 695376 656956 620382 567601 511139 484454 481122 473085 468102 480748
3837 480748 479605 422505 328297 262410 259451 313029 397579 474714 510559 493887 443712 397974
$$ packed form
3920b48384K756Q8630J38567J23095N2453k3922p5560j03104j02142p3429l3588
3909b54628K2986O7174N5509O694l6961n3765m1385J8886R6522J20596R1481N5799
3897A48908K5893j2350m1019k2223K3478N5672N6403L2349O916p185r033j9196
3885B38613m3788o4267o7026o5191n7929m6508m1418m1227l0799k923K4723M4311
3873a53429O0746M9201J5895N491K5963M8893N9176P9996R3520J10068J17984
3862E13504R3174N2977j0889o5096m2358K0307M5205L9009L6704L4076J6907k438
3850G31082j1816Q43K488k7221l8420l6574n2781n6462k6685l332q037m983J2646
3837D80748j143n7100r4208o5887k959N3578Q4550P7135L5845j6672n0175m5738
$$ plain form
3825 397974 389244 413104 456358 529436 622728 681769 679134 650804 616822 566387 507651 440407
3813 440407 367907 305531 259247 233968 223305 217628 215214 221694 243113 277749 315499 355591
3801 355591 382729 383214 379891 365532 305958 210894 115268 60193 74645 147501 229217 271415
3789 271415 254879 210161 193976 241984 353302 485521 571368 601593 621766 669975 736124
3778 736124 768083 719372 608774 481675 366674 309385 329074 382113 420671 442964 467798
$$ packed form
3825C97974q730K3860M3254P3078R3292N9041k635k8330l3982n0435n8736o7244
3813D40407p2500o2376m6284k5279j0663n677k414O480K1419L4636L7750M0092
3801C55591K7138M85l323j4359n9574r5064r5626n5075J4452P2856Q1716M2198
3789B71415j6536m4718j6185M8008J11318J32219Q5847L0225K0173M8209O6149
3778G36124L1959m8711j10598j27099j15001n7289J9689N3039L8558K2293K4834
$$ [...]
##END NTUPLES=NMR SPECTRUM
##END=
