##TITLE=31Pdec_LY_80.X.1.B
 CD3CN, 24 sc
 28.04.2021
##JCAMPDX= 6.0         $$ Bruker NMR JCAMP-DX V2.0
##DATA TYPE= NMR SPECTRUM
##DATA CLASS= NTUPLES
##ORIGIN= UXNMR, Bruker Analytische Messtechnik GmbH
##OWNER= root
$$ XWIN-NMR		Version 3.5
$$ Wed Apr 28 11:24:04 2021 Russian Standard Time (UT+4h)  she@DPX200
##.OBSERVE FREQUENCY= 81.013821
##.OBSERVE NUCLEUS= ^31P
##.ACQUISITION MODE= SIMULTANEOUS
##.ACQUISITION SCHEME= undefined
##.AVERAGES= 24
##.DIGITISER RES= 16
##SPECTROMETER/DATA SYSTEM= spect
##.PULSE SEQUENCE= zgpg30
##.SOLVENT NAME= CD3CN
##.SHIFT REFERENCE= (INTERNAL, CD3CN, 0, 248.564)
##AUDIT TRAIL= $$ (NUMBER, WHEN, WHO, WHERE, WHAT)
$$ ##TITLE= Audit trail, XWIN-NMR		Version 3.5
$$ ##JCAMPDX= 5.01
$$ ##ORIGIN= Bruker BioSpin GmbH
$$ ##OWNER= she
$$ F:/spectra/data/she/nmr/P31/1/pdata/1/auditp.txt
$$ ##AUDIT TRAIL=  $$ (NUMBER, WHEN, WHO, WHERE, WHAT)
(   1,<2021-04-28 11:22:42.42 +0400>,<she>,<DPX200>,
      <created by zg, POWCHK disabled, PULCHK disabled
       configuration hash MD5:
       00 E9 B6 7A A2 85 ED C7 34 08 36 98 17 FE 4E 26
       data hash MD5: 32K
       82 6B 7B 8B A5 C8 13 D7 70 89 08 07 2E 1A A1 42>)
(   2,<2021-04-28 11:22:49.26 +0400>,<she>,<DPX200>,
      <Start of raw data processing
       efp BC_mod = 2 LB = 1 FT_mod = 6 PKNL = 1 PHC0 = -5940.152 PHC1 = 296.8018 SI = 64K 
       data hash MD5: 64K
       BD 78 01 2E 45 CA 7B 2F 21 57 D9 40 DC 0D 3B 85>)
(   3,<2021-04-28 11:23:26.00 +0400>,<she>,<DPX200>,
      <pk PHC0 = -39.87978 PHC1 = 33 
       data hash MD5: 64K
       8A 88 7C 1B 29 DB 51 EE 6C 20 5B 17 1F 39 69 3C>)
(   4,<2021-04-28 11:23:31.48 +0400>,<she>,<DPX200>,
      <abs ABSG = 5 
       data hash MD5: 64K
       81 F9 6B 0D A1 56 F7 7E 16 19 D6 CA 55 49 98 1F>)
$$ ##END=
$$ 
$$ hash MD5
$$ 14 F5 51 EE 7D 12 9D 5A FC BE 5B 32 D7 AF DB D2
##$RELAX= 
##$RELAX= 
##$RELAX= 
##$RELAX= 
##$RELAX= 
##$RELAX= 
##$RELAX= 
##$RELAX= 
$$ Bruker specific parameters
$$ --------------------------
##$DU= <F:/spectra>
##$EXPNO= 1
##$NAME= <P31>
##$PROCNO= 1
##$TYPE= <nmr>
##$USER= <she>
##$AMP= (0..31)
100 100 100 100 100 100 100 100 100 100 100 100 100 100 100 100 100 100 
100 100 100 100 100 100 100 100 100 100 100 100 100 100 
##$AQSEQ= 0
##$AQ_mod= 1
##$AUNM= <au_zg>
##$AUTOPOS= <>
##$BF1= 81.014009
##$BF2= 200.13
##$BF3= 200.13
##$BF4= 200.13
##$BF5= 200.13
##$BF6= 200.13
##$BF7= 200.13
##$BF8= 200.13
##$BYTORDA= 1
##$CFDGTYP= 0
##$CFRGTYP= 5
##$CHEMSTR= <none>
##$CNST= (0..31)
1 1 145 1 1 1 1 1 1 1 1 1 1 1 1 1 1 1 1 1 1 1 1 1 1 1 1 1 1 1 1 1 
##$CPDPRG= <waltz16>
##$CPDPRG1= <>
##$CPDPRG2= <waltz16>
##$CPDPRG3= <>
##$CPDPRG4= <mlev>
##$CPDPRG5= <mlev>
##$CPDPRG6= <mlev>
##$CPDPRG7= <mlev>
##$CPDPRG8= <mlev>
##$CPDPRGB= <>
##$CPDPRGT= <>
##$D= (0..31)
0 1 0 0 0 0 0 0 0 0 0 0.03 2e-05 3e-06 0 0 0 0 0 0 0 0 0 0 0 0 0 0 0 0 
0 0 
##$DATE= 1619594561
##$DBL= (0..7)
120 120 120 11 120 120 24 19 
##$DBP= (0..7)
150 150 150 150 150 150 150 150 
##$DBP07= 0
##$DBPNAM0= <>
##$DBPNAM1= <>
##$DBPNAM2= <>
$$ [...]
##$SUBNAM3= <"">
##$SUBNAM4= <"">
##$SUBNAM5= <"">
##$SUBNAM6= <"">
##$SUBNAM7= <"">
##$SUBNAM8= <"">
##$SUBNAM9= <"">
##$SW= 501.771253377433
##$SWIBOX= (0..15)
0 1 3 0 0 0 0 0 0 0 0 0 0 0 0 0 
##$SW_h= 40650.406504065
##$TD= 32768
##$TD0= 1
##$TE= 0
##$TE2= 300
##$TE3= 300
##$TEG= 300
##$TL= (0..7)
0 120 53 12 22 120 120 120 
##$TP= (0..7)
150 150 150 150 150 150 150 150 
##$TP07= 0
##$TPNAME0= <>
##$TPNAME1= <>
##$TPNAME2= <>
##$TPNAME3= <>
##$TPNAME4= <>
##$TPNAME5= <>
##$TPNAME6= <>
##$TPNAME7= <>
##$TPOAL= (0..7)
0.5 0.5 0.5 0.5 0.5 0.5 0.5 0.5 
##$TPOFFS= (0..7)
0 0 0 0 0 0 0 0 
##$TUNHIN= 0
##$TUNHOUT= 0
##$TUNXOUT= 0
##$USERA1= <user>
##$USERA2= <user>
##$USERA3= <user>
##$USERA4= <user>
##$USERA5= <user>
##$V9= 5
##$VALIST= <valist>
##$VCLIST= <CCCCCCCCCCCCCCC>
##$VD= 0
##$VDLIST= <DDDDDDDDDDDDDDD>
##$VPLIST= <PPPPPPPPPPPPPPP>
##$VTLIST= <TTTTTTTTTTTTTTT>
##$WBST= 1024
##$WBSW= 4
##$XGAIN= (0..3)
0 0 0 0 
##$XL= 0
##$YL= 0
##$YMAX_a= 9826
##$YMIN_a= -23876
##$ZGOPTNS= <>
##$ZL1= 120
##$ZL2= 120
##$ZL3= 120
##$ZL4= 120
##$ABSF1= 248.5645
##$ABSF2= -253.2056
##$ABSG= 5
##$ABSL= 3
##$ALPHA= 0
##$AQORDER= 0
##$ASSFAC= 0
##$ASSFACI= 0
##$ASSFACX= 0
##$ASSWID= 0
##$AUNMP= <proc_1d>
##$AZFE= 0.1
##$AZFW= 0.5
##$BCFW= 0
##$BC_mod= 2
##$BYTORDP= 0
##$COROFFS= 0
##$CY= -3
##$DATMOD= 1
##$DC= 0
##$DFILT= <>
##$DTYPP= 0
##$F1P= 0
##$F2P= 0
##$FCOR= 1
##$FTSIZE= 65536
##$FT_mod= 6
##$GAMMA= 0
##$GB= 0
##$INTBC= 1
##$INTSCL= 5.30512e-09
##$ISEN= 30
##$LB= 1
##$LEV0= 0
##$LPBIN= 0
##$MAXI= 10000
##$MC2= 0
##$MEAN= 0
##$ME_mod= 0
##$MI= 50
##$NCOEF= 0
##$NC_proc= -2
##$NLEV= 6
##$NOISF1= 182.463
##$NOISF2= 159.3651
##$NSP= 0
##$NTH_PI= 0
##$NZP= 0
##$OFFSET= 248.5645
##$PC= 4
##$PHC0= -5980.032
##$PHC1= 329.8018
##$PH_mod= 1
##$PKNL= yes
##$PPARMOD= 0
##$PSCAL= 0
##$PSIGN= 0
##$REVERSE= no
##$SF= 81.014009
##$SI= 65536
##$SIGF1= 159.3651
##$SIGF2= -187.1042
##$SINO= 113.3802
##$SIOLD= 16384
##$SREGLST= <1H.CDCl3>
##$SSB= 0
##$STSI= 65536
##$STSR= 0
##$SW_p= 40650.406504065
##$SYMM= 0
##$S_DEV= 0
##$TDeff= 32768
##$TDoff= 0
##$TI= <>
##$TILT= no
##$TM1= 0
##$TM2= 0
##$TOPLEV= 0
##$USERP1= <user>
##$USERP2= <user>
##$USERP3= <user>
##$USERP4= <user>
##$USERP5= <user>
##$WDW= 1
##$XDIM= 65536
##$YMAX_p= 426055470
##$YMIN_p= -24900477
$$ End of Bruker specific parameters
$$ ---------------------------------
##NTUPLES= NMR SPECTRUM
##VAR_NAME=  FREQUENCY,     SPECTRUM/REAL,   SPECTRUM/IMAG
##SYMBOL=    X,             R,               I
##VAR_TYPE=  INDEPENDENT,   DEPENDENT,       DEPENDENT
##VAR_FORM=  AFFN,          ASDF,            ASDF
##VAR_DIM=   65536,         65536,           65536
##UNITS=     HZ,            ARBITRARY UNITS, ARBITRARY UNITS
##FACTOR=    0.620285442955139, 1,           1
##FIRST=     20137.2065510759, 0,            0
##LAST=      -20513.1999529892, 0,           0
##MIN=       -20513.1999529892, -24900477,   0
##MAX=       20137.2065510759, 426055470,    0
$$ Real data points
##PAGE= N=1
##DATA TABLE= (X++(R..R)), XYDATA
$$ [...]
38478 222796 338919 353399 235618 124256 154267 255856 240050 67718 -94598 -105289
38468 -105289 -12289 58924 76584 89414 110127 90511 -4475 -139577 -229388 -220238 -157789
38457 -157789 -134470 -147644 -84878 88607 223747 186849 82373 110908 253103 292914 157012
38446 157012 27679 68219 216623 322147 324856 224850 34919 -144412 -158473 -15104
38436 -15104 75844 -8117 -124280 -112474 -63731 -151276 -312994 -331287 -175737 -39862 -36612
38425 -36612 -64423 -19509 36723 2847 -97708 -165025 -154752 -91777 -12547 48726 62711
38414 62711 39191 21479 18093 -13576 -85088 -133063 -108201 -66701 -105152 -215161 -268912 -170131
38402 -170131 24705 167179 169605 59218 -94700 -241946 -331098 -303603 -165762 -25799
38392 -25799 7687 -51565 -103310 -102855 -100939 -147215 -224516 -287885 -305043 -249143 -121262 948
38380 948 10243 -95750 -183192 -128395 40517 177850 165405 10073 -163473 -208452 -91095
38369 -91095 62992 107723 56527 50860 150586 256841 272834 235746 226743 237462 204608 115183
38357 115183 2640 -113439 -218263 -277494 -281930 -271729 -263650 -212523 -109766 -55582 -139725
38346 -139725 -288751 -330441 -202171 -16083 83883 65233 1584 -24872 -2091 9390 -44576
38335 -44576 -128956 -151457 -86955 -15063 -8757 -47500 -76679 -84887 -73652 -22143 54273 78238
38323 78238 16548 -52132 -56135 -49988 -114141 -192864 -155742 3567 150474 193211 180249 198277
38311 198277 256155 293806 252945 131008 25 -49855 -25323 -40897 -153973 -248936 -179449
38300 -179449 21527 186068 235391 237793 252091 239270 154678 31900 -55787 -60153 9848
38289 9848 64274 -15885 -216631 -339163 -234439 -35832 3144 -132013 -214233 -130310 -20494
38278 -20494 -12560 -34330 6900 50542 23402 -2648 60275 156661 199063 222407 283851 324065
38266 324065 286983 269258 367737 466196 377437 141729 -26937 -61959 -88532 -142088 -81515
38255 -81515 138025 307750 214437 -75050 -299830 -300059 -133018 43613 120138 103292 92191
38244 92191 157499 230713 181312 21306 -70106 15471 151380 143278 -9833 -132292 -110121
38233 -110121 3484 113660 196156 244803 202917 33828 -172431 -248989 -131765 60961
38223 60961 165775 157099 139567 176669 207396 156584 50941 -30876 -65943 -78062 -70395 -45032
38211 -45032 -47269 -98763 -120521 -29215 111320 157559 102791 89840 180186 248120 165158 -28993
38199 -28993 -209380 -307010 -289215 -121278 134247 278613 185297 -4346 -35477 135278
38189 135278 303319 298339 169724 65333 43646 63430 79454 79397 59609 15748 -42003 -76973
38177 -76973 -35074 108240 291508 392505 348791 228316 144946 136671 166936 201027 219584
38166 219584 192683 111635 24129 -26633 -72303 -161481 -259235 -282054 -215633 -123912 -57679
38155 -57679 -24725 -24638 -33077 18314 151274 256379 207109 40728 -91482 -140456 -189122 -264284
38143 -264284 -277971 -200350 -139237 -169419 -209200 -156382 -38489 67842 166017 274321 313482
38132 313482 195318 -8853 -110349 -21765 145633 217471 144404 45194 72548 224338
38122 224338 307137 146924 -174791 -389155 -356442 -202901 -108023 -86548 -56005 5245 75719
38111 75719 164252 249190 235879 100855 -8700 36784 139215 115244 -14201 -68657 -11572
38100 -11572 6670 -65403 -63260 135131 396916 497691 389658 199632 41666 -60348
38090 -60348 -112654 -114540 -75381 -18318 25282 16193 -52273 -103747 -39113 121284 227589 177777
38078 177777 38616 -60825 -87406 -89911 -90845 -78688 -68607 -81009 -77024 713 124231 192541
38066 192541 159699 88497 59468 79924 106308 112161 103174 91583 81439 67137 38859 5180
38054 5180 3251 50872 93369 56518 -32069 -46874 61583 167712 132103 8781 -30447
38043 -30447 40233 64002 -36042 -117027 -39641 100218 108263 -31172 -179292 -276442 -357992
38032 -357992 -372297 -214673 26261 93390 -70726 -194840 -62143 169593 224725 131186
38022 131186 141440 319428 467481 450768 350010 254241 124802 -49479 -145826 -73004
38012 -73004 84514 195084 249590 301695 331395 282639 177601 90145 45506 32327 72010
38001 72010 182335 297691 318502 239076 155450 144157 187437 211632 148283 -23818 -229100
37990 -229100 -302632 -139774 143233 289594 190456 15129 -13221 103212 186826 162308
37980 162308 133309 168305 173106 69118 -30307 31164 199296 272262 197185 131358 179348
37969 179348 235326 165626 13664 -83073 -83339 -39174 25099 117938 209207 255240 271033 302855
37957 302855 360268 434641 531855 618699 604368 464665 320818 292141 329366 309167 237560
37946 237560 221060 270600 285208 228203 178833 191159 225297 243546 266117 306880 349978
37935 349978 404383 483203 519135 410370 176119 -32090 -101404 -55619 26670 94187 109752
37924 109752 56699 -15215 -30702 17163 88496 181665 289098 313285 182463 20590 10226
37913 10226 91298 23592 -216615 -360237 -260962 -121432 -136680 -160412 25738 299817 359086
37902 359086 189018 60044 84002 84099 -43529 -128924 -24971 118005 65787 -143240 -255997
37891 -255997 -168650 -48549 -73385 -194131 -228027 -96447 120972 321257 459242 494099
37881 494099 371967 129421 -63594 -61122 90489 224288 259987 243547 209285 131022 21667
37870 21667 -42212 -31529 3236 39643 109496 184366 169840 78181 69905 222824 375217
37859 375217 321512 82341 -137745 -198700 -127885 -38987 -48067 -202537 -391668 -403528 -185366
37848 -185366 34819 24512 -134385 -173574 -29697 93853 50611 -66739 -112337 -78749
37838 -78749 -31198 2290 -6557 -104465 -245389 -274161 -127498 39126 41253 -82287 -126111
37827 -126111 8626 211823 325776 309743 234628 195591 249290 373150 463599 424254 275594
37816 275594 136330 86906 101225 123429 143724 161269 137627 50847 -47843 -99128 -121350
37805 -121350 -156690 -170168 -105423 -21101 -42034 -159269 -218615 -158671 -114490 -191833 -279841
37794 -279841 -232519 -125743 -149484 -304224 -401152 -353188 -276914 -279206 -315039 -310267 -274633
37783 -274633 -223936 -120303 31443 136800 140027 108246 113332 112675 24429 -141306 -291371
37772 -291371 -342480 -269593 -120483 -6631 -9374 -75371 -80417 561 87598 155687 260123
37761 260123 378306 386839 260881 148120 160548 224953 225616 164874 91349 742 -91338
37750 -91338 -105373 -30766 22061 -449 -7853 39443 22106 -105123 -152940 29998 277267
37739 277267 330792 226639 198575 281954 294442 180644 93165 100563 68980 -90050 -258385
37728 -258385 -287201 -178238 -12678 168253 339384 453031 482624 433690 304465 124625
37718 124625 11351 56620 166951 161982 38213 -23495 64645 181979 212098 202236 222541
37707 222541 213650 97543 -56763 -104537 -16798 97256 138998 119532 109756 132740 126637
37696 126637 28395 -111563 -158779 -76895 -5734 -77471 -223474 -275647 -207089 -138577 -137306
37685 -137306 -152686 -142167 -119178 -74995 6649 52787 -31419 -181495 -214443 -84191 56873
37674 56873 95387 95448 131856 144418 61968 -58904 -136163 -200239 -308700 -402172 -371468 -225431
37662 -225431 -82616 -14334 20491 93028 217420 339204 374745 280742 112008 -14568
37652 -14568 -35281 8874 48735 75178 127739 223703 318235 327094 203740 14819 -96773
37641 -96773 -67135 12153 29754 10908 48104 124651 129824 33250 -80254 -154745 -225026 -318202
37629 -318202 -399979 -438528 -427053 -338560 -167277 -20850 -42776 -210889 -332305 -283107 -147447
37618 -147447 -75271 -104344 -171217 -204199 -156966 -35052 69739 53255 -61844 -149409 -165071
37607 -165071 -196021 -281728 -306876 -160924 79811 229069 213494 141627 155796 261837 329402
37596 329402 269350 180175 234277 405677 449166 240949 -7040 -35363 89179 111090 1897
37585 1897 -43839 3559 -56215 -271835 -396601 -262130 -48787 -12050 -126392 -178651 -81544
37574 -81544 66763 144589 109018 13050 -10705 117096 266566 216041 -32287 -224338 -195971
37563 -195971 -51750 61759 138553 175258 94828 -56373 -80826 36321 24482 -228946
37553 -228946 -398823 -177757 212027 314993 99431 -61664 8690 99661 37985 -49783
37543 -49783 2200 144528 230888 199297 58256 -137158 -238254 -101208 202367 416115
37533 416115 389909 213430 41339 -62621 -82513 -19989 39651 -17310 -153606 -197604 -94267
37522 -94267 8778 -3961 -47464 -5738 64858 40274 -51345 -65056 36288 125276 92667
37511 92667 -10109 -53705 1616 79274 110880 123299 170242 228341 235214 211763 248597 352775
37499 352775 411638 357882 269985 235742 213149 128448 31825 28839 101789 125518 47019 -58465
37487 -58465 -111022 -117387 -128574 -165921 -195610 -153310 -23369 94847 75621 -44888 -74587
37476 -74587 71016 226011 202607 56932 -14896 33588 75295 31821 -41987 -88262 -121335
37465 -121335 -160432 -194604 -225251 -261889 -279726 -249608 -192001 -146291 -126652 -153930 -254198
37454 -254198 -365561 -353295 -207392 -104631 -156534 -228395 -165311 -61674 -93417 -187547 -116329
37443 -116329 120916 269789 190153 23456 -55799 -57688 -79256 -146780 -223890 -265848 -228145
37432 -228145 -112820 -7485 15948 13537 73333 157556 169385 117060 65836 -444 -101830
37421 -101830 -135087 -30935 50042 -70428 -251936 -204439 44717 180726 107101 71037
37411 71037 211533 329521 246659 85316 17862 1178 -55455 -90438 -46668 -27937 -118288
37400 -118288 -220453 -230357 -195838 -163544 -68203 78837 110271 -18534 -99090 -10633 50208
37389 50208 -79978 -190225 -11738 313419 429605 314750 269504 404996 487180 321095
37379 321095 3581 -265515 -396535 -381645 -249137 -99714 -34093 -16441 55210 153001
37369 153001 151974 49346 -19456 10324 70750 115302 171966 228051 222642 179354 197964 286852
37357 286852 341596 310711 245629 170888 52649 -76756 -112058 -37314 35386 30479 -11129
37346 -11129 -50099 -112723 -188890 -197085 -118129 -53044 -77182 -129569 -115207 -39841 18936 12666
37334 12666 -51466 -126068 -133356 -25080 133599 199142 98095 -106109 -299893 -409926 -403355
37323 -403355 -275387 -64690 162927 350760 443581 392721 236938 118944 118609 123931 -6159
37312 -6159 -205557 -288886 -236276 -193651 -194311 -104327 106291 260231 237660 147703 114965 77989
37300 77989 -47422 -162918 -128532 2337 67171 28446 -47087 -162797 -352726 -514106
37290 -514106 -483379 -286937 -140500 -166243 -258409 -270753 -200549 -124965 -71173 -32629 -32840
37279 -32840 -80215 -97429 19707 264060 483754 517441 363391 189208 141985 167847 90668
37268 90668 -121905 -275517 -197278 29403 187349 210333 203038 215296 168395 31899 -80881
37257 -80881 -64851 39842 133666 188028 219520 222897 212433 251089 343551 368116 225679
37246 225679 7641 -105533 -83591 -53917 -80420 -85246 -23484 17434 -21093 -36108 81871
37235 81871 248565 289079 194630 119071 133013 150670 126861 146023 233980 252149 116897
37224 116897 -14541 43811 208843 252190 159354 118983 159548 74613 -205154 -427623 -371012
37213 -371012 -169858 -82161 -97271 -25626 127959 161179 20486 -110093 -100475 -33670 -15293
37202 -15293 -17781 9694 41747 66288 127458 205840 196916 81191 -23797 -48427 -55430 -69939
37190 -69939 -5775 137319 196166 105742 47397 155047 260163 165292 12446 86106 343818
37179 343818 459337 309146 108761 37914 25383 -16024 -11939 89886 177415 156617 104756
37168 104756 112786 125262 62054 -32204 -76541 -73147 -38806 59284 201118 275326 243615 213113
37156 213113 243699 230085 98968 -26174 -9248 81408 103268 67149 61043 57492 -11194
37145 -11194 -73849 -15365 114177 176006 168526 183220 194465 110567 1035 43469 237481
37134 237481 384813 380121 321857 296547 249038 132660 20001 -13095 13741 54887 91791
37123 91791 93476 49697 47950 168494 305895 278440 123465 65407 151289 165759 -1317
37112 -1317 -160846 -148667 -99017 -179766 -260508 -119314 150128 236606 71322 -90704 -68945
37101 -68945 11934 -35517 -186870 -281367 -234379 -68913 160419 365652 423449 295253 117114
37090 117114 56062 80830 -168 -223784 -324483 -49794 430569 639134 377292 1237
37080 1237 -45012 189352 295194 128085 -26204 45725 147455 21929 -212048 -239714
37070 -239714 -32346 128403 70479 -73787 -123427 -91922 -89857 -127492 -125104 -56630 6930
37059 6930 -7295 -75339 -90646 10474 148739 179322 81541 -3162 38513 150616 225649
37048 225649 269460 335614 368546 265412 75292 -15744 72822 210252 235627 143414 32517
37037 32517 -44120 -101448 -140443 -120289 -10691 162571 322439 383433 316462 191680 131434
37026 131434 185908 262915 218420 30726 -147552 -149483 9484 152293 163683 112382 104047
37015 104047 103489 11470 -138138 -200591 -131761 -36744 10375 52548 115106 132526 84114 69029
37003 69029 147498 220483 178511 76259 41323 82041 99918 38971 -70920 -162774 -151258
36992 -151258 10191 207892 217807 -4898 -203551 -139414 76422 156798 49780 -52072
36982 -52072 -59334 -78839 -140518 -90101 146228 386769 413412 240686 59016 5421 79933
36971 79933 207446 296279 289331 217941 163277 139979 83730 -23123 -95177 -55044 61921
36960 61921 150134 135014 20840 -110188 -151263 -84549 -21637 -54956 -108231 -47401 96109
36949 96109 165097 129116 118041 173581 159911 9305 -113030 -22884 217214 379759 351821
36938 351821 223278 143680 179109 278366 323060 243098 105591 34389 41258 32329 -13223
36927 -13223 -2858 99989 208966 265433 304678 314850 209436 34058 8780 220884 448371
36916 448371 458018 316262 208790 114510 -85240 -288247 -256468 12695 261459 317098
36906 317098 233574 97087 -67258 -180056 -141632 -22355 2153 -65547 -63700 3498 -46030
36895 -46030 -185734 -117974 232436 483224 313700 -44308 -152411 -1223 66799 -53133
36885 -53133 -119231 -9188 93151 58888 27071 116999 206360 173127 132796 232874 383079
36874 383079 399157 285738 167366 43359 -160178 -357597 -366811 -203450 -86395 -109791
36864 -109791 -117403 19713 192623 242567 202065 193479 201662 126439 -1802 -44430 20683
36853 20683 69288 46308 48325 137079 221494 215481 188023 242343 343473 392394 391909 396603
36841 396603 364492 232554 105819 165442 362716 413779 187245 -88575 -137975 869
36831 869 99670 100779 134621 232776 258134 146155 16341 -26741 -46687 -139583 -263926 -304998
36819 -304998 -231271 -103462 13346 78857 71707 14114 -40159 -80464 -146448 -229530 -242859
36808 -242859 -137822 21627 150749 233494 268671 219474 93544 -12458 -38232 -50422
36798 -50422 -110361 -136989 -30773 131852 180745 99241 35193 62383 77856 -23180 -186106
36787 -186106 -270521 -217996 -103246 -52593 -120105 -220844 -218262 -110129 -51433 -118145 -150181
36776 -150181 24943 287070 339165 113836 -137586 -192351 -98995 -10587 37067 74870 82571
36765 82571 50766 50656 121063 173963 123813 30997 4760 32900 24045 -32348 -63995 -45942
36753 -45942 -31078 -58071 -102910 -119333 -83882 -18462 6873 -63374 -178379 -211595 -117252
36742 -117252 10652 72675 78027 76981 68362 44978 52891 122070 194151 192691 120589 35193
36730 35193 -20640 -25552 10990 16200 -74098 -179734 -137933 50059 183763 149991 75124
36719 75124 81700 80885 -25048 -110768 -23374 125146 116691 -9455 -18212 142820 292106 326545
36707 326545 320929 301491 186959 11563 -41753 79578 198130 177056 93395 50522 17135
36696 17135 -36106 -29035 68571 137161 98614 48568 64351 47707 -79585 -182418 -112326
36685 -112326 24843 16954 -127851 -223813 -217433 -225203 -283904 -295790 -246189 -254729 -341996 -341268
36673 -341268 -149035 95443 211125 231745 306615 424742 418787 239974 63459 56309 158136
36662 158136 191597 119435 66009 99579 129775 70561 -10803 -6279 50128 40197 -37446 -71784
36650 -71784 -49432 -102710 -286618 -443606 -395558 -179836 18760 109956 154487 210023 235946
36639 235946 161912 -21444 -245132 -390914 -368535 -227180 -151341 -256792 -415258 -386420
36629 -386420 -122924 162239 251679 146123 -1151 -70238 -35820 69508 167931 164504 46521
36618 46521 -68796 -51688 92258 244968 322271 334614 317126 272316 196677 111521 42292
36607 42292 -6049 -36883 -36744 32155 204199 442512 601899 535067 280343 66293 50190
36596 50190 124963 98683 -6318 -6965 115259 160634 38074 -65691 27971 202533 215180
36585 215180 40394 -132157 -171707 -108450 -8548 88124 125847 72522 -10094 -49310 -75301
36574 -75301 -134826 -160048 -75284 36736 59093 63249 186023 337096 297938 105190 40241
36563 40241 186034 288171 156426 -73060 -205475 -252125 -274168 -218569 -93434 -66010
36553 -66010 -179915 -203832 8051 224590 169768 -49782 -139161 -69626 -26353 -36363 18598
36542 18598 104331 77013 -28190 -60589 -59633 -179733 -338894 -276846 20882 273662 314976
36531 314976 250677 174521 41521 -111979 -137842 -58525 -76812 -197796 -154629 142866 394787
36520 394787 345794 161616 136054 246046 259581 127506 9823 3301 55337 88231 51034
36509 51034 -82736 -242882 -280459 -174871 -107707 -203135 -324817 -284633 -130258 -45822 -61940
36498 -61940 -53639 32176 123428 165252 168172 137941 79674 44532 68876 104236 97810 86550
36486 86550 118490 149134 120552 73997 69663 60270 -30834 -157651 -203370 -149643 -82522 -59295
36474 -59295 -67100 -79891 -67347 9558 123313 152747 28468 -145173 -214175 -171402 -124494
36463 -124494 -117288 -102709 -63125 -39303 -49341 -77660 -133342 -225995 -292868 -244570 -94255
36452 -94255 29825 16615 -122079 -273538 -322016 -241976 -115844 -35831 9300 91209 190861
36441 190861 192257 57960 -96892 -162226 -165090 -179658 -203765 -201659 -180357 -144182 -55078 86500
36429 86500 198513 219080 170994 82510 -43914 -140507 -103666 11335 -3982 -200735 -344677
36418 -344677 -246646 -48353 9005 -54201 -51107 38360 80945 61227 84818 143986 121849
36407 121849 26343 -5162 49792 59878 -22951 -82448 -43590 11592 -8721 -86109 -169601
36396 -169601 -245050 -280884 -220277 -74250 64873 124780 94440 -14581 -147868 -184525 -65198
36385 -65198 79804 71220 -70451 -167838 -156028 -130952 -130630 -66215 91083 240198 321832
36374 321832 382743 407382 276176 -6962 -219769 -189662 -23105 69057 59215 66763 126724
36363 126724 163586 154629 160947 191623 162432 19610 -178073 -326288 -364152 -282757 -110588
36352 -110588 73208 158583 95798 -37433 -105121 -63897 -6111 -23504 -74294 -54644 26009
36341 26009 45976 -39038 -122689 -118895 -95892 -146952 -214852 -165750 8580 177483 239916
36330 239916 210092 148976 95821 63793 42594 15543 3705 42260 84462 26958 -108587
36319 -108587 -145485 -11221 107583 30990 -113475 -73299 120786 184088 8894 -189336
36309 -189336 -213627 -142369 -134162 -160417 -83375 104817 258468 252906 101656 -71798 -138742
36298 -138742 -75909 13080 22734 -29033 -63220 -82681 -142858 -211421 -199863 -132639 -129587 -194834
36286 -194834 -184645 -43557 82161 59597 -30605 -22885 97820 209253 240933 233294 233386 235594
36274 235594 234339 256927 307747 320163 216579 27015 -95733 -33834 139143 238015 207052
36263 207052 175092 233483 291161 242955 156426 151599 192180 160551 69915 23199 8447 -72778
36251 -72778 -192519 -210337 -114073 -57304 -114089 -166334 -97017 48472 162076 216532 244280
36240 244280 262173 264472 226858 113347 -47449 -125040 -35739 107657 132327 59167 55749
36229 55749 153334 201101 122910 32596 39680 98031 107552 40040 -73429 -164677 -133995 34241
36217 34241 180327 156492 75090 160511 370147 423163 242732 89766 155587 282804 243116
36206 243116 75470 -27178 -2935 71194 125825 113628 -7634 -188154 -286618 -246496 -164300
36195 -164300 -128613 -130245 -170376 -275688 -356737 -265771 -63519 12089 -70580 -63298 123598
36184 123598 221618 49742 -144695 -75492 111859 100557 -64218 -81366 85464 178977
36174 178977 101166 32859 72552 76453 -55525 -186390 -147245 33225 198389 255067 239106
36163 239106 253824 348256 422992 331334 126035 58409 213421 322430 138891 -160534
36153 -160534 -218956 -30802 82801 -13235 -107993 -34049 83916 73867 -23094 -60489 7018
36142 7018 120681 197196 157696 -209 -136252 -112786 -13143 -44188 -206143 -264932 -111199
36131 -111199 64233 63519 -31948 -16613 128090 237325 205855 88323 -12692 -52991 -48018
36120 -48018 -36169 -41982 -45138 2354 113522 239384 310975 296878 234062 212704 288613 390962
36108 390962 385014 260288 156970 142375 92164 -84259 -230972 -144496 101973 247077
36098 247077 207381 131147 104138 46509 -60409 -82079 43593 182098 209439 182599 196141
36087 196141 212806 156939 63560 16435 20026 30452 42029 61176 62860 44771 56981 111125
36075 111125 126489 33793 -119961 -224476 -222075 -144825 -88938 -156888 -344478 -481266 -388082
36064 -388082 -111438 113970 160984 135165 161783 200696 165886 99520 102277 171335 221715
36053 221715 216583 185160 154140 133818 133552 141438 135569 141643 202967 268930 222874 68600
36041 68600 -33202 14468 113277 147207 158052 220124 263511 181438 27086 -59637 -57846
36030 -57846 -40594 -7694 78951 139114 54623 -99523 -108381 61236 180972 75907 -140761
36019 -140761 -242361 -170118 -37511 47586 60536 26488 -2327 19182 63119 54694 -840
36008 -840 -9508 43312 33974 -102797 -237546 -231065 -150080 -142164 -183096 -139790 -29651 2861
35996 2861 -41864 -6014 127644 168143 43572 -34767 112606 353915 469395 478276 513872
35985 513872 518524 347768 102328 49063 207597 304172 190840 39119 17581 30486 -67990
35974 -67990 -204250 -216181 -113376 -31139 -24299 -57140 -109222 -151665 -104134 44851 152114
35963 152114 91880 -56042 -123108 -87616 -57413 -82012 -120464 -138219 -103841 39744 254968
35952 254968 340988 164676 -101833 -174047 -43063 50010 9991 3137 127507 219529 119307
35941 119307 -59948 -89144 68217 253651 342079 336048 275429 176821 62746 -28099 -71650
35930 -71650 -66341 -20602 44954 102359 139348 155900 135952 62798 -27863 -58353 -3374 53943
35918 53943 -1463 -175357 -316824 -252007 5591 223997 210259 65499 55506 233451 373133
35907 373133 332477 269099 351172 452689 358349 129910 11789 58561 118094 126967 146533
35896 146533 136476 -7844 -180639 -139204 89153 183161 12109 -161860 -113600 14475
35886 14475 22445 19557 196500 426568 413884 148057 -76235 -65050 85427 197943 207685
35875 207685 130261 4185 -98048 -109971 -40358 57491 148344 186909 108389 -63278 -188015
35864 -188015 -192971 -179706 -231811 -245871 -115423 47935 86010 73239 172763 295415 200309
35853 200309 -81307 -233194 -116804 40547 13913 -126548 -213323 -223874 -171391 14442
35843 14442 303106 458456 341289 157200 167479 292375 270878 110812 65049 186211
35833 186211 229572 60392 -134005 -161659 -107134 -127798 -170517 -99543 30925 56680 -16052
35822 -16052 -23895 82595 174405 162157 107791 84417 77435 76419 125319 209403 214803 89585
35810 89585 -55099 -98769 -76117 -80239 -81330 21597 208604 339131 342419 283719 226934
35799 226934 154392 65676 42285 132920 247983 258401 161398 63510 16746 -36001 -128193
35788 -128193 -160058 4724 347958 671345 792103 723882 619698 567650 520085 429277
35778 429277 357392 382360 449665 412642 220914 -2054 -90429 -2800 156500 247904 215648
35767 215648 125339 95202 170807 268031 265569 150719 36487 26850 105687 181827 205783
35756 205783 194171 154568 56150 -87856 -161259 -52555 177857 328714 299002 212696 225600
35745 225600 293204 265948 165078 176580 343158 451182 327812 105496 46878 197376
35735 197376 363520 387653 294583 176332 71787 -4919 -17304 54508 168802 250150 253088
35724 253088 200145 163995 192783 252874 284234 302053 367399 456266 467075 385516 312241
35713 312241 273412 158812 -49086 -147086 17513 269375 307607 120326 -18263 53877
35703 53877 202729 243993 187821 162045 217771 296079 324729 294163 260462 276616 310288
35692 310288 279368 192327 158808 209976 239564 213992 277083 486935 609884 407014 14473
35681 14473 -216164 -182251 -73131 -11550 52487 109978 65854 -26631 554 113844 92437
35670 92437 -70126 -89306 165263 440929 474939 332092 197385 82460 -57466 -133047
35660 -133047 -72500 5417 -21870 -71241 -24320 43808 9954 -58091 -17266 105649 183069
35649 183069 205254 244587 291517 301001 312394 355487 334928 181597 21014 8448 85789
35638 85789 87694 7597 -29319 13388 72825 131197 197955 217196 161406 137217 223274 295914
35626 295914 212357 73549 79243 193759 196906 25966 -165468 -259354 -258951 -157401 39927
35615 39927 182059 108657 -81720 -140696 -42895 9742 -40682 -31144 76070 84115 -81043
35604 -81043 -191775 -69530 126702 161538 76961 69430 158939 199226 129512 26115 -39463
35593 -39463 -40416 50521 207404 307382 272058 199725 226986 309256 280123 100945 -87779
35582 -87779 -159644 -121604 -31604 81696 178229 183412 73732 -59369 -89519 6388 120873
35571 120873 136620 63034 26130 106236 220668 223922 107934 19405 61394 169014 234014
35560 234014 265655 332323 396354 333299 128182 -55033 -59286 73787 169027 141097 70525
35549 70525 57837 93009 115601 127716 161919 182982 129932 44251 39368 123639 170613 108031
35537 108031 20660 2353 22606 26156 49085 121520 161870 108499 63563 140322 243161
35526 243161 193030 25927 -47358 30234 98945 77619 89887 210440 299040 220852 61581
35515 61581 -27942 -62658 -134643 -204251 -160735 -27150 65104 71010 50136 21597 -40353 -78081
35503 -78081 10171 171439 199970 16017 -181769 -149474 91013 284993 259741 105029
35493 105029 26876 99815 217651 261879 249999 276174 339154 316635 148845 -28652 -30430
35482 -30430 129590 246620 195459 77479 45688 92130 104801 55101 5087 -26897 -74432
35471 -74432 -113827 -86516 -38525 -88957 -220257 -253106 -106687 61550 83452 11128 -17863
35460 -17863 -16780 -63527 -74189 102904 390021 507898 337003 59935 -101257 -108887 -21264
35449 -21264 123419 243886 214513 48234 -60943 5065 121255 128193 72175 89643 163523
35438 163523 161217 49953 -72059 -117567 -72404 32480 116763 86022 -40098 -118449 -84981
35427 -84981 -53466 -113273 -172487 -138957 -99141 -132118 -101832 124871 381321 409437 286642
35416 286642 332242 608323 826861 782604 584251 406477 306210 352433 624434 972654
35406 972654 1116730 1156595 1630978 2754419 3862380 4025346 3121818 1940648 1239576
35397 1239576 1043143 926944 666301 402027 332388 451501 578932 552068 380150 222517
35387 222517 194954 223108 155991 3851 -49780 93982 282476 281605 59775 -180641 -242073
35376 -242073 -130938 -2054 38133 16939 -1991 -27631 -100418 -179780 -159341 -15125 131934
35365 131934 152897 66812 297 13916 33492 -39510 -198858 -337098 -353515 -242064 -86963
35354 -86963 15045 35509 29665 72417 174429 261540 244452 115888 -27908 -79012 -30999
35343 -30999 21709 708 -75517 -145892 -196762 -248734 -284682 -262782 -201739 -180716 -226482 -259900
35331 -259900 -200799 -84530 -17038 -36468 -83588 -107848 -131034 -173527 -180043 -87439 61677
35320 61677 153464 153709 142935 174229 182206 97793 -15702 -33948 56837 152088 174026 135357
35308 135357 71760 8427 -5742 69288 181046 222068 168165 98398 73585 86230 124173
35297 124173 167186 127043 -55285 -236095 -178380 101755 290475 186147 -33288 -104712
35287 -104712 -64156 -122799 -283576 -336142 -197350 -25306 25601 -22740 -83482 -136288 -193438
35276 -193438 -244994 -285979 -324108 -340251 -307588 -251240 -219609 -201951 -143986 -38950 59274
35265 59274 103065 82446 18237 -31222 -4432 73467 99256 41292 -8428 1930 -13875 -106757
35253 -106757 -144260 5425 231399 303378 189361 76166 93303 173991 190155 97506 -53246
35242 -53246 -155538 -124054 -7069 48633 21079 74311 275926 413857 286271 28928
35232 28928 -83848 -39891 -16955 -16544 104496 287626 305027 149070 56818 104664 107957
35221 107957 -5900 -59387 26149 64250 -60224 -181660 -158195 -115729 -189145 -268617 -226717
35210 -226717 -176122 -252404 -323413 -183380 88883 221081 115490 -94951 -283473 -402904
35200 -402904 -375686 -137849 197016 392938 345978 176135 59929 63563 140404 209899 220617
35189 220617 171568 80959 -45434 -173612 -212730 -124412 -23637 -37053 -96046 -47275 59701
35178 59701 31544 -111532 -121927 53375 138146 -33841 -231500 -191495 -16495 49200 24541
35167 24541 75178 160756 122283 13244 16863 89634 8686 -230976 -369370 -271445 -96730
35156 -96730 -14406 10815 58304 87741 53538 22061 52688 78072 15084 -88476 -121193
35145 -121193 -73119 -46946 -115900 -222697 -234674 -99848 61285 65002 -112270 -281287 -263186
35134 -263186 -104858 3719 -23407 -97418 -105991 -42748 19655 24001 -14434 -21403 51398 150569
35122 150569 180273 144631 149311 233948 303001 278333 220418 219888 255429 246837 178812 90253
35110 90253 2955 -68850 -101439 -110124 -140555 -170992 -127965 -44027 -60177 -195905 -270810 -164808
35098 -164808 -5828 34302 -17387 -53035 -98643 -217043 -314338 -257455 -104397 -10145 28061
35087 28061 118700 227809 216237 105324 75375 180002 266640 218513 94682 -14598 -106219
35076 -106219 -183365 -200491 -150655 -96205 -67772 -32020 11730 6505 -57389 -103398 -67157 34082
35064 34082 139955 191523 151554 53975 7401 66476 137282 111157 49158 104112 283124
35053 283124 430998 454924 426473 429399 430784 362721 246672 170320 174762 203182 161017 30348
35041 30348 -90010 -107122 -78125 -127085 -216375 -164916 46354 180818 90454 -30592 67088
35030 67088 296876 373296 244727 130117 163401 249228 275024 246846 193017 120701 84473
35019 84473 128772 164234 73820 -73582 -105137 -21950 17346 -14682 21679 155060 232542
35008 232542 188771 152825 200752 222820 147032 89765 149590 226757 192552 92337 37159
34997 37159 19734 -16723 -32122 37687 130826 118120 -20216 -170695 -213006 -113957 62523
34986 62523 197330 216914 174615 169433 185270 114932 -43874 -147289 -104846 3632 67622
34975 67622 81794 75296 25824 -66511 -118742 -73881 2629 16591 -26247 -50685 -13108 77514
34963 77514 177213 210925 136223 33556 38880 151547 218326 154865 60054 42222 61231
34952 61231 44574 43334 136837 256972 248502 75464 -143514 -286757 -323203 -273317 -170789
34941 -170789 -67984 -7079 27492 79256 136723 126978 12853 -131036 -173961 -72553 63134
34930 63134 85453 -14935 -112275 -137468 -168339 -265709 -327891 -236012 -71021 -25733 -130263
34919 -130263 -229522 -231947 -211867 -237664 -266146 -267515 -302675 -388998 -412853 -277140 -52027
34908 -52027 107415 132999 75749 34054 95220 269432 430704 403297 165370 -102503 -223374
34897 -223374 -209020 -189886 -234126 -300496 -318292 -256156 -143494 -52981 -25388 -5816 88079
34886 88079 233860 316269 277391 169118 47546 -82390 -192053 -209534 -127095 -35463 6274
34875 6274 49654 138919 192075 94915 -115687 -251614 -182757 -4372 61302 -49415 -121682
34864 -121682 69722 406143 517016 270995 -34403 -101020 -30339 -77802 -199167 -152571
34854 -152571 57614 186783 168330 180754 276235 284382 154553 63485 77443 28532 -135110
34843 -135110 -193227 -30868 121532 47936 -109527 -111079 -2528 23590 -30772 -33680 8595
34832 8595 -1208 -44363 -48273 -50121 -97841 -109518 -32107 2060 -100239 -167093 -24871 154452
34820 154452 80335 -181914 -300631 -190031 -81620 -82116 -23585 163570 266302 139301
34810 139301 -25236 21076 213869 291526 168366 1848 -69377 -92627 -178274 -302781
34800 -302781 -308261 -111169 138466 197334 40909 -85600 4611 194259 264399 210452 177788
34789 177788 183344 120837 -8011 -93120 -129158 -207171 -293216 -245757 -81160 10646 -31221
34778 -31221 -53443 16106 30094 -94259 -181236 -67067 119130 153888 63577 45579 130911
34767 130911 158902 67469 -4899 55283 168475 178999 36175 -185335 -366233 -413004 -319828
34756 -319828 -188321 -125837 -110647 -30775 123307 197607 72134 -147445 -233789 -118174
34746 -118174 28571 22419 -106552 -178293 -106120 15090 61386 26941 -22081 -65203 -125626
34735 -125626 -191310 -219532 -210947 -208752 -219505 -196491 -114687 -8587 80999 148595 193379 195403
34723 195403 150682 91028 40571 -11710 -67103 -84443 -35783 34607 60180 47632 66025
34712 66025 137896 198706 188732 136527 108433 107061 74419 -14107 -113716 -175094 -195627 -188486
34700 -188486 -148468 -80211 -22201 -3785 -4174 12239 47815 92847 156716 225355 220433 75815
34688 75815 -146254 -280750 -222945 -34869 114423 92986 -88199 -275639 -303909 -171373
34678 -171373 -55711 -101129 -234504 -276418 -194243 -123122 -140102 -156456 -83205 13370 6584
34667 6584 -110803 -226487 -256421 -229211 -234101 -318860 -431471 -460048 -358185 -220711 -181635
34656 -181635 -239668 -255431 -137184 42206 144747 123460 42683 -10880 -3273 27099 3470
34645 3470 -107403 -240397 -289478 -215904 -69410 72389 139803 88042 -45736 -133549 -89273
34634 -89273 18386 72168 79898 126979 201950 219892 194504 215702 260383 216365 117441 144553
34622 144553 324688 432679 301409 50571 -118951 -192039 -252109 -275872 -195900 -70794
34612 -70794 -18296 -34662 -22791 47774 128731 187937 208805 156825 52354 6921 75920
34601 75920 148670 104457 1420 -26464 7749 -18488 -114848 -150333 -45569 131540 262110
34590 262110 268104 126834 -99100 -258805 -242274 -109032 -9294 -3241 -42707 -90813 -150573
34579 -150573 -198952 -203220 -192848 -217286 -246901 -214213 -136612 -93158 -92507 -77074 -54504 -98770
34567 -98770 -195676 -209750 -67076 116713 165950 51290 -104325 -199310 -254831 -321501 -348763
34556 -348763 -231642 5095 165600 104879 -71642 -144652 -78000 -31626 -83940 -123235 -71589
34545 -71589 -37274 -128762 -257869 -268732 -165621 -79460 -83464 -158251 -258512 -296315 -151897
34534 -151897 151944 364815 268120 -22037 -176012 -55693 159337 250541 208240 159674
34524 159674 169172 176109 83309 -119126 -302193 -305389 -133244 20065 8791 -77995 -65754
34513 -65754 43198 89492 -3345 -150357 -256694 -316731 -350223 -351816 -328332 -300540 -251506
34502 -251506 -146518 -10746 85322 123102 147480 171168 135706 -2120 -182755 -276252 -212911
34491 -212911 -84955 -82421 -273547 -481168 -475925 -277902 -129847 -155261 -212396 -152897 -45317
34480 -45317 -17816 -35357 3140 62451 42583 -25678 -26944 46711 99939 91921 60592 29911
34468 29911 6731 18788 52065 21909 -87152 -147488 -78117 3186 -28273 -76793 14180
34457 14180 171346 186582 44996 -73788 -93448 -105298 -133622 -73603 85888 180816 95483
34446 95483 -76321 -162147 -99839 38287 121589 60692 -81385 -113135 43271 197443 126886
34435 126886 -96778 -207276 -128803 -45793 -89246 -171390 -169737 -81558 52721 202643 276533
34424 276533 170418 -54086 -196577 -173080 -95014 -59372 -34136 -3850 -40650 -139625 -151707
34413 -151707 3474 187088 213986 75686 -97116 -196631 -183827 -71432 58460 106195
34403 106195 86902 113873 192189 155136 -94511 -389685 -475920 -318793 -111278 -14175 -13631
34392 -13631 -32008 -60378 -128836 -211409 -232142 -161184 -56907 5563 11974 -13988 -65704 -121869
34380 -121869 -101625 40666 188703 167480 -5426 -119953 -75062 -18972 -101106 -244852
34370 -244852 -291123 -225479 -123986 -7743 97314 86807 -66787 -203348 -189662 -123330
34360 -123330 -145893 -192094 -136698 -52809 -72840 -108443 9944 196948 210209 37759 -100414
34349 -100414 -110099 -98271 -107318 -60132 28107 60141 78221 193088 297652 168008 -125804
34338 -125804 -245357 -88998 56866 -23202 -177547 -192223 -109165 -71902 -85577 -90131 -79315
34327 -79315 -21948 143441 331632 330987 100273 -155106 -280480 -320720 -308089 -180132 -12359
34316 -12359 -28894 -223763 -270278 -9843 254839 205770 -5400 -18745 176916 272317 120614
34305 120614 -106616 -214726 -198381 -153625 -147396 -186816 -220040 -184318 -100446 -51868 -42424
34294 -42424 8137 99415 140434 141221 213657 319238 253789 -6948 -195983 -145601 -45521
34283 -45521 -111331 -223186 -145672 68565 165786 70767 -62768 -102354 -31439 129589 310655
34272 310655 374551 277753 166366 164684 178847 71886 -87987 -140593 -91031 -65268 -97684
34261 -97684 -140099 -192333 -248086 -201900 9175 249808 338117 271663 155518 20353 -119541
34250 -119541 -154975 -31309 97232 67550 -38463 -46370 15107 6128 -34098 43766 194032
34239 194032 208507 44542 -121076 -174954 -186470 -226463 -262211 -260680 -236707 -187765 -116348
34228 -116348 -92905 -156817 -207160 -151651 -92949 -171448 -290734 -232548 -7628 152881 142494
34217 142494 64523 -31980 -228098 -490773 -612640 -499469 -306837 -190791 -120547 -42526
34207 -42526 -26597 -105654 -141254 -16245 161386 205616 108731 1920 -61135 -126697 -196380
34196 -196380 -212367 -174143 -140312 -111065 -26965 95206 138310 46465 -81150 -128879 -122250
34185 -122250 -149220 -176843 -87799 92456 159237 -2756 -241193 -343978 -320672 -323680 -371253
34174 -371253 -346769 -240780 -175984 -173160 -110236 27507 72304 -50378 -170344 -132527 -32641
34163 -32641 -29830 -73698 -12304 129815 185333 108419 21557 4454 -12817 -120101 -288942
34152 -288942 -394710 -337894 -147535 24719 54467 -9461 -18902 60963 124720 117721 106016
34141 106016 116944 69554 -62984 -166325 -142011 -24388 118966 257321 315443 202822
34131 202822 -2545 -92671 -34853 -23298 -128968 -153654 13782 157874 65341 -138149
34121 -138149 -215831 -170307 -111020 18466 279749 477302 383292 110205 -46061 -35918
34111 -35918 -35001 -97601 -142097 -191919 -305457 -339591 -126782 160194 178966 -60730 -206231
34100 -206231 -106236 23799 31770 43610 131276 124028 -65335 -218304 -123545 109829 244520
34089 244520 234665 172820 83624 -38685 -107678 -43560 70193 68255 -95085 -309096 -427944
34078 -427944 -383967 -241457 -161502 -236438 -356881 -346689 -219309 -153538 -207450 -237454 -154787
34067 -154787 -78915 -134184 -249074 -289208 -273595 -309859 -381644 -350650 -166098 40282 105078
34056 105078 23278 -56890 -18431 89731 134802 80285 8793 -19537 -20053 16917 135163
34045 135163 268362 251122 74607 -35564 61980 193937 147647 22187 62570 252433
34035 252433 341099 222602 27812 -132781 -261058 -314536 -217695 -53423 -1972 -56909
34025 -56909 -37282 81621 101579 -63002 -223981 -200884 -60748 31754 25835 -51981 -172522
34014 -172522 -243957 -148745 54760 135332 5602 -132791 -92100 18814 -16115 -179281
34004 -179281 -264629 -191576 -82116 -41329 -26805 31083 96051 73381 -60426 -221421 -301499
33993 -301499 -266986 -168757 -66874 25331 115263 191420 237101 246671 205197 102519 -10554
33982 -10554 -55530 -49112 -94300 -198063 -223743 -112739 -13919 -57254 -129630 -54043 112204
33971 112204 165696 76062 -1042 1584 -5817 -58807 -65825 9897 62153 -7777 -168473 -317121
33959 -317121 -369377 -293421 -145266 -48212 -54433 -81620 -70854 -101944 -226916 -319795 -268069
33948 -268069 -179172 -174897 -120139 146895 414708 295195 -182397 -537852 -474662 -218955
33938 -218955 -105574 -130715 -94191 55358 221648 342169 388760 308395 116214 -44222
33928 -44222 -56905 21492 56299 -2662 -117043 -231795 -287996 -239897 -112896 10090 77550
33917 77550 89090 50218 -5748 11241 138114 254657 222128 93387 40021 101394 164504
33906 164504 166876 149232 122876 59411 6337 44924 140550 194567 217535 275400 300709 161995
33894 161995 -95616 -281854 -320608 -283564 -200595 -59263 39003 -29238 -173954 -198806 -130122
33883 -130122 -166819 -306555 -325729 -167069 -40208 -67296 -122914 -112247 -117794 -161138 -100900
33872 -100900 95171 228647 165834 34869 -4061 22216 33235 44971 63504 14610 -106371
33861 -106371 -180011 -142083 -54527 44252 161252 193627 -2432 -332463 -507878 -438250 -324298
33850 -324298 -297169 -250764 -121032 -33909 -53644 -64123 -22941 -54585 -173047 -207251 -128139
33839 -128139 -134302 -268939 -290811 -106637 17399 -98323 -229319 -142917 4972 -27952
33829 -27952 -152284 -154717 -82912 -94512 -129560 -58155 27706 -13852 -80010 -13721 71332 -23303
33817 -23303 -211586 -264651 -201619 -210873 -274730 -201769 19266 200224 257050 266490 256488
33806 256488 193913 146407 210517 303969 257404 87174 -36523 -60206 -75965 -113861 -112842
33795 -112842 -72534 -41229 13634 131990 199037 62578 -205603 -362447 -309326 -184173
33785 -184173 -135966 -162806 -185902 -158594 -90183 -41525 -72670 -140696 -127998 -33724 -11483
33774 -11483 -123510 -210000 -137143 -15435 3733 -2467 123403 319838 387209 290795 166517
33763 166517 87349 30585 16582 68224 81977 -45385 -195963 -152676 72720 241971 220542
33752 220542 102195 -11503 -146585 -309144 -380493 -264637 -37917 133433 164391 86555
33742 86555 -30928 -132432 -166390 -87625 85719 232316 222295 89535 18866 83277 112217
33731 112217 -28908 -152379 12326 359244 490379 272823 -383 -73033 -31211 -23559
33721 -23559 9497 134978 218802 138168 893 -43901 -30230 -36022 -14068 59838 66554 -43968
33709 -43968 -113539 -34550 49965 -3604 -92818 -77098 -29559 -63327 -101747 -45768 19937 11578
33697 11578 38115 174721 252244 130797 -19032 12767 114940 61261 -99255 -168439 -156300
33686 -156300 -193158 -225904 -129501 -2635 -23514 -109294 -43429 139812 216494 150624 103187
33675 103187 123691 130313 140293 225261 290115 191063 28797 31040 177163 226307 95664
33664 95664 -63216 -143816 -176694 -165703 -89428 -42370 -123639 -211204 -96917 175977 350886
33653 350886 307177 142854 -44364 -213015 -262154 -123972 48803 37581 -115805 -172157
33643 -172157 -58259 72117 117989 129481 133574 91432 35022 44390 89223 67564 -20151
33632 -20151 -92699 -129281 -136132 -61589 86973 152182 41152 -85630 -34307 141599 273996
33621 273996 334016 339549 201031 -80295 -253505 -152716 -3059 -72870 -216106 -128955
33611 -128955 118164 220620 169145 194320 276507 173109 -96571 -234788 -146304 -41705
33601 -41705 -46063 -72986 -94192 -172601 -222676 -95503 91098 58275 -190688 -370143 -351540
33590 -351540 -269659 -205987 -109682 -25640 -67553 -173205 -191704 -163653 -209505 -244302 -146316
33579 -146316 -66436 -169606 -231382 32127 381031 346124 7097 -111527 124538 336239
33569 336239 340924 360944 470197 446848 272695 198914 227282 105425 -94345 -13797 291809
33558 291809 349196 71049 -110427 -27894 26653 21627 297619 762841 833556 456061 306498
33547 306498 649129 951054 1020557 1438876 2329626 2977198 3528743 5659096 10026356
33538 10026356 14097510 14458854 10978669 6885481 4727611 4027072 3250341 2263329 1814243
33529 1814243 1867057 1750957 1376553 1230540 1417385 1525788 1337979 1053385 857262 731744
33519 731744 655929 633973 567719 379603 193414 161222 209704 181153 118214 179159 357974
33508 357974 506309 565334 579541 543916 428421 308608 293767 351194 353691 275514 201423
33497 201423 167817 133418 89043 60193 11572 -109417 -228523 -194980 -19073 81837 -40781
33486 -40781 -253179 -309277 -158832 36693 150912 211712 269350 289728 242772 192293 211278
33475 211278 271978 299693 286852 277523 277768 256103 206242 146823 83942 23053 -14915 -27148
33463 -27148 -31525 -10554 69645 158662 156203 92125 119523 248860 275411 109207 -21956
33452 -21956 91562 279356 235213 -5209 -136511 -59985 30762 21177 20124 102660 187794
33441 187794 223699 252889 257104 172583 79701 126415 243811 211227 38272 -11936 154506
33430 154506 311055 274267 135947 28672 -58837 -112998 -26127 156357 187314 -16545
33420 -16545 -203571 -148864 42828 157488 160381 93785 -72621 -291165 -360638 -214388 -79763
33409 -79763 -139149 -241587 -186810 -86825 -155647 -299114 -235860 50138 274248 248281 66390
33398 66390 -104734 -203898 -221950 -156424 -70624 -69857 -169467 -263340 -250533 -145849 -54462 -55463
33386 -55463 -102984 -60030 121997 292369 264946 68759 -89619 -102279 -53116 -33474 -29711
33375 -29711 -22372 -35372 -43399 22921 144324 224757 246127 254180 200709 2517 -237026 -300364
33363 -300364 -188527 -141471 -266370 -391448 -371049 -285083 -226678 -138580 1495 60498 -28518
33352 -28518 -121094 -87459 -2494 30250 60858 150197 215348 170436 73911 1257 -81859 -195581
33340 -195581 -247906 -186404 -103961 -81966 -78510 -71739 -135875 -252293 -231024 17730 285364
33329 285364 309539 109656 -71062 -73679 52644 169112 189697 144477 142366 225629 284049
33318 284049 207574 73246 33804 72459 52538 -36218 -94147 -132389 -238671 -354929 -344204
33307 -344204 -249550 -215258 -192169 -34212 147933 94759 -138119 -212541 -43110 100232
33297 100232 89263 113062 244600 261016 67739 -91650 -42699 61014 71334 85821 166934
33286 166934 169476 43749 -25294 33261 31728 -94641 -130921 -2967 32667 -152166 -294289
33275 -294289 -192592 -49153 -78148 -136044 -42463 69113 31682 -36688 5520 44999 -16314
33264 -16314 -22799 113171 166463 -20986 -223263 -199660 -79547 -77215 -131864 -140359 -231159
33253 -231159 -476655 -636666 -520468 -311544 -219789 -131977 65876 167437 18834 -122833
33243 -122833 -1018 182746 125556 -64810 -122933 -93923 -131991 -123442 60965 217473 137578
33232 137578 1529 28156 52420 -100018 -172432 64989 261600 -5848 -460455 -513600
33222 -513600 -205087 -71502 -223097 -258352 -51514 62708 -56986 -136877 -29684 52303
33212 52303 -28738 -117303 -87739 -2508 110559 273114 333304 114082 -201207 -226832 51299
33201 51299 244793 145303 -40230 -94569 -65914 -47086 3768 109561 177261 134541 -734
33190 -734 -184991 -332217 -309466 -121938 14882 -27978 -91062 -30165 723 -154839 -310178
33179 -310178 -219373 4259 107342 123942 205759 243621 87069 -53959 105920 397662
33169 397662 432684 237730 161116 248970 233627 91495 90085 267634 351377 242059 141932
33158 141932 144111 98546 -48766 -146583 -127630 -89266 -55790 47434 184800 249379 266995
33147 266995 293942 213271 -60591 -300806 -242378 -16308 60777 1419 42894 146703 57780
33136 57780 -197621 -321992 -233826 -132721 -100834 -39801 18425 -67090 -231109 -280989 -253259
33125 -253259 -319145 -394840 -251847 26025 114125 -36178 -151256 -102799 -36833 -31967 1030
33114 1030 62661 44145 -27108 -16986 63466 103964 122046 183028 211833 148471 118189 169206
33102 169206 88381 -185279 -271534 83425 455441 301170 -186366 -384332 -200895 -74061
33092 -74061 -139010 -92195 126803 183495 -36130 -225569 -179111 -37676 56398 120560 117931
33081 117931 -14287 -131898 -61573 56866 -5622 -132366 -78152 53495 33515 4639
33071 4639 199744 369793 135911 -250533 -206871 215195 394912 145221 -89868 -74562
33061 -74562 -78550 -223111 -227027 18418 226600 233275 198362 180747 47751 -111700 -36051
33050 -36051 171768 114298 -220130 -408395 -293159 -160603 -143800 -34952 202825 304937
33040 304937 207140 152907 208224 180410 75830 114157 251178 222675 74753 94564 227852
33029 227852 161390 -40840 -27912 136966 65017 -167631 -71734 352555 540336 311342
33019 311342 123400 206011 207625 -56781 -233844 -90318 111399 169906 264974 464933
33009 464933 500852 281097 85592 42342 -49549 -211182 -164465 115925 289589 232134
32999 232134 178780 190445 64118 -141060 -107037 133136 218928 146687 252653 472808
32989 472808 368373 -30768 -190807 3750 94914 -44127 10255 351896 496392 273683
32979 273683 147956 348679 468678 245338 -5305 -44248 -77805 -186894 -111736 122304
32969 122304 95578 -225206 -336527 -79094 94517 -17899 -39287 178238 237768 3584
32959 3584 -92177 118572 209954 5284 -64478 193128 339855 143364 6973 169941
32949 169941 265249 74471 -52253 71790 89093 -155890 -258704 -37690 90212 -93716
32939 -93716 -201489 -9183 131471 27821 19614 249515 339449 152156 85069 263626
32929 263626 260440 -43304 -165585 63841 171362 -28256 -63221 263930 480517 350419
32919 350419 264440 368776 252723 -133010 -233042 61838 132490 -220288 -395781 -149939
32909 -149939 -28241 -224566 -164735 297119 456434 67152 -125049 258257 535911 257032
32899 257032 -18205 112251 144822 -211418 -365908 -21955 167103 -144375 -280239 150338
32889 150338 446344 122123 -185065 50500 297529 108900 11799 380555 607431 291578
32879 291578 77833 413740 653287 303565 -26239 168573 335016 32363 -156743 188117
32869 188117 439509 145232 -62966 340392 896148 1258440 1826354 2510764 2369699 1321250
32859 1321250 648469 916640 1065061 491300 183754 692896 924918 241507 -186302
32850 -186302 455856 1042819 623969 186449 658523 1072749 494621 -89779 324709 800434
32840 800434 316842 -206395 273819 856274 475019 -4567 461183 990849 536365 -2229
32830 -2229 438785 952243 480652 -32603 475780 1013336 499194 -14204 589972 1201199
32820 1201199 655791 115094 787541 1464294 915204 443777 1369856 2429577 2479701
32811 2479701 3041715 5055857 6085060 4293738 2184972 2481960 3390733 2254582 737429
32802 737429 1532504 2975943 2220352 883673 1928231 3718833 3153351 1941607 3382419
32793 3382419 5644321 5149184 3896286 5888486 8985754 8657634 7274330 10364173
32785 10364173 15891008 17612298 17207038 21339678 28001100 29503831 29194884 39196995
32777 39196995 58730423 73378026 84900312 123719187 213902817 332824256 420183857
32770 420183857 426055470 345609442 217119366 97194743 28677599 15118716 24574786
32763 24574786 25508848 15821499 11075214 14889587 16262394 10800378 6668372 8352195
32755 8352195 9645661 6388135 3547686 4920386 6346081 4283567 2203248 3311363
32747 3311363 4607318 3190540 1733988 2842476 3959939 2552042 982385 1761714
32739 1761714 2817458 1785547 549082 1344022 2420390 1603982 462581 1063603 1998240
32730 1998240 1339225 397246 971516 1797725 1160180 295585 883386 1709725 1040917
32721 1040917 -53800 170550 900336 591140 -50245 290128 867792 500993 -25141
32712 -25141 348382 739285 162841 -335501 297063 919334 337593 -323701 239635 962276
32702 962276 450040 -322320 107619 880611 485445 -373345 -189552 509802 331673 -273435
32692 -273435 -10117 695095 583218 2492 109942 573372 327458 -252714 -107807 401697
32682 401697 232733 -292536 -181893 264133 129973 -248362 1707 471033 237146 -298677
32672 -298677 -185586 209514 -53684 -596581 -412599 213791 285365 -36024 98273 486970
32662 486970 353698 -29106 99648 394404 71595 -418136 -123163 556298 510862 -71411
32652 -71411 -110493 371959 434293 60751 79628 466198 411499 -59836 -130898 253401 366002
32641 366002 126585 125642 333592 172280 -227205 -181007 228607 283694 -24407 -46465 232091
32630 232091 203298 -129926 -146808 199785 325184 113123 8764 74994 -27172 -208934
32620 -208934 -85541 181350 110400 -192438 -255252 -138879 -209471 -300716 -43597 277939
32610 277939 170685 -88737 92026 517654 570010 345663 389469 612330 531356 281764
32600 281764 324880 456453 190805 -176831 -16958 410541 336251 -150854 -276416 67757
32590 67757 290007 255598 349954 528855 417152 224113 463039 891150 825928 380356
32580 380356 269101 517785 510262 211957 167693 341130 152316 -322804 -373427 64945
32570 64945 295135 111097 44877 253586 275150 45093 60161 333656 256816 -256467
32560 -256467 -509919 -187598 180767 200232 146348 230484 195761 -44569 -153815 -36413
32550 -36413 -25595 -186410 -156211 126030 254076 98125 5354 100502 96328 -52331 -20006
32539 -20006 216022 274193 79652 -8081 108175 130687 28947 124459 406669 471573 252960
32528 252960 120948 166283 98673 -68402 19229 313771 346606 68103 -55640 90897
32518 90897 92345 -158874 -242221 -33177 35276 -212717 -367153 -198508 -45119 -136745 -199775
32507 -199775 -50417 40143 -108925 -241962 -162718 -61827 -91515 -96739 17876 119260
32497 119260 197317 403047 624429 542325 213243 61367 196617 292092 216508 199357
32487 199357 281475 219830 47528 99043 352666 386477 130363 12303 191903 305300
32477 305300 166114 62404 127459 63394 -236515 -399875 -204658 55676 113202 108253
32467 108253 177323 174933 56344 39234 152349 118508 -97306 -134091 144095 376269 288881
32456 288881 71948 -46997 -124483 -184894 -67980 185680 264440 111938 63206 260363
32446 260363 406435 304475 167403 174659 177276 60470 -32625 -30992 -65354 -113422 34559
32435 34559 309791 340018 49617 -190839 -166668 -80537 -66218 32023 215401 203525 -30656
32424 -30656 -116904 88925 243157 119180 -25917 42905 143907 79009 -4857 57731 149023
32413 149023 149364 162455 244423 255041 150352 72666 29503 -128944 -323498 -281257 -53187
32402 -53187 -15854 -240917 -363689 -212092 -48320 -31618 30105 215314 298864 215087 201295
32391 201295 303279 257166 31298 -58196 58413 68649 -87157 -63523 191231 236904
32381 236904 -71533 -245871 37661 413913 483331 410612 462377 496516 347244 220327
32371 220327 272509 257320 1106 -215302 -146808 -9061 -23562 3729 236127 386799
32361 386799 188419 -119615 -204296 -163001 -222550 -284829 -186448 -68637 -94505 -121886 -14136
32350 -14136 60228 -26620 -74323 58886 155814 50864 -53798 -9763 -37800 -270922 -417352
32339 -417352 -262015 -76403 -130044 -221346 -113637 -10444 -145250 -302744 -214271 -49276
32329 -49276 -50196 -56135 135683 307157 211639 74382 196562 394064 342864 168100 170954
32318 170954 265171 208231 117060 226530 384467 307674 114131 96124 180037 103675 -79244
32307 -79244 -151945 -178904 -322317 -429090 -278932 -36134 19216 -4237 145321 331883
32297 331883 252797 1193 -93188 -12740 37481 77462 220336 290018 83622 -169866 -136352
32286 -136352 24548 -64794 -308498 -314988 -118774 -93706 -235360 -179646 83174 158254 -41638
32275 -41638 -149163 -11865 69831 -71576 -179089 -68724 44758 -47967 -201740 -203134
32265 -203134 -103587 -60943 -83461 -94207 -68271 -4292 87286 135061 98578 77523 153871
32254 153871 210871 131201 57231 166634 302410 177929 -116927 -198149 28109 237694
32244 237694 192508 30293 -32785 7554 55344 82863 94944 96339 136519 243014 326555
32233 326555 300556 230517 196743 115418 -88913 -249517 -157971 91529 226586 184322 106410
32222 106410 40621 -53223 -80238 78546 275884 246108 27341 -80257 21008 114647
32212 114647 48005 -72816 -119829 -121609 -145297 -200958 -292247 -392003 -386482 -215132 -8227
32201 -8227 97237 180301 358758 516877 483837 364394 371508 427648 297171 57547 35161
32190 35161 255867 359862 154193 -105750 -120639 65030 229596 285889 274615 230934
32180 230934 187845 180421 169562 81187 -47400 -91240 -15666 104973 226308 335592 349093
32169 349093 192795 -34021 -157443 -166491 -171849 -175038 -92912 25113 45303 8882 98907
32158 98907 321507 449885 342900 128955 14278 61471 197207 306302 297401 185613
32148 185613 95718 86605 46574 -106553 -232274 -163805 4315 54236 -8586 -930 97433
32137 97433 120962 26991 -35947 10494 84624 145806 256002 395832 432264 331554 225791
32126 225791 212446 240923 236772 197948 141106 76238 38525 32501 -20928 -152095 -220518 -94054
32114 -94054 110404 168055 90481 103172 273190 382970 238668 -64767 -266400 -226863
32104 -226863 -43621 65751 -9677 -140684 -110248 82225 203288 127636 11545 11239 38096
32093 38096 -29703 -97331 -41132 37473 -758 -59582 4695 83522 10182 -93451 -7530
32082 -7530 161121 112906 -153095 -349868 -368835 -369133 -411559 -373415 -253637 -206488 -224193
32071 -224193 -130460 49749 60809 -154938 -334476 -312694 -239539 -239748 -172412 76939 328860
32060 328860 354888 199062 56595 -17552 -98076 -200927 -264243 -251638 -177733 -92908 -82971
32049 -82971 -190400 -318655 -338307 -294584 -347750 -485702 -488768 -250182 46704 172194 127497
32038 127497 70118 75673 89598 52063 -21791 -65706 -27809 73450 165479 214112 251676
32027 251676 274276 200373 14481 -145733 -164424 -119419 -142749 -200229 -174286 -92005 -87991
32016 -87991 -183780 -275185 -306575 -303161 -268559 -198167 -149465 -159028 -149482 -55502 42595 59715
32004 59715 71961 164686 231246 134765 -33243 -85814 -39999 -43359 -90574 -74538 -42163 -113815
31992 -113815 -199627 -96529 146717 255115 131085 -41399 -117613 -148082 -174792 -131291
31982 -131291 -15428 56254 33287 -9342 -32254 -77238 -132482 -126697 -72026 -49994 -55162 -7177
31970 -7177 98548 195524 256232 262936 163142 9686 6487 214523 375455 277113 113388
31959 113388 165814 305168 203700 -86970 -214672 -117034 -72516 -173835 -216857 -151252
31949 -151252 -174748 -292855 -243700 5783 129608 -18525 -152836 -52131 79597 2187
31939 2187 -150147 -130830 14488 84728 62546 68876 131484 196102 240518 242382 172395 104529
31927 104529 154182 242181 148144 -120241 -267366 -131051 90858 164942 123790 100704 105401
31916 105401 121839 208695 349432 405170 343271 297500 294486 179876 -53314 -154119 -15251
31905 -15251 97326 -52203 -287610 -306043 -137189 -33588 -57447 -64757 -9734 -362 -79781
31894 -79781 -155122 -142565 -54616 41451 77883 45711 37122 142759 290230 316533 219239
31883 219239 165307 214301 226363 104897 -67032 -202928 -323084 -410085 -362148 -184345
31873 -184345 -30036 32943 96177 181317 171613 63230 36976 161647 264868 222726 138218
31862 138218 106580 57165 -30128 -12843 149034 274246 271543 297669 425130 453827 285086
31851 285086 178222 338746 526747 425402 173558 138667 314168 355423 148034 -52520
31841 -52520 -55473 36669 91225 144563 240361 290953 214344 66543 -51031 -118861 -170778
31830 -170778 -203468 -164001 -12781 204438 357858 357715 273015 247306 303032 343151 343474 386667
31818 386667 476382 488484 364922 195402 52013 -84593 -181882 -141835 -9543 17224
31808 17224 -110920 -198792 -128703 -52537 -112908 -196122 -149829 -50152 -47770 -114358 -145234 -165600
31796 -165600 -233730 -274583 -208583 -122301 -117639 -110476 23556 208668 269272 183843 63996
31785 63996 -31175 -94645 -80128 20434 93384 52764 -16820 -13300 -4162 -94446 -210023 -193853
31773 -193853 -43747 112351 211344 272617 289415 250986 213503 220862 224301 194572 215410
31762 215410 329319 391117 239793 -49119 -237362 -210279 -66900 33370 9614 -109810
31752 -109810 -207823 -176427 -53110 8721 -50427 -112664 -59122 76487 181549 187756 92329
31741 92329 -23999 -535 218830 414901 324433 44791 -63544 86277 190846 70994
31731 70994 -51989 25513 136349 63460 -74420 -51291 82060 139881 136253 183092 214805
31720 214805 108273 -47860 -76541 -435 33968 9957 -4843 -31354 -84923 -50966 111772
31709 111772 199056 54842 -112985 -8650 275406 372487 164039 -109664 -223483 -176128
31699 -176128 -42802 124930 240210 227325 140168 92407 108048 162283 269488 384511
31689 384511 354234 153551 20635 131463 283580 169475 -152396 -350142 -302036 -190603
31679 -190603 -154355 -139742 -109333 -135923 -238992 -319024 -297448 -196121 -86748 -60703 -179387
31668 -179387 -344698 -333860 -101864 90252 18750 -181003 -233043 -107291 36606 140061
31658 140061 227199 232133 115124 35587 139025 284188 257616 138283 145322 235876 190958
31647 190958 20283 -70017 -66091 -146657 -305335 -320366 -130757 68700 142938 140861 82506
31636 82506 -83595 -270233 -282084 -115107 23781 36151 25305 43135 6459 -87423 -116348
31625 -116348 -63391 -56225 -125201 -155570 -131150 -183726 -328622 -383120 -243446 -46553 37286
31614 37286 7915 -45045 -78959 -89756 -85182 -99803 -137950 -122066 -15072 63852 -544 -112941
31602 -112941 -104498 -4571 34751 15865 57714 134886 116951 40533 70518 188011 183356 -10101
31590 -10101 -216258 -284459 -240549 -148567 -32752 45304 30982 1997 62151 139168 92948
31579 92948 -24045 -47225 11731 12780 -25643 34566 163314 200974 150524 133458 99733
31568 99733 -81168 -272943 -199118 70172 157599 -36680 -191888 -107769 14897 -11786
31558 -11786 -53155 34176 112221 27148 -99140 -77214 55871 146991 151649 92316 -29233
31547 -29233 -148283 -147621 -55524 -39059 -122879 -146745 -77206 -80975 -179292 -139833 118418 313855
31535 313855 218389 24296 41619 235673 324813 187990 -57304 -261163 -322729 -179645
31525 -179645 94178 270825 205369 8840 -127160 -164360 -168972 -163642 -151611 -168067 -195241
31514 -195241 -143702 -13252 55679 -19611 -147335 -220079 -243605 -235372 -160844 -53094 -25713
31503 -25713 -81638 -81320 21524 102072 101472 130291 237428 298109 252669 232940 309246 333741
31491 333741 203825 75970 128680 286651 366077 340583 284840 193488 29762 -157067
31481 -157067 -299534 -386074 -377969 -212351 19169 90062 -47653 -175800 -156228 -122904 -172296
31470 -172296 -135070 106648 316485 214476 -82693 -236445 -178784 -126231 -176805 -195314
31460 -195314 -96518 10155 -776 -120175 -257957 -324085 -258304 -80840 100609 200798
31450 200798 226457 196087 98856 -2305 32131 213097 350864 310658 208569 214093 282590
31439 282590 246526 81799 -75789 -125074 -86741 -39429 -51233 -123118 -158209 -67530 82881
31428 82881 154174 155263 198005 238279 117850 -95528 -114797 112068 272294 179942 76005
31417 76005 202918 381541 317041 82793 -39565 -21438 -41188 -101214 -34065 166049 312114
31406 312114 297746 172515 -3408 -173015 -229820 -158574 -134769 -273998 -397517 -283890
31396 -283890 -37727 60598 -19906 -68277 -506 61395 47260 14094 -18854 -76994 -101660
31385 -101660 -37937 -1965 -122029 -266825 -196610 50083 198108 150934 79815 83320 48845
31374 48845 -80489 -163196 -91266 32068 48496 -61058 -199313 -253628 -157763 29484 126771
31363 126771 41561 -74586 -41525 61790 43424 -44130 24053 236570 318154 157967 -28025
31352 -28025 -54175 -13366 -41509 -80082 -40916 -12251 -112538 -267654 -303545 -183392 -27022
31341 -27022 44124 -8077 -144696 -270989 -309098 -287553 -286833 -284935 -171216 55586 232134
31330 232134 233387 123098 44993 64786 168228 302583 359509 231964 -31553 -226294
31320 -226294 -223808 -114806 -42011 6300 119886 261059 284991 156554 18946 7005 79216
31309 79216 99556 40973 24445 140298 297106 312885 135388 -101679 -247964 -282760 -261371
31298 -261371 -200711 -94807 3750 7465 -97881 -219826 -246166 -151565 -23008 22633 -35909
31287 -35909 -99063 -78498 -13462 8939 -3081 11640 28466 -14526 -56528 21687 172346
31276 172346 211125 96365 -24071 -75345 -131210 -176681 -76502 109521 85104 -220089
31266 -220089 -436648 -258225 97002 228580 135635 103894 179138 153384 1072 -65320
31256 -65320 18114 70023 -3799 -82522 -88665 -99989 -140126 -111458 -10169 24436 -46437 -81840
31244 -81840 -3788 81737 86808 72993 92857 78363 -13535 -97805 -103619 -92802 -146307 -235873
31232 -235873 -281000 -250581 -166866 -88004 -93781 -192203 -254609 -164659 -6107 49831 18392
31221 18392 69205 217469 270425 142579 11010 46914 170322 209486 166553 167834 234845
31210 234845 264844 219267 199305 292265 411180 362593 92564 -192625 -237366 -55491 82208
31199 82208 7050 -146897 -174975 -77512 18211 63530 61957 -27522 -186812 -265138 -194186
31188 -194186 -141557 -240409 -317291 -154303 112420 173294 31382 -37645 38657 59102 -48706
31177 -48706 -126456 -126534 -188489 -298047 -235867 14120 158230 49742 -84125 -56602 -31958
31166 -31958 -182190 -331267 -242536 -42652 -39213 -243520 -365736 -226785 57955 279295
31156 279295 340823 274345 165479 60412 -80762 -274371 -382973 -260556 -26558 38472
31146 38472 -80900 -85547 156142 371394 307628 116074 70951 141404 119617 -9959 -113960
31135 -113960 -175488 -239150 -220798 -51741 101815 48862 -98692 -101548 1426 -12491 -123756
31124 -123756 -101406 59303 110011 2387 -13771 147475 224355 71933 -35446 158749
31114 158749 426200 366971 28123 -152378 30389 317502 414361 348307 285065 235686
31104 235686 131185 30200 41340 111801 92879 -1911 5077 165327 285734 186253 -59157
31093 -59157 -248909 -313481 -317502 -283471 -172139 -10238 110653 167830 217199 262001 231510
31082 231510 111215 -14104 -74006 -77602 -52077 -11741 2887 -42254 -94481 -73870 -15826
31071 -15826 -31504 -120789 -166684 -133398 -112403 -138079 -132009 -88511 -125903 -255588 -289721 -123543
31059 -123543 56020 25545 -137477 -176063 -33496 98270 83290 1469 -13284 64080 190008
31048 190008 332941 458128 510779 464169 346143 201169 60869 -45760 -91453 -69972
31038 -69972 -1719 74862 119102 126076 147024 220878 283183 217956 24295 -149259 -182352
31027 -182352 -123236 -96020 -130793 -155497 -119598 -61208 -55794 -123739 -188612 -149542 -25286
31016 -25286 26014 -92842 -256343 -276739 -175821 -128305 -162665 -136022 -28836 -15824 -151320
31005 -151320 -226505 -91309 98093 143929 125135 217823 356760 354605 262503 311773 515804
30994 515804 614967 464255 233817 139896 172773 196103 163508 121895 103203 113607 160820
30983 160820 217099 214282 135987 59587 51042 67718 24569 -76201 -138716 -87765 50471
30972 50471 187719 270244 315473 351749 356299 295415 205126 158889 150375 95614 -21101 -101522
30960 -101522 -84729 -38991 -24612 22535 150331 235604 141346 -27554 -24320 179319 326923
30949 326923 229033 8298 -106481 -84953 -49820 -27396 70881 234406 301565 189594 49215
30938 49215 76453 233957 288300 118879 -134609 -274414 -282785 -270467 -270387 -212015 -77552
30927 -77552 44167 82893 69969 64678 75485 84548 79759 33788 -80819 -228137 -325884 -346776
30915 -346776 -330939 -283099 -154003 39643 179189 189913 135623 101087 68043 -5778 -61423
30904 -61423 -4108 141267 240011 207888 92915 1293 -7178 47022 100040 118152 136959
30893 136959 196092 243792 180287 16175 -98079 -54878 65636 100186 6820 -101260 -104959
30882 -104959 -11401 61891 18723 -97645 -141543 -49606 60430 47837 -46429 -69550 2277
30871 2277 42417 -7386 -59484 -52764 -42024 -64688 -76601 -84180 -177267 -345576 -423582 -326612
30859 -326612 -197237 -200796 -307657 -391947 -411534 -371816 -252652 -103599 -68607 -169987 -213194
30848 -213194 -69938 92730 56596 -117092 -221843 -243468 -307972 -384971 -324693 -152307
30838 -152307 -50988 -53384 -10380 112420 164499 87873 19851 37143 23810 -94112 -183291
30827 -183291 -115002 12469 18018 -98042 -177178 -131266 -28872 24000 7599 -8933 36621
30816 36621 95288 29673 -200683 -416153 -385228 -107195 181190 277872 179817 -15039 -219496
30805 -219496 -342885 -317381 -201441 -133728 -130146 -59659 115085 227905 149030 -4577 -47506
30794 -47506 -7408 -47968 -169514 -187787 -24994 158569 194191 127822 109166 153520 149024
30783 149024 65562 13713 65236 133625 111535 45489 65108 175959 243067 187307 87217
30772 87217 48756 68758 82616 69701 46750 16430 -13909 -10448 33089 63899 42534 885
30760 885 -15628 -8132 17907 87992 196130 274822 288552 287814 307157 290623 196812 92901
30748 92901 46991 7588 -95664 -203372 -210031 -143330 -120198 -155250 -153410 -83301 -22741 -18357
30736 -18357 -17278 32199 102187 138667 130640 103251 79748 56908 6796 -70233 -99057 -15305
30724 -15305 93498 58814 -108425 -181671 -40232 132604 116605 -32211 -121351 -138135 -193995
30713 -193995 -250080 -161893 40333 168565 168941 163079 196873 187619 140911 173832 272274 263182
30701 263182 102591 -31526 -19464 42371 58342 87414 156699 137602 -26839 -156469 -88023
30690 -88023 51867 35484 -108272 -143335 13143 183687 192566 72809 -32449 -66270 -96002
30679 -96002 -199532 -351434 -427615 -338162 -149886 -29966 -58430 -150983 -182382 -124617 -38200
30668 -38200 15829 23923 18725 43373 89981 97603 55772 52895 134278 179457 62572 -109917
30656 -109917 -104765 93830 240248 173498 21390 -21013 50959 121817 143809 133426 83201
30645 83201 -7128 -78441 -74401 -300 117787 245327 287561 156211 -62261 -146481 -20937
30634 -20937 138767 158001 75750 16169 3414 20460 100195 216925 227072 78181 -48170
30623 -48170 20861 171254 159877 -31699 -203075 -239441 -203642 -149349 -50686 63073 86335
30612 86335 1485 -74394 -57043 -1008 1280 -63821 -144707 -179023 -121897 5683 93970 50021
30600 50021 -68390 -100743 27331 227848 358421 342712 200717 35341 -24346 55207
30590 55207 155695 140489 18907 -101575 -186560 -284805 -389983 -427823 -393764 -371838 -379268
30579 -379268 -317534 -142449 24037 40263 -67223 -147954 -113792 -2759 111251 192643
30569 192643 231037 214700 133977 -10306 -196800 -363766 -419937 -314127 -96115 115204
30559 115204 226569 222654 141033 29278 -70229 -124894 -122363 -69108 22787 128761 193612
30548 193612 162539 55593 -27878 -22043 21829 21071 -4350 29193 112154 136535 66107 -4791
30536 -4791 -7719 3070 -19181 -4553 111693 259625 340470 368545 387392 348492 224276
30525 224276 140029 204432 291049 208101 28049 -2299 139920 217433 121855 20692 40038
30514 40038 72819 27386 14633 119124 200157 118963 -5337 27883 194098 305642 283622
30503 283622 195170 101685 26356 1954 18553 -3605 -86140 -139470 -129342 -148162 -204860
30492 -204860 -130738 133617 348140 295827 126351 113755 220072 209509 85970 63225
30482 63225 145587 109828 -68297 -131188 24439 157983 75247 -77685 -87431 3902 52399
30471 52399 89673 216787 355065 333695 161722 17658 -7051 2850 -49831 -146631 -206543
30460 -206543 -186957 -112504 -41803 -9393 7623 45551 86903 85329 44890 5252 -40575 -125442
30448 -125442 -211493 -220413 -166890 -147498 -180171 -176845 -100809 -19268 36170 115912 205746 193948
30436 193948 74728 28349 168463 338597 314114 111362 -66779 -125634 -146374 -188694
30426 -188694 -197409 -127763 -29199 41565 98217 169300 227276 217441 129902 17817 -50459 -58721
30414 -58721 -59564 -99926 -141382 -112529 -36758 -12253 -37024 26264 231899 410930 377352 196498
30402 196498 92767 125820 129594 -5323 -147178 -101037 128391 343027 372173 213656
30392 213656 -20204 -227256 -368260 -428750 -373893 -181635 77644 253850 262172 182763
30382 182763 151674 172933 121157 -60863 -253311 -295711 -177243 -31427 31481 22719 3514
30371 3514 -20728 -84075 -160993 -158070 -43279 69453 43067 -89519 -147579 -39871 113893
30360 113893 154459 89728 39901 38864 8913 -83542 -161823 -150194 -70257 -3268 -14317 -115690
30348 -115690 -238524 -248561 -82106 125403 151052 -43270 -251539 -280067 -156090 -19132
30338 -19132 75152 136300 128554 27534 -69847 -46883 45628 55785 -22020 -32705 76033
30327 76033 146574 48072 -125502 -206318 -185272 -159542 -135138 -39759 105431 180909 140228
30316 140228 60519 5864 -46685 -118206 -168780 -167695 -140542 -113719 -91273 -110284 -219749
30305 -219749 -361528 -379844 -222314 -35830 30119 29172 108609 259532 324598 239192 117884
30294 117884 70859 59605 -1411 -90090 -105287 -7967 129687 199766 148796 12628 -112984
30283 -112984 -154163 -123612 -82035 -41215 41273 161263 233898 206414 150073 176267 291633
30272 291633 397896 419239 374122 330190 338622 404369 468563 426090 221261 -63663 -267541
30261 -267541 -311293 -252938 -176729 -97155 -5494 60015 61233 40612 77797 169924 218146 147179
30249 147179 -4790 -130980 -160212 -104189 -27970 7836 -13611 -67705 -117912 -131874 -83423
30238 -83423 17168 89470 42986 -92870 -165334 -87981 30333 37528 -38957 -50502 24625
30227 24625 55325 -5079 -32535 45613 108725 47319 -23953 75979 300007 410883 294871
30216 294871 86108 -34889 -42513 -33577 -84627 -179749 -231953 -167561 -24709 56016 -13903
30205 -13903 -163899 -264738 -276379 -223502 -103817 64166 171153 139521 67458 92920 155654
30194 155654 85044 -88776 -130779 51817 268589 329012 272334 215505 161761 97500 110871
30183 110871 239722 325789 206385 -29024 -150226 -99290 -20724 -9633 -2515 67692 153208
30172 153208 174569 128048 66522 29318 19030 17601 15280 29538 72299 100323 58239 -18457
30160 -18457 -30727 20798 4737 -142576 -287884 -263231 -79539 115139 220869 236388 191390
30149 191390 125104 78933 33749 -77085 -226499 -271502 -162835 -50858 -57617 -79136 16422
30138 16422 126577 77628 -42679 16371 261530 411737 291672 33777 -164009 -259335
30128 -259335 -270972 -179316 -34935 8764 -103123 -226303 -223080 -142688 -97989 -94040 -93969 -133125
30116 -133125 -231474 -283397 -174766 42490 203832 213971 86987 -129587 -361488 -486556
30106 -486556 -425886 -249709 -110463 -78318 -103375 -116881 -101132 -71199 -48594 -53802 -86119
30095 -86119 -113222 -102094 -50504 16374 55006 16429 -100307 -210005 -220358 -153664 -119242
30084 -119242 -161829 -226178 -281993 -369612 -478999 -498628 -360861 -149807 13119 113854
30074 113854 197984 252490 226915 126938 13354 -55377 -35464 82767 219071 248555 165859
30063 165859 116496 190339 282925 261747 171201 138816 153872 95277 -55171 -174846 -170422
30052 -170422 -70513 39680 72359 -44372 -279720 -452114 -397151 -178828 -14426 -1816
30042 -1816 -50406 -66751 -52520 -10748 77860 150695 101804 -20666 -22868 149291 296577
30031 296577 245442 87491 6823 9145 -10099 -42370 -8701 45833 10629 -66416 -27003
30020 -27003 113118 143296 -12385 -143566 -56280 123376 111178 -150273 -430125 -510310
30010 -510310 -409197 -286423 -234718 -223363 -194831 -156969 -172178 -269796 -388551 -431190 -371937
29999 -371937 -268073 -160772 -31098 109676 160207 43344 -154607 -251423 -178726 -50455
29989 -50455 -6247 -50185 -79778 -36292 19653 -8135 -105337 -123035 49507 303307 396563
29978 396563 257131 88921 95068 205156 212378 90397 -12987 -49614 -116113 -214612 -201423
29967 -201423 -48383 61094 15131 -43111 32106 130843 78688 -53209 -60730 53382 91644
29956 91644 -14193 -116613 -104532 -44361 -29391 -55174 -93551 -149192 -193870 -164665 -65496
29945 -65496 35967 125077 230270 290989 189403 -49008 -232117 -227313 -81863 111101
29935 111101 308128 432291 376998 182278 43863 45597 43190 -71755 -163973 -68844 131021
29924 131021 226905 174946 88145 31135 3812 45195 162002 222949 120775 -21347 -11657
29913 -11657 99333 100217 -32895 -133901 -180008 -324228 -544063 -577452 -343812 -135386 -188187
29902 -188187 -313580 -211709 45186 142246 15084 -97857 -54701 30628 46617 41695 62889
29891 62889 54113 -5414 -38380 -15684 -1194 11283 125388 322569 399824 246406 17372
29880 17372 -101725 -138032 -178275 -140807 74325 325079 374308 242170 159057 187490 155614
29869 155614 -4172 -117859 -61575 45751 69605 73822 150345 213144 151543 54947 79863
29858 79863 183805 198650 113386 75346 128201 151966 84714 18485 22141 31136 -8185 -19136
29846 -19136 80332 226988 289174 237087 146796 72325 289 -78447 -125976 -107624 -49533
29835 -49533 -22375 -70201 -160920 -213608 -180032 -91000 -16503 1293 -37241 -110641 -177671 -177733
29823 -177733 -79050 65902 145180 88080 -59337 -163664 -124773 13775 91299 1088 -183799
29812 -183799 -304166 -304959 -250722 -177950 -62182 52690 44490 -98579 -213950 -182005 -84770
29801 -84770 -43161 -24536 49926 123746 102115 43843 73460 160873 173239 105984 75320 102356
29789 102356 89032 4842 -73238 -101943 -88413 11832 224540 401070 350225 136725 24395
29778 24395 94863 163953 128607 126844 238359 287665 127325 -89705 -129751 -20822 30350
29767 30350 -45389 -142778 -185972 -187809 -152145 -73969 -7277 -2954 -5251 77156 216548 274992
29755 274992 158384 -89138 -315282 -362838 -208727 -15803 43511 13401 65670 184562
29745 184562 152064 -87298 -283236 -237441 -88175 -61882 -140211 -182045 -190968 -215874 -148671
29734 -148671 95918 323899 291412 105494 76667 224720 277292 160604 123521 287041
29724 287041 414128 291494 59588 -40144 -28761 -77593 -185135 -193855 -55131 109330
29714 109330 177070 120436 -32298 -211480 -304908 -247338 -109295 -25721 -39942 -67982 -12727
29703 -12727 117141 200757 124746 -64981 -165020 -39996 180045 234914 63490 -131689
29693 -131689 -175470 -130492 -143323 -214248 -241366 -206177 -181028 -193260 -202815 -200210 -219832 -249934
29681 -249934 -221050 -109346 14925 70884 50061 -10009 -87406 -166795 -199026 -133814 -4381
29670 -4381 73801 31033 -58311 -57425 64655 202606 249663 197424 94198 -16662 -87692
29659 -87692 -77097 -15669 5533 -39037 -72734 -55071 -57414 -120799 -141408 -15555 179689
29648 179689 279619 245633 159662 68536 -23384 -64311 -21573 2809 -102885 -248422 -243463
29637 -243463 -96329 -891 -11260 42409 251000 455843 481801 358352 205335 74060
29627 74060 11711 97837 272084 299016 80658 -144744 -111486 95485 192411 123855 80799
29616 80799 137463 143533 14084 -111534 -89575 27382 105864 109359 72409 19691 1089
29605 1089 94565 274316 377481 314875 225088 284207 430228 438229 244315 20746 -95646
29594 -95646 -173103 -295216 -355259 -200678 91569 260933 185971 13896 -64961 -39593 -12429
29583 -12429 -26557 -53355 -74612 -80388 -41956 22362 12208 -119144 -244255 -201654 -27944
29572 -27944 85908 63274 19646 47232 72282 -4286 -147985 -261812 -318708 -326117 -240926
29561 -240926 -37413 186471 289198 261350 221870 235162 226294 110289 -68880 -187895
29551 -187895 -201381 -189924 -240903 -321000 -307665 -145013 75990 221420 264838 285325 333046
29540 333046 361439 307928 190962 93702 70868 90564 64863 -53091 -192103 -214619 -79237
29529 -79237 86376 132469 72008 36941 72983 87304 15512 -69522 -69842 -3026 35008 -810
29517 -810 -66500 -88043 -25988 84281 139168 63982 -78465 -139891 -74074 596 -30939 -125568
29505 -125568 -160095 -99704 -5347 84215 184661 292197 361328 370009 346072 308412 229749
29494 229749 90477 -57130 -120136 -68439 20134 48093 21513 37192 133646 216815 183139
29483 183139 62741 -33210 -66653 -84807 -109876 -125710 -160337 -255406 -342931 -290548 -112034
29472 -112034 5791 -38926 -108321 -37003 110602 140541 24295 -65124 -7777 109564 133070
29461 133070 40096 -59260 -70077 -10168 30370 -2250 -70912 -100652 -63035 20525 136034
29450 136034 274564 372175 332914 152076 -42658 -121696 -85106 -28211 -21640 -65914 -121744
29439 -121744 -140258 -95810 -24820 -449 -43830 -101343 -129534 -145381 -164921 -160688 -125491 -114241
29427 -114241 -165936 -235503 -253703 -203927 -98231 51678 181297 172159 -3281 -190216 -206196
29416 -206196 -60058 72064 68629 -26142 -103746 -119714 -106521 -116278 -168514 -228328 -237803 -181623
29404 -181623 -96165 -3086 114046 240530 304349 270263 200903 162786 126247 30846 -94145
29393 -94145 -153987 -110324 -17657 39574 2496 -127424 -257721 -257686 -104727 60638 80806
29382 80806 -57744 -248422 -383428 -398794 -285204 -128981 -62731 -93837 -69820 91753
29372 91753 243218 209143 56850 -454 89346 183286 183151 128865 57050 -56568 -186045
29361 -186045 -237663 -181475 -80851 24484 141157 223882 199102 106887 72530 104980 72724
29350 72724 -72004 -191706 -154826 -4866 129285 183618 162767 101580 75476 142626 233308
29339 233308 213638 94912 38242 104400 164162 130882 100515 144028 139920 -19806 -203215
29328 -203215 -213665 -86102 -2821 11593 87006 224547 243411 55292 -186145 -285905 -235860
29317 -235860 -171014 -185616 -260790 -322438 -317031 -248903 -163336 -89863 -23453 26201 21661 -25686
29305 -25686 -32016 38629 93597 37932 -73477 -109487 -42686 50343 124889 182071 180984 79105
29293 79105 -43946 -44297 83250 185033 160444 78994 50140 82142 113265 96374 20219
29282 20219 -77257 -110294 -49631 -10335 -107654 -239849 -194505 4496 72906 -118407 -318880
29271 -318880 -252021 -15116 88316 -9466 -110679 -103563 -89251 -144536 -186615 -146415 -101662
29260 -101662 -140580 -212340 -204227 -90133 61821 164219 150541 13019 -158091 -242046 -229107
29249 -229107 -220698 -258048 -245456 -102085 99317 228169 263963 276168 281843 227350 105941
29238 105941 1706 -15126 15724 -5507 -105172 -185455 -129448 50100 208363 236237 179537
29227 179537 138412 106325 11639 -111650 -133875 -33549 41415 -24325 -161346 -235457 -218247
29216 -218247 -158469 -83770 -30089 -78173 -239799 -372081 -328736 -153663 -12020 26540 17133
29205 17133 -5824 -66434 -151591 -203648 -214368 -223859 -229835 -194830 -129471 -68787 9441 131984
29193 131984 229866 221765 162144 151300 133211 -19749 -229569 -257967 -79455 33521 -94153
29182 -94153 -284322 -295070 -167310 -95966 -118403 -139681 -141381 -146907 -77452 126823 308729
29171 308729 255975 32140 -88551 -17917 46434 -47438 -198189 -251428 -215545 -176214 -146072
29160 -146072 -100791 -47255 22756 130847 202275 101196 -139339 -274852 -157667 49721
29150 49721 111594 36762 -22057 -72389 -241037 -465362 -491607 -249664 -11928 -46517 -261049
29139 -261049 -349681 -207866 -28202 3554 -50777 -9343 155574 271812 186469 -45026
29129 -45026 -227240 -244378 -154374 -71987 -34266 -19465 -27581 -59074 -54249 40225 152546 152137
29117 152137 59250 56953 218590 346413 217963 -79861 -229057 -83486 163878 251259
29107 251259 142306 -24132 -156387 -260804 -331273 -316423 -205803 -72246 -6309 -39257
29097 -39257 -129558 -203616 -221487 -215207 -238030 -273709 -248880 -149425 -51473 -971 55587 160561
29085 160561 248158 243387 188284 170471 183651 164991 117755 79508 17721 -109638 -228564
29074 -228564 -230260 -150292 -111714 -115318 -66817 1205 -46724 -176172 -174000 5636 124324
29063 124324 20686 -136962 -142458 -93480 -198229 -383980 -378987 -130307 117418 160933 41399
29052 41399 -106318 -211470 -237314 -160861 -34424 54023 101620 155292 171141 67533 -81447
29041 -81447 -92054 51417 151350 96515 20754 55930 101291 -804 -180183 -212604 -28483
29030 -28483 207612 315624 277968 194417 155273 183617 248246 309193 355692 382785 342048
29019 342048 186295 -17699 -111280 -33611 91549 126607 94647 92495 109715 63640 -27693
29008 -27693 -50031 26395 94237 65467 -17512 -61329 -30826 54895 161793 239000 242688 200445
28996 200445 194806 247864 281647 232412 142859 90707 83580 85788 97286 131329 152897 124064
28984 124064 88071 118102 187547 185356 79207 -22558 -7828 113665 264598 408636 539573
28973 539573 614123 578773 453822 330390 279687 298219 333187 330137 267796 176522 113216
28962 113216 101796 122394 167379 250320 326754 283166 85764 -112528 -117835 66314 237088
28951 237088 224592 44954 -169394 -299491 -294944 -191369 -92352 -60746 -25791 115926 311785
28940 311785 382401 264751 105771 59574 99639 106634 54061 17927 54360 137662 185557
28929 185557 111759 -90092 -286698 -307230 -147198 9650 18891 -62685 -97282 -51919 14878
28918 14878 70408 120210 156259 166929 157770 121412 50037 3234 60584 164603 140165 -56114
28906 -56114 -239698 -246949 -142523 -59456 22400 174645 319061 324016 227903 180272 212004
28895 212004 235148 219101 193206 124193 -24742 -150553 -114345 35430 126680 125312 141142
28884 141142 193618 183994 107660 82714 138153 172472 155878 173277 224547 189194 51840
28873 51840 -38576 -8348 42435 64232 164839 364310 447980 249383 -60316 -159712 20983
28862 20983 248094 292443 156098 6519 -20040 59238 116553 83955 46722 98312 160570
28851 160570 94621 -39709 -33289 143175 272740 217864 96716 36463 -29255 -167524 -247984
28840 -247984 -131461 81704 181901 129653 39239 -25651 -82908 -137480 -192849 -275129 -332226
28829 -332226 -228008 29569 193810 83593 -146256 -227377 -141164 -42126 51276 209649
28819 209649 317811 169396 -154814 -304719 -130749 117279 160368 38541 -37909 -6137
28809 -6137 29097 -21782 -157007 -314574 -391382 -305656 -114896 -69 -62192 -195467 -222432
28798 -222432 -100630 56892 121612 71094 3917 39405 158001 171319 -52706 -358554
28788 -358554 -445354 -264948 -108468 -209465 -422103 -447862 -265279 -126301 -162252 -218037
28778 -218037 -133032 13026 70764 91599 222008 385172 313991 -35764 -326787 -256247
28768 -256247 24709 124760 -44131 -197195 -140420 -21559 -30517 -103622 -90192 -15951 20005
28757 20005 63192 197458 322030 266698 75966 -47036 -56138 -94264 -199449 -210910 -40613
28746 -40613 156155 191496 86873 -5777 -19104 5859 38300 86413 135206 147379 132671
28735 132671 156714 252320 346884 325595 191049 109295 212817 381318 353682 87719 -149908
28724 -149908 -139151 8259 57243 -10104 -61049 -101535 -246203 -440077 -462419 -238215 51457
28713 51457 205058 183940 51102 -100157 -143984 -22547 135534 160650 93156 97578 153498
28702 153498 81240 -116650 -220874 -155236 -92522 -115765 -78106 67561 109495 -61765 -219841
28691 -219841 -159053 -21833 -13342 -40533 63693 182828 130136 35581 137233 319888 271507
28680 271507 23502 -91623 -4087 10340 -140553 -196684 -38175 71356 -54296 -186369
28670 -186369 -78469 99002 40310 -201755 -339311 -316216 -309588 -345843 -259049 -40405 76407
28659 76407 -39465 -217011 -236959 -117009 -34327 -80693 -195652 -266246 -213912 -40052 150248
28648 150248 213859 111077 -48430 -129332 -100254 -17680 61778 106789 94720 32010 -25317
28637 -25317 -23579 20618 46742 39213 38465 54206 28026 -75097 -182003 -182786 -70761 54719
28625 54719 119180 130943 104640 27519 -59889 -59161 31539 60791 -65550 -210305 -194533 -88327
28613 -88327 -112354 -276893 -355787 -259658 -183939 -263381 -311081 -108425 209713 314273 147091
28602 147091 -31192 -47374 -18344 -85630 -168402 -118050 24155 90168 49321 57379 224854
28591 224854 442684 502326 346040 124484 -90 -31106 -60899 -86242 -25514 95575
28581 95575 134580 59514 29334 145616 265489 208244 35271 -50576 -2985 59719 86228
28570 86228 125760 156323 93141 -22049 -41773 50796 114608 82099 18941 -69093 -255047
28559 -255047 -460725 -463227 -241316 -70009 -120958 -203386 -93939 92062 101241 -49345 -126996
28548 -126996 -43923 83770 167618 208223 177061 51627 -70833 -89986 -82687 -169785 -268605
28537 -268605 -210979 -61666 -54891 -211244 -282365 -127539 92731 173806 107018 -20656 -172195
28526 -172195 -304503 -332841 -259017 -205873 -237000 -259605 -176324 -17173 135826 231824 211616
28515 211616 29455 -217003 -317155 -193536 -8078 44951 -51488 -180903 -229777 -141579
28505 -141579 37120 132807 13199 -195476 -236146 -95599 -29439 -147073 -233259 -121319
28495 -121319 16203 -38109 -183338 -195628 -118661 -157702 -284545 -269014 -89015 -6727 -170744
28484 -170744 -386145 -394689 -214540 -74757 -112144 -247746 -322064 -265810 -132742 -11315
28474 -11315 55889 58886 -14783 -129293 -158168 -20560 145194 102598 -154507 -368632 -379308
28463 -379308 -321494 -351714 -385113 -287325 -147299 -123893 -149540 -42631 165546 274528 240913
28452 240913 205688 211337 149931 16023 -40170 21543 35295 -106426 -278014 -316941 -243865
28441 -243865 -180943 -173466 -192177 -212011 -201206 -120744 -8302 26101 -42580 -97022 -59398
28430 -59398 -35946 -166179 -387009 -476300 -330967 -100513 -7823 -96848 -207538 -177797 -15427
28419 -15427 143728 198484 155682 75193 13586 11032 55338 62914 -16574 -87947 -26824 91719
28407 91719 52086 -166167 -305134 -188561 21027 81243 19662 26335 126104 182101 143800
28396 143800 73249 -18933 -153271 -242013 -178917 -38226 15405 -15598 2699 76069 80689
28385 80689 8300 -15067 36167 53688 13007 8726 53090 57665 37172 102390 219837 220047
28373 220047 90533 10008 32135 3807 -115808 -140660 6346 124836 80038 45023 175418
28362 175418 286164 135873 -147469 -237974 -102844 -10673 -88860 -171623 -121519 -41299 -66626
28351 -66626 -137526 -110710 2854 42645 -81326 -263401 -328419 -244374 -147435 -139442 -139342 -19814
28339 -19814 166329 230061 104862 -81278 -209012 -296005 -383103 -438961 -440320 -415310 -345599
28328 -345599 -163240 85434 220872 169910 86910 127626 230692 246926 172841 120514 139924
28317 139924 195633 251764 274858 220579 109701 43067 59808 70459 12443 -37265 -4208
28306 -4208 43464 17522 -33228 -21528 17353 5538 -18557 29340 114838 139850 113048 121116
28294 121116 165242 163657 96894 29962 4854 12966 52015 115378 151237 122284 77194 79063
28282 79063 96760 49223 -75004 -213322 -303788 -305022 -201169 -49623 48676 90715 188196
28271 188196 361363 433065 259334 -27571 -164621 -95559 -10049 -63464 -192271 -222160
28261 -222160 -72590 156971 265760 147419 -67322 -134409 7432 170853 194247 135709
28251 135709 105395 67754 -39957 -125558 -61188 97999 183180 141247 54239 -2876 6161
28240 6161 103472 217268 179509 -43545 -228455 -175557 1863 65728 7846 -23959 -44926
28229 -44926 -182624 -358979 -339569 -119224 33670 -25046 -138238 -145659 -110521 -140511 -197363
28218 -197363 -208906 -200393 -205813 -199269 -201947 -297609 -449041 -462867 -251835 10796 117817
28207 117817 82665 48814 63842 79416 87699 119715 156084 149242 102956 51842 748 -48913
28195 -48913 -57375 -1310 59354 30214 -109344 -270928 -319872 -187774 35362 148974 56759
28184 56759 -91994 -81123 66797 106752 -73975 -269036 -219315 37802 213384 126916
28174 126916 -88096 -159761 118 196757 180045 -64511 -309481 -366171 -278276 -193588
28164 -193588 -156749 -135534 -157261 -260398 -352773 -284626 -68545 112431 132310 39135 -62532
28153 -62532 -123105 -125059 -65902 6290 29151 8330 -11989 -33532 -61595 -28318 103152 199966
28141 199966 98980 -125096 -211937 -53353 189234 322002 298893 145876 -94406 -284049
28131 -284049 -247639 -2114 216711 230168 84954 -94998 -253029 -337792 -286713 -166345
28121 -166345 -158502 -303635 -416422 -354093 -202245 -89433 3266 117766 179837 137880 83874
28110 83874 80635 29179 -118365 -182356 -14220 205686 186765 -35693 -145494 -305 203860
28099 203860 240900 115628 -28179 -88494 -41603 64551 107340 -7428 -204996 -301910
28089 -301910 -226096 -83545 -123 -1491 -59601 -144599 -200032 -167517 -78512 -43552 -114219
28078 -114219 -221305 -274074 -252412 -177642 -70208 19312 5469 -134440 -284629 -281670 -98349
28067 -98349 100165 119259 -51739 -227222 -237900 -102417 54758 185717 313911 389078
28057 389078 304984 91421 -59875 -33966 64616 90166 56462 53286 74838 67824 65599 122361
28045 122361 169620 97195 -46948 -92559 11083 126101 123834 34072 -43084 -79616 -120411
28034 -120411 -194416 -262430 -239504 -87472 86983 85611 -152239 -423335 -471167 -295832 -134672
28023 -134672 -144899 -243011 -283616 -255895 -229647 -217008 -189975 -171822 -208546 -272514 -280091 -208488
28011 -208488 -131463 -120145 -151531 -146209 -77096 -2542 18021 7976 35351 104409 139493 90531
27999 90531 3573 -43002 -28753 15799 61756 85687 63325 7042 -30411 -36186 -68034 -141983
27987 -141983 -155089 -24477 140619 140544 -40484 -195051 -160429 -1882 126090 177411 181932
27976 181932 126357 5991 -69620 13941 167826 162988 -50875 -231061 -140480 143136 335258
27965 335258 292647 117644 -46008 -156219 -190563 -90109 115198 237232 117222 -160247
27955 -160247 -348321 -314770 -150932 -19973 12628 -9699 -14532 35592 116171 163107 144296
27944 144296 96517 66737 51630 36027 44339 87839 101813 20447 -107153 -161884 -109128
27933 -109128 -34587 -32436 -119890 -239521 -278632 -128953 175410 413810 388843 163420 -28057
27922 -28057 -84462 -112126 -196952 -269834 -249593 -175169 -118165 -74579 -21312 8596 -19037 -77295
27910 -77295 -128083 -174409 -221676 -245448 -226472 -163945 -54478 68244 94876 -39925 -203664
27899 -203664 -176239 58276 270411 275843 128840 -16766 -85528 -53987 94838 289121
27889 289121 367959 268340 112902 34021 25313 44006 122285 264744 355054 294272 148961
27878 148961 53625 41346 59283 67164 37476 -50075 -135232 -100846 48133 138767 52237
27867 52237 -114816 -196155 -152720 -46816 52856 59905 -92360 -312061 -401250 -339891 -338217
27856 -338217 -495480 -616254 -522888 -336761 -246628 -198925 -61345 82157 76600 1532 46740
27845 46740 180103 215321 134090 76446 80858 91088 142313 271358 326911 164936 -45635
27834 -45635 -38437 96271 44877 -169947 -182193 107961 338297 244526 40725 34364 176520
27823 176520 238080 187978 142659 114670 46529 -24128 -26351 7287 10601 1219 18267 43820
27811 43820 72951 142372 217794 201033 122010 143223 276704 298481 84496 -161242 -185428
27800 -185428 -22784 127227 198204 224710 162063 -14683 -132803 -6489 240574 282408
27790 282408 22968 -293832 -426867 -387181 -295410 -183324 -44378 51542 27508 -69252
27780 -69252 -112819 -69399 -44953 -132822 -262525 -270678 -131321 -31386 -139563 -356796 -417903
27769 -417903 -228423 34230 173942 184144 146066 66446 -68953 -179647 -161359 -33753
27759 -33753 81660 110130 81454 62752 87124 128522 116194 4373 -158401 -276970 -331273
27748 -331273 -382440 -451519 -478389 -419169 -297011 -140871 29760 147975 141933 53141 -10420
27737 -10420 -54127 -179277 -355435 -386700 -178182 123570 333708 413544 382771 243283
27727 243283 96630 128490 325985 411967 242347 64620 144871 322043 237502 -104386
27717 -104386 -336408 -262534 -81955 -39459 -116949 -158458 -102383 3085 79415 56853 -51738
27706 -51738 -100625 37086 262733 338498 189623 -22383 -135888 -147314 -117461 -73251 -34722
27695 -34722 -9281 54410 177361 233790 95957 -116029 -142379 34874 152986 75723 -7760
27684 -7760 88827 259719 322061 312663 344566 328043 107411 -201332 -288599 -79735 147266
27673 147266 136481 -34656 -112521 -6581 140654 157384 17688 -169628 -278879 -263716
27663 -263716 -171327 -84687 -50780 -51904 -32158 44502 148494 206482 187561 144131 131050
27652 131050 117372 42434 -69146 -138331 -160254 -188851 -195275 -87009 94831 159355 36038
27641 36038 -91486 -54574 32411 -46283 -252579 -339894 -226632 -102481 -121971 -187638 -133392
27630 -133392 18014 100377 30945 -108339 -182648 -135170 -29856 6998 -81878 -206324 -230083
27619 -230083 -140983 -43485 6107 42072 57504 -21935 -172499 -227951 -106753 40032 38970
27608 38970 -52908 -61867 18741 44285 -22885 -69319 -48959 -51956 -112164 -130032 -70023 -69758
27596 -69758 -228188 -408272 -397602 -195726 -4464 30508 -56424 -168665 -267344 -350127 -399665
27585 -399665 -400935 -373949 -359142 -375201 -390456 -339825 -200912 -57714 -36039 -150595 -272147
27574 -272147 -283488 -208263 -135347 -81235 -4614 90074 153060 171041 170222 152859 101874 34223
27562 34223 -18714 -66754 -124814 -140643 -46454 118286 223525 206082 137895 116822 156361
27551 156361 210553 248356 264435 252986 205108 119550 8848 -90744 -126063 -71751 38358
27540 38358 143799 202169 187644 93917 -22223 -55278 28292 128712 139207 84510 52835
27529 52835 43929 -5026 -76172 -79481 -2053 64686 57694 5840 -42939 -64218 -31158 55083
27517 55083 119935 108557 102349 206798 342156 320608 146913 48182 145883 288363 300778
27506 300778 217426 141307 47071 -109236 -222688 -173015 -34098 34817 38750 102601 225088
27495 225088 269282 185188 61844 -47336 -175983 -296123 -291451 -141212 12424 53708
27485 53708 28541 17038 -6706 -84573 -142751 -79177 66239 147146 98143 -11654 -100321
27474 -100321 -148325 -146805 -74851 32071 77331 29668 -7492 71516 214003 267537 183753
27463 183753 72012 37932 58442 59101 38176 40808 48779 -25661 -225407 -461532 -558279 -406660
27451 -406660 -103400 94405 31070 -144321 -146378 68149 242287 193637 66208 75581 169788
27440 169788 151851 29564 -5954 88851 151773 106552 79550 160354 246509 220069 121430
27429 121430 54090 41988 59911 95762 120939 100321 67876 81529 92116 2003 -137197
27418 -137197 -165787 -78318 -36198 -74935 -41238 95136 135972 4554 -67880 88146 269813
27407 269813 222187 63139 81252 257330 321897 210165 122134 141508 113936 -43908 -187398
27396 -187398 -187541 -121205 -121901 -197486 -274032 -298162 -246424 -142391 -86495 -156947 -276967 -301043
27384 -301043 -226086 -185301 -247025 -366582 -517468 -694034 -787362 -658038 -367797 -150689
27374 -150689 -103241 -85960 8180 84559 45127 -26072 -13624 31135 -8678 -111935 -160599
27363 -160599 -128970 -110756 -180950 -310292 -398802 -356366 -190867 -34399 -13446 -79925 -69419
27352 -69419 50710 122340 44385 -58888 -22363 119211 202773 168011 81963 -10153 -113407
27341 -113407 -183493 -142251 -18695 35302 -77760 -269975 -359350 -263222 -76260 27223
27331 27223 -40966 -201158 -285921 -205681 -25638 118816 149065 73632 -59068 -189239 -250858
27320 -250858 -209499 -109568 -50109 -94662 -217756 -341678 -399360 -351505 -184644 55578 244565
27309 244565 266444 149577 50663 57244 73807 -19280 -162191 -194943 -102970 -30220 -43357
27298 -43357 -48305 14218 55888 5611 -64273 -82927 -113729 -216691 -304417 -279480 -206937 -197396
27286 -197396 -217089 -176900 -117626 -126335 -146321 -65114 64760 90773 5671 -65797 -86299
27275 -86299 -108589 -94536 40747 211205 219628 56227 -84468 -113377 -147031 -254698 -338531
27264 -338531 -339363 -343401 -393826 -395165 -294954 -171508 -62735 87334 226658 169048 -105589
27253 -105589 -339836 -332070 -187877 -101952 -95130 -119556 -204004 -307742 -250392 -13312 97427
27242 97427 -143513 -491984 -551660 -335897 -181896 -204955 -203457 -82097 -3002 -56281 -98995
27231 -98995 -27113 56078 60882 71738 156684 210716 130698 -4374 -58154 -21853 30990 59954
27219 59954 37463 -64934 -178771 -157348 3163 96870 -5826 -135495 -59850 155292
27209 155292 231504 88575 -51316 -12758 73088 -26338 -299661 -497282 -448837 -250921
27199 -250921 -116358 -128552 -207038 -263370 -296371 -323201 -306351 -216512 -117856 -102285 -153258
27188 -153258 -167682 -121590 -107491 -157139 -133118 92354 403810 519875 316626 -28174
27178 -28174 -246287 -248941 -142947 -65495 -84558 -205918 -375264 -484811 -465726 -377115 -324818
27167 -324818 -292618 -157730 93797 279454 232526 25408 -124592 -130938 -106226 -161913 -253560
27156 -253560 -268144 -190824 -122866 -156734 -274261 -372715 -380935 -336895 -330004 -373526 -382739 -294017
27144 -294017 -144054 2497 130575 221300 202791 55110 -91710 -83676 58320 175311
27134 175311 182330 125941 49839 -56927 -166764 -203382 -155170 -84532 -10101 88447 136172
27123 136172 7998 -232768 -323867 -147283 72693 62710 -135497 -270220 -255367 -231361
27113 -231361 -279013 -287429 -164564 -20068 -33204 -212871 -378393 -359949 -168739 30081
27103 30081 91784 30286 -24759 3055 56142 46892 -17892 -68036 -76980 -65244 -29123 43223
27091 43223 88722 3421 -200547 -351768 -302160 -108670 39103 45684 -17589 -54653 -50127
27080 -50127 1100 148976 372832 502227 401850 193897 130335 250725 351838 323141
27070 323141 293640 352276 349844 159351 -48175 -22158 188136 314013 255483 149537 99161
27059 99161 86641 141868 333037 554947 575126 364184 165115 151129 213877 185604 81417
$$ [...]
##END NTUPLES=NMR SPECTRUM
##END=
