##TITLE=31Pdec_LY_7.2.Dix.1.B
 CD3CN, 24 sc
 26.04.2021
##JCAMPDX= 6.0         $$ Bruker NMR JCAMP-DX V2.0
##DATA TYPE= NMR SPECTRUM
##DATA CLASS= NTUPLES
##ORIGIN= UXNMR, Bruker Analytische Messtechnik GmbH
##OWNER= root
$$ XWIN-NMR		Version 3.5
$$ Mon Apr 26 16:13:19 2021 Russian Standard Time (UT+4h)  she@DPX200
##.OBSERVE FREQUENCY= 81.013821
##.OBSERVE NUCLEUS= ^31P
##.ACQUISITION MODE= SIMULTANEOUS
##.ACQUISITION SCHEME= undefined
##.AVERAGES= 24
##.DIGITISER RES= 16
##SPECTROMETER/DATA SYSTEM= spect
##.PULSE SEQUENCE= zgpg30
##.SOLVENT NAME= D2O
##.SHIFT REFERENCE= (INTERNAL, D2O, 0, 248.564)
##AUDIT TRAIL= $$ (NUMBER, WHEN, WHO, WHERE, WHAT)
$$ ##TITLE= Audit trail, XWIN-NMR		Version 3.5
$$ ##JCAMPDX= 5.01
$$ ##ORIGIN= Bruker BioSpin GmbH
$$ ##OWNER= she
$$ F:/spectra/data/she/nmr/P31/1/pdata/1/auditp.txt
$$ ##AUDIT TRAIL=  $$ (NUMBER, WHEN, WHO, WHERE, WHAT)
(   1,<2021-04-26 16:11:31.65 +0400>,<she>,<DPX200>,
      <created by zg, POWCHK disabled, PULCHK disabled
       configuration hash MD5:
       00 E9 B6 7A A2 85 ED C7 34 08 36 98 17 FE 4E 26
       data hash MD5: 32K
       D5 DC 5C FB B1 09 52 53 D0 84 81 23 59 12 EC 6F>)
(   2,<2021-04-26 16:11:35.37 +0400>,<she>,<DPX200>,
      <Start of raw data processing
       efp BC_mod = 2 LB = 1 FT_mod = 6 PKNL = 1 PHC0 = -5415.656 PHC1 = -114.7986 SI = 64K 
       data hash MD5: 64K
       C2 47 76 32 9F 22 A4 2C B0 CE DC D7 0F 86 4C BF>)
(   3,<2021-04-26 16:12:05.18 +0400>,<she>,<DPX200>,
      <pk PHC0 = 82.81222 PHC1 = -166.2 
       data hash MD5: 64K
       8C A1 FC 1E 49 8A 5D 8D A1 28 C7 25 8B BF 90 A5>)
(   4,<2021-04-26 16:12:09.29 +0400>,<she>,<DPX200>,
      <abs ABSG = 5 
       data hash MD5: 64K
       0D 0B 6A D4 39 0E A3 D2 4E AA 66 1D 0C 1D 1A 0A>)
(   5,<2021-04-26 16:12:39.46 +0400>,<she>,<DPX200>,
      <pk PHC0 = -147.4788 PHC1 = 299.6001 
       data hash MD5: 64K
       BE E5 64 DD 6D C8 E7 5C 39 BB 47 B1 1C 57 D3 D0>)
(   6,<2021-04-26 16:12:43.09 +0400>,<she>,<DPX200>,
      <abs ABSG = 5 
       data hash MD5: 64K
       85 D0 3A BC 10 28 73 57 AF 67 16 42 60 E3 3B 8D>)
$$ ##END=
$$ 
$$ hash MD5
$$ 46 CE A7 71 C5 6A FE 8E 48 C9 49 29 E6 11 C1 6C
##$RELAX= 
##$RELAX= 
##$RELAX= 
##$RELAX= 
##$RELAX= 
##$RELAX= 
##$RELAX= 
##$RELAX= 
$$ Bruker specific parameters
$$ --------------------------
##$DU= <F:/spectra>
##$EXPNO= 1
##$NAME= <P31>
##$PROCNO= 1
##$TYPE= <nmr>
##$USER= <she>
##$AMP= (0..31)
100 100 100 100 100 100 100 100 100 100 100 100 100 100 100 100 100 100 
100 100 100 100 100 100 100 100 100 100 100 100 100 100 
##$AQSEQ= 0
##$AQ_mod= 1
##$AUNM= <au_zg>
##$AUTOPOS= <>
##$BF1= 81.014009
##$BF2= 200.13
##$BF3= 200.13
##$BF4= 200.13
##$BF5= 200.13
##$BF6= 200.13
##$BF7= 200.13
##$BF8= 200.13
##$BYTORDA= 1
##$CFDGTYP= 0
##$CFRGTYP= 5
##$CHEMSTR= <none>
##$CNST= (0..31)
1 1 145 1 1 1 1 1 1 1 1 1 1 1 1 1 1 1 1 1 1 1 1 1 1 1 1 1 1 1 1 1 
##$CPDPRG= <waltz16>
##$CPDPRG1= <>
##$CPDPRG2= <waltz16>
##$CPDPRG3= <>
##$CPDPRG4= <mlev>
##$CPDPRG5= <mlev>
$$ [...]
##$SUBNAM3= <"">
##$SUBNAM4= <"">
##$SUBNAM5= <"">
##$SUBNAM6= <"">
##$SUBNAM7= <"">
##$SUBNAM8= <"">
##$SUBNAM9= <"">
##$SW= 501.771253377433
##$SWIBOX= (0..15)
0 1 3 0 0 0 0 0 0 0 0 0 0 0 0 0 
##$SW_h= 40650.406504065
##$TD= 32768
##$TD0= 1
##$TE= 0
##$TE2= 300
##$TE3= 300
##$TEG= 300
##$TL= (0..7)
0 120 53 12 22 120 120 120 
##$TP= (0..7)
150 150 150 150 150 150 150 150 
##$TP07= 0
##$TPNAME0= <>
##$TPNAME1= <>
##$TPNAME2= <>
##$TPNAME3= <>
##$TPNAME4= <>
##$TPNAME5= <>
##$TPNAME6= <>
##$TPNAME7= <>
##$TPOAL= (0..7)
0.5 0.5 0.5 0.5 0.5 0.5 0.5 0.5 
##$TPOFFS= (0..7)
0 0 0 0 0 0 0 0 
##$TUNHIN= 0
##$TUNHOUT= 0
##$TUNXOUT= 0
##$USERA1= <user>
##$USERA2= <user>
##$USERA3= <user>
##$USERA4= <user>
##$USERA5= <user>
##$V9= 5
##$VALIST= <valist>
##$VCLIST= <CCCCCCCCCCCCCCC>
##$VD= 0
##$VDLIST= <DDDDDDDDDDDDDDD>
##$VPLIST= <PPPPPPPPPPPPPPP>
##$VTLIST= <TTTTTTTTTTTTTTT>
##$WBST= 1024
##$WBSW= 4
##$XGAIN= (0..3)
0 0 0 0 
##$XL= 0
##$YL= 0
##$YMAX_a= 12333
##$YMIN_a= -17702
##$ZGOPTNS= <>
##$ZL1= 120
##$ZL2= 120
##$ZL3= 120
##$ZL4= 120
##$ABSF1= 248.5645
##$ABSF2= -253.2056
##$ABSG= 5
##$ABSL= 3
##$ALPHA= 0
##$AQORDER= 0
##$ASSFAC= 0
##$ASSFACI= 0
##$ASSFACX= 0
##$ASSWID= 0
##$AUNMP= <proc_1d>
##$AZFE= 0.1
##$AZFW= 0.5
##$BCFW= 0
##$BC_mod= 2
##$BYTORDP= 0
##$COROFFS= 0
##$CY= -3
##$DATMOD= 1
##$DC= 0
##$DFILT= <>
##$DTYPP= 0
##$F1P= 0
##$F2P= 0
##$FCOR= 1
##$FTSIZE= 65536
##$FT_mod= 6
##$GAMMA= 0
##$GB= 0
##$INTBC= 1
##$INTSCL= 5.30512e-09
##$ISEN= 30
##$LB= 1
##$LEV0= 0
##$LPBIN= 0
##$MAXI= 10000
##$MC2= 0
##$MEAN= 0
##$ME_mod= 0
##$MI= 50
##$NCOEF= 0
##$NC_proc= -5
##$NLEV= 6
##$NOISF1= 182.463
##$NOISF2= 159.3651
##$NSP= 0
##$NTH_PI= 0
##$NZP= 0
##$OFFSET= 248.5645
##$PC= 4
##$PHC0= -5480.323
##$PHC1= 18.6015
##$PH_mod= 1
##$PKNL= yes
##$PPARMOD= 0
##$PSCAL= 0
##$PSIGN= 0
##$REVERSE= no
##$SF= 81.014009
##$SI= 65536
##$SIGF1= 159.3651
##$SIGF2= -187.1042
##$SINO= 113.3802
##$SIOLD= 16384
##$SREGLST= <1H.CDCl3>
##$SSB= 0
##$STSI= 65536
##$STSR= 0
##$SW_p= 40650.406504065
##$SYMM= 0
##$S_DEV= 0
##$TDeff= 32768
##$TDoff= 0
##$TI= <>
##$TILT= no
##$TM1= 0
##$TM2= 0
##$TOPLEV= 0
##$USERP1= <user>
##$USERP2= <user>
##$USERP3= <user>
##$USERP4= <user>
##$USERP5= <user>
##$WDW= 1
##$XDIM= 65536
##$YMAX_p= 503774794
##$YMIN_p= -153276882
$$ End of Bruker specific parameters
$$ ---------------------------------
##NTUPLES= NMR SPECTRUM
##VAR_NAME=  FREQUENCY,     SPECTRUM/REAL,   SPECTRUM/IMAG
##SYMBOL=    X,             R,               I
##VAR_TYPE=  INDEPENDENT,   DEPENDENT,       DEPENDENT
##VAR_FORM=  AFFN,          ASDF,            ASDF
##VAR_DIM=   65536,         65536,           65536
##UNITS=     HZ,            ARBITRARY UNITS, ARBITRARY UNITS
##FACTOR=    0.620285442955139, 1,           1
##FIRST=     20137.2065510759, 0,            0
##LAST=      -20513.1999529892, 0,           0
##MIN=       -20513.1999529892, -153276882,  0
##MAX=       20137.2065510759, 503774794,    0
$$ Real data points
##PAGE= N=1
##DATA TABLE= (X++(R..R)), XYDATA
$$ [...]
37719 -361172 -388789 123718 1235542 2136825 2293380 1842190 891790 -559307 -1861349
37710 -1861349 -1958969 -882921 -70884 -536655 -1499971 -1613919 -856285 -268753 -386727
37701 -386727 -965149 -1773726 -2485569 -2204371 -529757 1146838 1055672 -231293 -347930
37692 -347930 1243630 2231452 962015 -1029217 -1454033 -540834 -39798 -281974 -284475
37683 -284475 118253 335666 598098 1424181 1981358 1087335 -460213 -754254 158793
37674 158793 418378 -356613 -434860 841164 1765110 1166183 281022 393073 674326 -8899
37664 -8899 -904033 -768592 -24980 293925 537264 1484128 2369556 1821434 139498 -1195246
37654 -1195246 -1814635 -2482575 -3157640 -2872966 -1560914 -378973 -32114 -119499 -280689
37645 -280689 -661420 -998141 -502724 892415 2139429 2341601 1679064 817920 116952
37636 116952 -333374 -523719 -618381 -765963 -760284 -351446 203557 463365 525580 767143
37626 767143 1020643 806240 332098 385827 1087565 1568037 1180923 345846 -206147 -473886
37616 -473886 -960762 -1702333 -2073988 -1662653 -972280 -862770 -1300762 -1241992 -166788 888973
37606 888973 752221 99256 593443 2059201 2285817 286019 -1971424 -2247093 -978010
37597 -978010 -67943 7581 84054 209903 -292517 -1052283 -871409 285750 1156502 1084410
37587 1084410 592012 40774 -782761 -1614273 -1685508 -1005310 -427101 -282598 -168589 -165329
37577 -165329 -907426 -2210205 -2901881 -2332984 -1008392 325290 1080053 491826 -1597044
37568 -1597044 -3635225 -3731881 -2304501 -1606178 -2345795 -2759493 -1647425 -276540 -196074
37559 -196074 -962874 -1340730 -1264938 -1271613 -1254238 -1087735 -1304053 -1884812 -1602376 46386
37549 46386 1435725 933145 -581838 -1059002 -354050 -79871 -788370 -1181631 -231673
37540 -231673 1386348 2238236 1520332 -482007 -2423433 -2604371 -684657 1478081 1738190
37531 1738190 232527 -1025386 -885055 -72739 528134 1113799 1967804 2483298 2055220
37522 2055220 1198825 894890 1200141 1293606 780694 222102 148811 89598 -849690 -2533946
37512 -2533946 -3587796 -2994928 -1414523 -316202 -186729 -399578 -589315 -1028589 -1525706
37503 -1525706 -1128962 523456 2410027 3252869 2818868 1733325 699848 230526 380014
37494 380014 451918 -196955 -918146 -504710 639455 673657 -728915 -1447498 -103693
37485 -103693 1612795 1517197 269950 -22415 628842 483180 -566095 -735591 442403
37476 442403 1223152 616668 -4254 645720 1563381 1158980 -128009 -522407 410811
37467 410811 1266585 921607 12369 -93566 833874 1654760 1428844 633210 373880 782343
37457 782343 1029128 791781 561362 324681 -619114 -1940651 -2009815 -457860 631913
37448 631913 -268630 -1493604 -765655 894038 697817 -1180761 -1716965 -13237 1206614
37439 1206614 110624 -1297159 -519824 1558110 2287058 1065272 -581051 -1568035 -1934485
37430 -1934485 -1744499 -1090300 -713609 -1181149 -1836772 -1703974 -885070 -30283 864429
37421 864429 2000771 2862284 2949908 2719163 2613290 2021080 554813 -564312 -94412
37412 -94412 1013660 915302 -163488 -393015 512902 981714 560614 714420 1919893
37403 1919893 2370050 938429 -576065 13502 1936932 2681941 1705177 880971 1510104
37394 1510104 2762959 3357970 3274649 3188397 3196407 2786296 1625342 26744 -1127335
37385 -1127335 -993025 255732 1246646 896156 -97065 -194359 582754 492899 -1214666
37376 -1214666 -2789537 -2296831 -443133 468122 -60961 -164259 1328741 3017559 3028107
37367 3028107 1680892 758909 904554 1219013 1143032 1203423 1665279 1804304 1178481 606376
37357 606376 986271 1788721 1715778 596738 -307457 32712 1154182 1745366 1109398
37348 1109398 -251075 -1234815 -1141165 -235648 555979 567461 -40750 -692826 -1114732 -1336551
37338 -1336551 -1239000 -669969 14890 168261 -201766 -311868 208368 585581 -56780 -1342400
37328 -1342400 -2050967 -1677085 -822916 -106115 463974 850636 632940 -185163 -699945
37319 -699945 -190850 697931 627305 -692877 -2081323 -2246230 -1075892 480888 1402152
37310 1402152 1385943 989912 1044922 1726248 2308560 2081841 1264769 611223 387339 313550
37300 313550 302290 516444 758229 585143 88163 -250232 -576947 -1591674 -3113127
37291 -3113127 -3720470 -2507155 -423118 925050 1192141 1113064 908585 49727 -1389678
37282 -1389678 -2224277 -1478308 359127 1875297 2251386 1835096 1321901 852896 212342
37273 212342 -373243 -296843 365687 542734 -426722 -1563883 -1372981 28962 1008985
37264 1008985 694027 -28724 -113929 213199 251520 41724 14566 209214 569204 1274975
37254 1274975 2078897 2109652 1138991 250533 357606 836195 624157 -91897 -430886 -356147
37244 -356147 -363212 -180173 808499 2145641 2653111 2032576 930655 -308569 -1657606
37235 -1657606 -2457918 -1971652 -844630 -519552 -1077694 -1153549 -233779 496419 93208
37226 93208 -776983 -1094798 -911685 -756028 -624276 -351482 -193066 -336509 -501069 -587538
37216 -587538 -1030892 -1930010 -2488644 -1968684 -736534 165276 142704 -567283 -1233623 -1128047
37206 -1128047 -119605 1082103 1694059 1800879 1937342 1948156 1242005 192674 145338
37197 145338 1642336 3526720 4194600 3045947 579652 -2031124 -3300223 -2456109 -513836
37188 -513836 576027 138800 -769582 -1206524 -1358979 -1395696 -774721 544722 1440694
37179 1440694 1087942 114073 -479206 -594335 -512047 -133022 415529 426316 -224014 -517902
37169 -517902 145908 781761 244822 -1024163 -1753200 -1569665 -931270 -97160 726643
37160 726643 922386 289709 -255640 105773 773138 666651 -130143 -769357 -1072050 -1414468
37150 -1414468 -1733539 -1787117 -1875635 -2192108 -2054819 -973344 168519 318924 20819
37141 20819 491625 1479465 1674854 916988 298647 229630 72774 -312926 -328260 -24975
37131 -24975 -102562 -341125 279188 1566285 1942708 844380 -365333 -652544 -880808
37122 -880808 -2016914 -3125131 -2588765 -543185 1275063 1762888 1444729 1352162 1748322
37113 1748322 2058993 1644157 592197 -175981 172942 1336406 2134038 1826156 704821
37104 704821 -563981 -1513752 -1808706 -1469500 -1344721 -2435507 -4371582 -5419714 -4514036
37095 -4514036 -2514997 -923269 -147746 245744 337817 -66152 -559549 -404760 303357
37086 303357 581016 -111350 -1059660 -1146481 -189518 915736 1319532 1178008 1290069 1911535
37076 1911535 2353215 1955879 1058977 535931 605428 674498 296892 -270134 -522377 -282889
37066 -282889 203775 385018 -258352 -1491062 -2127363 -1243526 474085 1333476 609280
37057 609280 -845305 -1958580 -2471227 -2456111 -1911004 -1322968 -1618607 -2797188 -3439437
37048 -3439437 -2468867 -753300 47651 -234409 -274286 626340 1569808 1473814 558022 -97323
37038 -97323 18077 393233 362870 82014 459532 2016677 3879148 4336588 2733618
37029 2733618 439152 -634351 -255023 131728 -398757 -1032924 -666095 304677 589832
37020 589832 -19971 -440629 -108613 136190 -488106 -1297557 -1111286 -93832 415497
37011 415497 -242659 -1348646 -2010028 -2098929 -1724209 -728733 698632 1623601 1321470
37002 1321470 244566 -590429 -881388 -1102691 -1508517 -1730399 -1412541 -782611 -389673
36993 -389673 -397295 -255924 734430 2368881 3383083 2893505 1690113 1213238 1433077
36984 1433077 1032927 -153782 -521182 726639 1966041 1475915 95758 -130920 941527
36975 941527 1706977 1486581 1044577 666831 -135806 -825465 95719 2519957 4151947
36966 4151947 3534285 2062376 1760935 2410291 2351797 1177309 29392 -281873 -29444
36957 -29444 356068 724107 759141 200105 -376411 60604 1571326 2945369 3125377 2330684
36947 2330684 1437355 774298 26660 -950627 -1763574 -1954752 -1491940 -649539 325855
36938 325855 1182320 1497561 1002817 140359 -163970 416182 1100363 989804 313664 158887
36928 158887 1005985 2044145 2100239 947510 -464385 -943479 -174403 1005420 1472418
36919 1472418 977543 287184 173333 602142 1035708 1125913 872589 477927 308942 633795
36909 633795 1164483 1280053 886468 517006 432527 390892 548385 1560806 3256772 4302569
36899 4302569 3960011 3083263 2451020 1379599 -670678 -2359393 -2181661 -1040548 -1037596
36890 -1037596 -2234163 -2817792 -2254482 -1905429 -2292544 -2125146 -779463 359562 108622
36881 108622 -674834 -659608 -73893 65223 -278841 -343639 156912 845916 1263712 1049528
36871 1049528 88329 -1130669 -1858838 -1929051 -1583401 -652366 973910 2222892 1725862
36862 1725862 -18810 -983008 -435676 252908 81429 -167712 245887 616935 295700
36853 295700 -25311 298545 625720 328374 -44454 -15905 -196517 -938090 -1445880 -1397299
36843 -1397299 -1834425 -3096046 -3570794 -2168053 -394058 -56271 -419131 199174 1352722
36834 1352722 1421983 621844 509210 1139207 1232428 817907 1244573 2599540 3363263 2778064
36824 2778064 1606629 471488 -659973 -1285737 -605924 820974 1395868 674065 -292042
36815 -292042 -783971 -952883 -653722 402120 1356716 1019580 42767 265926 1742268
36806 1742268 2547769 1833035 816017 273319 -570276 -1868484 -2270757 -1362053 -770127
36797 -770127 -1476197 -2098669 -1418130 -622021 -1144282 -2012801 -1549046 -376689 -350206 -1302426
36787 -1302426 -1246527 442563 2167640 2542086 1953317 1414892 1225293 1103129 667513
36778 667513 -374382 -1723604 -2300242 -1471640 -278199 -365928 -1784030 -2973114 -2976357
36769 -2976357 -2466907 -2325466 -2375647 -2085149 -1567275 -1161850 -695544 84007 788312 855296
36759 855296 477265 316849 371234 -103855 -1306242 -2192124 -1627420 82180 1423590
36750 1423590 1394061 456005 -270089 -203403 493015 1325199 1707912 1267326 356024 -121587
36740 -121587 179229 557096 369285 51956 322063 900816 999228 724891 910896 1670247
36730 1670247 2210726 2106554 1696104 1141177 225007 -677096 -585931 640598 1835921
36721 1835921 2038770 1617510 1327024 1087238 422801 -495948 -983449 -692013 112783
36712 112783 838925 950846 517508 407330 1231432 2088857 1417718 -646706 -2007846
36703 -2007846 -1360799 -59830 -259579 -2086144 -3797988 -4182762 -3655460 -3249609 -3475842
36694 -3475842 -4076097 -4237680 -3235811 -1385173 -4270 93239 -401313 -401919 39872 138803
36684 138803 -168826 -174079 406458 1107151 1549033 1823650 2025337 2043785 1859889 1570089
36674 1570089 1179747 778498 731766 1256830 2019087 2545451 2738950 2615619 2010097 1038047
36664 1038047 299305 15671 -402734 -1181715 -1322488 -15359 1691097 2003221 870054
36655 870054 -45846 215021 963124 1406862 1631318 1672809 1083838 59326 -291976 424735
36645 424735 1126272 922859 403143 259934 -190209 -1698023 -3175381 -2853883 -1026668
36636 -1026668 113603 -494632 -1518957 -1452831 -609897 -75977 67970 288645 248153
36627 248153 -655686 -1761634 -1596925 34084 1625935 1945479 1338253 631923 -93517
36618 -93517 -810769 -665654 916534 2814263 3301695 2380422 1656022 1848997 1895473 940242
36608 940242 -217775 -507667 -215033 -139128 -76973 537522 1115860 492769 -1189658 -2513043
36598 -2513043 -2715004 -2358984 -1920302 -961898 771076 2427335 2904871 2039408 474276
36589 474276 -1064520 -1919506 -1562817 -151442 1320497 1938955 1722618 1267352 906967
36580 906967 579469 173711 -365651 -989090 -1325128 -898572 136892 929579 936429 509319
36570 509319 105628 -447717 -1304784 -1836871 -1339785 -65595 1264498 2480799 3504666
36561 3504666 3418849 1476034 -1085565 -1887287 -456755 1081427 997566 135473 96716
36552 96716 670774 603366 -42913 -75743 711653 1334928 1453955 1788228 2493233 2638365
36542 2638365 1787175 815590 570533 811494 1047855 1322231 1503595 941063 -276581
36533 -276581 -728664 557976 2484148 3181039 2400500 1504558 1509224 2238223 3063840 3347379
36523 3347379 2386125 102781 -2268567 -3255331 -2889525 -2388781 -2220407 -1691848 -534194
36514 -534194 429968 617304 566279 956953 1664207 2268525 2603065 2279132 645455 -2006176
36504 -2006176 -3976974 -3815579 -2010569 -338646 68792 -582721 -1468435 -1785977 -1044130
36495 -1044130 471809 1649169 1616591 793656 356214 793071 1547974 1989877 2098476
36486 2098476 2074623 1815094 1105861 102458 -699323 -1010058 -1117996 -1552865 -2355473
36477 -2355473 -2874240 -2429727 -1013995 785351 2243637 2708884 1916066 571242 17561
36468 17561 579364 871763 -205776 -1471145 -1010254 706354 1297821 151288 -691242
36459 -691242 -38099 483182 -566357 -1676531 -829104 969070 1220898 -39763 -607163
36450 -607163 -40560 -252722 -1861065 -2803740 -1637080 141450 492871 -293478 -731900
36441 -731900 -671011 -869153 -996928 12042 1896103 2975099 2300621 805706 97847
36432 97847 841128 2411131 3517107 3117656 1279668 -790049 -1935639 -2181270 -2290493
36423 -2290493 -2454397 -2084131 -898295 467928 1202422 1195622 849714 342815 -456571
36414 -456571 -1402704 -1878740 -1490275 -721928 -442789 -744829 -805737 -136326 642583 780289
36404 780289 542701 530886 366001 -692421 -2004606 -1988347 -616936 153161 -734608
36395 -734608 -1720026 -1136286 -13107 -405468 -1854260 -1972436 -410431 383351 -924679
36386 -924679 -2316053 -1623565 -58778 -384281 -2658506 -4186270 -3468601 -1968083 -1510292
36377 -1510292 -1829171 -1661331 -908192 -460363 -607209 -774555 -550527 -88479 397692
36368 397692 884140 1343493 1771982 2290568 2808216 2776243 1784511 341511 -406019 158474
36358 158474 1427969 2058445 1141759 -870521 -2390253 -2250175 -1103381 -663875 -1416949
36349 -1416949 -2013698 -1428804 -606500 -909820 -1872673 -2009770 -1321663 -1210108 -1942031
36340 -1942031 -2034801 -643048 1064307 1686888 1369915 864023 57559 -1334527 -2525851
36331 -2525851 -2455910 -1391575 -615747 -795030 -1551539 -2329432 -2788299 -2603426 -1768120
36322 -1768120 -958251 -854872 -1264642 -1551821 -1643389 -1869965 -2126608 -2064826 -1926479 -2274990
36312 -2274990 -2934434 -3055911 -2343094 -1501210 -1310508 -1766921 -2218774 -1994892 -1015787
36303 -1015787 -114115 -387143 -1747144 -2620587 -1821294 -236467 296370 -578644 -1505237
36294 -1505237 -1397430 -513973 386134 835801 565436 -301534 -892170 -502609 100329
36285 100329 -473353 -1985431 -2599605 -1533224 -169370 188401 217051 1131867 2504529
36276 2504529 2876549 1871946 443899 -575816 -1054612 -949052 -182804 855512 1485755
36267 1485755 1522103 1426884 1678955 2231709 2421937 1353042 -1083864 -3396604 -3544726
36258 -3544726 -1341959 989434 1372766 216835 -648215 -551486 -262886 -241725 -84231
36249 -84231 327093 462159 194585 141993 598857 1001900 836692 343945 -50167 -363073
36239 -363073 -720294 -922331 -748852 -326403 86717 347308 283790 -284193 -1150052 -1696762
36229 -1696762 -1504168 -723422 259686 1181765 1771122 1648948 685641 -675482 -1647608
36220 -1647608 -1672781 -851923 92649 462802 357652 506413 1097686 1313798 614220 -72573
36210 -72573 561550 2200094 3187809 2848443 2213712 2100907 1862011 870325 8710 377229
36200 377229 1304454 1148847 -194887 -1067752 -503611 381191 48628 -1307783 -2067521
36191 -2067521 -1249435 408441 1402007 1082716 194324 -97557 447783 984522 798203
36182 798203 273386 265174 830397 1199673 910544 308068 -149434 -438128 -632605 -631802
36172 -631802 -506365 -553296 -660426 -208535 896376 1651305 1120356 -202721 -996541
36163 -996541 -890345 -774266 -1287747 -1870887 -1671996 -721167 307675 1049191 1601434
36154 1601434 1976198 1956151 1513039 1001145 833539 1111711 1579880 1858843 1765859 1424520
36144 1424520 965031 227240 -896148 -1859869 -1787029 -627109 585722 1039579 1109562
36135 1109562 1427043 1681127 1373009 1240013 2432201 4271419 4518323 2501169 395292
36126 395292 208519 833889 -158632 -2625988 -3899401 -2707466 -948266 -830077 -1966824
36117 -1966824 -2506827 -1918877 -1205770 -1014759 -980383 -779249 -633897 -647059 -534816 -233233
36107 -233233 -124179 -461374 -1007318 -1314419 -1044410 -124299 1048620 1787415 1935395
36098 1935395 2155193 2822596 3103004 2039970 229794 -742841 -478059 -154349 -602667
36089 -602667 -1255583 -1426998 -1407814 -1608893 -1664201 -1186325 -539475 -75432 542454 1408718
36079 1408718 1661521 752639 -327604 -293267 527905 745021 -67206 -1112214 -1777444
36070 -1777444 -2012081 -1598053 -474240 306704 -545415 -2534333 -3636796 -2936339 -1684109
36061 -1684109 -1287906 -1568586 -1699605 -1675590 -1911721 -2251400 -2300095 -2141990 -1963902 -1522701
36051 -1522701 -684894 20156 42834 -456933 -1075701 -1796671 -2528784 -2608309 -1567385 -36229
36041 -36229 846779 672009 -140706 -1083539 -1768605 -1775173 -1025905 -109646 379730 584234
36031 584234 881356 992163 371610 -701276 -1286414 -1090910 -836393 -1071225 -1252104
36022 -1252104 -472575 1192112 2547022 2560840 1544926 799166 1084650 1785110 1815466
36013 1815466 989169 -1052 -634396 -876676 -670321 -49627 263586 -525709 -1844801
36004 -1844801 -2062796 -725486 602023 417654 -754628 -1303791 -621633 603429 1496330
35995 1496330 1582929 895735 213422 495747 1420367 1404971 -117255 -1574047 -1518686 -827077
35985 -827077 -1096188 -1882662 -1478402 188231 1518470 1876019 2164749 2692410 2536358
35976 2536358 1510438 871563 1300561 1754947 1174707 -8972 -878465 -1285342 -1248891
35967 -1248891 -305199 1518252 3049589 3346115 2973601 2956471 3140773 2619012 1283885
35958 1283885 -39725 -737160 -839682 -495205 265181 1245759 2037685 2242647 1590705
35949 1590705 142969 -1420270 -2154118 -1833217 -1226480 -1106346 -1382457 -1508163 -1285582
35940 -1285582 -857518 -270490 493108 1240356 1674264 1691330 1439731 1228551 1375611 1862369
35930 1862369 2150754 1685432 569204 -591769 -1407827 -1872261 -2014842 -1945803 -2051293
35921 -2051293 -2481801 -2630808 -1901788 -835518 -553415 -1135868 -1554767 -1256780 -742995
35912 -742995 -430482 -83098 304676 178455 -550331 -1144215 -1172909 -1042325 -957240 -430508
35902 -430508 610753 1339635 1372801 1518049 2301845 2791332 1994925 584556 -47150
35893 -47150 154313 140343 -282041 -178541 687074 1083786 74569 -1255341 -870728 1427729
35883 1427729 3240070 2351082 -183337 -1040104 1006994 3264483 2776175 381937 -809222
35874 -809222 -50194 489464 -409093 -1395545 -1382839 -1296867 -1789115 -1640308 -129933 1070015
35864 1070015 353538 -1126696 -1303377 -348684 176738 155131 558706 1087315 541507
35855 541507 -854484 -1684071 -1644456 -1597912 -1568024 -802841 211461 -29724 -1509841 -2321060
35845 -2321060 -1328123 456212 1600443 1780297 1146153 -198243 -1425734 -1183747 563133
35836 563133 2007801 1618417 -74738 -1390971 -1374039 -277920 994716 1447684 672395
35827 672395 -637240 -1382328 -1344741 -1133680 -1035746 -912273 -1084838 -2011009 -2982595 -2574634
35817 -2574634 -762136 793725 1101718 1092725 1750295 2330754 1600095 -100351 -1286929
35808 -1286929 -1322304 -862245 -574244 -389756 -49737 344376 570584 734311 1199538 2009527
35798 2009527 2512039 1975522 754662 246261 1138211 2292727 2216596 1132720 486273
35789 486273 749232 1039066 819330 573586 624948 636272 607035 1071354 1843090 1783182
35779 1783182 425644 -1179476 -1820632 -1445388 -704287 -107264 -40449 -668176 -1402033
35770 -1402033 -1367325 -683377 -317091 -550792 -809322 -1057666 -1768012 -2287003 -1210537
35761 -1210537 1015720 2020643 1027721 193555 999516 1703977 544051 -764554 273601
35752 273601 2317380 1841713 -1196845 -3001831 -1563641 754732 1295300 730995 914462
35743 914462 1564879 1328536 525294 499191 1072922 794363 -566076 -1612389 -1491648
35734 -1491648 -913465 -687292 -586910 -286248 -354843 -1361973 -2526109 -2302291 -381964
35725 -381964 1657048 2087002 987975 -26671 155708 989225 1241794 550128 -378405
35716 -378405 -748254 -374600 438934 1257637 1736185 1788523 1572498 1167218 410718 -729491
35706 -729491 -1827405 -2373159 -2367524 -2236579 -2249803 -2315557 -2256000 -1992474 -1550615 -1140381
35696 -1140381 -1069357 -1269599 -1130561 -252859 787390 1003220 352678 -54145 659709
35687 659709 2007960 2780696 2546735 2050737 2112325 2573400 2672636 2262289 2080613 2580590
35677 2580590 3017884 2344546 768289 -397200 -480956 -173041 -210091 -295770 13402 188567
35667 188567 -481678 -1463449 -1485814 -381946 615796 546188 -227332 -891700 -1277881 -1616700
35657 -1616700 -1812543 -1528489 -724125 270728 1049632 1300318 915727 131508 -603043
35648 -603043 -962058 -798335 -12046 1197679 2020397 1619963 230340 -922238 -1107413
35639 -1107413 -943402 -1328003 -2055580 -2170923 -1412773 -574326 -420451 -812091 -1034976
35630 -1034976 -625987 236027 932179 999377 689229 723544 1216431 1239282 82755 -1383026
35620 -1383026 -1582299 -417146 609320 748586 1087281 2368327 3069778 1341938 -1820506
35611 -1820506 -3335768 -2018506 66401 727077 314317 296070 810994 1163139 1558102
35602 1558102 2498521 3111448 2049535 -50153 -875521 475875 2360687 3079928 2960183
35593 2960183 3078787 3288099 2816191 1963339 1744585 2164456 2178005 1448779 997673 1629771
35583 1629771 2513946 2103086 239879 -1394962 -1209176 391367 1571856 1343070 460000
35574 460000 -87204 -428854 -934976 -948212 280497 1898677 2257334 1354200 894475
35565 894475 1665007 2464267 2225983 1606174 1509467 1490350 875622 259072 424009 762482
35555 762482 364796 -96592 655472 2129012 2546326 1577214 751816 987623 1485567
35546 1485567 1500572 1465757 1616157 1117569 -314592 -1228677 -250680 1740490 2632352
35537 2632352 1828177 712959 562280 1162939 1628960 1627991 1439202 1373653 1482566 1577526
35527 1577526 1391323 857717 184842 -461744 -1089939 -1471418 -1022624 400438 1920835
35518 1920835 2525088 2344142 2306905 2610556 2456739 1494145 562826 474463 844040 872154
35508 872154 676902 913256 1402653 1186912 4302 -1168673 -1322628 -541435 321796
35499 321796 582739 150907 -496452 -627300 -39299 438409 -100839 -1170433 -1346964
35490 -1346964 -433681 50112 -785653 -1604744 -765331 1123497 2064783 1537559 908542
35481 908542 1194904 1985286 2638506 3038069 2898314 1781939 254777 -342080 163143
35472 163143 367420 -495036 -1268146 -735694 432836 764321 73377 -752448 -1293938
35463 -1293938 -1617354 -1320422 18575 1655614 2257887 1707733 1217955 1488228 1747031
35454 1747031 996760 -529918 -1657587 -1669641 -1027391 -688479 -852414 -663715 525409
35445 525409 1901812 2007289 791658 -226575 -172226 46213 -483388 -1029698 -533425
35436 -533425 471695 735216 347071 288107 417764 -280639 -1559602 -1863293 -748017
35427 -748017 309166 134251 -520373 -386265 415194 842234 606492 494435 1292417
35418 1292417 2860760 4110430 3937845 2696552 2531553 5259713 9843148 13070525
35410 13070525 13026968 10771704 8253167 6013150 3841104 2339169 2287855 3073238 3239678
35401 3239678 2481309 1851039 1923375 1892982 909294 -521787 -1089508 -268315 1160789
35392 1160789 2102101 2270256 2166003 2156379 2008407 1502040 1062714 1231173 1701079 1587971
35382 1587971 704292 -145546 -351351 -272972 -466158 -795152 -846654 -697274 -646622 -560321
35372 -560321 -124388 459282 622396 187901 -472402 -937569 -1004013 -593980 164198 807263
35362 807263 846633 222671 -712519 -1501530 -1702222 -1044789 147970 951227 703173 -232841
35352 -232841 -894925 -715455 212310 1484312 2496035 2591104 1838121 1386030 2116952
35343 2116952 3060140 2324288 -125355 -1888378 -1100688 1082338 2142857 1577102 1085061
35334 1085061 1663329 2289704 1971162 1474158 1863789 2414212 1481594 -962002 -3101050
35325 -3101050 -3594964 -2872082 -1868392 -690782 812944 2048835 2140566 1048343 -402074
35316 -402074 -1386182 -1567723 -1042650 -262545 200505 182993 50071 113052 311203 662828
35306 662828 1420962 2363448 2588982 1680800 505566 48454 -36954 -689383 -1587629 -1318483
35296 -1318483 458982 2174378 2186795 679773 -831397 -1327700 -1076710 -949141 -1438289
35287 -1438289 -2238372 -2548403 -1912876 -831334 -290717 -641369 -1258412 -1393433 -964998
35278 -964998 -311888 449203 1431668 2483216 3059770 2754166 1845802 1099987 884431
35269 884431 691573 -103623 -1167031 -1525208 -1019604 -595026 -749557 -629815 526512
35260 526512 1852064 1904981 765451 -201301 -414810 -520926 -777027 -503359 465930
35251 465930 1177486 1077860 930157 1372574 1661325 950105 -49702 -20498 858314 1178500
35241 1178500 540251 85467 506641 870829 216093 -697254 -416589 901840 1561797
35232 1561797 789796 -162256 445 630268 262293 -969164 -1497837 -732203 241791
35223 241791 590480 776249 1034933 438973 -1289173 -2380037 -1151895 1246230 2063073
35214 2063073 638080 -846426 -366935 1679552 3443005 3569595 1911777 -574054
35206 -574054 -2325085 -2473714 -1798264 -1587090 -1802777 -1517598 -861442 -948105 -1857727 -2421193
35196 -2421193 -2302363 -2522246 -3360675 -3520105 -2251256 -696648 -68919 55629 479425
35187 479425 790124 361834 -180003 106277 948338 1544724 1964736 2592550 2929438 2282740
35177 2282740 1084087 295491 -9688 -375837 -814682 -1013355 -1167415 -1556956 -1820239
35168 -1820239 -1626894 -1439288 -1616028 -1535591 -719600 52409 38499 -4624 794197 1503925
35158 1503925 739660 -804961 -1291072 -689651 -454933 -490625 864671 3449685 4611831
35149 4611831 3011449 741248 155226 569393 -17593 -1429263 -1711679 -282556 1326418
35140 1326418 1700575 926859 -252600 -1297796 -1689874 -1061808 68669 497700 -306807
35131 -306807 -1565082 -2207877 -2093207 -1880673 -2037614 -2370965 -2422993 -1967908 -1057152 125950
35121 125950 1208645 1607534 996921 -128261 -782816 -605228 -235134 -283296 -431333
35112 -431333 -101868 442126 506943 269480 695827 2004859 3072259 2785018 1412787
35103 1412787 192936 -73098 358629 688430 400637 -292101 -710886 -546587 -330903
35094 -330903 -697360 -1257796 -864943 752788 2214226 1910523 -39652 -1841325 -2067973
35085 -2067973 -1159570 -580298 -832049 -955770 -132884 933385 918306 -231720 -1237439
35076 -1237439 -1249863 -639570 135273 1220452 2338435 2293586 581380 -1378319 -1836888
35067 -1836888 -950621 -234803 -349898 -755572 -1091823 -1370000 -1061361 299665 1595910
35058 1595910 1035084 -1037004 -2033945 -622299 1318595 1353922 -262168 -1416736 -1237826
35049 -1237826 -770279 -981168 -1557524 -1733383 -1251494 -341026 527420 773183 189321
35040 189321 -638964 -877656 -418279 101983 190618 -58269 -407027 -848054 -1326711 -1437336
35030 -1437336 -763757 472433 1374623 1257489 530184 291758 872599 1305640 754198
35021 754198 -40561 370212 2031296 3367355 3167975 1818235 379187 -472643 -238041
35012 -238041 1405536 3578870 4281216 2690328 640330 471736 1865021 2310141 670412
35003 670412 -1310104 -1595277 -614777 -354873 -1418973 -2273563 -1443548 537940 1856966
34994 1856966 1576382 461593 -228663 -199377 -124151 -527937 -1074672 -992115 5841 1320972
34984 1320972 2009979 1781867 1377860 1707083 2653279 3200524 2830701 2132894 1663819
34975 1663819 994190 -296454 -1304802 -708796 1147232 2304203 1587629 -48647 -961850
34966 -961850 -721347 -66058 300768 247173 -12674 -174962 -132954 -215782 -772842 -1453071
34956 -1453071 -1474214 -726277 80385 546388 1067318 1869339 2379575 2044291 1097950 79513
34946 79513 -744116 -1108663 -742603 -90929 -111167 -727265 -496143 1327799 3357615 3758899
34936 3758899 2527096 937067 -403075 -1497902 -1727960 -546011 839645 439480
34928 439480 -1596742 -2816708 -1784280 83106 827598 537502 335983 36789 -1400494
34919 -1400494 -3553609 -4497628 -3406597 -1838155 -1676624 -2625367 -2679948 -814936 1695860
34910 1695860 2865822 2309214 1477189 1814782 3233644 4492641 4613183 3610120 2134762
34901 2134762 843967 100775 -33685 314673 942963 1543310 1693055 1191525 463196
34892 463196 254322 729357 1193358 948493 111957 -666923 -946803 -650836 93666 814429
34882 814429 763251 -277457 -1465135 -1768047 -1253625 -926700 -1324508 -1870136 -1727124
34873 -1727124 -788062 389775 1268411 1711194 1867047 1859703 1611264 1023243 307337 -105981
34863 -105981 -77211 90940 73331 -289397 -1227885 -2756812 -3920970 -3299466 -970050
34854 -970050 916203 583366 -1034813 -1698503 -1048720 -708555 -1317281 -1425564 -6045
34845 -6045 1623239 1582982 13096 -1432549 -1923203 -1920300 -1705957 -871370 573143 1696582
34835 1696582 1727490 986103 322036 57692 -112750 -437025 -720558 -609460 -11627 844093
34825 844093 1639007 2113413 2044827 1357709 418857 -33556 382180 1116580 1197767 310272
34815 310272 -931975 -1738936 -1839739 -1508734 -1287896 -1581353 -2083736 -1807779 -331895
34806 -331895 1161169 1024462 -639713 -1995151 -1975015 -1534032 -1756473 -1995290 -1090736
34797 -1090736 481555 1171121 629382 -13021 2885 310808 572546 1037774 1626776
34788 1626776 1636956 862551 65814 -135339 -6020 75193 217491 389903 155061 -358357
34778 -358357 -169127 1074680 2168269 1826831 412082 -728059 -988303 -609563 247709
34769 247709 1343953 1829476 1194263 353457 418152 771680 2712 -1473809 -1729499
34760 -1729499 -506081 79026 -1098777 -2140687 -1012937 1115809 1452444 -344827
34752 -344827 -1753191 -920895 1165546 2384399 2001250 904749 161438 -38204 -230767
34743 -230767 -730178 -948140 -102152 1299065 1571984 86670 -1513480 -1321903 327913
34734 327913 1553760 1502908 877265 370497 124619 456177 1473018 2071321 1034876
34725 1034876 -840434 -1575360 -1136891 -1624504 -3741250 -5313768 -4509892 -2524563 -1468563
34716 -1468563 -1267398 -555086 639519 1184753 1007703 951026 981751 470504 -66162 532452
34706 532452 1842974 2042845 662906 -548440 -126026 1166126 1690421 1157212 578912
34697 578912 645195 976244 811637 -17937 -835305 -839269 -133037 324629 54856 -249589
34687 -249589 71958 461159 105268 -496468 -162463 1082688 2021795 2000924 1402301 467701
34677 467701 -928899 -2219202 -2300488 -1134100 51051 471967 471858 255797 -544200 -1561292
34667 -1561292 -1576431 -532864 -111753 -1196482 -2228750 -1519768 47857 358880 -754638
34658 -754638 -1538969 -1092737 -267796 159867 479347 867042 706409 -278924 -1274453 -1397067
34648 -1397067 -712189 249819 1257787 2136090 2425693 1957853 1366908 1417259 2025698
34639 2025698 2429931 2174289 1506369 901547 599575 584412 648260 438345 -193868 -776931
34629 -776931 -552047 488247 1250466 731736 -644891 -1539274 -1478764 -1271567 -1421216
34620 -1421216 -1201463 -73782 920054 433865 -1055483 -1838548 -1487215 -1200743 -1504945
34611 -1504945 -1330780 -58266 1115496 993655 325640 540860 1401895 1461290 424659
34602 424659 -445288 -236301 580926 1167574 1292296 1049247 485836 -178650 -606991 -815492
34592 -815492 -1052091 -1179096 -841887 -308201 -367950 -1149255 -1728284 -1316937 -336106 132362
34582 132362 -309057 -908877 -553635 1061365 2923615 3470678 2149604 96537 -1076130
34573 -1076130 -978016 -444545 -82714 361316 1059650 1381064 678587 -634684 -1384477
34564 -1384477 -928666 209347 1009411 1020490 639015 397269 237227 -201347 -701295
34555 -701295 -514061 454360 1167730 772962 -118666 -252788 502633 1107660 897599 245665
34545 245665 -278319 -441190 24142 1272073 2572191 2724003 1661243 644527 344281
34536 344281 -168199 -1687994 -3166701 -2970430 -1236054 331164 715110 358040 -224560
34527 -224560 -1176132 -2267407 -2382448 -863157 1348284 2688374 2642137 1785616 644419
34518 644419 -601640 -1470500 -1244995 7578 1170190 1274888 561424 -21333 16192
34509 16192 445707 858114 925526 418076 -410678 -680587 102327 1013516 656093 -760650
34499 -760650 -1421928 -451344 707938 366349 -918118 -1200963 40905 1364371 1498041
34490 1498041 731713 16371 -231278 -142956 -77223 -498405 -1441119 -2075510 -1655410 -807151
34480 -807151 -759343 -1313468 -991428 538717 1747719 1562473 836993 589513 310468
34471 310468 -652052 -1370676 -709131 504105 491784 -795596 -1757534 -1612401 -1099982
34462 -1099982 -806994 -445727 48351 203500 70818 271096 742046 732857 256319 144778
34452 144778 361876 -197542 -1664241 -2499917 -1715678 -427094 -153144 -719629 -979530
34443 -979530 -620193 -64839 562201 1123141 858837 -572299 -1988365 -1956729 -806635
34434 -806635 -80864 -266751 -422168 45837 593122 667930 409184 -60063 -957120 -2067445
34424 -2067445 -2539528 -1892419 -606322 527757 1047660 758705 -170542 -909842 -605638
34415 -605638 450726 1097750 946524 819637 1235387 1503871 950026 110409 -111784
34406 -111784 212723 415437 429175 725254 1376609 1985937 2330234 2381922 1934068 956827
34396 956827 162952 399874 1421275 1971124 1301610 94324 -389975 228389 1064463
34387 1064463 960905 -182095 -1115846 -541281 1233355 2387518 1651752 -179148 -1297193
34378 -1297193 -1069269 -508691 -732287 -1647960 -2296219 -2067111 -1440303 -1624125 -3258514
34369 -3258514 -5352977 -6036861 -4761582 -3121214 -2785974 -3256697 -2729291 -756285 1275544
34360 1275544 2222784 2330924 2087328 1367116 337881 -45612 620318 1263461 720890
34351 720890 -614194 -1456327 -1374784 -901987 -326571 537433 1484322 1797830 1192336 265289
34341 265289 -153187 247418 1126073 1794981 1776277 1329397 1205309 1645371 2034816 1875944
34331 1875944 1533104 1466083 1333948 668573 -47290 36149 744300 1091352 785479 525121
34321 525121 777627 1241842 1656349 2191832 2771984 2832277 2079254 851941 -420071
34312 -420071 -1434088 -1696080 -944402 -25413 -232590 -1415450 -1909487 -926248 193657
34303 193657 35308 -657743 -108310 1764786 3135669 2663020 951119 -494157 -910584
34294 -910584 -663343 -544216 -896174 -1250560 -957597 -246007 -88167 -693241 -941268 -34746
34284 -34746 1072750 977593 -29441 -451739 69647 387350 -75855 -349271 460969 1736702
34274 1736702 2244470 1654902 564127 -304124 -394890 469741 1616954 1939433 1381435
34265 1381435 1297988 2573900 4044303 3812798 1805736 -55914 -233701 808509 1573339
34256 1573339 1332460 519359 -159983 -422199 -342305 -90008 99961 -30198 -439958 -603702
34246 -603702 -64310 735802 732459 -251702 -859194 150344 1996836 2718391 1810219 744840
34236 744840 623150 738821 209830 -325654 117309 1003145 1076440 415313 111919 247153
34226 247153 -106847 -844133 -577086 1036661 2306344 1767038 203773 -642792 -423605
34217 -423605 -38148 133703 479433 920945 773209 -28791 -633415 -531882 -274290 -482147
34207 -482147 -796972 -413550 662308 1483809 1319037 569655 319778 1037697 1959042
34198 1959042 1972553 1015587 175443 266213 782219 687816 -113442 -721400 -527630 84110
34188 84110 410380 249387 -137746 -448080 -514565 -413468 -532022 -1151346 -1859904 -1877433
34178 -1877433 -1156354 -588842 -766420 -1125025 -891273 -376308 -526372 -1403531 -1958140
34169 -1958140 -1414883 -246137 439820 74040 -893007 -1329768 -309727 1841812 3441903
34160 3441903 3028861 1124356 -236830 127932 1383295 2098154 1944067 1426047 754361
34151 754361 -103020 -731337 -638980 -183942 -260426 -1011039 -1565944 -1194857 -143071 815366
34141 815366 1164593 857792 187490 -388597 -601567 -618557 -679710 -597093 -37392 770794
34131 770794 1134955 759576 58910 -425703 -461858 24460 962272 1859024 2057463 1523007
34121 1523007 966788 971915 1356984 1564631 1304052 653241 -96522 -527944 -361632 244698
34111 244698 944023 1693836 2550998 3059745 2542314 1150911 -39173 -263269 172503
34102 172503 605276 859465 1024350 983687 653867 302929 232966 417842 657784 745247
34092 745247 389950 -528742 -1552606 -2062694 -2145795 -2332024 -2469965 -1851987 -631009
34083 -631009 56105 -180414 -307347 447661 1409741 1754341 1817937 2103488 2101864 1362084
34073 1362084 792764 1478477 2867561 3488123 2901346 1696584 239311 -1166287 -1572744
34064 -1572744 -510164 693766 446315 -665767 -827061 -69118 -217736 -1663699 -2461108
34055 -2461108 -1320340 472090 1094050 561636 39628 67825 462399 950770 1080296
34046 1080296 421947 -515470 -587656 237633 612467 -110749 -835761 -547347 139991 250433
34036 250433 15386 -18694 -362278 -1684526 -3291295 -3808733 -2914370 -1395031 -71832
34027 -71832 414558 -458140 -2212252 -3121391 -2129784 -499447 -247812 -1389478 -2153780
34018 -2153780 -1710996 -1148074 -1524730 -2278125 -2141215 -858567 579889 1113837 765396
34009 765396 655878 1688412 3188904 3501912 2257505 1132833 1565600 2595444 2259909
34000 2259909 600042 -300359 699610 2279996 2661431 1948959 1590630 2166209 2742652
33991 2742652 2402253 1600838 1497228 2222118 2555841 1650225 423320 406701 1517364
33982 1517364 2099132 1298052 242996 378946 1599325 2662869 2678589 1601037 29996
33973 29996 -923841 -396427 1039768 1806237 1424639 1070977 1434111 1490095 467288 -483900
33963 -483900 -142595 552852 36928 -1080257 -897979 591663 1389505 510884 -826853
33954 -826853 -1210826 -542580 644717 1817289 2191736 1331740 190140 167014 1041456
33945 1041456 1311976 638391 256530 726730 1039259 465393 -346633 -728678 -892394
33936 -892394 -844579 26193 1537573 2433967 2345003 2440807 3158623 2981886 910659 -1360033
33926 -1360033 -1570976 -183356 438580 -431834 -1175271 -636802 238916 159882 -536190
33917 -536190 -593260 257646 1074693 1136511 748563 438114 19534 -901169 -1788302 -1506600
33907 -1506600 -56712 979608 460592 -632914 -566344 674470 1522912 1115081 95891
33898 95891 -723926 -1110654 -741798 756575 2761791 3890720 3666390 2877225 2105250
33889 2105250 1157851 151535 -306573 -396046 -1036114 -2083988 -2177560 -1005339 -32876
33880 -32876 -114405 -168164 589821 895534 -412203 -1976881 -1656564 300354 1797468
33871 1797468 1990808 1917522 2326381 2711227 2574734 2156225 1705233 1203306 925855 1231347
33861 1231347 1687253 1366224 174115 -895536 -969975 -163411 797428 1310156 1268675
33852 1268675 1043016 995021 932750 484103 28779 387440 1346296 1625001 861860 402414
33842 402414 1279025 2638920 3243665 3289685 3408821 3066482 1634464 97963 -188357
33833 -188357 207093 -353192 -1895311 -2940479 -2975955 -2794257 -2459346 -1067053 1154514
33824 1154514 2502659 2218227 1608378 2015887 3027682 3440671 2889227 1846957 906419
33815 906419 519637 659324 543726 -428978 -1506165 -1451271 -471061 144517 264898 1047097
33805 1047097 2554824 3185259 2200780 1022757 981027 1410190 1203166 761177 928449
33796 928449 1210501 682857 -185634 -221703 501591 871185 519113 89977 3272 140009
33786 140009 539821 1304253 1969185 1958709 1487578 1135497 835400 233996 -313191 -210846
33776 -210846 220695 270709 275779 1134660 2422619 2545160 1123703 -243284 -242498 454479
33766 454479 618659 397127 638668 1158460 1060962 369244 -18737 87403 -120515 -978788
33756 -978788 -1707474 -1663301 -1326649 -1445332 -1865279 -1878206 -1294157 -533668 66772 478901
33746 478901 718680 853303 1085705 1398890 1390759 965940 829540 1552548 2403761 2058644
33736 2058644 478708 -874968 -905076 -36397 799625 1372343 1795555 1859409 1517988
33727 1517988 1396967 1956754 2594067 2402520 1497731 788235 672889 738582 586491 233139
33717 233139 -189721 -469022 -193864 705638 1445412 1162394 144410 -452250 -96289
33708 -96289 655367 1190307 1482203 1523546 1005867 50751 -400524 413952 1967961 2868613
33698 2868613 2313597 778386 -708762 -1622415 -2101666 -2296272 -2013703 -1213367 -429615
33689 -429615 -160630 -62700 536221 1419995 1694245 1305954 1261536 1954354 2452127 2120656
33679 2120656 1761271 2149581 2570405 2083907 1266657 1169970 1348926 684346 -379313
33670 -379313 -349664 765328 1369408 816424 151448 53847 -72287 -458533 -276141 654189
33660 654189 1149550 603818 120416 667080 1496868 1562146 1222942 1258253 1303704 716522
33650 716522 110170 474488 1302295 1101637 -378383 -1664662 -1360511 408088 2356361
33641 2356361 3283026 3047532 2637544 2977176 3592275 3203032 1771444 761806 906769
33632 906769 1186228 915404 1196472 2763859 3886520 2594566 61605 -675877 992386
33623 992386 2707329 2926755 2692732 3003485 2928715 1687972 590887 1114912 2403255
33614 2403255 2545867 1510869 946347 1444259 1775110 965200 -320844 -898479 -523297
33605 -523297 236501 832514 1010934 841231 855992 1665481 3054344 3909661 3494334 2459685
33595 2459685 2101404 2789690 3610779 3517413 2421411 1109445 431140 667429 1398708
33586 1398708 1840203 1530453 857825 751380 1702287 3194641 4181017 3995572 2802141
33577 2802141 1419833 790438 1274778 2275188 2864191 2963125 3427804 4625205 5540073
33568 5540073 5051801 3682824 3021273 3438071 3538353 2306191 749846 540810 1666214
33559 1666214 2531698 2241277 1675835 1948294 2647253 2431986 1061275 -111287 53073
33550 53073 905162 944477 -29073 -612110 286045 2110099 3592590 4189759 4004226 3067858
33540 3067858 1606591 484127 342651 568002 105153 -856438 -1011977 296038 2380758
33531 2380758 4198190 5051888 4464405 2597291 872160 858553 2287539 3441386 3718016
33522 3718016 4244704 5520762 6326314 5966599 5785328 6964859 8411890 8679010 8643363
33513 8643363 10095970 12825584 15842680 20744794 30164602 42007478 48705834 44740274
33505 44740274 33120439 21977031 15856413 12921284 10089383 7594493 7186091 8228346
33497 8228346 8121396 6058330 4174702 4432987 5914041 6286001 5019146 3719612 3556442
33488 3556442 3883046 3798059 3703222 4309731 5001966 4538210 3107384 2400077 3419282
33479 3419282 5197181 6069614 5494345 4206186 3210212 3113232 3943741 5059593 5529443
33470 5529443 5089953 4484699 4432770 4590156 4141707 3203716 2826007 3463816 4191843 3875361
33460 3875361 2634577 1626383 1659809 2525922 3487188 3889272 3416847 2350807 1587044
33451 1587044 1824742 2684816 3227838 3346156 3792824 4657312 4937853 4258029 3872315
33442 3872315 4846345 6154751 6093908 4990505 4665726 5342634 5182024 3445623 2090561
33433 2090561 2953891 4928712 5624958 4812798 4343834 5125251 6072892 6172220 5895325
33424 5895325 6022798 6358828 6393167 6345623 6735852 7465400 8052168 8439455 8945066 9587860
33414 9587860 9996547 9968155 9781033 9935056 10708291 11860001 12709597 12777577 12484763 12852691
33404 12852691 14211366 15541213 15557790 14271223 12996808 12908413 14051256 15708886 17135300
33395 17135300 17809537 17614389 17160495 17516528 19203476 21697892 24148560 26175088 27728276
33386 27728276 28848289 30156146 32917528 37652444 43060416 47403480 50804085 55081657
33378 55081657 61376965 69189566 77947273 88198772 100720645 115594752 132859856
33371 132859856 153151919 177104579 205092146 238220715 278499221 326890690 381218282
33364 381218282 435565813 480367791 503774794 496923151 461025592 408157080 352654927
33357 352654927 302027968 256996828 217526399 184951380 159048960 137293917 118175796
33350 118175796 102578508 90949382 81556291 72710163 64658595 58074706 52427195 47040493
33342 47040493 42273691 38544814 35467988 32819516 31014206 29822028 28033377 25257672
33334 25257672 22674855 21183042 20224598 19246232 18740050 18853162 18540753 17261030 16088506
33325 16088506 15986375 16326501 16219796 15906022 15734209 15305799 14829058 15657089 18034606
33316 18034606 19941948 19816393 18885978 19077881 20187801 21092366 22242233 24656069 27696154
33307 27696154 30290749 33363275 38503721 44982227 50700528 55633274 61666910 69118430
33299 69118430 75864841 80005937 81172731 79214454 73984274 66756659 59693927 53490090
33291 53490090 47431370 41863864 38264574 36439926 34126705 30352973 27043234 26054880
33283 26054880 26452498 26121157 24628636 23062929 22136139 21823315 22159153 23263307 25010893
33274 25010893 27321040 30186840 33027258 34903710 35853849 36977393 38584050 39363567
33266 39363567 38242109 36017236 34039601 32093195 28927189 24516921 20459879 17999925
33258 17999925 16673529 15295615 13575071 12156986 11389562 10779120 9855848 8972081 8647287
33249 8647287 8506297 7776815 6719493 6368393 6615704 5988955 4091080 2794626 3653483
33240 3653483 5305037 5208233 3220095 1520016 1342575 1796016 1974955 2261075 2995685
33231 2995685 3515588 3275492 2696489 2226912 1638515 892905 704038 1510200 2653686
33222 2653686 3246042 3241468 3075016 2756030 1934095 649107 -396750 -356937 932802
33213 932802 2584608 3390150 3088027 2491399 2229751 2130937 2147696 2783606 3909945 4381241
33203 4381241 3839416 3593915 4355259 4515856 2610023 244042 116144 1890565 2763415
33194 2763415 1831106 1031691 1535440 2060360 1528528 811852 761508 766170 471147 863176
33184 863176 2299531 3315979 2852672 2019507 2124095 2452380 1728625 570347 604100
33175 604100 1834711 2659250 2265538 1568436 1662486 2382684 2750485 2374775 1990828 2365764
33165 2365764 2805021 1680580 -952291 -2483149 -987963 1641650 1963620 -170343
33157 -170343 -1620013 -748931 692710 1037952 1024111 1384188 1002518 -612189 -1458889
33148 -1458889 55758 2280001 2761748 1912300 1719049 2141436 1561589 47889 -593770
33139 -593770 179214 1037191 1243217 1538886 2271128 2591865 2073485 1532442 1616917 1830981
33129 1830981 1567367 1105718 1005273 1245047 1440714 1389446 1093877 681335 521298 1091563
33119 1091563 2522420 4315093 5449113 4914728 2694549 311869 -352751 837218
33111 837218 2070648 1913304 1010820 846425 1655630 2511952 2876860 3009401 3110729
33102 3110729 2992616 2563385 2009876 1519198 1196882 1098619 1075154 864018 531913 447312
33092 447312 700761 1077159 1650233 2637403 3531057 3348054 2122839 1197401 1496576
33083 1496576 2377082 2742479 2455353 2035633 1754193 1671187 1877972 2118433 1821339 990433
33073 990433 392945 486767 895799 1203365 1344723 988122 -301794 -1899040 -2374461
33064 -2374461 -1431281 -312106 227748 859087 1882231 2151088 944482 -510558 -714141
33055 -714141 46539 559519 535198 353153 -9131 -548173 -693554 -359368 -501708 -1444397
33045 -1444397 -1814392 -538086 1215463 1635030 817548 94650 -274118 -955259 -1774165
33036 -1774165 -1898854 -1383625 -932267 -501872 356824 1174835 1100762 428265 135327 234008
33026 234008 29059 -317144 -14630 763740 1042388 734377 743871 1335918 1725992 1447320
33016 1447320 992131 900513 1107881 1301685 1235554 787328 298434 510704 1536375 2427409
33006 2427409 2478273 2233279 2320930 2160181 1020240 -414904 -933438 -639296 -482485
32997 -482485 -490280 4780 801114 1124983 1250674 2156431 3566106 3930527 2586185 565226
32987 565226 -975749 -1846718 -2089911 -1475571 -274562 488595 192607 -600117 -947052
32978 -947052 -605899 -6624 423964 614631 755627 1041336 1509559 2183249 3197245
32969 3197245 4379055 4871970 3931498 2138465 947452 876071 1085919 907779 632690
32960 632690 546434 507549 839547 2121833 3595425 3544228 2053136 1455063 2863423
32951 2863423 4244613 3545698 1846593 1345619 1821236 1526560 477121 283701 1283158
32942 1283158 2196514 2400401 2476516 2649833 2533710 2291476 2350654 2187336 1119303 63281
32932 63281 614457 2376176 3087751 1732140 -143301 -733079 -224819 -52415 -847847
32923 -847847 -1846193 -1905245 -697792 1007709 2185480 2581286 2618807 2517913 2251386
32914 2251386 2191775 2675289 2973848 2118485 821194 845772 2170894 2773344 1817397
32905 1817397 877773 1068897 1245026 395703 -325053 416436 1972559 3075008 3571530
32896 3571530 3425113 2000204 -133569 -800893 718822 2330404 2385149 1900379 1852989
32887 1852989 1129800 -574566 -779744 1960498 4860662 4674007 2389225 1024525 974060
32878 974060 865508 908722 1847276 2426727 1393512 290554 958370 2186672 2203346
32869 2203346 2222080 3747563 4756035 2921632 466781 982110 3204023 3050564 491934
32860 491934 -842166 19102 691653 520962 1268683 2924884 3616009 3531093 4411043
32851 4411043 5536867 4905454 3868408 5511264 8665952 8875292 5564782 3014534
32843 3014534 3573011 4899502 4813588 4184443 3954029 3483621 2765551 2611847 2371126
32834 2371126 1066414 347130 2208777 4583600 3935567 1442529 1336151 3727823 4784105
32825 4784105 3689415 3414286 4520250 4340369 2718234 2515480 3889741 4032711 3040326
32816 3040326 3956768 6579337 7479596 6524305 6848465 8085238 6643703 3184391 2435792
32807 2435792 4839779 5962910 5027747 6017029 9210895 10019300 7730360 6942959 8751332
32798 8751332 9357337 9018570 12673106 19379820 21255126 16050156 10873045 10149974 10072946
32789 10072946 8401558 8916640 12047856 12129643 8455608 7860000 11946214 13799433 11810311
32780 11810311 13231323 18896223 19713332 14900619 16642603 27861907 34144566 29927786
32772 29927786 32762678 53970706 73009023 63224251 30752767 6202812 7153483 28219093
32764 28219093 57845050 86013596 108499219 144015294 227635849 354961194 449272129
32757 449272129 429049202 307285799 181705135 121376322 105448080 84655799 55028579
32750 55028579 40898659 41885320 37263411 24777696 19283128 21592427 18460365 8893881
32742 8893881 4984978 8623396 9235893 4030257 1412251 3983122 4875153 1911324
32734 1911324 802412 3113691 3755362 1384140 145236 734968 -58650 -1288485 782218
32725 782218 4017555 2917884 -1076906 -1536853 1574525 2305568 -132065 -598636 1660618
32716 1660618 1810109 -885077 -1643756 454051 679322 -2226931 -3631327 -1620524 -176353
32707 -176353 -1556023 -2666792 -1355705 124189 122867 223584 931726 179552 -2115755
32698 -2115755 -3041673 -1707229 -581280 -782207 -644618 285643 452634 1589 692774
32689 692774 1891865 1380363 111025 1039472 3262183 2813678 -479994 -2601463 -2219313
32680 -2219313 -2159006 -3291323 -2923135 -529245 696933 -388858 -1033919 -144405 -246691
32671 -246691 -2028861 -2326351 146105 2112678 1300885 -5646 431214 1079263 236043
32662 236043 -716558 -416697 -211582 -1137281 -1625840 -634341 246762 50020 445260 2263125
32652 2263125 3367228 2353500 1130796 1379599 1560326 20517 -1780365 -1776853 -566249
32643 -566249 200856 444333 642114 499795 439408 1960145 4781287 6223054 5141323
32634 5141323 3718579 3653121 3697165 2986065 3400071 5928081 7862747 6810447 4807657
32625 4807657 5069964 6937091 7579392 6855299 6799093 7570815 7506845 6514026 6216001 7057938
32615 7057938 7992002 8776098 10159729 12006167 13399189 14400854 15784928 17377801
32607 17377801 18536193 19843421 22375036 25624383 28181022 30294524 33656548 38444652
32599 38444652 42593290 44625106 45543317 47006668 48885558 49766857 49144765 47861777
32591 47861777 46486850 44400777 41010837 37087356 33925754 31513158 28746021 25508592
32583 25508592 23035707 21676553 19957746 16966595 14040775 12511102 11298571 8832250
32575 8832250 6085931 5251397 6277043 7295545 7798735 8644398 9426470 8830596 7420278
32566 7420278 7033827 7419609 6616223 4797086 4299768 5334400 5250506 3038465 1036861
32557 1036861 862119 1099604 631908 800958 2238923 2842226 1317260 -219875 221238
32548 221238 1124390 429972 -657280 55723 1768184 2223223 1587130 1609253 2196865
32539 2196865 1906928 874662 377573 301828 -270234 -756397 -22692 1106129 974899
32530 974899 143076 591577 2255563 3010609 2029000 705773 182078 150093 225506 520348
32520 520348 756338 542397 416270 952014 1245142 179718 -1272999 -1209292 64161
32511 64161 401100 -735681 -1635374 -1362748 -974270 -1177194 -1120350 -391304 -134054 -1080269
32501 -1080269 -2188558 -2348875 -1978818 -1888802 -1903045 -1649388 -1502142 -1696963 -1626133 -1065518
32491 -1065518 -1011035 -2084151 -3065025 -2462010 -931174 -551876 -1801244 -2751438 -1716911
32482 -1716911 445847 1515334 762078 -371819 -403900 334189 488934 -315271 -1157121
32473 -1157121 -1319915 -1165834 -1316818 -1774205 -2211993 -2468921 -2377770 -1760309 -965492 -718062
32463 -718062 -1041730 -1114852 -634772 -390790 -871156 -1344592 -1206707 -1201021 -2123855 -3220924
32453 -3220924 -3308888 -2817431 -3079146 -3933816 -3775071 -2067565 -222107 450431 321474
32444 321474 387239 712628 701903 238979 -190063 -230145 -24641 61051 -130802 -382018
32434 -382018 -397530 -276014 -376062 -606720 -377780 428523 1046631 883073 354691 56580
32424 56580 -206921 -736150 -999837 -499519 -3617 -573503 -1661816 -1654719 -338760 624616
32414 624616 30513 -1361182 -2213563 -2388901 -2536936 -2705028 -2301274 -1162522 39039
32405 39039 487283 56588 -532462 -400460 492857 1189317 879106 -25217 -461325 -151463
32395 -151463 226256 228172 192653 416493 539422 160924 -445418 -675852 -359652 145575
32385 145575 405773 230779 -247629 -613713 -459515 161089 672222 539362 -126910 -643329
32375 -643329 -478051 173665 707889 997036 1554742 2527666 3027484 2212268 746284
32366 746284 158725 731212 1160739 586028 -307056 -763303 -1205965 -2027991 -2351378 -1377574
32356 -1377574 -110157 -168731 -1383615 -2112234 -1682805 -1021631 -943546 -1267052 -1648457
32347 -1648457 -1878889 -1284863 633330 2686496 2710479 420489 -1854617 -2101948 -1051127
32338 -1051127 -715163 -1602975 -2590132 -2817096 -2408409 -1609491 -397109 939205 1633746
32329 1633746 1152878 -230423 -1627321 -2195791 -1805194 -1167662 -1061482 -1396157 -1466088
32320 -1466088 -1120809 -980397 -1290884 -1396597 -839145 -221285 -286913 -761235 -919313 -838203
32310 -838203 -1168738 -1911950 -2329399 -2036482 -1423787 -958546 -707251 -562829 -354192 220091
32300 220091 1123258 1531375 666907 -867298 -1508083 -762932 90623 -182623 -1135343
32291 -1135343 -1529468 -1131750 -681599 -562618 -554043 -667009 -1162452 -1741233 -1710145 -1085259
32281 -1085259 -619266 -593273 -562416 -488529 -933595 -1671020 -1416757 198310 1616965 1495191
32271 1495191 732240 837561 1253409 340943 -1481516 -1971356 -591483 590002 279211
32262 279211 -59830 1055494 2432793 2185811 940908 796221 1876758 2221076 889207
32253 889207 -914372 -1963026 -2347926 -2317002 -1573945 -438978 -137290 -975084 -1508014
32244 -1508014 -618898 614389 386157 -1185576 -2202708 -1556604 -199999 292630 -357219
32235 -357219 -975671 -386740 1163601 2108800 1317697 -405295 -1237962 -746653 -308773
32226 -308773 -770650 -1074519 -280903 363778 -808035 -2852122 -3213878 -1662435 -778016
32217 -778016 -1880093 -2900995 -1756019 276876 704401 -148923 79595 1633005 2098996
32208 2098996 308300 -1789927 -2101064 -1164482 -644130 -651949 -171948 857179 1446985
32199 1446985 1074805 128318 -800286 -1197010 -690506 367264 942539 662752 374460
32190 374460 604813 509747 -534448 -1412884 -891991 185006 157674 -748978 -1095994 -1067686
32180 -1067686 -2135494 -3931615 -4179468 -2361096 -842268 -1194866 -1802311 -764556 884650
32171 884650 950842 -423968 -1264926 -826961 -13348 698033 1671901 2628587 2597626 1502112
32161 1502112 335577 -326742 -677877 -558607 552899 2207970 3022965 2485931 1581110
32152 1581110 1184313 968891 490421 296706 1090261 2471123 3370595 3350068 2773991
32143 2773991 2005974 1144186 424587 185004 261734 -94788 -1362497 -2983778 -3785152
32134 -3785152 -3214344 -1944064 -1100607 -1064219 -1274572 -1093516 -498150 70979 167046 -411528
32124 -411528 -1420617 -2102643 -1729001 -410800 938110 1557290 1434179 959641 511156
32115 511156 428264 768138 958512 421141 -274434 202084 1969968 3323959 2824738
32106 2824738 1157097 -13127 -296232 -546561 -1075458 -1230250 -707544 -95437 156782
32097 156782 413772 1131659 2064413 2520395 2055792 779639 -724491 -1781307 -2248575
32088 -2248575 -2663603 -3398055 -3859693 -3113883 -1286507 254235 353473 -645941 -1330504
32079 -1330504 -788276 446406 1082887 601517 -260191 -759797 -1334987 -2734664 -4299675
32070 -4299675 -4393701 -2778417 -1232111 -1144482 -1726855 -1584332 -922687 -826905 -1176483 -901179
32060 -901179 50242 575721 234652 -202820 -181986 -98313 -323241 -558643 -485066 -165179
32050 -165179 412411 1283312 1815785 1085098 -713734 -2179865 -2450654 -2128382 -2033804
32041 -2033804 -2052470 -1909361 -2111357 -3068130 -3914599 -3405944 -1744724 -384421 1430
32032 1430 237860 1014861 1607789 1021697 -311352 -1067089 -988217 -1106644 -1837665 -2094302
32022 -2094302 -1011511 484800 975716 738412 1220901 2576334 3256344 2299843 639941
32013 639941 -389143 -643798 -618700 -412515 -86056 -164028 -892429 -1668317 -1954664 -2065604
32003 -2065604 -2320457 -2201653 -1231499 -17114 473465 126684 -562025 -1247756 -1472459
31994 -1472459 -520764 1382052 2473896 1315621 -1200103 -2815493 -2495796 -1055788
31986 -1055788 320137 1084765 1188825 933276 750946 533663 -242444 -1213439 -1087569
31977 -1087569 185711 593669 -1151080 -3300142 -3380999 -1714466 -526202 -479446 -492942
31968 -492942 -378994 -1021089 -2100838 -2242955 -1541087 -1463039 -2035832 -1679723 -251989
31959 -251989 374343 -529117 -1381618 -1186657 -1005521 -1395050 -1020044 587158 1393871
31950 1393871 39586 -1529346 -968698 676077 705321 -954078 -1916691 -1129262 85384
31941 85384 604611 808592 1087771 996793 384603 -96625 -85947 -4235 -129207 -167441
31931 -167441 -27734 -122046 -563425 -783410 -296584 631614 1314329 1320555 733297 -15869
31921 -15869 -532279 -766800 -821559 -516742 394410 1529804 2035667 1673079 1103910 814648
31911 814648 497865 -83657 -421796 -96825 372890 262518 -231922 -298716 364265 1311938
31901 1311938 2000364 2203339 1959452 1425683 686739 -280993 -1201055 -1366020 -587325
31892 -587325 49002 -576258 -1790041 -1858371 -579767 384668 96272 -414982 -182167
31883 -182167 66305 -607358 -1593758 -1709977 -915784 21356 632765 616123 -296456 -1409486
31873 -1409486 -1266516 178428 1020765 279933 -329999 771713 2067330 1176890 -1093084
31864 -1093084 -1690144 137692 1933166 1792642 617790 111758 576159 1370010 1893717
31855 1893717 1524523 62900 -1277526 -828958 1081342 2167264 1262653 -195345 -541178
31846 -541178 -164672 -278457 -749894 -637884 -19738 265237 271067 845007 1861270 1923029
31836 1923029 356080 -1464325 -1666343 -374848 326193 -903718 -2899134 -3634126 -2970759
31827 -2970759 -2566378 -3217356 -3771702 -3117079 -1834312 -993265 -534789 -10695 151889
31818 151889 -421994 -713390 424578 2168736 2618559 1533474 464149 239714 115017
31809 115017 -396050 -629074 -220905 134425 45112 135340 681058 848315 131414 -632061
31799 -632061 -606378 -267298 -383984 -649593 -450560 -219167 -727202 -1462749 -1027113 822730
31789 822730 2568038 2678784 1349075 129194 97461 704647 529774 -882655 -2278365
31780 -2278365 -2120553 -485742 1063799 1377304 739363 -38005 -667425 -1174414 -1369199
31771 -1369199 -1076448 -480304 138622 662055 913309 642201 -9319 -462814 -358013
31762 -358013 134785 712212 1082959 717751 -664539 -2117168 -1990172 -39710 1874550
31753 1874550 2009916 917492 431046 1083630 1752730 1638745 1267349 1248912 1160677 347944
31743 347944 -826512 -1333110 -866227 -215400 -165109 -512748 -465043 254555 1078412 1346832
31733 1346832 1036714 624059 532718 938820 1825758 2852993 3326224 2744755 1436761
31724 1436761 365697 236365 924608 1689003 1743493 783180 -745290 -1985765 -2544101
31715 -2544101 -2853768 -3374194 -3702361 -3026862 -1379508 139653 514644 -166059 -915040
31706 -915040 -831358 61917 745182 171221 -1420708 -2530101 -2194000 -1312204 -1435772
31697 -1435772 -2577342 -3201376 -2309396 -521283 1037030 1924407 2175632 1866427 1394469
31688 1394469 1437408 2089377 2635787 2623857 2485880 2579183 2341251 1200493 -192524 -598231
31678 -598231 129577 887199 915948 748992 1202023 1991800 1994538 786555 -649117 -1044809
31668 -1044809 -337256 440238 587083 367056 120202 -372797 -1117880 -1353576 -688562
31659 -688562 -119104 -684328 -1553172 -992398 822415 1723712 763081 -228100 658600
31650 658600 2594899 3394405 2693590 1984498 1941180 1595655 351042 -867339 -1155299
31641 -1155299 -1047057 -1439732 -1982749 -1663046 -558525 141635 -129684 -560007 -246193
31632 -246193 558678 1037120 1070086 1158520 1342294 1015197 -76580 -1285429 -1757257 -1259683
31622 -1259683 -188357 789159 993562 246946 -634326 -502538 617950 1373412 897492
31613 897492 32826 24395 689305 866213 231031 -407803 -420627 41196 670761 1292123
31603 1292123 1528151 1077776 415589 452876 1411624 2620823 3302671 2956655 1380423
31594 1380423 -746394 -1727095 -595004 1199458 1305534 -314740 -1302625 -324074 1162587
31585 1162587 1319304 523449 370523 1230768 2099149 2195713 1604748 777482 265808 532115
31575 532115 1335913 1778576 1523531 1358711 1949519 2735209 2767827 1968082 808829 -538748
31565 -538748 -1886925 -2525505 -2029358 -1124415 -835815 -1126987 -1178753 -639726 146828 738374
31555 738374 701465 -349389 -2025067 -3014543 -2528694 -1367288 -683174 -353294 314409
31546 314409 907486 400318 -959035 -1717742 -1221296 -309722 76353 -151335 -748187
31537 -748187 -1473256 -1781212 -1298118 -745992 -1226282 -2405011 -2727257 -1815872 -1226164
31528 -1226164 -2042925 -3038186 -2404161 -422191 941622 679378 -279562 -672197 -415848
31519 -415848 -286212 -821559 -1862778 -2754183 -2796657 -1813612 -384588 742544 1469913
31510 1469913 2212771 2950372 3020967 2196363 1374890 1476960 1953678 1395748 -241731
31501 -241731 -1142289 -49249 1749726 2011678 544748 -803094 -978634 -870805 -1233137
31492 -1233137 -1152280 322068 2247133 2888180 2070967 1103041 740541 526165 41240
31483 41240 -356673 -209467 456984 1346221 2086218 2275511 1917128 1610969 1695713 1551616
31473 1551616 578234 -504125 -429552 665428 1244929 481235 -686541 -907209 20072
31464 20072 1233751 1730363 967062 -768021 -2390692 -3014195 -2900582 -2740731 -2238046
31455 -2238046 -571651 1725259 2799921 1929394 673745 754540 1763705 1939738 542392
31446 542392 -1471489 -2698146 -2440012 -972925 641643 1243562 594435 -453929 -1011086
31437 -1011086 -937980 -457807 265120 810213 621794 1516 115738 1280298 2100063
31428 2100063 1285845 -423858 -1326705 -1156100 -1043127 -1380865 -1262219 -240853 731933
31419 731933 725237 179179 101773 565477 761966 253909 -464469 -630760 -57099 746133
31409 746133 1099943 729621 -137153 -1100470 -1837529 -2089104 -1762019 -1173249 -830867 -783424
31399 -783424 -597085 -225671 -370676 -1505837 -2996743 -3756441 -3402172 -2213250 -449226
31390 -449226 1484106 2628521 2320273 1332530 1094595 1697349 1782672 725074 -195505
31381 -195505 494809 2375373 3641988 3334796 2240893 1624902 1732514 1848476 1533349
31372 1533349 1308859 1837941 2715200 2803468 1945860 1433821 2085884 2733651 1817177 -118071
31362 -118071 -1098870 -694777 -491412 -1298793 -1783951 -777922 712613 1091688 482583
31353 482583 6208 -209232 -689271 -1038107 -440021 631999 866388 155844 -344095
31344 -344095 -194782 -167149 -548239 -491447 380905 996054 236264 -1491566 -2753869 -2639882
31334 -2639882 -1443745 -278157 -176091 -1092272 -1840628 -1574355 -981373 -1122948 -1579515
31325 -1579515 -1168839 -221027 -296209 -1480021 -1981681 -1056702 -301556 -960163 -1857899
31316 -1857899 -1512401 -616602 -571552 -890822 -170578 1246753 1727481 985035 256231
31307 256231 83414 -201994 -857290 -1326816 -1468713 -1596715 -1374369 -313625 719392
31298 719392 330061 -996425 -1223674 239608 1817219 2429158 2783929 3319704 3041254
31289 3041254 1590246 496197 818894 1180811 -111864 -2271744 -3167148 -2323492 -1055785
31280 -1055785 -320064 -90488 -321621 -932680 -1218987 -700790 -147111 -420088 -886504
31271 -886504 -505649 138883 -222206 -1007982 -412002 1401623 2072453 613275 -1008390
31262 -1008390 -931991 -57956 -93642 -557490 236108 2071809 2839030 1566940 -312918
31253 -312918 -1118921 -973901 -1048915 -1690307 -2131003 -1661920 -410676 945712 1769317
31244 1769317 1738151 907672 -300178 -1301357 -1721374 -1571663 -1041161 -294929 339245
31235 339245 259174 -765540 -1827861 -1528082 197898 1610329 1287699 146096 225393
31226 225393 1710701 2565175 1455847 -305150 -621386 571979 1563137 1435105 1043407
31217 1043407 1341253 1874267 1516945 97181 -1328204 -1646537 -777639 350441 731123
31208 731123 235456 -291824 24136 1059191 1786633 1429305 307936 -517098 -237872
31199 -237872 1107269 2704223 3440720 2644757 734123 -985088 -1492579 -966170 -291086
31190 -291086 94078 365628 507598 157604 -490356 -433244 831543 2255574 2318648 950083
31180 950083 -422853 -685715 -75240 680921 1360678 1978399 2287444 2200644 2223573 2795641
31170 2795641 3490141 3512909 2838163 2247759 2295867 2763113 3108890 2940186 2025759 436159
31160 436159 -1157380 -1859294 -1538155 -1034615 -1035471 -1125192 -483650 702335 1247411 551056
31150 551056 -480502 -629539 -96646 -238674 -1531004 -2624883 -1972104 155840 2028765
31141 2028765 2586586 2353931 2201027 2105367 1572564 598666 -401720 -1197252 -1655464
31132 -1655464 -1377108 -117108 1529189 2519160 2510177 2085762 1780444 1493100 1113582
31123 1113582 1108919 1897554 2933558 3077264 1923970 259996 -941373 -1489853 -1670830
31114 -1670830 -1502241 -926537 -447007 -704687 -1330832 -1099461 361802 1805558 1976909
31105 1976909 1303822 1038317 1227939 805766 -410711 -1215974 -921014 -519917 -1138652
31096 -1138652 -2227239 -2346869 -1257519 -123823 246194 341240 846330 1378833 952903
31087 952903 -543575 -1962088 -2212457 -1600266 -1329647 -1729242 -1715102 -451647 1144155
31078 1144155 1459598 402150 -534625 -422211 26815 -138019 -701567 -930484 -809222
31069 -809222 -851795 -1184745 -1493435 -1536136 -1217795 -534576 133690 125874 -684064 -1645770
31059 -1645770 -2263657 -2717091 -2984889 -2294348 -321128 1683129 2059095 819998 -380874
31050 -380874 -305446 668428 1444513 1559500 1380318 1395068 1606298 1595278 1158530 684958
31040 684958 523768 183432 -1006493 -2354961 -2071567 304482 2738629 2947582 1157871
31031 1157871 -390763 -246569 942634 1631176 955167 -770845 -2385247 -2764448 -1872791
31022 -1872791 -759582 -263378 -267671 -525041 -1255616 -2251186 -2427571 -1312134 -88447
31013 -88447 9105 -518183 -572430 -482105 -1199454 -2164382 -1956632 -803666 -394832 -1110311
31003 -1110311 -1431962 -517894 521570 616125 315706 437308 553564 -3899 -634452
30994 -634452 -186531 1278083 2372196 1922113 173426 -1434944 -1614935 -539015 400822
30985 400822 429323 353011 998394 1572758 929154 -239107 -300160 552397 549388 -564866
30975 -564866 -1003196 -82996 443613 -621019 -1741777 -1161983 120474 -41571 -1494498
30966 -1494498 -2146185 -1266980 -306904 -343084 -558256 140453 1323767 1755970 1198098
30957 1198098 586609 563259 603544 -21064 -895608 -903964 -51164 218018 -831480 -1762775
30947 -1762775 -826819 1453368 3037415 3223701 3051545 3102552 2843299 2266839 2156106
30938 2156106 2273781 1326324 -561344 -1377780 -225626 1188090 1293905 930232 1312444
30929 1312444 1628091 715690 -343468 322590 2208682 2998043 1873977 262986 -483970
30920 -483970 -326398 414187 1508329 2255513 1938884 966159 380982 312615 60979 -481843
30910 -481843 -744131 -616841 -403878 164437 1474131 2708691 2513937 1101486 217359
30901 217359 726420 1626391 1880547 1836767 2116527 2293910 1676723 648696 228967 638976
30891 638976 1142033 1215162 1167626 1389929 1509657 866364 -256247 -642760 127824 694321
30881 694321 -316305 -2011774 -2230364 -755222 275698 -388130 -1428089 -1489489 -1374255
30872 -1374255 -2092276 -2543463 -1365945 212891 -82411 -1911965 -2771739 -1812451 -675517
30863 -675517 -471570 -446146 -102277 -240253 -1018065 -1099928 109854 1134888 589256 -739348
30853 -739348 -1228292 -686729 -54014 210167 204560 -213458 -1102082 -1754415 -1387226 -292318
30843 -292318 468636 351278 -240478 -605903 -382706 295761 960366 1227579 1115177 754154
30833 754154 15969 -1082207 -1880922 -1763298 -1171380 -1031705 -1263793 -922687 135625
30824 135625 902839 756086 198618 -230510 -592689 -733649 -172949 597791 124819 -1754331
30814 -1754331 -2980322 -1878967 337883 1162896 142479 -1003671 -1207221 -1200663 -1706551
30805 -1706551 -2175446 -2025795 -1837934 -2285192 -2714591 -1970210 -260994 950508 924074
30796 924074 425665 262730 118872 -487073 -1049246 -945246 -749947 -1343318 -2172235 -2016397
30786 -2016397 -1294371 -1665387 -3098681 -3533250 -2241195 -1208668 -1748375 -2044621 -234356
30777 -234356 2068227 2138764 568927 69312 705401 -46230 -2503514 -3695750 -1933864
30768 -1933864 717314 1796550 1505452 1004936 270182 -639221 -492693 1003524 1992216
30759 1992216 1280859 502441 1407051 2769586 2354958 520822 -641219 -652501 -603647
30750 -603647 -624934 -25383 559021 -205313 -1728911 -2039512 -1032304 -680808 -1612042
30741 -1612042 -1972325 -603869 899392 690329 -505281 -703392 277639 701294 -571417
30732 -571417 -2727936 -4116971 -3901687 -2590735 -1445824 -1395374 -2241644 -2901638 -2484715
30723 -2484715 -1089174 340536 762341 -144576 -1581190 -2236307 -1631504 -620353 -201655
30714 -201655 -240414 73125 884855 1558463 1688373 1472878 1165712 832480 569423 344976
30704 344976 -215815 -1225072 -1928314 -1496979 -268056 652770 903556 1046648 1288179
30695 1288179 1087071 242189 -618176 -980333 -1045818 -1061613 -881444 -600164 -830286 -1814223
30685 -1814223 -2873695 -3211603 -2718372 -1641281 -161235 1229286 1692624 1102875 540395
30676 540395 958274 1859747 2154418 1876196 1966452 2527661 2500727 1323863 -142762 -864824
30666 -864824 -963325 -1119738 -1320787 -1075551 -524692 -390642 -836806 -1163527 -772576 197444
30656 197444 1308313 2248741 2689030 2430231 1940756 1986147 2395576 2058345 651436
30647 651436 -583940 -566777 67067 185474 47717 575873 1414619 1386962 540429 -20740
30637 -20740 -218181 -1018922 -2241536 -2379348 -1130675 -98198 -160564 -146495 762568 1322124
30627 1322124 470606 -545955 -252233 369200 -460358 -2080599 -2305337 -953386 29749
30618 29749 -225149 -614716 -490472 -592858 -1056703 -766232 366439 512487 -1338128
30609 -1338128 -3331536 -3034033 -758172 962646 696275 -528515 -1074716 -680057 -247817
30600 -247817 -412239 -879379 -1054379 -902918 -886305 -1117631 -1069220 -397330 375432 464771
30590 464771 -204929 -1077698 -1638340 -1544192 -631426 529494 666751 -673629 -2104707
30581 -2104707 -1954596 -498526 492206 157338 -710371 -1141629 -904160 4098 1427374
30572 1427374 2520453 2433548 1665169 1473650 1873711 1655813 560609 -206477 -88530
30563 -88530 -160160 -1237268 -2463492 -2692464 -2038660 -1164531 -193032 770876 1165116 956718
30553 956718 1045223 1771890 2123617 1398339 531992 634778 1258264 1356172 1021233 963598
30543 963598 1105296 1029446 1065404 1563475 1792872 976036 -210449 -627787 -587870 -1205334
30533 -1205334 -2279272 -2498542 -1594087 -689359 -470053 -427271 -34831 563954 1110102
30524 1110102 1337109 607009 -1341779 -3358222 -3862553 -2842253 -1644629 -943870 -346268
30515 -346268 121914 -130149 -733327 -458344 693550 1167701 246793 -841828 -986265
30506 -986265 -800776 -1197026 -1781887 -1866096 -1858043 -2353988 -2799938 -2374432 -1483873 -1148796
30496 -1148796 -1459924 -1743312 -1755354 -1698347 -1522790 -1144976 -867416 -746791 -191271 907810
30486 907810 1456225 749354 -1602 761200 2384601 2725249 1268084 -190387 -161848
30477 -161848 824450 1577072 1862665 1963676 1789442 1300761 1023456 1343354 1854233 2051201
30467 2051201 2158126 2632124 3248678 3306548 2533924 1323616 220040 -469840 -676341
30458 -676341 -490560 -126163 107905 -144297 -998886 -1904109 -1889428 -711697 578695
30449 578695 813921 109211 -664360 -1394634 -2571975 -3796054 -3886429 -2801783 -2069751
30440 -2069751 -2642557 -3520392 -3355235 -2359957 -1578238 -1135416 -443362 438745 923030
30431 923030 1084429 1545131 2233734 2322103 1528110 633368 479853 1021538 1509767 1245362
30421 1245362 209289 -734473 -550802 652959 1500846 1131158 513080 1054659 2392633
30412 2392633 2813602 1707544 278123 -312204 -197751 150613 846504 1825465 2215361
30403 2215361 1446141 325034 17180 323723 -69217 -1687614 -3420086 -3770974 -2457534
30394 -2457534 -497563 988628 1716771 2025681 2123595 1929790 1554264 1352464 1284235
30385 1284235 819403 -63063 -421564 312402 1072782 378775 -1356276 -2034145 -663833
30376 -663833 1236579 1634422 449182 -766487 -972240 -556888 -324296 -345693 -44797
30367 -44797 852047 1723612 1660355 720366 92100 562070 1353184 1288525 634582 598140
30357 598140 1206408 1161983 32800 -887466 -493874 639891 1402668 1577358 1302498
30348 1302498 297658 -1290122 -2280768 -1939675 -1283005 -1658677 -2681896 -2899961 -2008320
30339 -2008320 -1016921 -499400 -77408 378703 338478 -364130 -1100275 -1307946 -1037039 -522749
30329 -522749 42161 205496 -528513 -1946008 -3115319 -3320270 -2681802 -1884359 -1611775
30320 -1611775 -2100221 -2884820 -3166258 -2702774 -2009816 -1460304 -808822 19969 502779
30311 502779 509388 809010 1691111 2035052 1002698 -170046 347239 2206455 3272311
30302 3272311 2597333 1358114 814329 944693 1289284 1596027 1339583 108480 -1164756
30293 -1164756 -906761 662035 1396144 294340 -849607 27569 2357057 3868794 3510298
30284 3510298 2098574 656514 -553340 -1484937 -1877165 -1570233 -777717 10034 313643
30275 313643 185614 441483 1679575 2956533 2453497 -26335 -2221031 -1926134 367175
30266 367175 2262796 2345527 1316463 592915 750909 1323547 1428408 550945 -852193
30257 -852193 -1626196 -1152954 -96427 432432 117845 -576243 -1235797 -1669320 -1542574
30248 -1542574 -614266 652909 1331639 1009711 116023 -777203 -1513837 -2049198 -2029344
30239 -2029344 -1119913 318821 1287056 1095017 77745 -900970 -1512124 -2095773 -2760260
30230 -2760260 -2979437 -2377775 -1368991 -608002 -291748 -383628 -889606 -1364485 -884815
30221 -884815 669394 1963211 1779452 621603 -276837 -799088 -1464488 -1827607 -1122847
30212 -1122847 -105792 -264159 -1217794 -960534 960355 2484107 1902836 -55020 -1719902
30203 -1719902 -2430664 -2254165 -1364767 -538969 -791763 -1765030 -1969697 -1234532 -1099997
30194 -1099997 -2024495 -2322083 -1059473 142403 -230196 -1144622 -1081292 -631623 -925474
30185 -925474 -1182882 -210170 1078885 1082801 219770 -250669 -866607 -2665689 -4327619
30176 -4327619 -3725535 -1687840 -1000728 -1958840 -2223317 -1158816 -809828 -1896749 -2271898
30167 -2271898 -708431 765925 93198 -1662654 -2264337 -1469700 -402483 648357 1935932
30158 1935932 2922931 2910598 2190231 1339619 255444 -1075414 -1875849 -1720392 -1344403
30149 -1344403 -1276400 -784772 652785 1935969 1737772 451889 -500038 -520045 128251
30140 128251 1204625 2155357 1830546 17130 -1510643 -1052753 507088 926191 -99410
30131 -99410 -721947 29158 931934 794536 327039 774200 1764811 1767501 332846 -1176926
30121 -1176926 -1304549 -308477 266830 -332009 -1108815 -828863 127061 367293 -274076
30112 -274076 -358839 974362 2642142 3132988 2414448 1456292 700503 83839 -42360
30103 -42360 739063 1877693 2283709 1781862 1235517 1191799 1250744 952746 573953 690465
30093 690465 1335979 1881829 1658810 641803 -481542 -1030302 -1020822 -828892 -365547 707040
30083 707040 1947519 2269310 1414514 380205 -45133 -178976 -328774 61823 1234295
30074 1234295 2162898 1994582 1557980 2050427 2937999 2745262 1482694 597251 652165
30065 652165 730837 259790 -188629 -240817 -350521 -575880 -151804 1011961 1690170 1098068
30055 1098068 229409 428413 1441631 1957119 1516804 833544 516868 449879 344705
30046 344705 140703 -167073 -526828 -683566 -518260 -445449 -939627 -1701022 -1890366 -1340555
30036 -1340555 -977543 -1653502 -2902138 -3359975 -2369697 -698276 465082 764210 581431
30027 581431 120756 -713561 -1647142 -2081847 -2013653 -2116531 -2560755 -2609899 -1992473 -1740930
30017 -1740930 -2630948 -3535155 -2770894 -783529 114708 -1104804 -2781243 -2903394 -1599879
30008 -1599879 -422122 -109214 -151902 -35534 178344 409215 863844 1615014 2279746
29999 2279746 2279167 1426326 386567 331655 1553862 2568939 1624503 -663885 -1456325
29990 -1456325 715541 3651987 4105658 1899414 -215333 -445728 187653 147964 -323611
29981 -323611 -192014 456332 808627 841039 1096967 1371328 961324 174451 299851 1744081
29971 1744081 3248308 3526683 2876401 2458734 2591122 2621479 2190843 1691168 1422901
29962 1422901 1110356 559030 180946 406043 947226 1145289 864490 568623 524615 387079
29952 387079 -207144 -906897 -897071 41654 1017223 919894 -215978 -1201438 -1223322 -824640
29942 -824640 -836004 -899198 -101209 1121755 1126635 -446927 -1717069 -1114830 244992 256719
29932 256719 -870153 -949783 618827 1733916 758594 -1020093 -1441103 -645858 -451646
29923 -451646 -1240503 -1404835 16549 1822670 2396919 1775025 1148330 1123339 1395473
29914 1395473 1671914 1948047 1972953 1327912 287096 -48703 1013599 2646938 3151697
29905 3151697 1834432 -63410 -588400 827841 2738385 3221335 1847801 -42194
29897 -42194 -838640 -143386 1173690 2011733 1950368 1351507 826453 640114 586431 426641
29887 426641 319655 610708 1229903 1609855 1331144 614794 24863 -95576 247862 826583
29877 826583 1189685 872882 15309 -501018 -50590 787148 912466 244711 -199003 144105
29867 144105 637418 627357 490905 801805 1154177 754895 -228698 -908306 -1061082 -1271124
29857 -1271124 -1706785 -1772791 -1181908 -462786 -86590 100541 235954 55177 -414227 -585012
29847 -585012 -301485 -332979 -1173423 -2014884 -1741523 -453808 797149 1354771 1239703
29838 1239703 567263 -361261 -750595 -152843 589397 314762 -656070 -831537 304723
29829 304723 1629335 2057317 1727810 1181300 518063 -96920 -183291 120260 -132001 -1155245
29819 -1155245 -1647865 -523152 1326247 2069076 1206436 -206115 -1107428 -1142827 -286736
29810 -286736 1046572 1796013 1374887 815099 1522726 3026180 3446048 2305317 1198548
29801 1198548 1166361 1144213 50653 -1155321 -1057721 -292838 -605408 -1988885 -2747522
29792 -2747522 -2315875 -1989566 -2396112 -2216858 -559034 1009726 510756 -1292851 -1750032
29783 -1750032 -113147 1478941 1270249 347729 641234 1750217 1544352 -455283 -2116211
29774 -2116211 -1557972 453510 1866112 2033834 1792464 1472700 454355 -1150203 -1876637
29765 -1876637 -810913 873343 1359271 614335 198097 837830 1458888 928774 -321804
29756 -321804 -1068353 -881448 -128182 1023249 2539154 3657005 3235655 1298252 -627298
29747 -627298 -1247373 -983702 -1095985 -1790991 -2060914 -1330477 -402917 -402164 -1323556 -2162932
29737 -2162932 -2247609 -1904853 -1779270 -1930710 -1888504 -1433492 -1017226 -1289867 -2302558 -3321825
29727 -3321825 -3513792 -2766979 -1722799 -997238 -574868 -109599 394745 568060 314368
29718 314368 37762 27454 -13073 -457202 -1038350 -1134527 -664689 -155832 115920 451175
29708 451175 984965 1231764 816847 169669 -110415 -227398 -800844 -1663811 -1852824 -922833
29698 -922833 396691 1093904 889117 159050 -580435 -837213 -369432 358282 475779
29689 475779 -88411 -259123 727715 2034628 2199275 1083907 -35030 -192065 336096
29680 336096 794979 707637 -244730 -2070908 -3830731 -4140250 -2933633 -1858011 -2130163
29671 -2130163 -2787779 -2108739 -161827 1370224 1672407 1656106 2112442 2389150 1619847
29662 1619847 232283 -723573 -1090235 -1450635 -1858103 -1746012 -1007709 -228548 267275
29653 267275 774751 1369024 1462296 637611 -622928 -1521835 -1845897 -1808913 -1398070 -537789
29643 -537789 273401 236439 -662809 -1386666 -993183 267077 1333373 1621423 1568947 1925630
29633 1925630 2815665 3624182 3628167 2611829 1024819 -258742 -463327 439017 1498655
29624 1498655 1525541 304217 -1122858 -1607003 -1076918 -272379 334587 725466 670734
29615 670734 -170094 -1267161 -1294021 163085 1653119 1479553 -107326 -1237578 -783911
29606 -783911 515869 1357387 1390267 1101004 897375 850043 956439 1179219 1385684 1532089
29596 1532089 1749652 2057294 2175080 1804071 972710 52854 -414597 -5877 1119729
29587 1119729 2099009 2195776 1765773 1795312 2382728 2464162 1432630 221816 47062 666024
29577 666024 818131 36111 -1026370 -1946536 -2991431 -3902256 -3425725 -1014754 1676424
29568 1676424 2196893 187645 -2087037 -2358081 -722087 1031920 1709287 1512336 1027661
29559 1027661 520682 284551 633796 1146733 822329 -403878 -1140648 -391727 798684
29550 798684 708314 -501950 -962101 195133 1635028 1660857 141979 -1811041 -3086924
29541 -3086924 -3016986 -1580597 180037 769200 -87004 -1068310 -1060803 -463842 -111725 74450
29531 74450 444432 560128 -57208 -777583 -639813 187295 802512 966816 1009830 834199
29521 834199 226415 -261960 -51571 199258 -512211 -1630193 -1610062 -351696 580820
29512 580820 360179 -131931 -127841 -116904 -499513 -638703 -151633 195435 -121035 -311799
29502 -311799 302990 922202 590584 -45974 233630 1099960 1127890 94586 -682758 -400436
29492 -400436 135852 -138288 -1037310 -1479949 -820336 559347 1683744 1786810 880128
29483 880128 -326654 -1084821 -1130747 -633453 31326 402746 289931 146259 563242 1240149
29473 1240149 1194086 336455 -53915 867985 2046110 1867409 429346 -696283 -713717
29464 -713717 -397569 -543948 -770008 -348739 531341 986300 610067 -58093 -239313 113375
29454 113375 197507 -635400 -1859718 -2227912 -1384640 -415318 -355057 -772936 -574219 253779
29444 253779 676164 268693 -144531 258423 1162634 1628010 1279633 603893 256641 333893
29434 333893 329510 -196505 -949867 -1134188 -428633 593730 1185100 1180047 843177 443237
29424 443237 252263 422965 547012 3750 -850148 -724487 673381 1703100 871372
29415 871372 -936756 -1650037 -879453 -73531 -87632 -235849 125524 571429 512759 -89001
29405 -89001 -1155021 -2424100 -2796187 -1197315 1478029 2750928 1545383 -527396 -1553404
29396 -1553404 -1559406 -1437223 -1084095 -48866 996777 1032521 394456 279817 869571 1249549
29386 1249549 1043858 904131 1311037 1899285 2157363 2060138 1853996 1733261 1763056 1754391
29376 1754391 1371045 680208 228304 185548 -22397 -658675 -909322 -14161 1388279
29367 1388279 2034009 1733603 1266004 949052 480653 -42287 -209403 -317061 -1000512
29358 -1000512 -1789102 -1403696 209577 1479999 1342707 524394 66908 -219899 -951476
29349 -951476 -1861961 -2382334 -2751601 -3413041 -3841508 -3152646 -1636700 -606859 -721149
29340 -721149 -1292857 -1313052 -506740 605659 1138486 483115 -866217 -1363700 -79432
29331 -79432 1838838 2295907 847931 -811443 -1120679 -334392 478846 1024132 1527884
29322 1527884 1700927 1045572 -92608 -689971 -233824 808722 1539486 1202953 -346943
29313 -346943 -2101093 -2362620 -737538 811403 204895 -1735537 -2180499 -343003 1320026
29304 1320026 776746 -633313 -482194 1033729 1776464 1192738 803014 1347725 1764398
29295 1764398 1421628 1257748 1817084 1958361 734119 -860766 -1372166 -1006552 -835870
29286 -835870 -769017 81122 1504045 2273687 2019489 1604139 1550357 1390870 871041 623024
29276 623024 1099459 1704043 1601252 830195 82883 -237364 -290495 -389854 -664406 -989403
29266 -989403 -1073450 -761873 -321815 -207480 -491207 -800864 -916567 -1128196 -1764079 -2525624
29256 -2525624 -2604929 -1590289 -110725 701890 476881 13172 168858 744647 1019310
29247 1019310 999288 1201597 1366455 630913 -791404 -1443981 -726650 173652 347967
29238 347967 795096 2597971 4587312 4624695 2620536 471130 -696774 -1384860 -1907051
29229 -1907051 -1664297 -645812 46201 -136995 -329192 280674 1255634 1785193 1697648
29220 1697648 1071119 -78027 -1135423 -997080 450072 1834464 1892136 745508 -798284
29211 -798284 -2167980 -2741253 -1829272 251079 2035324 2554028 2234156 1676067 768775
29202 768775 -277059 -437904 484306 1007585 38636 -1341835 -1568602 -999182 -1006283 -1528635
29192 -1528635 -1335137 -225356 786384 1228018 1518042 1725822 1472713 953294 668278
29183 668278 310456 -676353 -1654491 -1479418 -506653 -220869 -819230 -964714 -235068 63354
29173 63354 -788384 -1531933 -923538 249540 400831 -511910 -1105980 -579346 387265 595052
29163 595052 -370270 -1716909 -2164180 -1317356 -214068 -18940 -479631 -542423 -200888
29154 -200888 -439299 -1329469 -1678066 -964646 -179552 -82411 -24482 590112 965693 237339
29144 237339 -873249 -1060330 -405645 -1897 -29162 429504 1689707 2752110 2584123
29135 2584123 1382734 223259 -196372 -238843 -815280 -2201590 -3533568 -3805463 -3164821
29126 -3164821 -2592760 -2454560 -2268397 -1884973 -1722671 -1595005 -645871 981751 1791638
29117 1791638 1137525 457501 1103414 2121683 1711195 -15789 -1419743 -1845723 -1937327
29108 -1937327 -1788354 -732718 899210 1643596 1018962 248685 261478 378791 -205639
29099 -205639 -905483 -765771 -70843 232945 103986 222211 583590 459651 -245916 -665407
29089 -665407 -269655 358542 496011 306646 259741 71670 -873055 -2234201 -2829176 -2211405
29079 -2211405 -1255098 -815269 -716038 -655404 -1110442 -2281216 -2934918 -1753636 538999
29070 538999 1908017 1726749 1190464 1011598 548299 -339173 -478227 630577 1663020
29061 1663020 1448322 661383 352913 233189 -195752 -226839 657630 1275084 563029 -209407
29051 -209407 732661 2475400 2515772 621319 -975295 -1196941 -1309651 -2068214 -2260266
29042 -2260266 -1123729 -46171 -472630 -1708180 -2154698 -1535558 -681585 -86120 219785
29033 219785 113484 -381713 -899736 -1331575 -1891150 -2244552 -1634520 -308990 427246
29024 427246 200953 260545 1363225 2382959 2132850 1243093 855405 638954 -246708
29015 -246708 -1132565 -668661 770978 1341660 344136 -1008897 -1579699 -1592939 -1580732 -1342924
29005 -1342924 -609483 145821 240666 -329449 -978334 -1170761 -716364 237406 1222202 1654460
28995 1654460 1285288 490724 51446 448454 1171981 981448 -628187 -2402362 -2592335
28986 -2592335 -1259503 -253937 -604740 -1208025 -860938 -305908 -921292 -2282795 -2672976
28977 -2672976 -1673563 -680755 -810320 -1656842 -2351434 -2646105 -2587293 -2138432 -1573843 -1432646
28967 -1432646 -1678302 -1612255 -966548 -380606 -421594 -812306 -1069354 -1267578 -1608993 -1738927
28957 -1738927 -1180760 -246674 109347 -554778 -1508934 -1563445 -431481 761240 576267
28948 576267 -1057922 -2612648 -2671556 -1503927 -487346 -348470 -681898 -989839 -1295241
28939 -1295241 -1622146 -1711448 -1572291 -1637266 -2005769 -2145335 -1761357 -1372827 -1476945 -1638453
28929 -1638453 -1091342 60614 963451 1202041 1150805 1094952 721853 -207910 -1235764
28920 -1235764 -1706092 -1554483 -1137418 -534438 411519 1443214 1905260 1560081 872950
28911 872950 289934 -230639 -694145 -719098 -225239 130514 -65527 -91047 880042 2245860
28901 2245860 2640729 1949622 1328314 1161603 542963 -735983 -1266616 -97985 1558896
28892 1558896 1965937 1203771 511865 128245 -587913 -1389324 -1275114 -334162 223029
28883 223029 120761 531569 1981113 3142933 2615185 904620 -319163 -307034 291718
28874 291718 577262 200840 -743344 -1884317 -2610635 -2435736 -1483990 -470064 -157656
28865 -157656 -761502 -1687111 -1959987 -1271567 -517454 -774341 -1748346 -1962953 -760807
28856 -760807 616811 541448 -913561 -2139883 -2041490 -1153178 -616610 -699011 -755754 -349902
28846 -349902 131626 80218 -481176 -973568 -1047860 -866779 -551806 120610 1110208 1660749
28836 1660749 1126327 81005 -173468 640376 1243388 466195 -1091615 -1751019 -908908
28827 -908908 220363 200568 -846421 -1507062 -859488 557930 1591712 1751102 1322894
28818 1322894 609399 -364631 -1410758 -1963463 -1576242 -474765 514684 596241 -271013
28809 -271013 -1149461 -922113 382277 1420707 1169827 312463 228480 935842 1118993
28800 1118993 191730 -852660 -973119 -397862 76066 180072 67982 -20336 461160
28791 461160 1929486 3483084 3304076 1077680 -1089628 -1216433 66094 759481 341409
28782 341409 -50941 318626 1000017 1361698 1150532 255135 -1040630 -1834266 -1575631
28773 -1575631 -883491 -551337 -417977 -230717 -669523 -2031675 -2788416 -1375216 1098822
28764 1098822 1982369 712139 -729557 -939816 -547810 -337795 -81674 219638 -78464
28755 -78464 -750757 -605269 399988 762054 -93351 -838080 -654527 -633406 -1513479 -1961749
28745 -1961749 -775074 818832 959329 13994 -319727 165952 315972 1713 334332
28736 334332 1557532 2500975 2391906 1820234 1531571 1348137 755488 -145415 -695270
28727 -695270 -397717 514966 1118298 658551 -427048 -822804 3433 1028328 1074361
28718 1074361 439901 466036 1807849 3702213 4721760 3889008 1402711 -1341870 -2741581
28709 -2741581 -2280401 -659812 1192434 2626549 3024897 2168141 955309 571633 710049
28700 710049 -27366 -1586728 -1987869 -278845 1643571 1543640 -67126 -933060 -250674
28691 -250674 820667 1350035 1671014 2205766 2532097 1958215 433626 -1203280 -1732656
28682 -1732656 -749986 479273 176190 -1605679 -2807470 -2044413 -302101 737867 814822
28673 814822 609399 390166 256614 601702 1181350 852908 -588561 -1564796 -1014945
28664 -1014945 -168845 -442378 -975253 -241533 1104601 1274594 377908 58375 649499
28655 649499 984141 686635 453036 324800 -154908 -339029 721553 2079619 1847355
28646 1847355 263826 -651976 -544580 -1122431 -2729794 -3339048 -1917994 -240553 -27136
28637 -27136 -475742 -107204 830116 1389766 1800718 2679890 3521605 3425757 2458247 1152739
28627 1152739 -424746 -2064262 -2812566 -2117853 -868428 -338013 -690778 -1214492 -1314550
28618 -1314550 -690726 603389 1649178 1139870 -912186 -2782266 -3017006 -2011864 -1055242
28609 -1055242 -734854 -929426 -1411819 -1667064 -916762 890923 2721506 3625211 3618017
28600 3618017 3042114 1935268 513901 -581486 -1030738 -1099831 -929739 -480803 -298141
28591 -298141 -1067993 -2124201 -1832573 2294 1539014 1391001 344986 -168781 35277
28582 35277 399889 721350 826634 343840 -355693 -187825 894686 1509168 990536 433013
28572 433013 664742 843665 279170 -15312 897067 2029275 2055763 1439600 1292617 1343484
28562 1343484 820592 242313 471982 950903 691868 109705 57439 42516 -626318 -930434
28552 -930434 345423 1985972 1715628 -242477 -1474046 -1077101 -559927 -895598 -1137505
28543 -1137505 -532939 133181 103879 -156736 -64561 232966 652153 1418511 2035415 1427336
28533 1427336 -310982 -1596193 -1388154 -441078 -32075 -455799 -1182292 -1548391 -989827
28524 -989827 482048 1840232 1992322 1207398 632978 568729 442957 275463 592334
28515 592334 899362 3123 -1819842 -2665761 -1561524 306247 1439213 1644457 1287023
28506 1287023 456220 -450691 -743953 -715563 -1482457 -2917688 -3314527 -1945131 -349268
28497 -349268 -27993 -396542 -246167 254776 463731 803282 1721229 2220033 1259476 -147356
28487 -147356 -103384 1360223 2421420 2198878 1624136 1523294 1436115 773778 -78596 -395864
28477 -395864 -87948 379977 561083 341433 47654 176505 628949 483134 -894496
28468 -894496 -2763038 -3696883 -3195538 -1982715 -911801 -284056 -117253 -327907 -588312
28459 -588312 -560816 -283122 84865 660515 1424536 1704339 854273 -658342 -1628631 -1573604
28449 -1573604 -1093662 -790646 -638993 -551083 -716230 -1032710 -911511 -116492 697847 739087
28439 739087 22250 -790660 -1181363 -1095101 -790108 -700226 -1157752 -1893891 -2066581 -1191216
28429 -1191216 128404 823363 625354 270027 424208 875339 997209 673735 413410
28420 413410 675521 1394981 2178357 2723280 2943475 2819712 2289243 1364109 385752 22396
28410 22396 672784 1726389 1813333 281873 -1732842 -2312463 -902122 1087328 1966543
28401 1966543 1465545 481578 -179864 -228272 404898 1439632 2005194 1341218 -128794
28392 -128794 -1007694 -427316 1006577 1901177 1450810 87430 -986847 -895273 72969
28383 72969 724109 198330 -1162455 -2288634 -2450917 -1666858 -444315 481730 491098 -334469
28373 -334469 -1143608 -1223730 -732675 -175589 406482 1150705 1689022 1530662 932997 640511
28363 640511 834693 1010037 835599 525218 397912 589384 1065564 1445937 1107700 35935
28353 35935 -805150 -619762 131299 545225 633858 901313 1150610 955162 833385 1468186
28343 1468186 2073340 1240919 -620445 -1491442 -638041 479606 672946 619284 1214139
28334 1214139 1979554 2163856 2070654 2181380 2079238 1336856 541904 455034 960009 1625503
28324 1625503 2386827 2957458 2656784 1639011 1139509 1599588 1783940 810747 -244823
28315 -244823 -63617 832463 1175019 986683 879448 356598 -1279682 -3058157 -3358479
28306 -3358479 -2373125 -1656674 -1536814 -944161 266514 848991 306388 -309639 -223586
28297 -223586 37130 24721 299046 1154957 1597892 554180 -1584119 -3374187 -3850022
28288 -3850022 -3144534 -1946342 -749780 422093 1597639 2244575 1639008 123641 -819035
28279 -819035 -415899 327535 312982 122780 780408 1668067 1491330 736550 1076335 2469013
28269 2469013 2999370 1854417 388565 -274197 -661794 -1198231 -1013680 297201 1387768
28260 1387768 1034684 23366 -237647 81265 -111840 -753825 -737718 215957 1071695
28251 1071695 879290 -135009 -917226 -676973 201349 329520 -1028910 -2594345 -2454890
28242 -2454890 -868256 -128303 -1121495 -1820643 -398231 1803237 2161988 457713 -1329140
28233 -1329140 -2144401 -2623641 -2969827 -2283493 -484131 875340 579146 -617455 -1140546
28224 -1140546 -623629 -67793 -386976 -1283714 -1471342 -10257 2397560 3820713 3301591
28215 3301591 2135644 2093319 2859317 2539401 567884 -1413512 -1913562 -1375903 -895330
28206 -895330 -449153 476851 1409455 1376393 495883 -144415 -153875 -325615 -1250928 -2311231
28196 -2311231 -2476735 -1560983 -247374 783669 1327924 1438114 1151133 516579 -272013
28187 -272013 -867977 -932828 -412792 310972 693486 566872 332190 522098 1250603 2130976
28177 2130976 2554502 2008242 532055 -823510 -504574 1791292 4092403 3970568 1598496
28168 1598496 -169637 579720 2270013 2092439 -80403 -1741964 -1410417 -318408 -39659
28159 -39659 -222556 249449 1169856 1513653 1308549 1557517 2499123 3175170 2843635 1885213
28149 1885213 1072293 641039 376567 126688 -72630 -154071 -160435 -319790 -867104 -1616430
28139 -1616430 -1944408 -1522398 -858834 -717113 -1142900 -1490094 -1317084 -823964 -411332
28130 -411332 -187770 23739 429797 1013988 1392729 1087223 156576 -673889 -833272 -622436
28120 -622436 -713081 -1132876 -1248122 -686346 205863 850425 978691 653825 144653 -134143
28110 -134143 106502 671460 1001811 748459 88328 -540803 -862738 -912775 -911255 -1025686
28100 -1025686 -1205351 -1253858 -1042230 -591851 -57457 231398 -43558 -615009 -556423 557272
28090 557272 1633188 1162534 -630103 -1883848 -1671917 -1201608 -1733025 -2566383 -2278999
28081 -2278999 -998963 -48955 34051 -274422 -725668 -1293965 -1325204 -280800 870221
28072 870221 662716 -504452 -784321 187295 697730 -177611 -1048833 -523780 663707
28063 663707 1113429 917071 879231 715791 -316346 -1690137 -2090556 -1271448 -123625
28054 -123625 778505 1463308 1717127 1254053 596671 582886 1046713 1115623 762228 848674
28044 848674 1517995 1755275 910504 -359230 -1124749 -1336487 -1458637 -1604398 -1535638 -1131052
28034 -1131052 -522572 8822 256618 505342 1466329 3208825 4459439 3870883 1866702
28025 1866702 200405 -318106 -476796 -866706 -821682 173984 1207495 1085884 23909
28016 23909 -769063 -694082 -160096 180145 -112571 -1115635 -2178733 -2199634 -980516 192085
28006 192085 93613 -809218 -1113703 -365927 770858 1777579 2582691 2889692 2395189
27997 2395189 1591393 1236093 1098103 403460 -530215 -508220 478835 886732 -98869 -1232713
27987 -1232713 -1015301 227902 1028469 750881 -30466 -543515 -431945 127403 334511
27978 334511 -552557 -1923013 -2112574 -698401 590233 264902 -760000 -798477 -122440
27969 -122440 -178311 -784883 -374105 1076699 1673232 632955 -454875 -275917 230687
27960 230687 -219708 -1033364 -1021171 -662668 -1241002 -2388836 -2342360 -553791 1478354
27951 1478354 2228046 1863078 1622572 2274832 3489807 4203354 3450064 1279891 -1071071
27942 -1071071 -2259994 -2054453 -1221224 -469632 55365 465717 862529 1314536 1718806
27933 1718806 1763785 1281892 467463 -362342 -831570 -322362 1431815 3278863 3283754 1186218
27923 1186218 -843193 -960235 -105978 -271684 -1265630 -1197396 256394 1305928 957669
27914 957669 352182 542766 831930 345219 -277535 17270 1020969 1815339 2116726
27905 2116726 2100071 1747173 1305202 1511170 2364844 2560887 1284719 -199803 -36872
27896 -36872 1669840 3020973 2694438 1076839 -652207 -1551357 -1329166 -633866 -576124
27887 -576124 -1175732 -945298 977150 3131789 3589779 2727066 2334354 2513591 1714319
27878 1714319 -155169 -1107668 -245333 700239 177064 -750739 -303922 1191027 2119863
27869 2119863 2122539 2023861 1982796 1531977 1036057 1322056 1984003 1762647 728430 441674
27859 441674 1555563 2798778 3006040 2784171 3198113 3881810 3643639 2329102 970810
27850 970810 415914 743436 1772601 3169081 4114188 3805362 2459468 1146276 539363
27841 539363 483786 778581 1458550 2058195 1628145 137023 -971209 -501298 790315
27832 790315 1204597 442244 -152302 412602 1618746 2421414 2418137 1768731 837204 253250
27822 253250 484922 950964 402438 -1335210 -2864469 -3042007 -2416339 -2114329 -2215879
27813 -2215879 -2222730 -2298026 -2748939 -2837621 -1536829 732282 2413560 2783557 2415984 1827051
27803 1827051 1028742 463731 899297 2037156 2565816 2047332 1478445 1484463 1339028 541421
27793 541421 28288 720824 1910481 2297735 1879632 1629845 1882917 2179370 2291330
27784 2291330 2317926 2056400 1266641 342605 -154921 -405347 -933551 -1549629 -1552998 -869593
27774 -869593 -211952 -170074 -725858 -1478225 -1831594 -1314656 -269867 243059 -175534 -627269
27764 -627269 -371605 -58638 -449023 -817395 -138780 839297 564341 -621082 -770724
$$ [...]
##END NTUPLES=NMR SPECTRUM
##END=
