##TITLE=31Pdec_LY-mix.Dixi
 D2O, 24 sc
 3.03.2021
##JCAMPDX= 6.0         $$ Bruker NMR JCAMP-DX V2.0
##DATA TYPE= NMR SPECTRUM
##DATA CLASS= NTUPLES
##ORIGIN= UXNMR, Bruker Analytische Messtechnik GmbH
##OWNER= root
$$ XWIN-NMR		Version 3.5
$$ Wed Mar  3 13:16:15 2021 Russian Standard Time (UT+4h)  she@DPX200
##.OBSERVE FREQUENCY= 81.013821
##.OBSERVE NUCLEUS= ^31P
##.ACQUISITION MODE= SIMULTANEOUS
##.ACQUISITION SCHEME= undefined
##.AVERAGES= 24
##.DIGITISER RES= 16
##SPECTROMETER/DATA SYSTEM= spect
##.PULSE SEQUENCE= zgpg30
##.SOLVENT NAME= D2O
##.SHIFT REFERENCE= (INTERNAL, D2O, 0, 248.564)
##AUDIT TRAIL= $$ (NUMBER, WHEN, WHO, WHERE, WHAT)
$$ ##TITLE= Audit trail, XWIN-NMR		Version 3.5
$$ ##JCAMPDX= 5.01
$$ ##ORIGIN= Bruker BioSpin GmbH
$$ ##OWNER= she
$$ F:/spectra/data/she/nmr/P31/1/pdata/1/auditp.txt
$$ ##AUDIT TRAIL=  $$ (NUMBER, WHEN, WHO, WHERE, WHAT)
(   1,<2021-03-03 13:12:09.48 +0400>,<she>,<DPX200>,
      <created by zg, POWCHK disabled, PULCHK disabled
       configuration hash MD5:
       00 E9 B6 7A A2 85 ED C7 34 08 36 98 17 FE 4E 26
       data hash MD5: 32K
       50 99 72 88 2B F4 CD EE ED 57 6C 1A B0 AA 75 B8>)
(   2,<2021-03-03 13:12:11.93 +0400>,<she>,<DPX200>,
      <Start of raw data processing
       efp BC_mod = 2 LB = 1 FT_mod = 6 PKNL = 1 PHC0 = -2841.837 PHC1 = -593.5972 SI = 64K 
       data hash MD5: 64K
       A3 B2 D1 80 CC D9 B7 6D C1 C7 6B 94 C9 B5 24 89>)
(   3,<2021-03-03 13:12:56.42 +0400>,<she>,<DPX200>,
      <pk PHC0 = -327.1797 PHC1 = 1020.598 
       data hash MD5: 64K
       49 A4 3E 07 79 0F BE 8E 5B 8A 13 4C EA 3A 23 1C>)
$$ ##END=
$$ 
$$ hash MD5
$$ A6 7B A1 6B 75 E6 44 8C 9C 3D 0F 80 F5 8A 30 9F
##$RELAX= 
##$RELAX= 
##$RELAX= 
##$RELAX= 
##$RELAX= 
##$RELAX= 
##$RELAX= 
##$RELAX= 
$$ Bruker specific parameters
$$ --------------------------
##$DU= <F:/spectra>
##$EXPNO= 1
##$NAME= <P31>
##$PROCNO= 1
##$TYPE= <nmr>
##$USER= <she>
##$AMP= (0..31)
100 100 100 100 100 100 100 100 100 100 100 100 100 100 100 100 100 100 
100 100 100 100 100 100 100 100 100 100 100 100 100 100 
##$AQSEQ= 0
##$AQ_mod= 1
##$AUNM= <au_zg>
##$AUTOPOS= <>
##$BF1= 81.014009
##$BF2= 200.13
##$BF3= 200.13
##$BF4= 200.13
##$BF5= 200.13
##$BF6= 200.13
##$BF7= 200.13
##$BF8= 200.13
##$BYTORDA= 1
##$CFDGTYP= 0
##$CFRGTYP= 5
##$CHEMSTR= <none>
##$CNST= (0..31)
1 1 145 1 1 1 1 1 1 1 1 1 1 1 1 1 1 1 1 1 1 1 1 1 1 1 1 1 1 1 1 1 
##$CPDPRG= <waltz16>
##$CPDPRG1= <>
##$CPDPRG2= <waltz16>
##$CPDPRG3= <>
##$CPDPRG4= <mlev>
##$CPDPRG5= <mlev>
##$CPDPRG6= <mlev>
##$CPDPRG7= <mlev>
##$CPDPRG8= <mlev>
##$CPDPRGB= <>
##$CPDPRGT= <>
##$D= (0..31)
0 1 0 0 0 0 0 0 0 0 0 0.03 2e-05 3e-06 0 0 0 0 0 0 0 0 0 0 0 0 0 0 0 0 
0 0 
##$DATE= 1614762728
##$DBL= (0..7)
120 120 120 11 120 120 24 19 
##$DBP= (0..7)
150 150 150 150 150 150 150 150 
##$DBP07= 0
##$DBPNAM0= <>
##$DBPNAM1= <>
##$DBPNAM2= <>
##$DBPNAM3= <>
##$DBPNAM4= <>
##$DBPNAM5= <>
##$DBPNAM6= <>
##$DBPNAM7= <>
##$DBPOAL= (0..7)
0.5 0.5 0.5 0.5 0.5 0.5 0.5 0.5 
##$DBPOFFS= (0..7)
$$ [...]
##$SUBNAM2= <"">
##$SUBNAM3= <"">
##$SUBNAM4= <"">
##$SUBNAM5= <"">
##$SUBNAM6= <"">
##$SUBNAM7= <"">
##$SUBNAM8= <"">
##$SUBNAM9= <"">
##$SW= 501.771253377433
##$SWIBOX= (0..15)
0 1 3 0 0 0 0 0 0 0 0 0 0 0 0 0 
##$SW_h= 40650.406504065
##$TD= 32768
##$TD0= 1
##$TE= 0
##$TE2= 300
##$TE3= 300
##$TEG= 300
##$TL= (0..7)
0 120 53 12 22 120 120 120 
##$TP= (0..7)
150 150 150 150 150 150 150 150 
##$TP07= 0
##$TPNAME0= <>
##$TPNAME1= <>
##$TPNAME2= <>
##$TPNAME3= <>
##$TPNAME4= <>
##$TPNAME5= <>
##$TPNAME6= <>
##$TPNAME7= <>
##$TPOAL= (0..7)
0.5 0.5 0.5 0.5 0.5 0.5 0.5 0.5 
##$TPOFFS= (0..7)
0 0 0 0 0 0 0 0 
##$TUNHIN= 0
##$TUNHOUT= 0
##$TUNXOUT= 0
##$USERA1= <user>
##$USERA2= <user>
##$USERA3= <user>
##$USERA4= <user>
##$USERA5= <user>
##$V9= 5
##$VALIST= <valist>
##$VCLIST= <CCCCCCCCCCCCCCC>
##$VD= 0
##$VDLIST= <DDDDDDDDDDDDDDD>
##$VPLIST= <PPPPPPPPPPPPPPP>
##$VTLIST= <TTTTTTTTTTTTTTT>
##$WBST= 1024
##$WBSW= 4
##$XGAIN= (0..3)
0 0 0 0 
##$XL= 0
##$YL= 0
##$YMAX_a= 14697
##$YMIN_a= -54470
##$ZGOPTNS= <>
##$ZL1= 120
##$ZL2= 120
##$ZL3= 120
##$ZL4= 120
##$ABSF1= 0
##$ABSF2= 0
##$ABSG= 0
##$ABSL= 0
##$ALPHA= 0
##$AQORDER= 0
##$ASSFAC= 0
##$ASSFACI= 0
##$ASSFACX= 0
##$ASSWID= 0
##$AUNMP= <proc_1d>
##$AZFE= 0.1
##$AZFW= 0.5
##$BCFW= 0
##$BC_mod= 2
##$BYTORDP= 0
##$COROFFS= 0
##$CY= -3
##$DATMOD= 1
##$DC= 0
##$DFILT= <>
##$DTYPP= 0
##$F1P= 0
##$F2P= 0
##$FCOR= 1
##$FTSIZE= 65536
##$FT_mod= 6
##$GAMMA= 0
##$GB= 0
##$INTBC= 1
##$INTSCL= 5.30512e-09
##$ISEN= 30
##$LB= 1
##$LEV0= 0
##$LPBIN= 0
##$MAXI= 10000
##$MC2= 0
##$MEAN= 0
##$ME_mod= 0
##$MI= 50
##$NCOEF= 0
##$NC_proc= -2
##$NLEV= 6
##$NOISF1= 182.463
##$NOISF2= 159.3651
##$NSP= 0
##$NTH_PI= 0
##$NZP= 0
##$OFFSET= 248.5645
##$PC= 4
##$PHC0= -3169.017
##$PHC1= 427.0008
##$PH_mod= 1
##$PKNL= yes
##$PPARMOD= 0
##$PSCAL= 0
##$PSIGN= 0
##$REVERSE= no
##$SF= 81.014009
##$SI= 65536
##$SIGF1= 159.3651
##$SIGF2= -187.1042
##$SINO= 113.3802
##$SIOLD= 16384
##$SREGLST= <1H.CDCl3>
##$SSB= 0
##$STSI= 65536
##$STSR= 0
##$SW_p= 40650.406504065
##$SYMM= 0
##$S_DEV= 0
##$TDeff= 32768
##$TDoff= 0
##$TI= <>
##$TILT= no
##$TM1= 0
##$TM2= 0
##$TOPLEV= 0
##$USERP1= <user>
##$USERP2= <user>
##$USERP3= <user>
##$USERP4= <user>
##$USERP5= <user>
##$WDW= 1
##$XDIM= 65536
##$YMAX_p= 342869129
##$YMIN_p= -10429593
$$ End of Bruker specific parameters
$$ ---------------------------------
##NTUPLES= NMR SPECTRUM
##VAR_NAME=  FREQUENCY,     SPECTRUM/REAL,   SPECTRUM/IMAG
##SYMBOL=    X,             R,               I
##VAR_TYPE=  INDEPENDENT,   DEPENDENT,       DEPENDENT
##VAR_FORM=  AFFN,          ASDF,            ASDF
##VAR_DIM=   65536,         65536,           65536
##UNITS=     HZ,            ARBITRARY UNITS, ARBITRARY UNITS
##FACTOR=    0.620285442955139, 1,           1
##FIRST=     20137.2065510759, 0,            0
##LAST=      -20513.1999529892, 0,           0
##MIN=       -20513.1999529892, -10429593,   0
##MAX=       20137.2065510759, 342869129,    0
$$ Real data points
##PAGE= N=1
##DATA TABLE= (X++(R..R)), XYDATA
$$ [...]
38553 83673 73405 113748 160169 91136 -72809 -143269 -14660 192003 306555 317604 319412
38542 319412 339685 317976 214999 68740 -47967 -94033 -98836 -134994 -216991 -242790 -105408
38531 -105408 138728 295271 244266 54573 -124807 -200967 -148141 9412 176797 247521
38521 247521 241044 285826 401126 411430 188350 -120910 -255529 -175747 -78448 -101800 -179869
38510 -179869 -208503 -193177 -167762 -101072 19523 103813 61344 -63519 -144724 -127345 -59252
38499 -59252 -7310 -9134 -73582 -159869 -184736 -117324 -36562 -23099 -30967 39743 167293 221976
38487 221976 163675 107662 151961 243665 281743 266751 265917 290177 294354 264801 226572 184375
38475 184375 127530 78412 70071 87341 91567 89460 110221 124872 64809 -73079 -208261 -273401
38463 -273401 -266077 -200200 -84884 28452 62478 21374 10714 95537 198722 204259 114624
38452 114624 35307 33076 79451 122285 151319 187066 240089 281644 244650 88099 -116354
38441 -116354 -213001 -123673 62517 206364 266722 269455 205119 69169 -45452 -32135 65902
38430 65902 108260 72973 76963 163139 224508 194496 159348 195572 236194 208044 175923 218730
38418 218730 268193 218039 111659 70552 102663 132323 155381 198804 185764 35155 -135329
38407 -135329 -112703 101875 286838 318052 285489 263817 198785 96803 95235 220240 281519
38396 281519 158916 9941 21949 124021 138139 72612 48565 47070 -36732 -157763 -170413
38385 -170413 -79026 -23620 -31007 12735 136667 228156 227381 205210 215374 224631 219801 237294
38373 237294 256376 202332 85579 9057 16345 56390 104230 181537 258903 287915 326326
38362 326326 459613 594631 530460 272377 78785 132926 342265 515256 553886 426639
38352 426639 168602 -19594 89091 399268 521652 291395 11917 -6282 97623 3828
38342 3828 -258502 -373049 -227688 -29784 42779 28153 4113 -30403 -47722 35948 211849
38331 211849 344350 337569 230455 105136 4807 -44949 -32560 8193 38770 78698 159906
38320 159906 251313 301532 308088 272348 165938 37803 51348 271232 500124 498858 308156
38309 308156 174111 202861 280424 305571 297447 267679 183764 93805 112742 237056 322002
38298 322002 285997 200314 136524 61710 -59984 -175200 -208248 -143459 -14614 118357 180909
38287 180909 145189 70464 23984 7088 21517 115273 261963 310349 196079 83144 123624
38276 123624 212654 196842 174533 298688 409464 230412 -125079 -240387 -5372 249663
38266 249663 287587 238820 239432 192595 59874 31446 206143 413977 537637 695230 939598
38255 939598 1141892 1362283 1892462 2629404 2869432 2179598 1107670 508537 458067 405416
38245 405416 165119 75600 237591 287769 51357 -163457 -122436 -28917 -97053 -180247 -93582
38234 -93582 33197 883 -128593 -198826 -226290 -267613 -232787 -67373 64107 11141 -104397
38223 -104397 -86439 24262 63934 41972 85803 183956 216373 179111 165262 169161 114037
38212 114037 43729 89191 250680 387078 420156 391807 326691 203129 66751 10506 19893
38201 19893 -9553 -75866 -51881 90458 195033 136949 -14109 -132238 -204232 -249159 -194335
38190 -194335 10800 233371 284021 181410 124079 190256 235413 144818 28321 49288 172755
38179 172755 227506 157197 61732 12717 -22317 -59017 -45891 14342 22204 -60173 -116532 -44211
38167 -44211 72549 80647 -9182 -49634 3287 28556 -50365 -128560 -71576 84323 182094
38156 182094 154771 94328 111373 199700 265326 242844 149085 49018 4747 41361 119997
38145 119997 150136 81574 -5013 38786 240889 445027 490537 396394 290244 216219 127552
38134 127552 29150 -18626 -35393 -103468 -185348 -122834 109129 303045 286814 165724 161284
38123 161284 303219 431905 449963 421141 434084 489228 526614 487495 359847 220373 189395
38112 189395 277635 336321 244771 88424 48304 161969 304100 370099 368531 347903 326779
38101 326779 290982 202731 49031 -75797 -24384 189701 339884 263191 82192 10589
38091 10589 49563 59441 34442 78794 165076 160952 85361 97230 208342 240027 112634 -40285
38079 -40285 -106808 -132656 -147160 -66798 117472 243429 195933 72333 14274 13362 -3959
38068 -3959 -30550 -32025 -29356 -28138 16237 74430 23750 -143973 -245672 -167707 -54984 -78191
38056 -78191 -143858 -36492 230556 415224 380395 253087 231555 361025 531851 617260
38046 617260 582555 490490 404937 305303 152139 13827 7840 107507 159123 126851 137801
38035 137801 212794 172259 -44817 -182242 -6983 312637 423074 272960 122667 135569
38025 135569 230318 314041 390210 413053 289390 84627 3961 94368 165072 84266 -36716
38014 -36716 -50597 14648 65882 104580 146348 121193 1576 -78965 10430 188119 256919
38003 256919 161695 21706 -54673 -60547 -16522 72808 182597 279101 369713 465571 509029
37992 509029 435076 307010 282627 406376 525780 478233 297645 159862 158274 215030 211728
37981 211728 133117 52230 23296 33680 42707 31462 14926 21714 57147 81620 47872 -28731
37969 -28731 -70069 -28690 56825 132829 205120 283473 308404 233951 150755 197259 342404
37958 342404 394020 264376 92413 31983 51398 48286 40891 96342 153984 95505 -42548
37947 -42548 -97082 -21735 56978 53609 40675 93242 154413 147114 114914 143902 215836 251434
37935 251434 255991 303397 382788 375133 218894 18954 -63868 12075 151097 242365 247552
37924 247552 189841 122665 113567 192722 288737 273695 120027 -34216 -40334 73494 144850
37913 144850 88598 -22296 -89384 -103511 -89859 -24950 121539 306013 433149 442809 346868
37902 346868 209018 110452 95098 119582 96232 13598 -29380 55568 229213 364966 375283
37891 375283 271048 129369 29458 -9282 -42987 -126708 -221559 -229951 -127588 1698 70675
37880 70675 61640 -6741 -101165 -155303 -126085 -79098 -110489 -179619 -159967 -69983 -66909 -157681
37868 -157681 -138804 54654 171166 16303 -194207 -127940 150071 271199 121757 -14285
37858 -14285 92051 307816 384326 280276 111805 -42513 -149729 -162566 -80572 7479
37848 7479 32268 26531 41551 66497 87261 132743 196926 203096 120719 45887 90391 240458
37836 240458 380218 410558 312939 154335 55260 84491 163183 151718 46393 -15607 24566
37825 24566 53484 -22886 -121174 -117822 -41597 -5084 -16014 12537 105047 199712 260665 301691
37813 301691 308679 250296 174529 187806 303477 396383 355978 221447 111427 67037 31354
37802 31354 -33249 -79448 -52575 11532 18733 -57175 -129645 -106344 -5990 75243 96640 115240
37790 115240 184690 265844 279301 219621 164871 168551 189956 165361 116334 124998 198558 231396
37778 231396 146107 11533 -49530 -22596 17419 47362 98945 134986 62902 -102643 -223499
37767 -223499 -228026 -191282 -179163 -151548 -83185 -32484 -10037 62657 166951 141296 -43538
37756 -43538 -157421 -45663 96568 24087 -150852 -144747 28378 109631 45881 25574 75774
37745 75774 3847 -195771 -248309 -46885 139174 86405 -43885 -6672 131635 143174 -1888
37734 -1888 -165140 -283261 -352660 -294114 -68558 150957 142406 -68516 -248438 -253284 -136169
37723 -136169 -8962 56633 31464 -36912 -35355 61994 124227 63341 6524 112707 299182
37712 299182 337077 177963 3983 -34236 36579 128460 195891 202075 119142 -307 -52579
37701 -52579 -7385 78878 171988 285042 392074 421400 361574 289231 259200 234597 163741
37690 163741 79000 71770 173190 289636 293720 190252 129716 194118 244482 114867 -96201
37679 -96201 -131763 20980 79218 -99645 -279663 -204930 23539 144061 125446 108989 100550
37668 100550 9099 -87705 -14327 184656 272900 185216 106474 147154 185058 107239 -6382
37657 -6382 -42592 -21960 -1487 46178 154582 275836 353025 386595 374761 291958 177635
37646 177635 138542 204596 277310 269874 205234 133739 52599 -43235 -117356 -146410 -151102 -151095 -154369
37633 -154369 -181149 -213131 -154844 29270 182715 138541 10361 76429 344992 488391
37623 488391 310894 41866 2505 186538 374658 495125 616076 675341 497444 98795
37613 98795 -235667 -255195 -9830 230563 251713 74953 -80517 -17258 223997 409420
37603 409420 409685 360909 443982 607186 653135 530341 361859 216200 46223 -126328 -163687
37592 -163687 -25540 131289 164523 124304 114748 110983 56272 28367 121870 228926 151618
37581 151618 -69386 -159616 -6244 160173 103777 -77971 -136644 -55538 -11200 -22619 79896
37570 79896 303153 381147 150196 -172274 -266692 -131326 -23887 -66461 -122777 -57197 79607
37559 79607 173563 212632 253242 308090 340857 332833 304116 278278 245144 164558 25861 -99803
37547 -99803 -121554 -60445 -40247 -101017 -116327 16454 189961 214589 76926 -62421 -94938
37536 -94938 -50653 22059 113242 175707 136943 29244 -12700 61225 133415 86501 -24246
37525 -24246 -38286 112712 329334 448002 391621 225736 72786 -22206 -107342 -205812 -258114
37514 -258114 -219333 -129688 -30930 88953 187944 129485 -116418 -339723 -330553 -171619 -97416
37503 -97416 -127156 -69567 125674 271945 248237 174989 198268 275327 278480 182535 57273
37492 57273 -32041 -53673 -15897 26024 37672 62556 124313 134043 32156 -54957 10209 119933
37480 119933 81332 -28238 33902 236161 286084 123750 29167 132609 203238 101348
37470 101348 57318 240854 399906 258324 -9753 -66683 54110 87553 37128 120573
37460 120573 311831 348501 176809 19074 -18608 -62781 -152175 -128286 59026 214730
37450 214730 189019 87687 79094 168189 262878 318030 329988 309336 312379 382930 438216 349513
37438 349513 159905 69517 161152 284719 270113 130010 -5539 -51546 -16756 26820 -1381
37427 -1381 -94205 -127284 -13490 150616 209650 173425 164666 185098 125710 2941 -25491
37416 -25491 82414 179601 177744 180083 274874 366319 335010 239066 221702 296404 341302 270026
37404 270026 126307 22650 21102 63449 31872 -86825 -146019 -26505 174623 257110 177483
37393 177483 61102 -9959 -60944 -92590 -61604 -4572 -9576 -41305 31727 199897 277698
37382 277698 159765 -48110 -200964 -253556 -186678 11254 214290 206234 -29212 -230131
37372 -230131 -185459 2776 97344 24211 -119975 -221509 -197139 -24830 158060 131833
37362 131833 -101831 -241124 -60594 272390 429827 346291 212756 146672 94774 28239
37352 28239 19446 96210 170630 153270 52004 -48283 -46839 92885 261556 272900 97157
37341 97157 -62131 -33295 78982 62661 -72537 -126409 -32710 55020 30556 4300 122528
37330 122528 340598 473235 410153 210488 16058 -75183 -59397 7840 70215 95994 85286
37319 85286 92187 199181 393856 511193 420154 244906 231510 379424 413618 197738 -50044
37308 -50044 -96520 -33225 -67188 -153082 -103515 49127 94853 2962 -46728 13686 58792
37297 58792 41934 83117 212783 274792 194252 122254 175786 226018 117638 -47080 -37848
37286 -37848 167227 350417 336820 178632 58938 94374 227687 272702 102075 -176329
37276 -176329 -300498 -163435 46641 97926 14833 -1622 113715 228441 256479 278863
37266 278863 352969 363503 202104 -8065 -46203 82908 155400 88510 83180 282915 477832
37255 477832 374697 61124 -74818 113398 346288 353930 230939 198309 240144 212467
37245 212467 160924 255992 468067 559891 413607 166503 -3902 -63448 -65389 -63063 -110626
37234 -110626 -221009 -297761 -226322 -46090 85075 98598 61588 23681 -31806 -75050 -29807
37223 -29807 80689 141099 138165 194699 354809 482352 443966 268187 63772 -93010 -136833
37212 -136833 -24750 154697 218960 122371 26588 63039 156460 171536 98579 -10007 -153650
37201 -153650 -309945 -366139 -261583 -106038 -28596 4433 95803 226618 290504 249513 139236
37190 139236 -6676 -124779 -107532 46341 158801 99745 -1273 54711 210044 224534
37180 224534 47510 -99500 -40276 137220 235658 184570 65582 2763 64302 191329
37170 191329 218868 58890 -148796 -180357 -12073 168015 227701 217059 206122 163673 67838
37159 67838 -5007 2582 30928 18558 26013 139778 314897 415823 379751 254055 97830
37148 97830 -67136 -206767 -250574 -156317 18870 140118 109795 -30663 -135562 -109519
37138 -109519 2378 102504 163754 206284 208961 143118 65568 67753 140267 197340 229779
37127 229779 304807 404013 412272 313979 246662 278844 285257 163670 38236 76787 201656
37116 201656 190268 32555 -31292 125965 313324 289127 90578 -53551 -53791 -26522 -44067
37105 -44067 -4464 170091 346744 342898 211789 196564 383924 562631 502046 241797 -5417
37094 -5417 -128844 -149325 -62144 145131 336122 307430 84235 -58931 31219 170845 126175
37083 126175 -43680 -112718 -32749 72158 182573 390965 623008 620758 310167 -28710
37073 -28710 -109989 5118 79130 80678 161439 318669 345467 152244 -89043 -206634 -238819
37062 -238819 -263813 -207226 -5121 178692 136586 -40721 -55270 154534 306595 190377
37052 190377 -31991 -84283 33487 102253 36337 -16971 85946 297595 447594 413066
37042 413066 223034 50962 69628 253545 379311 288618 75047 -75965 -134711 -185423
37032 -185423 -228968 -201189 -134983 -118758 -116608 -15602 151574 219135 140770 50856 47875
37021 47875 90926 134979 182139 170072 18591 -163294 -142898 85149 247623 198426 126033
37010 126033 202636 281144 167019 -21575 -37809 101316 187576 179459 201714 252484 198631
36999 198631 50591 -19339 48561 134137 163970 193044 234553 212948 127174 78246 98257
36988 98257 121311 142853 224446 321823 310455 216640 211001 320335 370193 293456 262133 387523
36976 387523 509291 450293 294405 215459 180863 49241 -130188 -145158 73701 357440
36966 357440 518177 526989 462470 396797 357499 326576 260421 152260 62776 52080 109381
36955 109381 185115 251642 292979 280769 205781 99074 -1382 -59914 -19857 140806 314054
36944 314054 332455 179715 25512 2666 64536 116312 147099 147130 44767 -144581 -237785
36933 -237785 -111427 86248 114983 -36169 -165982 -142316 -8874 143943 257724 283827
36923 283827 226251 183834 226092 271670 219611 132662 127444 154183 90591 1976 60004 209634
36911 209634 192708 -35163 -180124 -29125 237701 324788 227561 161129 210112 260838 220592
36900 220592 117145 441 -102830 -141730 -75417 38824 92308 63762 29506 42233 82027
36889 82027 120821 150282 145414 86169 25635 50687 146363 177701 56330 -130739 -217702
36878 -217702 -152263 -30391 45512 72480 94828 117525 134450 201490 382818 609248 688801
36867 688801 528323 281380 184668 278961 390108 377678 291833 251638 268025 262638 206589
36856 206589 154179 145213 140638 82677 -12807 -65069 -34322 22296 41262 66504 189769 376602
36844 376602 462523 371275 223491 141983 67418 -92809 -234831 -177458 31443 144129
36834 144129 58674 -74951 -132675 -176969 -252050 -239112 -67562 105057 104337 -74 -25871
36823 -25871 40031 84052 97581 149099 184201 90591 -48944 -11356 215643 364498 260664
36812 260664 65082 14348 86820 100272 27348 10283 97350 157790 96083 3753 18181
36801 18181 120512 168266 93331 -18306 -50199 5228 63474 66997 41148 38161 67249 93735
36789 93735 81499 24323 -42019 -52657 25963 133191 156631 71923 -3923 45107 169695
36778 169695 207560 94448 -56749 -111123 -73963 -44851 -57746 -43879 46877 156420 190933
36767 190933 150258 129061 183606 250409 239120 174664 178200 295964 411660 378135 205856
36756 205856 65177 97762 259647 365425 279541 61696 -79060 10411 262949 450730
36746 450730 416851 223949 62401 46012 129146 200625 213033 209855 244878 292100 258193
36735 258193 110471 -28173 16989 246872 437488 385271 163372 41802 153889 338206
36725 338206 357379 199693 76871 145008 323930 426411 389593 302694 248059 220990 213987
36714 213987 266133 367917 408954 312944 161881 85344 79171 50907 -2253 -12036 -15575 -131721
36702 -131721 -326897 -385302 -198617 66058 195255 195241 204936 257709 279585 247408 198215
36691 198215 128374 19994 -68009 -63431 -6013 12914 7703 69814 201755 306177 333733
36680 333733 322322 291028 212672 102644 32342 39054 97805 171376 216203 181634 96040
36669 96040 91394 219003 312815 199985 -17009 -93580 -14328 16443 -47457 -11855 191044
36658 191044 336236 247913 66964 4522 39140 54922 91486 225521 349274 312190 184165
36647 184165 146313 202849 231870 243744 333311 425932 348046 144614 48465 103383 99560
36636 99560 -42777 -113933 20187 155621 63942 -128466 -125856 88146 243882 188962 64149
36625 64149 52031 142128 214741 220829 191276 152246 117256 122223 194862 293922 328292 254920
36613 254920 135348 65463 50836 -1851 -136261 -243167 -191232 -34825 31906 -51004 -121045
36602 -121045 -53742 25721 -67854 -271506 -337806 -180988 22499 106082 116137 166204 226677
36591 226677 182584 30552 -99178 -101387 -1159 93339 99416 35866 16132 132550 325419
36580 325419 421453 337124 177186 78922 37712 -23471 -80726 -37178 97648 193780 190068
36569 190068 180401 259994 377833 411202 329755 219853 174489 205885 251845 243022 174984
36558 174984 112156 94923 67084 -40944 -171875 -179328 -26569 143295 177761 81036 -29403
36547 -29403 -56580 25450 170659 261020 194710 31568 -42252 40593 126696 71649 -46530
36536 -46530 -66931 10676 77321 118456 181229 201691 73672 -130962 -219999 -165546 -122955
36525 -122955 -140019 -73438 131222 297015 279335 188093 190942 238793 162065 -51213 -237371
36514 -237371 -267852 -154599 5458 88378 7941 -173831 -263038 -157685 18833 105240
36504 105240 121542 165944 197479 112406 -19536 -7739 167031 305417 273021 164097 121617
36493 121617 137750 117449 36880 -49580 -101847 -130165 -167952 -227827 -252856 -134880 146497
36482 146497 426610 497878 345925 144480 24815 -26971 -43616 -3990 65838 64826 -29309
36471 -29309 -97715 -59171 -3108 -42409 -126534 -122381 -22515 48171 11119 -78614 -121400 -81422
36459 -81422 -2913 46071 51048 73588 158215 233688 198162 104271 124680 285191 382830 271088
36447 271088 86523 45860 134203 178531 150167 177529 280037 310362 203347 93432 103753
36436 103753 162796 123720 -35731 -211121 -286738 -194387 53250 321315 428272 337748
36426 337748 211154 209668 316225 416407 469310 502758 503084 422881 277704 146790 85343
36415 85343 95277 155358 215570 195496 68852 -69734 -101430 -33835 23582 23933 31622 95171
36403 95171 160150 147476 55062 -60877 -158274 -216554 -202095 -81532 118089 286884 305909
36392 305909 174035 47681 92699 275480 372838 243550 17846 -72043 11278 106796
36382 106796 113505 97811 126031 142751 80388 -31240 -139147 -244123 -322964 -278923 -73056
36371 -73056 178436 342333 425684 487181 482023 344636 163520 100862 158205 186808 126598
36360 126598 65043 44615 -5464 -96205 -117317 -32234 29655 -16767 -62595 1035 79226
36349 79226 33790 -60918 -22425 138554 227876 168755 98218 136319 234887 310435 370442
36338 370442 426232 409742 279213 121120 52226 76666 111969 105158 63954 26217 50041
36327 50041 172215 322262 349039 202176 19086 -48454 -27180 -45270 -124599 -175854 -169683
36316 -169683 -172235 -197325 -153352 9937 197143 276069 231579 153100 112517 111645 127438 156825
36304 156825 211117 285294 338547 315283 202721 55887 -60438 -136444 -187514 -190605 -120789
36293 -120789 -34965 -19771 -37286 64814 320748 522321 446690 163530 -21516 56308
36283 56308 225937 226731 50438 -81695 -48787 6493 -99419 -312787 -406961 -287101 -94987
36272 -94987 12095 54748 129767 228999 279140 284061 284370 226502 43531 -146268 -117940 134579
36260 134579 336965 292052 131675 83891 144547 160850 128612 184378 339545 435231 381589
36249 381589 266070 183696 112990 17979 -54604 -46712 37342 173438 338807 456640 431578
36238 431578 291342 184892 182213 185856 108992 25685 51162 173127 304042 407263 457124
36227 457124 367111 108188 -157351 -219560 -82762 56845 89264 100665 184642 286861
36217 286861 301609 220566 115088 41874 27539 86743 190134 252470 211744 103693 21206
36206 21206 16479 66860 111550 93998 -7921 -157958 -274698 -295884 -234321 -161057 -133230
36195 -133230 -141407 -127394 -55917 34819 70273 31334 -15189 7372 102827 214180 290731
36184 290731 315644 292331 239312 184487 136222 74444 -9382 -87378 -129424 -127717 -66963 76722
36172 76722 266813 391330 376058 272989 185889 159941 198301 309516 448756 489185 374318
36161 374318 236101 217485 235683 109388 -105540 -140051 83112 299046 266424 83212
36151 83212 -16256 -8004 -25719 -87027 -100694 -85439 -151495 -269884 -276107 -143226 -57494 -144884
36139 -144884 -284992 -297513 -178008 -28956 126747 308087 424902 348083 132696 6411
36129 6411 77638 181857 107960 -113516 -261868 -215451 -61958 73869 177740 269637 294476
36118 294476 196517 52796 20870 150398 325341 404304 351161 212456 40015 -116527
36108 -116527 -188529 -126799 33839 183062 230440 193860 178952 251000 338279 309733 158082
36097 158082 37708 74265 201630 263362 222070 167447 152436 144034 129924 142157 151286
36086 151286 68454 -92748 -176568 -87133 69288 139596 139810 199998 342222 439929 399312
36075 399312 277041 185228 151763 127350 95693 107392 177162 196110 35220 -243715 -381685
36064 -381685 -215931 91876 243917 174824 79977 98683 158413 166083 158655 179379 180038 156857
36052 156857 218434 382046 460650 325805 145938 154364 281929 257786 26893 -174892
36042 -174892 -165804 -15786 136495 258451 346156 350470 279195 244260 314993 420069 462390
36031 462390 435440 365537 244334 98072 31734 108024 239013 281208 203666 102645 81642
36020 81642 160031 266204 291417 192545 62362 42153 143726 228629 194319 97680 41354
36009 41354 22650 -20143 -73554 -66285 1785 47264 29256 5818 33783 78508 82178 86866
35997 86866 203757 432863 589512 503054 268756 181348 369669 606381 584431 310093
35987 310093 83655 111093 278939 344538 226709 40759 -71611 -66721 9710 89693 136182
35976 136182 144915 100092 -34551 -240011 -395555 -382864 -224281 -46190 80405 178983
35966 178983 258836 274081 215094 150788 141960 174082 195510 165940 70034 -44967 -59744
35955 -59744 91093 290481 350969 258358 174952 187915 206567 150095 72669 25649 -41268
35944 -41268 -127398 -80529 190096 499066 555046 306634 -15548 -172920 -123083 17174
35934 17174 101028 57400 -48437 -79541 -8302 28185 -72270 -205960 -207619 -97356 -40983
35923 -40983 -98558 -156757 -108528 24952 159886 232301 210154 118281 52482 83346 156785
35912 156785 172858 130326 88069 24401 -122257 -288790 -325794 -223635 -148096 -202811 -290034
35901 -290034 -266308 -120797 56810 177220 173545 42449 -83327 -33931 158570 259392
35891 259392 156127 30819 77049 194903 157178 -26108 -136870 -101046 -75303 -154894
35881 -154894 -211420 -110549 73250 173195 148070 75017 11838 -25309 -12632 44061 67948
35870 67948 10951 -40056 32562 184378 241121 139076 17723 23920 120949 167842 118696
35859 118696 50004 26552 39355 75058 152356 253461 287901 183847 -11054 -167144 -203577
35848 -203577 -151989 -98014 -88552 -97717 -65508 30893 135486 154633 56376 -83912 -158435
35837 -158435 -135038 -66918 -16314 -12796 -70482 -173568 -229907 -124050 120597 293759 205371
35826 205371 -78705 -297122 -289342 -143365 -34961 -21811 -47976 -62687 -53040 -16122 21042
35815 21042 -744 -76812 -89258 51758 258818 369300 364005 353823 368751 326062 233839
35804 233839 244114 410805 546246 454182 204677 35154 42825 114307 123957 70478 25186
35793 25186 49883 161965 298456 334480 220647 74141 44493 122943 186228 193190 212584
35782 212584 270940 306110 283804 243258 212094 183873 186534 253149 312343 240252 52854
35771 52854 -83580 -76068 -9521 22014 48704 110586 142095 82827 7155 25952 122393 189722
35759 189722 187408 170607 194785 255020 290901 220903 30135 -155071 -173820 -45374 42340
35748 42340 9077 -7685 84806 137503 -1628 -193513 -181419 23225 176358 190313 221301
35737 221301 336420 362162 181604 -36762 -75039 22173 51781 -36068 -117428 -128095 -128226
35726 -128226 -137827 -80260 66748 198913 229986 208570 219517 250545 241910 209040 213379 232940
35714 232940 165300 -17940 -195946 -223563 -92053 79377 197935 299472 470485 676284
35704 676284 721817 458391 27008 -215640 -87702 191368 278240 133297 8758 53415
35694 53415 143280 137644 86478 82413 88599 45717 3646 12652 16235 -18017 -2825 94895 144230
35681 144230 80198 73087 266668 518428 632237 669095 761801 844546 930460 1412131 2526528
35670 2526528 3621450 3625691 2386583 948691 272128 231569 204368 79431 145672 366367
35660 366367 394186 171659 -7296 649 47221 44045 84733 188928 230160 161392 80939
35649 80939 60047 91251 174290 274880 269722 119320 -3752 42183 128325 88065 30457
35638 30457 130870 255078 137973 -162035 -346807 -345449 -328324 -309599 -135960 135865
35628 135865 252466 186131 161670 227071 192459 45163 2803 67631 -28225 -296104 -362487
35617 -362487 -70717 219768 192053 32112 38754 145050 162566 166328 263483 270749 27361
35606 27361 -211905 -123152 136153 164785 -30917 -86273 83806 165895 4196 -151724
35596 -151724 -77937 89499 115882 9055 -71462 -73998 -71814 -116770 -171662 -138701 56511
35585 56511 340050 485815 351713 86235 -28221 97797 322413 503378 598619 582749
35575 582749 463467 369952 424032 514606 404250 89109 -157534 -160612 -57186 -43111 -101443
35564 -101443 -122107 -132271 -224760 -342120 -311907 -84728 192562 350140 348613 251624 137085
35553 137085 75709 127895 282235 408229 351233 117304 -91032 -90585 69019 195456 224301
35542 224301 264870 368037 417013 330751 225817 242761 319880 293456 154363 49485 64225
35531 64225 147333 233063 304053 337176 307949 256723 253827 298944 336562 351699 364730 361846
35519 361846 324423 291020 289920 257804 144604 47880 96634 240496 322380 340657 448500
35508 448500 675883 848777 848567 783592 821057 991870 1248131 1582989 1994705 2432334
35498 2432334 2852399 3220066 3390800 3150089 2505811 1813469 1435038 1343555 1233223 964218
35488 964218 697166 584761 541283 410674 213323 90522 80682 90722 75185 117508 288008
35477 288008 501613 591708 501908 341142 243876 229088 225589 197654 190069 243265 307460
35466 307460 282867 147533 9723 -3858 96243 169085 124967 42546 50386 139732 184041
35455 184041 127999 53266 36930 43894 9761 -46863 -55915 13402 142167 290120 390337
35444 390337 373044 246653 106137 19510 -33936 -74477 -60072 16039 55392 -13236 -96828
35433 -96828 -54495 85914 150407 49862 -119538 -212096 -175986 -53125 76763 134959 101012
35422 101012 48803 61757 104067 51849 -124477 -286792 -292156 -178073 -112946 -172681 -242841
35411 -242841 -184701 -44421 -2455 -111040 -198378 -105618 85251 181603 151745 99596 33211
35400 33211 -117711 -265921 -210634 23998 159185 80315 13903 118284 179904 -17982
35390 -17982 -264282 -207867 73441 176927 -8737 -176925 -118053 6601 11024 -17251 65429
35379 65429 187816 201608 121666 54424 11171 -49996 -86737 -18385 141846 298873 377211
35368 377211 350331 229804 82994 8512 51306 181583 352443 501455 516354 329495
35358 329495 62686 -56795 35144 175462 214248 186350 191576 239205 289832 339382 378074
35347 378074 354554 252530 129742 35474 -28392 -38790 43691 166723 212682 184145 222617
35336 222617 369084 452469 327028 98184 -17506 32314 125545 159782 134103 85165 51877
35325 51877 74303 142893 181018 147815 114134 162239 253955 280607 215457 137275 112309 118909
35313 118909 98121 38657 -9017 -514 35369 32427 -3438 13078 104193 165360 124651 73498
35301 73498 117573 184650 139104 13472 -63176 -107229 -227948 -368932 -353477 -188065 -60484
35290 -60484 -16439 81153 228957 234917 87478 47317 218118 340616 215018 31917 36802
35279 36802 132893 101775 -7299 -12587 61092 83606 101547 213525 303467 209374 38097
35268 38097 1366 52265 9245 -65002 34500 245255 299463 168037 83870 129650 159495
35257 159495 138183 188737 267676 172977 -53853 -117180 33053 75673 -148902 -351405 -255038
35246 -255038 -14874 75441 15981 -27875 -47385 -105267 -121600 -18835 74967 23902 -57537
35235 -57537 3317 120934 96363 -24100 -10845 183428 370767 412535 339529 213998 74490
35224 74490 943 53524 162264 225001 260825 312918 295602 147659 48177 213926 520890
35213 520890 612283 396192 155058 110203 160781 156943 159491 257368 341151 264254 93022
35202 93022 5190 27878 43451 -3306 -49084 -30779 46364 131344 150814 63509 -54459
35191 -54459 -60842 56805 142984 106911 61187 117076 184974 140579 59454 76539 111869 -11166
35179 -11166 -224310 -272173 -124732 -44893 -163770 -260984 -113668 166603 332469 355955
35169 355955 382495 466223 551770 613577 630245 535709 385056 421008 728392 986311 925706
35158 925706 923455 1636231 2950136 3801592 3352537 1996739 838440 427137 421913 341823
35148 341823 143320 2502 -48338 -64586 -22456 94105 184787 161583 84331 54679 64069
35137 64069 45281 -3725 -40377 -60840 -83173 -94734 -77375 -41039 9482 85278 153946 140224
35125 140224 36884 -50817 -30027 63700 128132 122123 82465 61339 93771 181398 266339
35114 266339 267856 183275 103428 93676 113230 82593 -29264 -204573 -377215 -408613 -188983
35103 -188983 162295 321514 110036 -263600 -436924 -300970 -44783 135436 199941 167751
35093 167751 46311 -101534 -168744 -142865 -126076 -170636 -198234 -132061 -8126 101504 179263
35082 179263 210472 139510 -29068 -158817 -118591 43909 158657 142220 66175 29239 46152
35071 46152 74004 77494 40136 -41235 -140252 -203749 -197031 -139240 -80505 -46155 -12038 58305
35059 58305 155556 225886 244386 255746 301945 339125 294742 193526 135547 138488 109626 18205
35047 18205 -21304 73103 192473 183639 82383 46508 91686 65706 -99161 -270643 -306600
35036 -306600 -224622 -117091 -23562 34564 17804 -30449 35977 254054 420078 330653 81967
35025 81967 -57785 -33930 -44248 -174254 -231154 -54318 202444 275996 159243 62257 69752
35014 69752 52068 -70860 -181809 -166820 -102065 -109057 -134837 -42732 128844 182501 56663
35003 56663 -67076 -30529 71314 55274 -62873 -119713 -90345 -119357 -243359 -284526 -119764
34992 -119764 104962 174067 104800 82704 158734 193259 99086 -23705 -39814 50824 143541
34981 143541 150043 60848 -42834 -34193 118472 262274 221184 45834 -40789 28252 64248
34970 64248 -66539 -208670 -146653 61097 170594 108370 38850 84026 163695 159313 84334
34959 84334 17403 -20814 -39225 -6290 99084 209845 227333 143867 49868 21671 49405
34948 49405 82393 104981 140386 196228 241834 252918 252323 273015 294562 265357 190687 139023
34936 139023 138053 128883 69382 22065 69383 186190 277986 314831 334879 332987 257696 135854
34924 135854 88057 161582 231136 145104 -74244 -249743 -247442 -96975 72482 160394 157181
34913 157181 123717 125857 174863 232196 274917 324062 381689 381101 264445 95682 17266 76209
34901 76209 167559 188361 170176 188861 214575 167147 85437 95111 189095 194787 37919 -101051
34889 -101051 -29730 154786 182109 -10239 -194069 -169688 -1125 131972 176013 195750
34879 195750 223661 234597 223292 205663 160971 54417 -81499 -149415 -91712 31258 87835
34868 87835 13470 -99695 -93526 53541 184011 182276 144815 205339 283238 213313 81069
34857 81069 154485 438019 590271 422282 195832 207600 327304 252471 40805 21578
34847 21578 250168 420616 342742 174805 102661 78386 -625 -91324 -119799 -108247 -72199
34836 -72199 33053 163466 174398 68386 48809 186988 255396 89153 -91642 13474
34826 13474 302243 397687 200306 5250 44249 185809 186279 30892 -100614 -75114 94181
34815 94181 296821 393491 310991 130566 16295 20544 44408 23625 40090 174518 346250
34804 346250 402685 310119 160712 32684 -59806 -102072 -63730 41115 147188 206432 218710
34793 218710 195238 139959 69065 2762 -64994 -143797 -195058 -159927 -52274 34274 42698
34782 42698 26622 65171 141808 164623 94199 -2295 -32794 20686 98871 137864 130726 128646
34770 128646 190404 324600 476285 570931 570981 493445 384780 283118 197210 123158 86130
34759 86130 137884 274040 380041 338365 195121 123219 181374 220810 117950 -8081 42699
34748 42699 235228 326424 207314 40815 10504 90223 146289 137538 107754 76642 51393
34737 51393 82352 202403 347862 417714 380601 277742 178782 175547 325009 527779 566698
34726 566698 369554 142065 118737 263040 352698 289992 164114 52769 -54509 -136225
34716 -136225 -112139 29036 200515 333093 405285 370486 207017 47044 77836 267536
34706 267536 362174 231645 52030 37200 145304 198740 169264 158248 162775 63258 -147739
34695 -147739 -292449 -224824 -14935 148979 175449 122922 78460 54711 16185 -38082 -61490
34684 -61490 -32943 -3870 -32143 -85575 -71220 24927 91483 36156 -67079 -57594 82983
34673 82983 169996 46379 -179933 -236014 -31880 205554 222567 70204 12625 149653
34663 149653 301474 289034 153590 18464 -105724 -243132 -301754 -171956 77993 255885
34653 255885 272797 199735 130916 107890 147501 226079 261333 217347 185362 244438 302529
34642 302529 225168 68842 7629 57426 67797 -16301 -89373 -105722 -158330 -278543 -345157
34631 -345157 -274893 -146762 -62283 -26524 -29479 -91242 -160195 -124754 2117 70656 35448
34620 35448 29592 114643 156155 68387 -15682 27397 99953 81218 63432 174253 308080
34609 308080 280193 148918 126249 219739 220484 46752 -135128 -171576 -105387 -41109 4750
34598 4750 41163 20577 -86431 -204550 -215965 -89801 72659 113688 -35622 -261025 -358600
34587 -358600 -253554 -67219 61619 125329 165213 164570 119767 99863 117095 57734 -115120
34576 -115120 -215864 -80905 146425 197973 77052 29044 148668 273690 284492 256456
34566 256456 254837 210242 93045 14579 45012 92516 67764 23608 31781 58364 63791 97606
34554 97606 186980 245456 195182 76516 -50084 -192393 -325538 -338913 -204626 -73999
34544 -73999 -70678 -104974 -42986 57989 64614 17136 48732 119688 71069 -72475 -104922 13913
34532 13913 58693 -107142 -291112 -250300 -53178 39232 -30868 -56250 100635 296167 302850
34521 302850 109383 -67499 -35286 171755 342014 312732 135144 5483 38352 149311
34511 149311 184088 112528 36317 38665 103307 173594 214407 206917 153906 108885 134600 211631
34499 211631 252709 229089 209854 244733 287685 285462 264994 267902 264856 208879 120484 49669
34487 49669 4502 -17449 9947 74776 95231 47433 47987 192726 384113 454963 400207 332061
34475 332061 268351 156522 65597 123660 257170 235098 28784 -110719 -32337 87094
34465 87094 35860 -118175 -186199 -160012 -147305 -134809 -38765 89797 126997 95784 118430
34454 118430 176511 127974 -23280 -73964 99732 361378 493052 451136 365796 352405 398388
34443 398388 419605 383132 347550 361371 350258 195858 -54184 -177791 -59524 132959
34433 132959 170210 59701 -24131 -26527 -44327 -107119 -120068 -38874 67222 156665 263565
34422 263565 364998 356028 223554 109607 121171 190800 207983 183238 187898 220391 234005
34411 234005 227071 204818 115615 -60751 -208886 -192129 -55434 19130 -26053 -43775 81354
34400 81354 244975 277776 193141 139920 164848 190836 218220 347087 542783 582895 369686
34389 369686 124103 91274 198980 230140 205031 294583 420865 307435 -26316 -189292
34379 -189292 7769 228718 101464 -226525 -318851 -68891 221366 297982 204859 99443
34369 99443 62611 107911 193695 211997 108552 -1648 27267 158278 239069 229618 201115
34358 201115 163044 76053 -59 35842 138537 173125 143875 172266 250966 224418 40336
34347 40336 -165895 -271172 -279971 -217730 -85207 51116 95684 80991 117168 166027 63744
34336 63744 -190037 -374173 -346539 -203380 -58047 129189 378090 536466 465550 250826
34326 250826 84357 35117 50260 81589 99288 75236 51743 126934 280073 328231 163963
34315 163963 -80946 -226135 -274669 -315513 -317670 -206173 -61096 -35756 -104551 -86245 70870
34304 70870 204932 186888 96876 75684 117875 117614 53460 16572 65759 142576 158462 113982
34292 113982 87308 122643 173911 166359 83901 -17892 -65097 -26281 53859 82703 22859
34281 22859 -33425 44277 244916 403019 394308 262323 113628 -10320 -93852 -92558 -17416
34270 -17416 21554 -34521 -86386 -31996 66094 95713 76023 75261 52288 -45136 -125634 -97624
34258 -97624 -66997 -159749 -247985 -140759 25691 -60732 -350790 -431347 -145848 154921 146205
34247 146205 -23837 -46861 72370 131208 103846 108931 143650 124642 100410 171530 263688
34236 263688 214680 50403 -39387 15769 97782 107783 70840 28110 -20091 -47233 -10769
34225 -10769 50533 44809 -28976 -70940 -37587 -12526 -78524 -186364 -201321 -59785 144615
34214 144615 236453 130298 -81185 -239979 -302568 -343778 -398268 -401295 -308207 -171091 -57480
34203 -57480 14219 23146 -61956 -187183 -220207 -121811 -11315 7242 -23037 -33295 -63728
34192 -63728 -160118 -230905 -151094 36965 157717 127011 41415 36940 129115 209833 173357
34181 173357 40333 -49825 5944 152138 260927 299299 313305 284613 152199 -19121
34171 -19121 -57154 82102 241441 280812 231930 180347 140593 120187 164655 256647 302250
34160 302250 290980 328437 439183 499710 453442 411682 426487 355105 110783 -125044 -138489
34149 -138489 -56 56597 -26746 -115353 -129311 -113851 -102618 -79439 -53102 -40159 -9490
34138 -9490 49222 65636 4318 -45242 -13262 14455 -55995 -145277 -128478 -51176 -36893 -52620
34126 -52620 39142 236983 392741 422294 360810 238472 70304 -48542 -7928 146120
34116 146120 240633 182522 32783 -97257 -114409 39299 302481 474652 427871 296574
34106 296574 300964 423049 440732 271484 89058 65138 162442 244880 263916 266985 306301
34095 306301 391480 480503 498717 408474 251704 89546 -55604 -154585 -149802 -59551 -17260
34084 -17260 -97859 -184718 -134005 6397 86418 90094 112595 151931 115629 27055 36577 190749
34072 190749 344288 356759 262893 196627 229547 322459 376444 313045 149387 -6020 -61726
34061 -61726 -19375 76977 193322 266523 212942 50848 -80199 -98607 -71024 -46164 50813
34050 50813 233176 323533 192386 -6100 -43858 44701 63097 2294 35466 199455 326305
34039 326305 298642 171024 37628 -36278 27318 228605 374975 268635 7372 -111923
34029 -111923 5654 161399 183489 115953 53456 5240 -20475 7215 26330 -71412 -230782
34018 -230782 -260469 -120767 13141 34116 41811 116956 165459 105674 31090 51855 117870
34007 117870 125791 78734 26223 -35995 -95089 -65257 77114 197494 160905 14127 -90420
33996 -90420 -88915 -35941 -25 -10396 -58039 -85344 -24035 108532 209546 226421 218745 241146
33984 241146 250899 196977 121222 86329 60483 -30942 -160303 -192821 -49296 171907 272048
33973 272048 152461 -80896 -229141 -197595 -47112 118447 229876 229618 103795 -21748
33963 -21748 40685 282421 452254 376903 190974 109226 111088 39645 -102677 -183905 -193550
33952 -193550 -226196 -254665 -165102 -15026 -10532 -185566 -325270 -274903 -131780 -51396 -33253
33941 -33253 6022 77124 124095 98079 -20873 -189983 -276661 -171269 54273 198489 146907
33930 146907 -51144 -286899 -448317 -414222 -162205 120163 196105 67130 -45385 -8960
33920 -8960 86142 113988 74945 38627 56103 147847 264182 270291 99026 -109778 -166050
33909 -166050 -84311 -19904 -6273 44653 125466 145419 135552 200797 280226 216013 63830
33898 63830 45644 158953 146422 -58875 -177729 -26264 176728 149706 -38998 -131864
33888 -131864 -83065 -57847 -132396 -208332 -185932 -69906 75047 179602 213726 229179 304921
33877 304921 424988 491755 472954 429895 393295 339126 292413 304411 318822 233741 112763
33866 112763 135759 299573 381136 272097 142214 168951 293005 355639 311162 191006
33856 191006 12764 -162324 -220376 -144303 -48057 4307 64341 130186 103016 -3814 -16174
33845 -16174 122572 220827 127614 -31634 -68510 -10092 19662 48192 171960 324188 338633
33834 338633 204588 80119 66773 119132 175355 241137 308583 289535 104316 -178835 -354351
33823 -354351 -283708 -73454 40122 713 -4962 141032 283217 246595 131829 140320 231639
33812 231639 211857 74595 -19908 -42633 -89775 -135397 -95059 -85529 -274444 -496205 -409045
33801 -409045 -62703 104589 -77563 -274980 -207489 -29078 52307 139292 355706 524291
33791 524291 444477 245769 174494 225829 241357 188278 110911 -11399 -139162 -99311 136267
33780 136267 289776 136407 -148382 -244283 -131004 -30773 -47950 -119448 -210552 -308943
33770 -308943 -304056 -106526 158368 269156 183908 51468 3149 59563 173361 246252 179217
33759 179217 9563 -84623 -3845 142764 196393 125623 -11863 -146607 -179925 -49167
33749 -49167 125509 133390 -17546 -71876 108822 346109 408789 293895 144091 58522 77096
33738 77096 186023 267516 211975 115534 163619 301564 278796 60197 -94255 -29640 118371
33727 118371 220487 326715 433879 390329 169397 -39826 -128488 -176469 -188688 -53425
33717 -53425 148486 164102 14588 25158 265129 385667 212483 59187 184587 355511
33707 355511 274442 78954 60455 178882 204526 115043 48577 49196 92421 175491 215759
33696 215759 86536 -120012 -142663 31812 129811 63597 54641 178602 230698 178991 261703
33685 261703 459318 397596 7088 -252811 -97533 177125 267989 300239 391261 341963
33675 341963 105526 14047 185664 256343 47647 -84024 73565 184725 38180 -27462
33665 -27462 188502 299646 56331 -140622 39724 280735 274490 276969 481237 543650 278947
33654 278947 93279 185425 121496 -237672 -290768 196360 515675 249545 33255 317262
33644 317262 507676 215540 134215 673209 1028709 730871 686210 1420082 1885683 1499389
33634 1499389 1545262 2754906 3552849 2995428 3134207 5441133 7487972 7553205 10180058
33625 10180058 20747458 34809500 39999178 30942040 16358094 7843198 6716599 6524688
33617 6524688 4167210 2278138 2562396 3070190 2436923 2054943 2902361 3695510 3374017
33608 3374017 2739685 2566964 2288226 1508721 959833 1073252 1176882 833969 584138
33599 584138 749276 809803 512461 377036 607782 655822 315663 143302 354111 394695
33589 394695 49834 -89244 260568 501110 217858 -97717 64381 428143 540738 477013
33579 477013 450945 359761 153979 89967 240926 293410 130377 67504 244315 347277
33569 347277 202750 85747 179857 275558 252448 322392 550908 663788 566469 547941 753877
33558 753877 964932 1096277 1393011 1922592 2398562 2722518 3171781 3811302 4233389 4143941
33548 4143941 3743456 3296328 2788610 2237424 1864387 1709087 1502239 1147911 905504
33539 905504 891868 852140 638954 467792 470530 444467 285017 226787 397873 553636 510244
33528 510244 437180 466680 422330 208163 73345 197747 368817 348462 226070 150331
33518 150331 53931 -92249 -93524 121254 286336 207454 74555 95093 129649 -4187 -152865
33507 -152865 -82213 116050 190308 123435 76138 81086 45176 -53947 -168704 -274448 -325952
33496 -325952 -249731 -81478 38927 77273 122823 152016 21601 -230016 -346538 -226311
33486 -226311 -71447 -54380 -96005 -90076 -83521 -107863 -86623 -31938 -80305 -221038 -252565
33475 -252565 -119451 -17050 -44491 -43289 81431 165636 70313 -96100 -183212 -184655 -108265
33464 -108265 74223 245164 198590 -11291 -83333 61615 158733 66586 -13467 53540 93185
33453 93185 -2648 -38714 91167 141511 -58903 -256958 -179844 14155 42857 -11105 96673
33442 96673 288758 279366 45789 -157577 -169072 -24312 202946 403140 392953 141584
33432 141584 -71012 22358 296086 420525 320784 186873 123101 67144 7268 15279 72453
33421 72453 81474 48620 71267 154568 201627 171262 107965 44915 4373 50076 207138 368377
33409 368377 405657 343796 316072 380493 477897 541265 561300 564802 581818 607069 576531 439109
33397 439109 251979 120561 56143 7196 6954 126312 286557 316260 218641 172729 225612
33386 225612 212803 60511 -70135 -57448 -17647 -85668 -190894 -206779 -159486 -135129 -120305
33375 -120305 -71812 -15031 43010 161605 322648 389200 314402 234504 244215 246941 151178
33364 151178 44692 29457 39172 -25512 -114233 -127384 -82880 -49482 -20427 32193 81850
33353 81850 117367 171617 208578 125111 -60517 -181708 -162596 -113135 -113936 -107502 -88057 -163399
33341 -163399 -301385 -261320 45036 347285 374248 221683 150018 198835 238627 251281 305326
33330 305326 358022 318209 231290 199510 193512 128446 43561 20148 5623 -87188 -180298 -129004
33318 -129004 34107 143292 146572 129435 127447 96283 55860 93195 203986 266539 201345
33307 201345 65283 -24365 3711 129844 251413 269119 207900 191019 249135 251277 107467
33296 107467 -58258 -59251 93626 216918 214147 182416 242037 359802 399378 306712 181917
33285 181917 148433 194876 211226 165657 140160 166251 160382 97637 101978 237443 354553
33274 354553 315981 241478 317565 479723 528764 469584 460833 494527 421902 264625 197374
33263 197374 230568 216905 175097 278582 487063 525907 311352 86236 44833 117311 206483
33252 206483 329213 428115 361101 197497 213155 455499 616151 483153 227593 90464
33242 90464 75363 110543 227086 400976 482986 446216 446825 511665 459709 263951 161171
33231 161171 247013 311407 251702 270284 444704 499809 284289 87873 164929 316301 304786
33220 304786 317368 585675 871379 812634 532514 411555 459573 421310 346092 508872
33210 508872 837428 956023 814231 775614 1002552 1201961 1114579 868308 679058 531467
33200 531467 354294 249947 328713 485206 536571 478347 441641 462807 443939 333416 228586
33189 228586 249011 370907 475396 546572 686513 875056 889480 635364 402597 522105
33179 522105 864969 1011232 870434 750331 791949 773361 591506 496668 634308 754906
33169 754906 648327 506058 547227 615953 498331 356249 467487 749158 905217 875599
33159 875599 797577 681632 472145 304596 365788 577587 704461 698937 694839 748178 806691
33148 806691 836055 790673 600797 360092 326706 541130 681381 536025 357210 444401
33138 444401 637179 591695 356316 269028 412036 553099 553472 496447 465840 481670 588909
33127 588909 767476 857027 792771 762806 900649 1022383 939459 808098 847358 932491 836499
33116 836499 676397 715705 883779 907723 798173 789546 891328 901921 798057 731668 709440
33105 709440 638045 603541 735609 881077 795319 580530 546419 706532 806276 785306 804568
33094 804568 862607 803017 684334 732127 916732 968151 828581 720958 747095 771097 727438
33083 727438 716260 772548 832416 906352 1005226 981693 768679 647148 877446 1188251 1109603
33072 1109603 736194 619993 901045 1113850 964629 752079 806721 987391 1010533 912335
33062 912335 897619 989144 1066959 1066739 969871 763507 524954 389961 378981 416822 520554
33051 520554 751983 997408 1054199 947904 904286 992096 1055523 1016594 977279 995623 1015790
33040 1015790 1040864 1126897 1193560 1086016 834841 631835 570280 625349 813158 1104802
33030 1104802 1274625 1145615 911812 891013 1033049 1029118 842655 740665 828700 952135
33020 952135 1053970 1232553 1427001 1437356 1290564 1209100 1191273 1016373 703549 550155
33010 550155 635450 693716 597050 578755 820729 1151478 1322095 1314319 1235796 1140158 1057541
32999 1057541 1005805 915775 732817 590142 667630 904965 1081547 1131676 1147355 1156814 1162633
32988 1162633 1284654 1566488 1766343 1663939 1431559 1351196 1344914 1200521 1066150 1209444
32978 1209444 1434698 1314033 923356 757790 933591 1072283 1012397 1032703 1260843 1427954
32968 1427954 1373179 1293473 1325311 1322785 1202907 1109863 1116424 1130555 1159531 1290034 1393924
32957 1393924 1267137 1053409 1085828 1329216 1457340 1446865 1560263 1756418 1700173 1391919
32947 1391919 1208431 1260341 1278075 1188003 1216084 1361291 1367802 1281411 1408111 1656276 1591767
32936 1591767 1244865 1154323 1453989 1635124 1435465 1259083 1430359 1684827 1715939 1642960
32926 1642960 1635739 1607921 1540608 1604105 1760941 1761639 1665865 1804189 2135886 2284827 2283903
32915 2283903 2554245 3067110 3370697 3584843 4389501 5711246 6421542 5851861 4731675
32906 4731675 4051188 3795116 3428787 2909986 2519951 2255632 2031946 2026781 2293718 2478005
32896 2478005 2365102 2244711 2343431 2415857 2277200 2191655 2346650 2489740 2451603 2470296
32886 2470296 2658089 2729849 2584933 2569413 2881199 3323209 3831570 4520806 5048701 4816896
32876 4816896 4029433 3606153 3790247 3872609 3571597 3502504 3881249 4040491 3784133 3915675
32866 3915675 4734027 5305825 5028453 4634422 4774956 4902560 4526429 4277979 4650580
32857 4650580 4940992 4587583 4317501 4764408 5198099 4898009 4523703 4774987 4985170
32848 4985170 4490711 4079408 4522383 5006597 4685270 4393196 5023516 5663464 5331906
32839 5331906 5045246 5947052 6985272 6926419 6949024 8351983 9559173 8916882 8538591
32830 8538591 10965644 13892713 14151617 15942787 27219948 45908754 57504287 51434839
32822 51434839 34369459 21446502 18343002 18670616 16470529 13320785 12488437 12959303
32814 12959303 12271308 10908396 10640633 11132753 10987488 10429049 10563653 11144431 11145748
32805 11145748 10774939 11074552 12005240 12573561 12634943 13060685 14102885 14986749 15399566
32796 15399566 16133773 17731745 19591017 21177173 23182127 26449267 30505177 34511861
32788 34511861 39262516 46702817 57658326 71932724 90922396 117778263 153587260
32781 153587260 195143947 237966690 279386875 316058010 340217993 342869129 321992337
32774 321992337 285452152 244922344 208387045 178198458 153199993 131054833 110408570
32767 110408570 92444625 79339229 70636960 62977865 54288145 46140806 40602201 36853486
32759 36853486 32884640 28773607 25923888 24212300 22277604 19959611 18234178 17111504
32751 17111504 15633770 13769713 12456697 11826903 11070281 10032740 9377496 9147059 8654830
32742 8654830 7850041 7371337 7186206 6571193 5552328 5003692 5134670 5170192 4748720
32733 4748720 4395326 4351109 4137270 3609071 3324417 3496361 3590726 3319110 3088702 3131743
32723 3131743 3091329 2804518 2643375 2758205 2787012 2597445 2520949 2596302 2402759 1922090
32713 1922090 1739319 2063436 2343621 2209070 2026109 2138383 2273076 2121923 1876064
32704 1876064 1774555 1686107 1509594 1467399 1664318 1834701 1806929 1753520 1764037 1665378
32694 1665378 1458765 1413128 1536339 1490446 1213661 1067843 1181488 1228066 1064510 994151
32684 994151 1157463 1257070 1154906 1151958 1372543 1444524 1135372 780913 728237 834256
32674 834256 861992 911631 1099743 1230185 1137847 993989 963083 913858 748902 656686 760733
32663 760733 867538 821359 768954 835606 885215 831118 835676 973316 1038527 911378 780655
32652 780655 794832 822373 757234 732047 832669 915672 883452 838788 834365 784532 717900
32641 717900 766356 837789 701302 455395 453398 692390 788728 661853 673515 923914 1011352
32630 1011352 740572 483545 524062 601051 464838 364261 566996 847782 875862 728299
32620 728299 634445 573578 483025 502248 663141 698853 492818 343443 454327 563842
32610 563842 435742 301785 419769 593026 556073 458507 520845 575216 420061 288649
32600 288649 463385 725358 700206 491801 462653 613200 684377 673545 746241 813068 690030
32589 690030 523120 568144 696769 610795 407310 418359 597716 599232 405676 343349 474000
32578 474000 498960 328547 251189 414776 575934 520744 365170 278647 235916 209375 316098
32567 316098 581346 780211 707107 457293 292186 329603 474891 577518 575056 528219
32557 528219 545928 646604 718085 658999 503888 352187 255307 242533 347698 510023
32547 510023 562356 438992 291066 274860 336576 337108 276793 252026 286926 343792 407024
32536 407024 440425 374797 252867 252314 438132 635537 682106 647004 650626 641692 538826
32525 538826 431729 434021 471113 417304 319467 291452 315954 340363 419742 556978 567038
32514 567038 351089 153306 255087 530580 619481 467549 366950 475622 617049 605620
32504 605620 494185 408303 348890 261603 154008 65467 24750 71470 217050 369355 402580
32493 402580 319192 250055 283078 373156 428402 414971 365878 328954 310462 267638 186247
32482 186247 140041 193426 274790 275128 251986 355763 541103 569215 365043 156272 151529
32471 151529 279597 368031 387192 381509 341308 286209 305986 384393 359157 189024 67785
32460 67785 129345 243460 262742 255946 310172 318251 182094 37375 51444 165965 246759
32449 246759 308589 382886 361706 205737 108820 206941 321975 257821 144153 190069 297664
32438 297664 255131 141980 187430 363569 471262 505289 578467 607752 457748 289378
32428 289378 358420 545440 513557 287200 222299 397738 500735 382200 269033 297516
32418 297516 271924 81275 -31639 132783 374243 399961 257205 202838 311723 448437
32408 448437 506617 471740 331908 106239 -78908 -76324 121420 360029 445911 302544
32398 302544 69023 9594 223907 488048 512397 308691 137897 140114 220411 283132 346983
32387 346983 396957 346626 219065 178832 307664 499468 627550 665461 613073 475561
32377 475561 351515 358175 423271 342673 104169 -46074 55975 277798 417796 459315
32367 459315 468532 413101 254630 104737 110502 237248 307670 235996 117975 91541 177496
32356 177496 269776 264850 198130 218102 383013 537771 488550 265294 91095 102190 223570
32345 223570 323989 359967 340341 275330 210241 213478 286165 353564 365729 341103 313941
32334 313941 311950 366818 462957 508363 453470 391312 418980 458193 374281 226421 198187
32323 198187 289105 300145 167350 83717 190628 346592 347900 230134 179494 233641 249125
32312 249125 150637 62473 139311 344730 475257 403110 233275 166374 241499 312516 280444
32301 280444 217220 204926 194312 132312 107394 222003 404659 492064 430999 276547 85437
32290 85437 -47037 38422 360791 660990 678051 488576 358265 344258 305682 239127 285609
32279 285609 404917 371217 159758 33761 136168 272432 243538 143807 144128 184076 93146
32268 93146 -110685 -238011 -176072 14459 190300 222004 80063 -92262 -78044 162506
32258 162506 422305 490093 366166 179371 14010 -88521 -71195 68175 211915 239766
32248 239766 179107 158419 240181 367233 456073 486334 491421 484386 418286 256358 78984
32237 78984 40870 179409 351024 416992 388147 312156 169674 19097 76058 429154 805492
32226 805492 880065 723309 651452 710950 663877 468851 378415 473225 483886 247052 283
32215 283 -5851 96266 55795 -59390 1299 232431 376588 322179 232401 257389 325665
32204 325665 291287 159920 83128 169293 357749 498122 532705 536582 557205 522975 399383
32193 399383 314366 371836 447772 377227 249111 255337 318721 194651 -69149 -136178 92665
32182 92665 317367 323920 276899 352723 425720 363347 332979 518841 763087 790678 617219
32171 617219 448745 329620 179609 58345 97342 239031 306041 283085 301722 392287
32161 392287 465543 500483 549895 590412 546653 437302 346343 290717 249431 258468 341655
32150 341655 421605 428747 410804 412988 367980 240282 141602 149279 162623 108723 111055 243879
32138 243879 313290 151905 -45663 -1251 177920 173606 6818 13729 283273 508358 458046
32127 458046 256556 105187 34112 35312 161837 368522 486618 468740 452439 498872 492335
32116 492335 387575 323771 380509 438604 403708 360572 379547 373078 281847 207498 209676 160810
32104 160810 -21901 -167197 -70053 200023 398290 420959 353619 284563 238037 242479 315256
32093 315256 401545 431314 403490 340523 224952 61991 -66134 -91872 -42273 36045 140375
32082 140375 232354 211351 65667 -58465 -47999 20707 27267 -7186 -11718 -23368 -87825
32071 -87825 -103949 39634 239385 287117 168793 60819 51008 64656 73031 167075 368977
32060 368977 544677 579921 510672 415489 302672 171140 73492 49283 79797 150231 262512
32049 262512 359121 356799 299136 336623 483970 541196 365184 95183 -27625 28945 101898
32038 101898 88127 33783 6007 19255 78736 176149 248183 243932 218655 257616 334390 365264
32026 365264 375093 457372 573865 567971 418572 311413 373209 476389 421207 210259 23260
32015 23260 -18529 38791 67246 -22651 -206773 -343504 -304397 -147577 -69757 -133149 -162124
32004 -162124 -5627 226125 330589 310990 321875 386872 385747 310609 312441 436029 500325
31993 500325 350307 94149 -30155 59173 243117 385127 449400 455156 412686 337522 278178
31982 278178 277699 300482 238340 43097 -157408 -159342 69029 325667 420471 390899 382939
31971 382939 416066 410724 383674 436354 556559 600812 503404 363460 290357 286000 307666
31960 307666 322843 274653 124761 -33180 -35938 129653 298961 361015 371603 384142 336160
31949 336160 197921 78360 61337 69488 22900 8494 134020 311946 363388 277387 198463
31938 198463 195584 213844 238930 326767 436188 401120 160190 -99612 -141547 32068 194116
31927 194116 181583 69259 22117 62650 80415 40411 52923 190651 346889 373097 287813
31916 287813 236631 286185 371025 417744 409518 348281 262074 222387 240973 198845 24868
31905 24868 -112635 2875 275926 372592 188734 -4051 33973 197285 263050 218070
31895 218070 181280 162925 92813 -12330 -71480 -61349 -5771 76719 135445 107288 44765
31884 44765 85914 223102 272629 165778 70681 102960 137012 70692 45610 181037 302149
31873 302149 202631 -1975 -79172 -80814 -203564 -359867 -263110 83854 342182 322123 209646
31862 209646 235499 373490 453571 375664 150829 -100256 -170425 33461 313294 393264
31852 393264 291464 258292 366698 431145 353830 269350 275687 283991 232774 213772 274732
31841 274732 310156 260517 229317 298898 405443 477260 514311 471993 287372 93459 151825
31830 151825 454233 647039 507223 250478 183007 279891 328796 287728 251106 218251 144737
31819 144737 102942 161300 215646 162639 122502 246677 410686 370168 155019 28135 78518
31808 78518 132882 88234 67536 176837 324381 370274 297430 167308 42157 -3930 68163
31797 68163 167570 158210 65299 52118 161379 243962 201949 138007 173819 263958 298420 270511
31785 270511 226249 148089 18581 -74445 -33288 87883 144416 111741 115625 234106 369943
31774 369943 372973 234277 101080 110432 246372 371752 379379 284893 175280 111807 112318
31763 112318 182841 302263 397013 405041 361479 346255 348706 279921 138498 51174 90540
31752 90540 159646 149260 114780 167286 252573 200336 -12043 -198577 -204506 -79700 40102
31741 40102 108165 148327 162411 152872 169963 243080 315865 333087 337154 384536 418871 340602
31729 340602 172109 39445 7712 44205 121459 226381 278539 194028 53679 51347 220571
31718 220571 358102 293315 99646 -46407 -82314 -31376 106903 294104 382966 273381
31708 273381 82104 15008 116304 271693 398828 483645 478328 340975 168508 124142
31698 124142 216879 295802 273599 209023 153174 77186 -2174 18137 167665 329036 399111
31687 399111 409195 412179 370721 255565 153224 160434 237414 267964 212643 112794 -1202
31676 -1202 -107403 -144289 -69632 58659 152007 210931 276330 295673 174484 -33014 -135675
31665 -135675 -68343 -5954 -105738 -248079 -199901 19426 138121 20100 -152259 -177867
31655 -177867 -124731 -146094 -170198 -27381 198779 251430 139263 176552 481065 733383
31645 733383 628434 315559 141268 154401 159055 113321 141468 215845 165090 5376 -50904
31634 -50904 34570 46521 -102321 -192450 -41864 211709 342268 347645 341930 304564 157466
31623 157466 -9890 -14954 143416 257991 175450 -26658 -144272 -63414 138505 284457
31613 284457 294851 267439 310553 356559 273404 125329 125059 299502 418464 338379 203857
31602 203857 181450 201483 140328 73307 126227 220006 204580 138380 179465 279086 260060
31591 260060 155423 166501 272977 204256 -109332 -356648 -282994 -57573 13740 -54377
31581 -54377 -26439 117611 153123 8139 -98176 -1716 152880 155428 63645 99662 294884
31570 294884 443923 415418 328733 356324 482627 554001 483561 309076 103195 -75309
31560 -75309 -170248 -160471 -99123 -54125 -20142 50061 144961 193416 156767 65360 -21810 -42630
31548 -42630 49121 222235 359085 382276 350304 344913 324208 212283 84849 97488 230542
31537 230542 277295 127438 -86382 -179737 -121745 8497 142199 227190 229163 201526 253340
31526 253340 381106 436941 336205 192471 161742 243670 323471 331124 273867 177754 75933
31515 75933 5166 -38526 -87895 -124864 -95210 -22088 5027 -13561 32703 184542 342952
31504 342952 427785 462624 451199 344127 206850 222640 402681 487838 307243 57788
31494 57788 24006 171066 248179 180759 107997 101433 98671 88274 124290 158271 75469 -82770
31482 -82770 -131797 -11209 137412 194867 199050 212080 210893 173947 150399 177478 219182 228793
31470 228793 199003 139425 83967 111275 260883 437196 495267 407124 246064 50629 -157435
31459 -157435 -259985 -135381 117867 231672 100960 -86109 -118120 -17433 66169 98692
31449 98692 171075 317736 438414 412910 248164 91236 86096 218380 344153 385061 409560
31438 409560 467046 456386 283686 61085 -16450 57275 123003 119814 138746 215504 265222
31427 265222 260737 296513 412796 507597 490315 396698 300473 232796 223349 284459 322712 221226
31415 221226 48761 12864 148693 248272 188093 121427 205676 330593 308851 191103 175348
31404 175348 293853 400283 413620 376138 301008 160269 25151 31001 165040 243217 148389
31393 148389 -33836 -161079 -194233 -157782 -60375 61213 112022 54697 -352 77887 249027
31382 249027 332834 236411 64905 -23240 322 51537 85506 142406 239301 303414 270351
31371 270351 200406 218600 343615 448336 416346 282571 173138 141956 132350 98763 92506
31360 92506 175519 292180 312290 208915 105708 100446 126660 80371 11305 44693 140166
31349 140166 107124 -96303 -251313 -170050 33917 104619 -13917 -140390 -116390 31172
31339 31172 174287 221544 171324 103010 104557 158343 143222 6985 -132141 -135980 -26362
31328 -26362 78417 130929 150803 132455 82085 73008 130666 144542 48297 -6557 140976
31317 140976 353449 342346 99854 -79445 -34986 67990 64294 50233 166610 316298
31307 316298 292386 87217 -92473 -81326 81125 224997 231668 151600 137281 228244 269526
31296 269526 144328 3806 83179 334335 468891 373306 238102 223157 244396 195636
31286 195636 149326 191555 250177 242304 232222 294281 363429 361362 332270 324215 283765 198948
31274 198948 184184 275291 307539 165516 -11999 -61708 -58931 -134801 -197936 -101354 47689
31263 47689 39807 -67313 -47104 76556 45612 -175195 -289652 -117511 135546 205266 136151
31252 136151 139199 249997 328835 306968 243877 173889 62495 -63354 -73132 101206 318510
31241 318510 346050 138111 -81267 -73916 131321 306334 330022 289313 280023 276200 246552
31230 246552 234561 240716 183726 75640 66760 195409 275770 192385 112384 193762 274523
31219 274523 136273 -73787 -31760 225233 322733 125701 -66136 7717 208527 252113
31209 252113 79277 -168258 -341798 -331531 -105402 178947 275554 169343 113719 251307
31199 251307 410231 410785 346202 366142 387466 265829 98541 80113 152294 85850 -119819
31188 -119819 -198569 -16442 230401 300673 204825 111478 96048 105672 97649 100392 154961 260136
31176 260136 371557 429374 401579 318236 253114 263447 345413 429731 416481 257498 33737
31165 33737 -93856 -57335 32495 26955 -72995 -140136 -100624 -863 98338 197837 303591
31154 303591 375633 383608 358994 339284 299655 199523 75125 18571 56522 105705 78195
31143 78195 -7024 -54952 -11814 91161 193130 248836 225396 122755 14595 -1469 68302
31132 68302 104025 42520 -17217 36034 135925 124308 1045 -56832 45917 175769 154355
31121 154355 -4592 -131966 -121709 -22298 70576 134829 217572 343849 451289 430126 248807
31110 248807 25635 -71298 1276 135019 219308 250934 274259 286987 261036 210993 183746
31099 183746 201272 251460 311083 346620 324668 258725 214244 225712 239666 192262 120498
31088 120498 128408 235268 319699 255458 72080 -73039 -86868 -51354 -97956 -207337 -216883
31077 -216883 -39368 212769 370340 398722 376938 358934 354371 388356 455609 451640 290997
31066 290997 81014 23426 129588 195716 102557 -26700 -39406 39637 119701 211349 341550
31055 341550 421601 359017 220557 135574 106772 62917 28821 76732 158598 160772 97787
31044 97787 80628 111779 91475 21800 12010 64573 59031 -5544 36826 235785 392337 336079
31032 336079 163844 54926 1831 -97991 -206375 -206905 -130620 -111597 -145571 -91928 71188
31021 71188 173965 89611 -91263 -178831 -82546 146173 382248 501930 463427 345004
31011 345004 255165 211369 168914 135651 155374 198573 189804 134358 90047 27043 -123485
31000 -123485 -277632 -251646 -55925 67180 -8660 -106244 -31324 147855 273617 366177
30990 366177 500780 569665 428415 188098 93685 159340 186007 112254 68411 77735 4994
30979 4994 -134481 -116336 110084 249813 66187 -245292 -299535 -2002 408301 689419
30969 689419 780485 729188 617589 534462 491509 394561 190479 -15158 -81514 -6991 112045
30958 112045 218544 292761 300049 250144 225621 248029 217927 103004 57623 194719 358325
30947 358325 325248 150267 94391 254951 472437 575587 525224 348090 131463 54470
30937 54470 205238 380560 294995 -14215 -232055 -220713 -157424 -176110 -167387 -40157 100174
30926 100174 185936 339975 606922 768723 658882 468077 481271 656135 728656 632120
30916 632120 533002 506246 453413 344627 286829 306788 286597 186029 139990 240238 371335
30905 371335 372601 256175 160098 157409 203076 222294 175847 69851 -38291 -63974 27414
30894 27414 177130 291204 322955 281419 194217 100147 55322 94931 179703 214738 143256
30883 143256 5827 -111084 -166161 -171402 -126630 -6222 172012 323853 385558 379815 355882
30872 355882 317048 259454 222240 227425 230120 212404 252468 382367 453498 311144 55373
30861 55373 -70690 -35489 -31426 -107760 -58267 210574 446257 378694 107168 -55796 -10678
30850 -10678 75495 73256 36075 50273 107674 152084 151590 118734 113804 188400 284667 282464 203591
30837 203591 230343 416903 541962 414161 180503 117654 225529 271055 168863 63560
30827 63560 56108 91322 119814 144979 103624 -67553 -228851 -142804 174249 438334 483574
30816 483574 420708 357377 242791 104951 154940 460896 746973 736231 517038 357028
30806 357028 317507 284535 242771 258685 277808 190627 53223 13447 52330 21095 -88951
30795 -88951 -139899 -102661 -84192 -79932 56110 324761 493826 414103 239730 198798 290376
30784 290376 350575 304074 205355 115104 73633 132769 282208 391490 349412 224017 164966
30773 164966 183107 160862 65378 5857 56721 153833 214307 253419 323791 420637 501184
30762 501184 526943 447009 230503 -27248 -133498 -26753 108702 71634 -83703 -143735
30752 -143735 -55951 17365 -30880 -100037 -55235 83893 202569 231170 156358 -4153 -161476
30741 -161476 -191124 -94063 -22562 -51767 -39661 151607 396628 447046 277634 104872 71111
30730 71111 92988 50326 -42461 -110712 -125611 -68836 89972 306130 447300 440307 353819
30719 353819 281923 233118 192880 199949 274501 339669 300322 158012 -9711 -132687 -163856
30708 -163856 -84073 44579 100592 53057 25907 131255 299408 368541 296807 186929 132147
30697 132147 135897 166599 198760 202597 168831 138348 142315 133187 51484 -59735 -97260 -45982
30685 -45982 9917 27195 56268 134562 224073 288620 338407 351052 250969 51939 -65748
30674 -65748 54275 312235 441958 341736 190303 186310 291332 329285 253273 172553 145698
30663 145698 103165 4970 -65397 -35733 39288 84750 126350 197310 217760 106608 -50382
30652 -50382 -96557 -29070 25485 26811 43112 80925 87390 120756 295425 519677 530069 275355
30640 275355 26757 -21407 -16316 -131180 -226502 -90634 159627 227862 90039 -6777 47157
30629 47157 112857 98292 83072 108836 102027 68060 126896 276019 336352 229907 114186
30618 114186 134833 219342 220716 107218 -81679 -300422 -424532 -295366 39715 297871
30608 297871 296387 154950 46196 -51275 -181284 -204611 -14833 194777 162063 -39279
30598 -39279 -109166 18736 121548 89650 83874 217002 340928 284399 112710 7007 15235
30587 15235 53244 63936 62719 75823 107868 137302 120599 54889 27621 107386 193859 115028
30575 115028 -103243 -220824 -97517 125552 244100 245521 231239 217797 169271 137658 203687
30564 203687 317928 347870 268712 185103 171755 199123 208995 168500 66509 -45801 -38841
30553 -38841 149586 367278 386645 202468 42320 39192 53458 -83825 -290904 -349254 -214764
30542 -214764 -44710 59038 155916 280251 316776 174093 -24397 -70494 45209 125531
30532 125531 54045 -50148 -23739 120003 264176 379132 491895 527541 373724 115347
30522 115347 9419 142529 278859 181489 -43121 -92259 117420 368265 453547 386477
30512 386477 272553 149155 35182 8338 114085 259115 294737 185366 32880 -47722
30502 -47722 -32328 15108 16331 -39688 -81156 -42759 40197 79449 68272 90053 180024 268026
30490 268026 292478 278222 249332 162907 10322 -106056 -108635 -92360 -206563 -418109 -524755
30479 -524755 -412466 -185474 -13854 49983 60795 67668 73706 70922 67933 88691 152177 243071
30467 243071 315164 341167 329328 267510 111673 -110573 -253217 -210488 -75166 -17988 -45695
30456 -45695 -27096 58192 82785 13974 -5096 96134 172873 106722 28697 122920 328847
30445 328847 440070 416006 378875 353129 249681 107297 93677 202422 193275 -38274 -243479
30434 -243479 -153624 129325 292652 259961 233503 321350 374747 253929 44501 -103432
30424 -103432 -191513 -284996 -323240 -193268 53011 224040 239360 211974 247596 298609 287837
30413 287837 256138 273494 285082 184591 9205 -76934 -5273 108314 126652 43103 -60559
30402 -60559 -104389 -17714 225600 504370 594183 423729 202499 172846 308737 400943 378020
30391 378020 361552 416272 440275 354252 237334 195021 220466 270526 362717 496959 577799
30380 577799 526617 404784 323197 285741 222501 130129 74652 82780 122100 168718 217310
30369 217310 248612 255482 266137 276542 218491 81925 -322 86565 247659 297014 237541
30358 237541 247983 379987 451941 312213 55820 -115742 -133812 -64162 30509 117532 150949
30347 150949 111089 55636 53389 98320 146174 187432 222335 218636 165037 114541 102385 78955
30335 78955 8456 -28591 56651 195062 231270 148465 90965 149305 249174 294359 304467
30324 304467 339430 373771 336636 235359 159764 173288 251109 321368 331276 276189 192793
30313 192793 127720 98377 81527 44089 -15206 -52912 -12540 113872 253451 312945 285575
30302 285575 255982 271021 262181 157907 24064 -2285 95446 185439 161743 58983 -26754
30291 -26754 -46549 603 91452 163337 155710 111938 155165 304892 409400 347081 210537
30280 210537 172450 231061 238678 164461 162253 329905 540462 605405 515102 411907 377365
30269 377365 358528 295445 218497 186532 194016 183171 117691 17629 -55190 -33915 91805
30258 91805 229153 248600 144740 80478 190540 375011 406334 251003 144744 273694
30248 273694 508412 589708 491642 420250 478922 537199 478493 388596 386233 416476 367072
30237 367072 285983 296611 342235 218570 -105724 -376041 -351875 -104145 95225 105006 14327
30226 14327 -53502 -94099 -136539 -119125 33659 239649 294111 131815 -41336 10539 225840
30215 225840 304879 115246 -118049 -118384 77423 209822 171961 106694 140797 217095 251884
30204 251884 294622 416315 545717 543039 380753 148499 -69150 -211993 -192631 29090
30194 29090 316104 433617 305952 98429 393 22819 69091 103756 147379 171454 122699
30183 122699 28836 -32138 -59696 -115480 -180087 -155580 -41416 30082 0 -11310 93448
30172 93448 208939 193722 109043 109105 169122 140241 41865 51809 180980 218688 91150 16396
30160 16396 140722 250729 81428 -249377 -381514 -203940 51552 173883 181666 155336
30150 155336 90300 -13320 -79397 -46261 72800 233889 363471 346621 163824 8007
30140 8007 79082 277966 320159 157115 33651 81830 136577 65608 7937 106817 241411
30129 241411 239779 164769 155477 151844 34049 -98572 -69126 45421 15999 -146605 -196153
30118 -196153 -61742 26829 -98726 -287704 -285680 -46757 263493 455169 436964 263313
30108 263313 114583 137391 276199 356466 330291 309084 348871 360845 275179 150999 71561
30097 71561 51143 82576 153285 189781 128653 67243 174637 408186 509105 363866 179997
30086 179997 180459 300247 348610 327245 388588 556227 673914 612324 396013 145598 -7619
30075 -7619 14465 163860 285062 269948 149016 -4568 -156055 -233134 -113294 187519
30065 187519 437192 455160 360246 380983 502513 502663 299795 61078 -44833 -30636 2767
30054 2767 3623 -17850 -12455 76785 220606 281005 195622 120513 227276 412978 422054 241666
30042 241666 136846 250477 407050 409867 313756 260025 226334 122749 5977 4449 104671
30031 104671 186834 224060 277326 317016 227384 21934 -93027 47645 349286 551234
30021 551234 504990 296116 103515 8815 -19976 -11688 47652 129515 141834 62656 15671
30010 15671 113487 284957 377859 386780 429250 513340 503041 345876 170440 94337 78770
29999 78770 47180 11848 -3752 -39182 -93248 -62583 108152 317014 446419 503675 513713
29988 513713 404602 155042 -54730 -30009 159792 269720 208461 104011 65120 61645
29978 61645 53410 66671 100844 98864 59430 66977 165107 288086 345264 296772 145181 -54223
29966 -54223 -178791 -142428 -19269 41732 21351 27889 93689 121484 60516 -10286 -22491
29955 -22491 -5661 17726 86880 185632 206735 116892 33660 48379 91979 72676 25381 13185
29943 13185 1014 -42663 -36861 61550 107760 -32655 -209166 -141337 164288 387825 337441
29932 337441 202061 254390 475173 629771 611681 533129 500986 459010 300021 49957
29922 49957 -125150 -86667 123225 305306 299659 162421 109380 258518 473687 522946 365157
29911 365157 191585 168361 236634 243461 195522 245510 427864 560004 488146 317851 270854
29900 270854 377034 459506 407368 304162 257663 252850 239214 232323 238160 188050 57764
29889 57764 -36519 21776 178749 288250 297654 245123 146446 25417 -6428 127069 292876
29878 292876 279160 97176 -33238 -15472 16392 -20061 5497 179138 323464 238245 30307
29867 30307 -25634 106107 185579 69927 -93289 -110884 -8545 56998 33153 -4624 -1888
29856 -1888 21140 49775 105357 169586 153893 6038 -180548 -237761 -127393 -14641 -71810
29845 -71810 -241125 -289009 -105613 154799 281092 252599 196647 187998 210180 256569 325566
29834 325566 336747 204185 8631 -52536 64811 170563 107393 -23700 -14610 161875
29824 161875 341281 396541 356152 308162 291437 293198 281570 232436 174877 193521 319003
29813 319003 432305 367055 124020 -92301 -88510 112240 307261 319924 147426 -59913
29803 -59913 -139016 -54720 79431 128321 77986 27328 46869 92506 76671 -10364 -80138
29792 -80138 -37203 122677 299304 371668 307369 191701 140878 189966 271219 289240 207911
29781 207911 81261 11143 52793 149593 190290 144225 96100 121072 180556 192043 154390
29770 154390 136784 172627 227778 251270 204711 79761 -50487 -49011 124742 313235 330730
29759 330730 210547 158689 264297 388994 371837 223492 69331 -718 26015 111354
29749 111354 185787 200556 182070 176792 156731 74897 -4193 35598 167218 237664 204716
29738 204716 189563 244203 247475 122359 -11800 -20173 59168 125319 174735 228880 237346 182346
29726 182346 148807 165953 128390 11504 -11157 154486 306503 233110 54393 18714 101067
29715 101067 101887 30105 49936 117369 36144 -140650 -144905 31447 77816 -120494 -280037
29704 -280037 -186045 -12023 35104 67550 245037 416596 352277 152763 105222 237355
29694 237355 320178 262718 215992 277083 340564 303595 230445 230527 293644 324149 277703 212408
29682 212408 218826 307632 375813 323842 195459 121725 130408 130426 103360 153119 297194 370259
29670 370259 254715 76966 35448 130774 205315 178461 112687 94376 149591 232023 229351
29659 229351 59063 -182676 -274064 -138532 59737 161415 195350 218720 163759 7380
29649 7380 -74149 72549 317471 409049 303315 148197 38405 -22458 -9155 76697 124622
29638 124622 65734 13114 70670 125109 44054 -50604 33681 219731 292134 268471 319926
29627 319926 401074 316996 124387 87008 217029 242305 84342 -16909 48453 72905 -62064
29616 -62064 -164456 -109209 -88065 -246021 -383774 -294913 -124111 -91900 -101605 52576 272818
29605 272818 297419 132671 16209 22323 12867 -53292 -51001 63846 181445 233510 259545
29594 259545 266834 209637 116868 70781 58258 8115 -34121 48307 214455 267989 129910
29583 129910 -48021 -89601 18473 179353 292362 271136 95733 -96437 -99206 109917
29573 109917 311996 316300 188829 119666 147751 146541 55010 -13806 56002 193398 219940
29562 219940 101737 14768 105417 270065 282798 107316 -53467 -35930 90139 165287
29552 165287 161033 163306 215654 277756 295981 242987 129355 28103 29544 122792 194993 197268
29540 197268 213777 297614 353897 291871 185939 153991 169112 141958 106939 149541 206925
29529 206925 140996 -7153 -39141 101178 239869 236446 159194 119472 94895 32308 -5740
29518 -5740 57292 145779 118431 -11665 -82477 -14951 81666 78353 4438 -17595 40356 84227
29506 84227 51962 4526 23147 83058 96498 43104 -18136 -48966 -63918 -62986 -13770 78679
29494 78679 149710 145529 68132 -47879 -140189 -115403 62992 278797 359580 284750 189931
29483 189931 152427 108715 19281 -40322 -23137 5828 21615 122910 342970 519113 500658
29472 500658 370377 300409 293213 241920 160605 157404 227682 263334 241398 227127 212608 136672
29460 136672 59150 119694 289876 348166 173585 -76591 -163720 -39441 152580 264863
29450 264863 261299 192541 122749 79752 60794 75436 142594 228084 246993 172225 79406 36885
29438 36885 27523 34508 103867 237505 329234 314410 280581 310116 325550 236039 121265 93478
29426 93478 87080 -5772 -89168 -2887 155882 128737 -95907 -247346 -176827 -33579 24277
29415 24277 38847 73964 61291 -38820 -107466 -42609 71436 94756 24188 -45712 -60767
29404 -60767 -27944 20270 34455 2662 5863 113596 241857 261177 220399 269764 376698
29393 376698 361424 235522 222159 360651 388677 165691 -66156 -47864 110465 148667
29383 148667 63463 31155 69520 51847 -26614 -47311 13147 74572 120810 185849 219074
29372 219074 151609 58837 78523 199799 298271 336491 357024 325315 177829 6928 89
29361 89 184188 397859 517623 541591 457097 229476 -42154 -156494 -72930 21462 -9558
29350 -9558 -57506 42427 256974 414192 433502 376778 323030 303427 334791 415821 484479
29339 484479 454821 319697 172458 104245 107403 103318 47758 -24118 -58683 -51867 -30243 3354
29327 3354 55599 90926 59604 -15537 -46142 1911 50063 2574 -136576 -267757 -288626
29316 -288626 -176764 -15478 68231 36810 -5260 47844 146848 167236 106762 63335 34446
29305 34446 -79343 -242891 -259251 -59677 160898 212967 150805 110243 75474 -20676 -106735
29294 -106735 -82769 -13644 -8141 2929 142936 309770 271549 32435 -141595 -101165 2762
29283 2762 -14456 -116485 -165909 -144419 -118856 -80652 47308 268307 464365 501817 358745
29272 358745 149898 24515 31375 104617 180204 252338 284766 182362 -46388 -196479 -86744
29261 -86744 178611 323629 247164 98760 24483 13240 20077 72054 183846 292525 341096
29250 341096 333966 274463 150757 14337 -42196 -24073 -35470 -102980 -127865 -71102 -47799
29239 -47799 -147243 -279604 -308946 -237533 -144917 -38970 98353 192508 158876 65922 61844
29228 61844 149070 186565 133662 129628 262403 398897 360060 172021 13686 -28356 -11178
29217 -11178 33063 154437 337078 440313 373931 226563 124788 58997 -36774 -120488 -110389
29206 -110389 -62610 -105918 -213566 -219458 -80089 58544 99217 113379 143328 72494 -167297
29195 -167297 -404097 -412271 -207774 -4767 64036 41124 -119 -48040 -95895 -97336 -9182
29184 -9182 154057 302170 312325 155696 -21094 -43909 57715 110798 97357 179960 365372
29173 365372 403621 183749 -18506 70287 290898 308317 147556 128525 335931 505425
29163 505425 451371 295412 210474 204167 231987 294021 337879 265938 113395 41230 96861
29152 96861 157898 155384 164397 227921 285394 325217 406169 474499 379748 147544 10001 63577
29140 63577 122947 44022 -33060 62245 227496 245181 108316 -13375 -36659 -8778 40010
29129 40010 113530 161929 127523 55741 41693 87735 112639 80198 33915 20578 44149 82095
29117 82095 109634 126730 167390 241474 285113 243469 176150 172732 193069 138043 57830 97666
29105 97666 224054 229528 72338 -23877 74850 184864 102528 -61030 -53792 138714 300300
29094 300300 289013 148919 -21717 -141169 -125421 41429 231596 286287 186345 31173
29084 31173 -95070 -147795 -88037 62321 187559 205284 173708 178441 180390 87992 -72512
29073 -72512 -173579 -145526 -32288 85037 157007 192376 254172 375470 465377 397509 213133
29062 213133 103112 146781 224209 246283 284323 368062 352147 144449 -94660 -161225 -88115
29051 -88115 -43258 -64287 -69499 -30638 33806 143318 280978 339652 286371 251194 300820
29040 300820 284675 95283 -89692 -60271 86109 120176 55214 54642 88157 6067 -126889
29029 -126889 -112704 12287 32922 -46417 -11721 149623 214326 142018 156773 320320 384962
29018 384962 208379 -15451 -96683 -109851 -142246 -91600 73648 141224 -5748 -126271
29008 -126271 23869 283246 327646 159013 42760 69711 94323 54554 51288 103445 85251
28997 85251 -49076 -187028 -249599 -278494 -280239 -155166 130211 419830 511705 370510 149521
28986 149521 43993 137059 334263 437424 337333 141589 58826 156066 296357 328304
28976 328304 263613 224394 268741 335378 348830 314992 287004 281877 280814 286566 309657 300614
28964 300614 188141 17665 -48383 58485 191749 181542 68786 17800 57670 76145
28954 76145 51048 106918 300768 498387 531186 377493 140224 -66361 -165160 -132513 -15005
28943 -15005 107732 180611 167950 56470 -64279 -23191 197741 348982 216244 -53687
28933 -53687 -161313 -108039 -143172 -293410 -304551 -102735 57598 30824 3822 103290 138930
28922 138930 -10436 -91635 115855 368993 310542 29386 -124902 -110199 -140723 -189537
28912 -189537 -22169 291878 378268 151991 -13042 142108 382593 367662 123198 -79936
28902 -79936 -92857 52150 257586 372193 262843 20488 -79902 46481 159807 78425
28892 78425 -31356 51192 229441 265005 162652 104344 117284 95371 71980 167642 294531
28881 294531 222704 -26970 -149162 3258 208495 232458 155683 167778 229442 163863 -27186
28870 -27186 -165476 -174257 -153820 -171053 -143816 12188 239031 403441 441534 394567 349335
28859 349335 367643 430094 439062 331261 192726 184576 324135 421899 301887 26271 -180724
28848 -180724 -197674 -103063 -17746 45207 133483 240008 312844 350982 414039 525896 623013
28837 623013 629136 550483 458520 390155 309671 183271 52365 -4604 35583 130408 244648
28826 244648 375734 490017 497399 347337 123476 -16489 3150 116164 203958 204654 134018
28815 134018 44258 -16875 -31631 -20201 -19919 -50072 -93501 -102346 -26149 134669 293737 337951
28803 337951 248143 123907 62854 65905 97192 163012 255771 288351 197071 70889 53907
28792 53907 138091 184401 143599 106807 120689 120316 98931 168404 348545 456541 350276
28781 350276 154855 82558 129934 140826 93975 109177 192107 202882 113696 82576 185768
28770 185768 266642 181972 50228 87095 279282 395004 295736 90840 -30809 -6391
28760 -6391 95900 186227 216186 184597 128829 96112 105676 145437 193434 219139 187409 105574
28748 105574 45213 55122 67837 -21977 -180316 -240546 -132657 1250 10952 -33228 45196
28737 45196 230011 298718 139349 -70838 -92750 69851 201327 155037 -1021 -100774
28727 -100774 -57770 75089 166784 128595 6853 -63895 -28962 11227 -55113 -185543 -242906
28716 -242906 -185042 -99800 -63574 -60500 -48256 -15613 43751 136607 225917 249804 208540 170123
28704 170123 166269 144071 50189 -87262 -188461 -197299 -115557 1149 79919 100764 119279
28693 119279 178921 233996 223191 178225 170409 189500 188340 209545 321690 450125 448144 346312
28681 346312 330197 420933 400968 171808 -29000 48441 291919 400263 322153 273241 353547
28670 353547 398475 259496 36370 -68913 -11508 77373 68142 -42795 -158732 -185049 -107059
28659 -107059 15085 108246 123148 39760 -95453 -152106 -41832 126514 151644 41111
28649 41111 41356 270867 502956 483240 308698 257070 341181 317866 125602 18121 171919
28638 171919 397446 394672 148695 -86096 -117618 3530 106738 101185 37719 17146 64697
28627 64697 112921 107897 78511 64680 42825 -12513 -62225 -82277 -130808 -223229 -228089 -48332
28615 -48332 159403 144981 -78623 -242952 -192732 -37900 87375 188848 264206 217274
28605 217274 47190 -60581 20407 163811 183457 94981 41231 65207 107246 146036 198720
28594 198720 237583 227448 197535 183784 165729 144005 188449 306814 362900 248165 50781
28583 50781 -67419 -73156 -14396 118999 315599 413602 261395 -28657 -185725 -130313 -31304
28572 -31304 -14057 -12524 48076 113327 130487 170499 316454 521816 660377 657180 528630
28561 528630 359622 263899 287689 334840 275254 137890 86563 181868 291480 283312 185780
28550 185780 91542 18871 -46024 -68990 -27081 30002 67482 139677 282076 401190 384256
28539 384256 271629 211537 274490 408354 538894 606032 535216 310875 84356 71722
28529 71722 293252 515807 514200 312724 109566 35215 62245 101372 94314 24309 -87075
28518 -87075 -180229 -202382 -160311 -94567 -12333 100842 207704 233448 179918 151082 209188
28507 209188 270804 229857 135040 127049 210532 228177 105902 -10723 36747 180094 227154
28496 227154 141669 62279 58039 36560 -59375 -120246 -37013 108467 149370 76067 41568
28485 41568 129704 232427 198725 34378 -103611 -89227 36627 118262 59379 -68933 -103633
28474 -103633 36015 269231 439608 447807 307445 124143 31760 88945 205347 221028
28464 221028 94824 -40782 -53955 25856 89624 122289 186478 268570 268081 153369 21267
28453 21267 -30398 -2909 63338 161779 281465 365622 365604 288673 155859 -22311 -181778
28442 -181778 -198808 -36968 152819 185690 81077 46356 207704 443120 524538 372499
28432 372499 126109 -11193 41654 197099 304350 286170 178204 59666 -18554 -36541
28422 -36541 10304 90318 132317 93547 19967 2023 81434 224957 355252 371474 199218
28411 199218 -95589 -286327 -202828 31114 111805 -53513 -210985 -108040 150914 254638
28401 254638 121807 -6168 78263 283768 395004 364686 294002 215022 67424 -122572
28391 -122572 -207896 -117188 39655 134941 184359 246407 257812 121699 -78881 -129248 21608
28380 21608 165285 115119 -35412 -53094 109754 268039 265418 154894 84025 95033 109561
28369 109561 73366 41945 98575 220335 280173 206477 93907 88443 185142 237887 181549
28358 181549 128478 188394 305491 371283 404043 483675 568930 533195 372089 235438 228945
28347 228945 294749 323341 298322 291551 365508 495845 562488 451165 212213 54749 99425
28336 99425 211255 194915 72822 1804 -16811 -118567 -283099 -310793 -146992 -615
28326 -615 -43567 -186066 -253748 -208644 -90306 79538 214855 171629 -25232 -134605 -22076
28315 -22076 150400 213797 264283 433310 581763 500551 278284 173814 213822 214119 137761
28304 137761 119490 155919 90776 -62639 -88577 74592 224319 229210 210820 279997 345001
28293 345001 324271 317400 392815 412766 273191 147551 254960 489123 518554 229380 -129391
28282 -129391 -258122 -118943 92138 178224 102994 -25715 -93205 -87632 -57049 8482 162704
28271 162704 364593 467956 405926 292824 269336 319375 317621 205813 52904 -24080 42321
28260 42321 203380 297282 191530 -37124 -146997 -15809 194289 232098 63453 -98244
28250 -98244 -43976 207967 438017 453231 293926 190782 284092 442655 447141 290203 148399
28239 148399 93477 27752 -77402 -96537 18576 125053 121898 111213 184267 226725 126675
28228 126675 26923 135410 372137 451701 295181 130700 154700 290780 355773 312270
28218 312270 256659 248828 255427 232690 192917 174356 173923 146334 86952 71619 149646 231986
28206 231986 195539 91303 104111 269237 389131 320709 199294 244853 449055 593837
28196 593837 518507 259880 -11930 -111842 22395 224706 233522 20241 -139686 -33787
28186 -33787 197630 292013 238316 218996 290889 346737 325836 256482 149498 43637 74676
28175 74676 278201 409600 224793 -119427 -238440 -64432 101814 95705 93187 219939
28165 219939 302905 192876 52949 98700 255237 301731 212297 138037 148412 181384 189534
28154 189534 182185 162655 129057 90257 20332 -114624 -233548 -178744 43492 210176 176785
28143 176785 73674 77740 143973 134013 76612 97917 184825 221299 199062 197851 202355 133731
28131 133731 36173 36988 123258 144513 56428 -11923 29965 113892 155965 179447 232397 301394
28119 301394 373038 480458 620676 706910 666220 521054 328407 110191 -100923 -213760
28109 -213760 -152909 43353 247614 351864 331329 231875 124178 54648 24381 20028 48016
28098 48016 109807 167168 181749 171204 166534 134324 26441 -96473 -97046 49672 198506
28087 198506 225917 191521 222332 307050 323022 238764 161130 160214 162883 85893 -7704 18176
28075 18176 174006 314137 314518 205263 99010 56430 74802 152271 276326 365531 320659
28064 320659 164537 52323 84796 170585 157011 65265 84032 303085 554662 600364 417929
28053 417929 199620 85098 18397 -93013 -197850 -186413 -89320 -54520 -129042 -189898 -131651
28042 -131651 -17499 24257 -21979 -63929 -35463 50483 152842 235682 263762 220498 128146
28031 128146 26150 -45655 -30396 114084 324139 441631 384576 248317 165947 134337
28021 134337 69970 -27508 -86545 -97083 -108639 -120736 -100822 -92582 -167689 -268636 -245895
28010 -245895 -82495 54187 38539 -51062 -62674 28738 124341 142894 93779 39056 20093
27999 20093 11776 -41041 -120811 -120784 11906 177456 250899 241293 221550 186052 121251 126160
27987 126160 267891 391089 308035 130227 134049 310273 364717 207516 95906 179357
27977 179357 253901 156494 74916 207385 390193 363130 189699 106561 130770 124931 101937
27966 101937 149538 180734 82632 -500 124084 301629 218754 -64110 -169873 -805
27956 -805 131443 46443 -30598 116293 349893 443184 403447 332847 211034 29416 -63869
27945 -63869 29080 169181 204014 224697 381981 571565 544725 277040 9872 -72255 -34107
27934 -34107 -33913 -99381 -112182 30284 269438 419558 374262 242426 202715 265524 304945
27923 304945 294266 332365 428263 459173 392602 351646 386739 384886 299820 260870 327650 349576
27911 349576 230439 129262 203519 338134 351139 301668 344026 419904 377474 289827 346596
27900 346596 481437 423512 129304 -131041 -170387 -102005 -78135 -51275 81633 281217
27890 281217 439896 524716 547776 506400 432187 394583 388279 319649 166398 48741 76271
27879 76271 208694 321163 333762 247359 131801 88237 128478 105494 -101080 -345142 -349935
27868 -349935 -110527 61724 -14385 -125925 -7311 251686 362862 274783 199691 256593
27858 256593 328637 293162 191988 114495 63731 10485 -30026 -43502 -56103 -71113 -37634
27847 -37634 57707 125813 70482 -80975 -203683 -222854 -183407 -162086 -155185 -96925 20825
27836 20825 105681 79641 -2464 -16505 60437 123317 99582 52322 74156 148315 188597 175651
27824 175651 175184 232904 312823 339870 266291 109116 -42542 -80672 14238 134343 158084
27813 158084 88206 28895 39518 72075 63140 32529 52729 137676 196266 116559 -101785
27802 -101785 -319596 -387342 -291672 -143848 -40379 11826 40870 55656 65675 88968 114837
27791 114837 117415 119879 167726 222297 184543 62468 -4772 44925 93727 46106 -3324 50161
27779 50161 99191 -14211 -191271 -169378 82659 294335 270285 131626 90364 160170 219765
27768 219765 233649 260892 310535 317215 241611 114017 -8794 -82740 -95346 -75634 -57781
27757 -57781 -27582 46630 129661 136133 41615 -90952 -193301 -219612 -114952 116601 315470
27746 315470 299738 131172 78770 249413 431424 411220 270351 214809 259047 271787 232668
27735 232668 237655 302822 354108 387244 463184 553184 552671 459788 393491 408983 418036 325195
27723 325195 153700 17868 30913 215801 437665 478721 278624 43365 4929 143513
27713 143513 278968 342218 365044 284228 18642 -271149 -285320 -13833 195570 110780
27703 110780 -79527 -89535 44531 79809 -40692 -144232 -116605 -23417 56955 150396 290677
27692 290677 416977 432525 324650 185465 113964 110245 90758 20157 -23294 32306 124309
27681 124309 141544 92058 63176 51813 -11672 -86839 -49833 86895 166182 135554 115958
27670 115958 167879 192049 144243 137713 216751 236033 111595 -5445 22853 87986 50495
27659 50495 13295 138849 329104 352630 211045 124793 195083 308701 354308 326385 235789
27648 235789 110240 59433 153344 267070 235194 119896 117806 233211 272205 156620 17540
27637 17540 -37007 -31067 17306 120294 181009 63996 -141881 -161297 83887 336960 349431
27626 349431 177495 36522 26672 104723 184450 176255 55788 -48467 19512 188262 207141
27615 207141 7807 -180059 -160981 -23584 52733 50530 39976 23814 4849 64831 233509
27604 233509 399711 468559 481084 484733 443739 377825 401075 495568 450500 187749 -58411
27593 -58411 -78553 2043 -21393 -73500 21235 169872 153447 28068 39069 189781 241034
27582 241034 136429 90750 204870 300860 231123 87695 -1104 -54138 -109832 -114800 -46053
27571 -46053 24886 72397 153507 239216 198194 28997 -84606 -45892 17859 -4786 -31807
27560 -31807 18975 55554 -5484 -58908 390 66926 12384 -51435 64264 291982 388253
27549 388253 300392 204760 186866 130684 -29050 -167292 -168303 -88916 -28305 16091 64954
27538 64954 67517 11375 3957 112758 220291 186889 86217 106823 249940 311147 187025
27527 187025 23883 -10823 49923 90760 122079 214267 308473 275415 135549 41695 36373
27516 36373 10487 -57612 -24524 153917 271391 155945 -36408 -28877 157867 233745 70293
27505 70293 -133581 -164365 -59128 36468 92154 137660 119684 -19031 -185622 -214946 -83067
27494 -83067 71289 130465 109264 86657 111043 182662 263229 289204 224511 111007 32511
27483 32511 28049 67914 100729 86306 -2276 -157058 -310653 -374692 -319524 -199447 -97806
27472 -97806 -58820 -60365 -33932 72795 227056 319386 272118 129633 9665 -23751 -311
27461 -311 34506 79867 138481 163422 102985 -8376 -61219 -2672 83022 80943 15750 34657
27449 34657 193621 346760 328516 186021 114165 180471 253322 232843 207900 289761 401118
27438 401118 369486 180195 -1707 -51888 -4229 61111 119289 145140 72442 -102083 -243532
27427 -243532 -205713 -10846 170315 207938 127170 45339 52548 153644 278228 338435 308072
27416 308072 244540 210684 199646 178441 170877 218291 267273 192730 -35526 -284703 -398861
27405 -398861 -347526 -203369 -45969 62486 78703 23887 -26883 -56598 -135241 -270362 -325565
27394 -325565 -201449 -14796 49374 6569 26907 155274 264022 282605 277973 276981 211048
27383 211048 101898 102041 247669 351923 270208 113015 59589 107075 148760 160332 153350
27372 153350 81392 -40274 -60974 74746 169351 63968 -59055 62422 324659 394961
27362 394961 229049 102433 131877 131417 8565 -55866 44669 141920 116555 127292 298462
27351 298462 439207 338766 140996 136775 317424 420512 344369 247156 255320 308000 309814
27340 309814 258571 195587 158988 190444 282405 339801 293875 212342 193825 214278 198176
27329 198176 171723 198156 219429 129168 -29457 -105900 -69399 -34365 -58246 -67971 -6061
27318 -6061 86577 160760 219576 268319 295274 303680 284324 190575 33532 -61807 -24863 8195
27306 8195 -117455 -295479 -282469 -79702 48033 -38461 -180154 -196924 -109751 3514 152505
27295 152505 307761 328944 176097 33463 67087 198759 270736 287870 319864 303418 162461
27284 162461 30295 108073 333494 422112 258971 48502 20942 157002 284227 319452
27274 319452 315650 336604 372595 366364 284946 167963 98238 105733 126000 88329 11866 -32675
27262 -32675 -20852 21965 78143 135876 165177 160471 166519 193677 165327 45727 -39177 54726
27250 54726 251734 316327 168039 -11630 -38925 37858 51520 -31151 -79780 7509 166526
27239 166526 233821 124562 -65110 -150026 -64453 66899 112915 120890 209036 328034 298285
27228 298285 97024 -66781 -32086 112074 199654 224064 269993 315825 265118 128271 30226
27217 30226 48748 149969 267427 350393 352934 266537 151071 62517 -15022 -91637 -89303
27206 -89303 50981 232816 310080 294022 309364 370325 369768 290996 245479 264678 238356 123253
27194 123253 31802 23347 -12797 -142350 -225544 -134648 14565 44792 15811 112440 299346
27183 299346 336619 143332 -84938 -172601 -173304 -194028 -185643 -43022 193931 371159 400199
27172 400199 312246 175563 45347 -28078 -17820 47171 106298 126354 121673 122663 132652 120451
27160 120451 79234 90554 253922 502814 585160 348247 -14875 -157387 1685 215895
27150 215895 278756 263011 322907 430898 438891 297814 103626 -8055 55381 277244 484467
27139 484467 475317 269215 113379 159749 270224 244914 90991 -74766 -231514 -373857
27129 -373857 -372373 -158422 53296 4966 -188919 -162637 151469 397288 306289 60767
27119 60767 -8727 123434 220506 148108 7815 -42595 30624 121055 86048 -97168 -264114
27108 -264114 -232273 -43818 81704 52221 1998 42964 104099 108458 120127 180256 174067
27097 174067 33045 -84835 -14387 149577 221016 237278 346499 468491 375832 104399
27087 104399 -29749 106154 261446 190067 729 -47568 81187 214125 232349 149271
27077 149271 17923 -83836 -49515 125525 266693 211248 27933 -80957 -38803 79694
27067 79694 214225 338997 365051 225597 53827 62302 210747 214624 -33653 -270818 -227260
27056 -227260 9249 179227 237522 318286 422818 415874 307271 273768 366251 429767 377905
27045 377905 325355 356430 375598 313149 276152 332439 333906 163929 1111 79937 294712
27034 294712 328377 133868 -8758 62208 177382 158032 90190 127661 224585 245795 206310
27023 206310 221339 302034 355285 330127 240025 95451 -72366 -176534 -172225 -134599 -137181
27012 -137181 -122742 -18404 90124 57665 -79717 -129386 -14999 128706 168232 136535
27002 136535 119566 96490 -1879 -134554 -157529 4157 252312 411066 405736 317542 258718
26991 258718 237830 196746 143689 147820 190960 146778 -24935 -168971 -122942 61213 199695
26980 199695 224923 224983 267934 318027 325799 290981 229878 172870 188794 314513 463689 502183
26968 502183 410600 279689 165533 66391 25781 109959 264010 335536 282164 220067 219043
$$ [...]
##END NTUPLES=NMR SPECTRUM
##END=
