##TITLE=31Pdec_LY-TMF-7.40.3
 D2O, 24 sc
 2.3.2020
##JCAMPDX= 6.0         $$ Bruker NMR JCAMP-DX V2.0
##DATA TYPE= NMR SPECTRUM
##DATA CLASS= NTUPLES
##ORIGIN= UXNMR, Bruker Analytische Messtechnik GmbH
##OWNER= root
$$ XWIN-NMR		Version 3.5
$$ Mon Mar  2 15:42:07 2020 Russian Standard Time (UT+4h)  she@DPX200
##.OBSERVE FREQUENCY= 81.013821
##.OBSERVE NUCLEUS= ^31P
##.ACQUISITION MODE= SIMULTANEOUS
##.ACQUISITION SCHEME= undefined
##.AVERAGES= 24
##.DIGITISER RES= 17
##SPECTROMETER/DATA SYSTEM= spect
##.PULSE SEQUENCE= zgpg30
##.SOLVENT NAME= D2O
##.SHIFT REFERENCE= (INTERNAL, D2O, 0, 182.463)
##AUDIT TRAIL= $$ (NUMBER, WHEN, WHO, WHERE, WHAT)
$$ ##TITLE= Audit trail, XWIN-NMR		Version 3.5
$$ ##JCAMPDX= 5.01
$$ ##ORIGIN= Bruker BioSpin GmbH
$$ ##OWNER= she
$$ F:/spectra/data/she/nmr/P31/1/pdata/1/auditp.txt
$$ ##AUDIT TRAIL=  $$ (NUMBER, WHEN, WHO, WHERE, WHAT)
(   1,<2020-03-02 15:41:05.32 +0400>,<she>,<DPX200>,
      <created by zg, POWCHK disabled, PULCHK disabled
       configuration hash MD5:
       00 E9 B6 7A A2 85 ED C7 34 08 36 98 17 FE 4E 26
       data hash MD5: 32K
       BB C8 73 93 19 EF E7 26 FE 53 61 55 9B 5F 23 AC>)
(   2,<2020-03-02 15:41:07.62 +0400>,<she>,<DPX200>,
      <Start of raw data processing
       efp BC_mod = 2 LB = 1 FT_mod = 6 PKNL = 1 PHC0 = -1168.691 PHC1 = -244.5984 SI = 64K 
       data hash MD5: 64K
       22 BA 20 EA 03 73 F9 9B 04 22 03 EB C6 61 F7 25>)
(   3,<2020-03-02 15:41:19.28 +0400>,<she>,<DPX200>,
      <pk PHC0 = -1.412685 PHC1 = 0 
       data hash MD5: 64K
       F3 C9 D9 3D 95 39 66 95 AC 0A 83 B0 C3 F0 F2 29>)
(   4,<2020-03-02 15:41:25.53 +0400>,<she>,<DPX200>,
      <abs ABSG = 5 
       data hash MD5: 64K
       4F F4 82 3F A6 6C BA 83 D9 30 44 6A 45 66 A5 2E>)
(   5,<2020-03-02 15:41:41.42 +0400>,<she>,<DPX200>,
      <pk PHC0 = -2.595529 PHC1 = 0 
       data hash MD5: 64K
       AE 67 EC 2B 13 CD E3 DC 4B C0 A4 B4 AA 99 49 67>)
$$ ##END=
$$ 
$$ hash MD5
$$ E4 97 82 DD 42 F1 84 24 1E CA A9 78 8A 96 5E 27
##$RELAX= 
##$RELAX= 
##$RELAX= 
##$RELAX= 
##$RELAX= 
##$RELAX= 
##$RELAX= 
##$RELAX= 
$$ Bruker specific parameters
$$ --------------------------
##$DU= <F:/spectra>
##$EXPNO= 1
##$NAME= <P31>
##$PROCNO= 1
##$TYPE= <nmr>
##$USER= <she>
##$AMP= (0..31)
100 100 100 100 100 100 100 100 100 100 100 100 100 100 100 100 100 100 
100 100 100 100 100 100 100 100 100 100 100 100 100 100 
##$AQSEQ= 0
##$AQ_mod= 1
##$AUNM= <au_zg>
##$AUTOPOS= <>
##$BF1= 81.014009
##$BF2= 200.13
##$BF3= 200.13
##$BF4= 200.13
##$BF5= 200.13
##$BF6= 200.13
##$BF7= 200.13
##$BF8= 200.13
##$BYTORDA= 1
##$CFDGTYP= 0
##$CFRGTYP= 5
##$CHEMSTR= <none>
##$CNST= (0..31)
1 1 145 1 1 1 1 1 1 1 1 1 1 1 1 1 1 1 1 1 1 1 1 1 1 1 1 1 1 1 1 1 
##$CPDPRG= <waltz16>
##$CPDPRG1= <>
##$CPDPRG2= <waltz16>
##$CPDPRG3= <>
##$CPDPRG4= <mlev>
##$CPDPRG5= <mlev>
##$CPDPRG6= <mlev>
##$CPDPRG7= <mlev>
##$CPDPRG8= <mlev>
##$CPDPRGB= <>
##$CPDPRGT= <>
##$D= (0..31)
0 1 0 0 0 0 0 0 0 0 0 0.03 2e-05 3e-06 0 0 0 0 0 0 0 0 0 0 0 0 0 0 0 0 
0 0 
$$ [...]
##$SUBNAM3= <"">
##$SUBNAM4= <"">
##$SUBNAM5= <"">
##$SUBNAM6= <"">
##$SUBNAM7= <"">
##$SUBNAM8= <"">
##$SUBNAM9= <"">
##$SW= 369.568048894756
##$SWIBOX= (0..15)
0 1 3 0 0 0 0 0 0 0 0 0 0 0 0 0 
##$SW_h= 29940.119760479
##$TD= 32768
##$TD0= 1
##$TE= 0
##$TE2= 300
##$TE3= 300
##$TEG= 300
##$TL= (0..7)
0 120 53 12 22 120 120 120 
##$TP= (0..7)
150 150 150 150 150 150 150 150 
##$TP07= 0
##$TPNAME0= <>
##$TPNAME1= <>
##$TPNAME2= <>
##$TPNAME3= <>
##$TPNAME4= <>
##$TPNAME5= <>
##$TPNAME6= <>
##$TPNAME7= <>
##$TPOAL= (0..7)
0.5 0.5 0.5 0.5 0.5 0.5 0.5 0.5 
##$TPOFFS= (0..7)
0 0 0 0 0 0 0 0 
##$TUNHIN= 0
##$TUNHOUT= 0
##$TUNXOUT= 0
##$USERA1= <user>
##$USERA2= <user>
##$USERA3= <user>
##$USERA4= <user>
##$USERA5= <user>
##$V9= 5
##$VALIST= <valist>
##$VCLIST= <CCCCCCCCCCCCCCC>
##$VD= 0
##$VDLIST= <DDDDDDDDDDDDDDD>
##$VPLIST= <PPPPPPPPPPPPPPP>
##$VTLIST= <TTTTTTTTTTTTTTT>
##$WBST= 1024
##$WBSW= 4
##$XGAIN= (0..3)
0 0 0 0 
##$XL= 0
##$YL= 0
##$YMAX_a= 9973
##$YMIN_a= -10922
##$ZGOPTNS= <>
##$ZL1= 120
##$ZL2= 120
##$ZL3= 120
##$ZL4= 120
##$ABSF1= 182.463
##$ABSF2= -187.1042
##$ABSG= 5
##$ABSL= 3
##$ALPHA= 0
##$AQORDER= 0
##$ASSFAC= 0
##$ASSFACI= 0
##$ASSFACX= 0
##$ASSWID= 0
##$AUNMP= <proc_1d>
##$AZFE= 0.1
##$AZFW= 0.5
##$BCFW= 0
##$BC_mod= 2
##$BYTORDP= 0
##$COROFFS= 0
##$CY= -3
##$DATMOD= 1
##$DC= 0
##$DFILT= <>
##$DTYPP= 0
##$F1P= 0
##$F2P= 0
##$FCOR= 1
##$FTSIZE= 65536
##$FT_mod= 6
##$GAMMA= 0
##$GB= 0
##$INTBC= 1
##$INTSCL= 5.30512e-09
##$ISEN= 30
##$LB= 1
##$LEV0= 0
##$LPBIN= 0
##$MAXI= 10000
##$MC2= 0
##$MEAN= 0
##$ME_mod= 0
##$MI= 50
##$NCOEF= 0
##$NC_proc= -5
##$NLEV= 6
##$NOISF1= 182.463
##$NOISF2= 159.3651
##$NSP= 0
##$NTH_PI= 0
##$NZP= 0
##$OFFSET= 182.463
##$PC= 4
##$PHC0= -1172.7
##$PHC1= -244.5984
##$PH_mod= 1
##$PKNL= yes
##$PPARMOD= 0
##$PSCAL= 0
##$PSIGN= 0
##$REVERSE= no
##$SF= 81.0140089999434
##$SI= 65536
##$SIGF1= 159.3651
##$SIGF2= -187.1042
##$SINO= 113.3802
##$SIOLD= 16384
##$SREGLST= <1H.CDCl3>
##$SSB= 0
##$STSI= 65536
##$STSR= 0
##$SW_p= 29940.119760479
##$SYMM= 0
##$S_DEV= 0
##$TDeff= 32768
##$TDoff= 0
##$TI= <>
##$TILT= no
##$TM1= 0
##$TM2= 0
##$TOPLEV= 0
##$USERP1= <user>
##$USERP2= <user>
##$USERP3= <user>
##$USERP4= <user>
##$USERP5= <user>
##$WDW= 1
##$XDIM= 65536
##$YMAX_p= 465552291
##$YMIN_p= -5170298
$$ End of Bruker specific parameters
$$ ---------------------------------
##NTUPLES= NMR SPECTRUM
##VAR_NAME=  FREQUENCY,     SPECTRUM/REAL,   SPECTRUM/IMAG
##SYMBOL=    X,             R,               I
##VAR_TYPE=  INDEPENDENT,   DEPENDENT,       DEPENDENT
##VAR_FORM=  AFFN,          ASDF,            ASDF
##VAR_DIM=   65536,         65536,           65536
##UNITS=     HZ,            ARBITRARY UNITS, ARBITRARY UNITS
##FACTOR=    0.456856943014862, 1,           1
##FIRST=     14782.0589164792, 0,            0
##LAST=      -15158.0608439998, 0,           0
##MIN=       -15158.0608439998, -5170298,    0
##MAX=       14782.0589164792, 465552291,    0
$$ Real data points
##PAGE= N=1
##DATA TABLE= (X++(R..R)), XYDATA
$$ [...]
##PAGE= N=2
##DATA TABLE= (X++(I..I)), XYDATA
38927 178530 81965 -243548 -1226986 -2456312 -3002123 -2459078 -1276158 -201324 230031
38918 230031 -145079 -978132 -1517246 -1307104 -706182 -294944 20771 706215 1573766 1904068
38908 1904068 1651622 1621298 2140602 2438139 1868415 979372 666142 874434 918044 616407
38898 616407 312372 118888 -35127 95619 660725 1020673 415962 -724616 -1099702
38889 -1099702 -275317 758981 972189 438715 -127959 -231152 295713 1313278 2195067
38880 2195067 2264906 1683853 1254112 1168572 810607 89057 -59615 887725 2038819 2325355
38870 2325355 1931330 1574570 1122495 75068 -1071980 -1203220 -183602 977251 1514324
38861 1514324 1532693 1313965 956469 744002 970571 1290705 1045386 297077 -256699 -408693
38851 -408693 -577982 -767696 -410374 509686 1180053 1170744 994500 1057626 992393 532243
38841 532243 117493 20969 -219996 -784844 -892541 -44685 861049 725591 -79975 -384486
38831 -384486 -52894 105045 -72284 23262 360117 143311 -657296 -975916 -350131 224003
38821 224003 -138891 -770573 -492867 604768 1444127 1587207 1548018 1614829 1363958 552215
38811 552215 -276929 -486021 -204022 -122521 -665094 -1628368 -2491415 -2857325 -2675877 -2210792
38801 -2210792 -1783334 -1487748 -1195405 -830089 -501883 -314482 -182493 51069 405241
38792 405241 750169 902768 674333 21907 -682445 -772591 -39498 753612 583104 -538266
38782 -538266 -1463592 -1329358 -577979 -163659 -197452 -40465 503290 902765 871336 837807
38772 837807 1120806 1286950 854419 184426 45096 498996 839100 627755 264317 331003
38762 331003 723058 728825 -78931 -1214237 -1672006 -1004263 125869 680953 446815 110326
38752 110326 132260 123435 -335763 -806227 -544027 347757 1012851 1015990 773016 755433 901204
38741 901204 1018979 1205763 1519552 1677904 1495444 1314764 1562314 2052436 2167269 1677555
38731 1677555 989084 510127 109599 -594243 -1569943 -2233634 -2024506 -1038800 -6092
38722 -6092 395506 157370 -173765 -160331 119754 331720 335667 212093 -29305 -461045
38712 -461045 -873800 -692847 389717 1728556 2076196 891070 -914310 -1862236 -1447269
38703 -1447269 -429968 330256 788804 1253024 1534180 1123845 77329 -796361 -766453
38694 -766453 53267 892271 1137380 852545 531803 452223 442170 361205 512341 1162930
38684 1162930 1809773 1569609 426647 -588961 -783625 -646552 -776037 -691342 380720
38675 380720 1996462 2831485 2374319 1302968 257025 -682269 -1207219 -698213 614466
38666 614466 1450827 1111785 479886 671398 1415910 1608295 913355 -51981 -723274 -901663
38656 -901663 -384411 777322 1774688 1691153 711454 -50938 21036 502062 851409 1089394
38646 1089394 1300941 1192550 601324 -26342 -126672 256198 551793 296692 -492535
38637 -492535 -1370658 -1745364 -1325590 -418444 395010 902140 1331769 1817963 2176177 2271644
38627 2271644 2195860 1961372 1468849 967923 1060938 1880622 2627227 2360523 1064089 -412579
38617 -412579 -1282233 -1369474 -942158 -410782 -146183 -257532 -507526 -606082 -519552 -355379
38607 -355379 -121781 164964 305603 158378 -37581 113079 631637 1105235 1156168 794944
38597 794944 346613 170777 356732 555052 288272 -381262 -747219 -338840 349557 475344
38587 475344 38254 -114864 507127 1389972 1734976 1375586 754032 344560 320808 511764
38577 511764 520464 151092 -202840 42183 791444 1282047 1134297 838422 892626 1080315
38567 1080315 1125386 1462168 2532532 3667961 3635948 2299088 882530 430650 747620
38558 747620 1111718 1280064 1312903 1010868 192405 -751349 -1171424 -953077 -575199 -442965
38548 -442965 -528594 -639750 -677570 -557244 -162896 453339 961710 1007767 590813 110181
38538 110181 -54329 12916 -83878 -385181 -356523 369539 1294971 1603433 1287583 1116755
38528 1116755 1457101 1831897 1865154 1901770 2234959 2411390 1969726 1333295 1192829 1387026
38518 1387026 1224862 639783 118962 -344056 -1188521 -2114227 -2059799 -765991 541279
38509 541279 652722 -70463 -307452 467425 1484610 1742957 1061590 123544 -224149
38500 -224149 228457 827778 803279 250312 -22757 312423 652718 470820 136944 227874
38490 227874 538986 440165 -117132 -610254 -770168 -806529 -949202 -1277858 -1826304 -2342355
38480 -2342355 -2196351 -1159807 -47420 164913 -285455 -300709 398860 930045 755266
38471 755266 494167 728150 911573 270422 -809814 -1175506 -430060 674753 1279148
38462 1279148 1235099 894706 591304 425990 271118 -32661 -322964 -161588 491890 937007
38452 937007 530592 -354594 -731596 -320458 121171 -85459 -636323 -758591 -256022 329398
38442 329398 437435 63214 -377692 -578181 -644949 -837463 -1041437 -751355 220705 1267979
38432 1267979 1632148 1410150 1416516 2020182 2670299 2752707 2368441 1939384 1548781 1147988
38422 1147988 1012808 1387011 1884416 1854182 1276688 760551 684909 889236 1213948 1723703
38412 1723703 2241006 2272678 1713750 1113424 862862 581626 -201269 -1123970 -1348134 -668976
38402 -668976 295396 966177 1315186 1468795 1323086 777082 22380 -611185 -908274 -777852
38392 -777852 -246081 455077 1006738 1312891 1511650 1641601 1554510 1245272 995486 1037822
38382 1037822 1288450 1529467 1632139 1502343 1096790 645845 536516 749813 747329 216209
38372 216209 -418216 -631935 -609927 -816548 -988355 -366380 974392 1844961 1414808 346787
38362 346787 -115911 256833 710639 847731 1056160 1531564 1748944 1348409 883312 1036324
38352 1036324 1506033 1425648 702904 131409 106182 29840 -681266 -1673004 -2215075 -2161702
38342 -2161702 -1804690 -1228672 -503264 -194163 -849113 -2019960 -2561117 -2017982 -1084021
38333 -1084021 -564702 -536992 -702770 -874424 -800285 -187093 648894 753188 -264393 -1455844
38323 -1455844 -1599408 -727342 42430 4744 -431315 -493327 43518 783495 1218977 1254625
38313 1254625 1346790 1961842 2799126 2957473 2147454 1234520 1088513 1380878 1217487 587800
38303 587800 322751 763240 1335380 1480740 1252454 924368 722239 991703 1863981 2653465
38293 2653465 2423359 1370966 794576 1321760 2007052 1712563 638927 -166673 -214208
38284 -214208 237251 906679 1624402 2035251 1929729 1734100 1997067 2459796 2296404 1339028
38274 1339028 461627 509969 1249185 1659739 1089508 -122016 -1116895 -1419082 -1232363
38265 -1232363 -929893 -594535 -274885 -303227 -796490 -1051491 -214330 1375966 2310028
38256 2310028 1847009 767346 81260 -332631 -1144441 -2249465 -2835260 -2455977 -1390850
38247 -1390850 -195016 592480 664932 407760 690405 1608548 2010859 1076980 -235395
38238 -235395 -410208 402840 709208 64357 -307094 452879 1524468 1729784 1115683
38229 1115683 514588 317847 389224 598311 786051 650245 205533 -40208 199059 523503
38219 523503 484655 205603 -32431 -282910 -530427 -330186 555122 1580469 2065514 2044951
38209 2044951 1918374 1671939 1119783 576351 523550 779277 718636 257016 -45035 139103
38199 139103 504859 652291 530101 288155 84973 55238 141037 41096 -343039 -603204
38189 -603204 -377041 42540 167618 121471 335663 676896 684487 553739 934858 1687365
38179 1687365 1854385 1175375 621568 897903 1324204 942772 -4623 -571720 -516762 -283903
38169 -283903 6761 515616 836023 291613 -832547 -1371106 -882333 -257903 -266209 -323861
38159 -323861 534804 2020402 2820558 2305168 1199937 478979 274514 190320 173006 521759
38149 521759 1162780 1432059 820085 -274146 -842097 -367762 596819 1124006 984757
38140 984757 699287 589081 292363 -507647 -1288882 -1175055 -137359 806342 750107 -96803
38130 -96803 -777017 -694134 -91601 423483 538343 394586 273114 231557 87019 -227003
38120 -227003 -402810 -83961 531992 715653 45406 -968072 -1388854 -931206 -262621
38111 -262621 -204841 -851479 -1573341 -1750019 -1343823 -758327 -257087 295755 1011553 1479688
38101 1479688 1090204 -33582 -821729 -352790 1021879 2046955 1984203 1261283 694931
38092 694931 522567 412593 96710 -339925 -681997 -836787 -851712 -795924 -647613 -316343
38082 -316343 145845 402977 103262 -651514 -1286502 -1325737 -870854 -407802 -246710 -289375
38072 -289375 -303324 -282961 -463225 -975538 -1553799 -1705751 -1229497 -452217 117992 255120
38062 255120 64884 -209077 -265663 115972 743963 1038088 712253 198734 -9848 -142000
38052 -142000 -636294 -1052333 -381903 1401837 2947278 3063878 1981010 647090 -521830
38043 -521830 -1548696 -2125142 -1806128 -804116 106766 451824 329352 -68066 -679738
38034 -679738 -1335310 -1724963 -1663473 -1153167 -310041 537507 932401 791584 528107 330174
38024 330174 -223785 -1271750 -1881156 -1030973 855727 2297566 2607267 2394316 2165894
38015 2165894 1532981 233741 -1007200 -1335420 -878506 -357912 -32875 356055 896217
38006 896217 1327981 1424154 1161646 665158 259187 369923 1108965 2127644 3021750 3596511
37996 3596511 3649182 2982471 1893209 1165472 1223329 1691920 2080559 2369629 2545360 2195230
37986 2195230 1191022 243407 29875 177123 -89396 -622667 -597914 94213 657059
37977 657059 611100 309035 94774 -189466 -587962 -700407 -348651 38022 67398 -109248
37967 -109248 -230066 -307402 -270420 169508 876774 1103478 497884 -176696 31596 936848
37957 936848 1449452 962321 -46308 -676022 -391795 719674 1980581 2469165 1806808
37948 1806808 628023 -58139 74539 524474 690515 364649 -309785 -901212 -862292
37939 -862292 -151682 457098 263189 -320192 -347327 119991 17332 -978453 -1760418 -1421546
37929 -1421546 -649521 -617762 -1171019 -1204763 -475893 165800 337875 731078 1775732 2661723
37919 2661723 2349933 999842 -242338 -569097 -127020 462902 759930 798656 1010883
37910 1010883 1691226 2383756 2182913 956127 -179032 -124002 798319 1355585 1081240
37901 1081240 654723 651474 786942 679458 609182 998610 1621115 1877041 1603584 1177847
37891 1177847 1004195 1236713 1777368 2188819 1856079 687373 -492223 -700560 102339
37882 102339 1049092 1407635 1181754 761072 469607 494464 797755 1005988 787823 381774
37872 381774 283902 389833 96588 -550284 -581670 509426 1770452 1944654 1187567 742618
37862 742618 1128932 1637498 1672521 1582642 1796231 1999731 1763221 1337321 1169717 1123022
37852 1123022 867455 633672 771625 853622 156365 -1016702 -1463124 -735096 203520
37843 203520 327313 -234345 -799736 -1179504 -1427769 -1191364 -224095 792501 889864 185938
37833 185938 -243972 100031 592133 647596 591814 920027 1345076 1182038 333778 -605905
37823 -605905 -1024741 -718264 105463 888692 1023436 474807 -47630 125373 818556 1311915
37813 1311915 1272752 1007186 883637 906758 880183 679883 313961 -78133 -275151 -184980
37803 -184980 35286 209945 382006 637134 821545 669011 137724 -543712 -1052972 -1096429
37793 -1096429 -625124 -114457 -258481 -1046837 -1532972 -1010267 -57191 236277 -204257
37784 -204257 -500235 -283655 -150272 -502869 -863654 -737617 -401109 -320719 -391877 -299224
37774 -299224 -148326 -198794 -369791 -518273 -832206 -1437577 -1965096 -2012317 -1690325 -1227057
37764 -1227057 -475390 563124 1193839 845237 115775 72042 663060 829835 181528
37755 181528 -513034 -717001 -919846 -1545464 -2018475 -1653215 -799888 -331727 -443824 -663479
37745 -663479 -682853 -502927 -73420 520586 793324 498490 280756 873875 1824749 1972782
37735 1972782 1217478 757108 1264509 1866382 1573778 845453 787032 1363461 1529487 979822
37725 979822 657265 1281134 2282491 2691089 2423831 2086312 1922804 1636366 1080141
37716 1080141 510867 145459 -38280 1569 410678 1040400 1442098 1483865 1599139 2127918
37706 2127918 2735648 2867232 2541383 2251263 2203823 2127771 1822787 1438446 1120743 802373
37696 802373 497981 424365 618481 773891 688317 549774 521123 391300 -9569 -377138
37686 -377138 -367064 -203888 -338775 -692208 -819845 -695089 -630606 -442207 471615 1966716
37676 1966716 2889217 2496854 1508609 1109458 1438667 1823286 2092871 2685819 3535967
37667 3535967 3838592 3183444 2167384 1524111 1249877 996191 802421 912014 1179960
37658 1179960 1167753 694039 -42405 -731203 -1079502 -911528 -459377 -320792 -754940 -1221851
37648 -1221851 -1042402 -365588 -10103 -399253 -1124656 -1608781 -1754906 -1785251 -1779424 -1606186
37638 -1606186 -1171894 -617096 -305056 -518947 -1016645 -1064960 -237062 932316 1466557
37629 1466557 1078032 389824 54459 101632 217544 211148 55679 -147619 -124343 276998
37619 276998 677031 527699 -18244 -174695 338445 859969 832321 621818 777263 1074692
37609 1074692 985054 627804 502177 618975 691277 897666 1552824 2160215 1763424 318451
37599 318451 -1163645 -1976720 -2328587 -2384736 -1732382 -352747 753526 738608 160657
37590 160657 219024 1033515 1504428 839712 -463652 -1296634 -1130457 -348197 344815 643318
37580 643318 782364 989269 981766 345036 -643541 -1104375 -660732 78181 446865 566897
37570 566897 793270 908125 597422 302464 685885 1418838 1447878 551829 -245395 -93916
37560 -93916 590963 856602 457143 -78726 -216381 162389 813575 1275092 1210267 862559
37550 862559 878179 1433153 1884043 1604960 838679 323596 352740 649529 964157 1266339
37540 1266339 1398716 1056683 259123 -494357 -709038 -361002 207796 690099 1004085
37531 1004085 1192666 1259580 1143564 849854 530092 317765 142423 -90969 -180867 176500
37521 176500 800885 1055916 715834 417307 846952 1768838 2340325 2201219 1723689 1301247
37511 1301247 990309 866666 1095833 1459363 1387814 771116 246594 320852 659921 692146
37501 692146 477895 385029 250670 -346175 -1095813 -1125102 -338660 234459 -124979 -747335
37491 -747335 -570151 338468 1082345 1404541 1822068 2325400 2074338 815173 -346759
37482 -346759 -300763 619667 1324313 1526070 1645278 1580006 823656 -183703 -103375 1439916
37472 1439916 3067241 3377055 2662750 2134473 2086507 1790514 870528 -163222 -715919
37463 -715919 -720730 -434184 -195753 -368392 -979315 -1455869 -1230422 -526271 -10352 174393
37453 174393 349065 420550 -23935 -658831 -465760 744719 1736518 1411228 296996
37444 296996 -259618 97086 532871 364537 -194276 -590798 -576619 -207096 292196 528608
37434 528608 208610 -436893 -759488 -368431 446025 1022627 962665 463911 107467 265428
37424 265428 677211 735524 220517 -468180 -865726 -913322 -743136 -383988 36385 157975
37414 157975 -146780 -443129 -282241 145694 334051 220907 142045 185082 123185 -85155
37404 -85155 -268095 -496639 -1017488 -1647929 -1762339 -1082214 -84924 580335 787841 883454
37394 883454 1181764 1649080 1923631 1621239 772409 -126558 -678625 -977737 -1127099 -718083
37384 -718083 584429 2129249 2741343 2156712 1269086 830420 694363 603073 874793
37375 874793 1766828 2784905 3225046 2977059 2333745 1487693 707533 504470 1033961
37366 1033961 1741947 2125520 2339427 2475585 1932958 437124 -881380 -664747 644891
37357 644891 1257640 558574 -156968 188609 911181 872878 242266 -46913 155936 288600
37347 288600 231726 315770 408321 73342 -353806 100727 1548261 2743153 2574911 1412170
37337 1412170 417237 36442 -159999 -444702 -517393 -174937 215061 170832 -324197 -921792
37327 -921792 -1310372 -1284951 -689247 330561 1106888 917597 -148901 -1038661 -712555
37318 -712555 739516 2140175 2424801 1681479 912047 869058 1342217 1629586 1440511
37309 1440511 1059451 763813 508213 270794 292020 688672 1128768 1229736 1055239 861585
37299 861585 596694 134395 -184349 113858 757307 847917 35362 -1005157 -1487719 -1328115
37289 -1328115 -770848 135889 1202484 1790660 1477532 688493 134511 -25621 62768
37280 62768 553908 1492936 2169853 1813687 803116 275297 541801 806801 534117 110859
37270 110859 -108206 -431030 -1015634 -1285511 -805224 -87387 133508 -100065 -335192 -563427
37260 -563427 -981282 -1291170 -1021843 -324267 254479 619861 1084751 1628068 1888094 1812100
37250 1812100 1636751 1282798 502822 -341704 -447729 263433 864009 658622 107291
37241 107291 74461 633932 1126994 1097291 665048 133453 -321684 -589344 -591299 -385529
37231 -385529 -141068 18207 84312 133023 266814 507449 720876 754029 644249 562905
37221 562905 591805 731301 1039480 1474010 1663375 1240472 447353 -14735 148736 538668
37211 538668 791373 1102731 1741122 2491788 2955297 3012313 2630395 1665074 353286 -436191
37201 -436191 -124180 689925 971769 666464 560891 848325 802327 71658 -624358 -550898
37191 -550898 5878 290336 103875 -266892 -661041 -982303 -922287 -388261 80340 -30258
37181 -30258 -359691 -164123 504086 864837 636394 392842 534260 684760 493398 358473
37171 358473 784152 1474539 1713894 1417831 1187168 1374277 1658527 1641517 1395083 1207371
37161 1207371 1121600 997445 827565 713439 617578 400781 100353 -61529 -1697 107787
37151 107787 152195 264771 483528 441843 -195554 -1051085 -1267671 -554477 421309 882909
37141 882909 748273 316386 -325798 -1068712 -1389711 -910512 -115874 220748 187251 494857
37131 494857 1140312 1273619 611960 14561 187147 679198 792047 716129 985919 1432012
37121 1432012 1577428 1624331 2079611 2670500 2612686 1854916 1125807 760424 421290 69122
37111 69122 208354 852221 1168941 677432 48890 103551 595926 681199 180115 -328614
37101 -328614 -453254 -362424 -294602 -298820 -506129 -1104853 -1843696 -1997292 -1181914 11821
37091 11821 584433 294018 -119757 -7295 305992 127127 -402940 -442690 168304 504837
37081 504837 -35740 -695956 -478726 292932 514613 25510 -332292 -246061 -289772 -592438
37071 -592438 -402887 535166 1294291 1144796 669211 665982 767883 160878 -916300 -1485053
37061 -1485053 -1312592 -1040788 -964417 -655303 145653 1084360 1766380 2094531 1926136 1050737
37051 1050737 -286978 -1365472 -1697751 -1394707 -761819 12618 675217 901929 702830
37042 702830 501347 610718 858640 850264 415304 -249350 -702900 -560986 110152 763470
37032 763470 961690 874840 907619 1013609 817105 332439 45645 181129 318995 -43631
37022 -43631 -810150 -1366718 -1249988 -639278 -184542 -293561 -632302 -560908 -45149 292480
37012 292480 131741 -115944 -126590 -235928 -658919 -826454 -318256 114187 -486994 -1647611
37002 -1647611 -1973906 -1198395 -477487 -503854 -552084 170519 1306467 2092538 2450561 2659068
36992 2659068 2622479 2157237 1509859 996107 527844 -38683 -526215 -824356 -1136620 -1380339
36982 -1380339 -917402 494478 1947860 2277608 1424130 320721 -296273 -380421 -154042
36973 -154042 138790 169604 -182681 -473584 -103452 860976 1613373 1407036 254179 -1092710
36963 -1092710 -1709808 -1211101 -60756 929904 1414376 1571780 1495883 1113743 743135
36954 743135 957777 1620107 1836229 1315400 972347 1554466 2447339 2670647 2392723 2461962
36944 2461962 2921931 3070659 2709480 2277515 1904894 1352077 802157 697755 810901
36935 810901 502699 -51717 10260 712178 966380 215467 -700142 -855618 -475439 -181738
36925 -181738 140483 856925 1554876 1440719 503056 -487989 -990123 -1059950 -863702 -472489
36915 -472489 -137182 -194022 -587630 -893696 -894866 -781806 -704735 -470670 142150 987643
36905 987643 1642914 1806677 1539850 1208298 1221847 1692703 2263773 2380706 1848354 1037576
36895 1037576 404321 -82676 -729459 -1331369 -1106025 198615 1522604 1523278 307363
36886 307363 -641011 -424559 192172 100339 -547955 -796700 -388459 95299 308289 450732
36876 450732 610083 651293 786552 1428618 2334318 2651118 2041327 1091249 370775 -240954
36866 -240954 -977878 -1574797 -1672873 -1370244 -957861 -479009 85028 511482 555533 256385
36856 256385 -151488 -370682 -50539 870118 1735980 1688327 846373 364473 961048 1998000
36846 1998000 2470003 2286189 1956067 1568834 910678 262899 191129 604447 803523 520045
36836 520045 210971 191990 163804 -117936 -310983 -86566 156600 -256595 -1277665 -2118648
36826 -2118648 -2248814 -1918921 -1533502 -991606 -75444 837771 1090370 732879 553008
36817 553008 970202 1554254 1932769 2426934 3192126 3432449 2416810 859918 210928
36808 210928 699137 1148728 761966 12223 -414382 -481685 -260528 434390 1368910 1803965
36798 1803965 1645595 1756565 2504244 2984617 2501097 1840227 2012329 2562634 2428706
36789 2428706 1874053 2094468 3135301 3665099 2940332 1724908 968174 687115 574527
36780 574527 710974 1065428 1043660 234879 -810629 -1130447 -480992 443932 786366 316883
36770 316883 -395657 -514531 198516 1055714 1195715 569064 -131471 -381728 -227190 135801
36760 135801 639283 1146599 1456207 1604910 1764579 1798453 1381421 637349 169005 300007
36750 300007 719038 1033104 1246009 1496737 1735125 1916452 2199806 2687434 3167502 3296112
36740 3296112 2898202 2057643 1123768 606882 757791 1226949 1437351 1282592 1126078
36731 1126078 1178178 1335472 1625308 2236484 2958389 3151680 2579714 1828512 1556448 1676195
36721 1676195 1646628 1310757 1045189 1181671 1588966 1828372 1573726 900003 220464 -107838
36711 -107838 -108741 -49159 -81139 -192790 -399303 -724055 -1047890 -1214025 -1201420 -976042 -366581
36700 -366581 568009 1255370 1172515 577948 186542 206407 240103 61771 -157267 -414382
36690 -414382 -947574 -1563529 -1583259 -787926 141195 499973 435188 587241 1229763 2104374
36680 2104374 2826849 3165672 3108736 2821193 2398954 1739546 961186 720835 1465661 2439253
36670 2439253 2273416 773513 -686809 -904497 -231244 243739 184324 39274 107098
36661 107098 288515 526509 906734 1383006 1721909 1651475 1027267 144621 -191676 496412
36651 496412 1439756 1333871 143992 -732483 -476160 9031 -385430 -1280290 -1553199
36642 -1553199 -1016440 -342272 104512 339959 149296 -550168 -1110080 -960793 -705169
36633 -705169 -1323240 -2536199 -3129581 -2798725 -2444943 -2525132 -2317718 -1227965 163543
36624 163543 903441 857500 646078 851263 1583182 2448643 2796775 2355354 1617844 1186590
36614 1186590 901907 240455 -595984 -826566 -338659 68871 -155188 -700830 -1115817
36605 -1115817 -1330677 -1229619 -531388 527582 1135265 960853 632958 761293 1099381
36596 1099381 1101494 735000 317174 74676 224087 902324 1651135 1638922 843090 295468
36586 295468 591384 926949 410934 -367552 -146052 1052117 1930384 1810788 1409605
36577 1409605 1519139 1872952 1787282 1267800 925163 1140822 1770855 2486667 3038631 3245114
36567 3245114 2990487 2292205 1316436 355385 -248814 -351111 -255122 -507851 -1220825 -1711638
36557 -1711638 -1157300 310020 1488850 1382312 373807 -286745 -52994 445463 559633
36548 559633 487210 554088 368306 -466629 -1224131 -690765 1069733 2521426 2462298 1298715
36538 1298715 265143 52915 536138 1233438 1614393 1399682 920601 818735 1180476
36529 1180476 1434389 1274708 1050261 947517 532457 -364474 -987117 -616878 266267
36520 266267 569204 57829 -495338 -483562 -95125 197780 192854 -34582 -228634 -53120
36510 -53120 536421 1079844 1122725 825924 681673 757460 690058 383372 227701 529454
36500 529454 1079403 1426310 1377691 1134467 995266 923703 487869 -518771 -1462216 -1397019
36490 -1397019 -357812 511685 489607 264443 779464 1723001 2080192 1779761 1702019 2139750
36480 2139750 2355567 1881274 1272252 1141324 1255105 1166785 1125855 1652362 2529731 2904656
36470 2904656 2365636 1451773 998021 1245789 1704080 1748738 1246070 593796 242882 318212
36460 318212 703282 1243093 1693017 1695730 1111483 298600 -148246 120922 1057805 2253407
36450 2253407 2952400 2470325 1041575 -86536 43839 949956 1429464 1154205 798756
36441 798756 768906 752552 621091 791717 1321290 1521087 1063527 760334 1482806 2779478
36431 2779478 3389183 2900927 2091063 1613635 1144382 143906 -1081673 -1606278 -998814
36422 -998814 229448 1320912 2036868 2530384 2791248 2678753 2406455 2416563 2618726
36413 2618726 2342247 1414327 710628 1014459 1797891 1994993 1717537 2120289 3444809
36404 3444809 4306189 3509433 1785789 929690 1605555 2760335 3089739 2446485 1678159
36395 1678159 1488816 1728695 1738834 1225624 609395 428738 638872 801190 791206 865917
36385 865917 1084883 1182064 1077251 1000278 972176 687397 136228 -159592 143521 674338
36375 674338 868961 711396 615386 801314 1085467 1159682 942453 781947 1239917 2347461
36365 2347461 3198260 2834161 1515793 450929 199254 134597 -306356 -731273 -591241
36356 -591241 -69046 395323 773272 1077825 1025731 680452 711016 1324511 1697560 1269565
36346 1269565 805001 1183578 1902581 1967046 1577057 1537897 1567594 835328 -147885 -27045
36336 -27045 978817 1076689 -247478 -1214973 -385050 1341226 2361385 2529652 2437854
36327 2437854 1878804 597955 -380764 90225 1307102 1521491 471475 -441960 -425264
36318 -425264 -148928 -112528 291725 1441857 2467476 2451653 1787436 1432246 1409351 977360
36308 977360 -18750 -831941 -830219 -190891 517873 991751 1261742 1390445 1303768 903195
36298 903195 296957 -157843 -177082 116331 377192 533521 816729 1291135 1740288 2127595
36288 2127595 2709004 3418737 3597230 2790496 1521340 758906 799506 1159866 1418627
36279 1418627 1586808 1683223 1550888 1218918 942145 747767 433460 140490 330256 921644
36269 921644 1087394 401799 -329284 -27432 1204075 2258721 2460950 2134743 1817859
36260 1817859 1614035 1423574 1207039 838079 197469 -412117 -425177 215590 900471 1175949
36250 1175949 1277533 1600868 2097179 2498020 2719743 2715726 2347070 1778819 1581737 1974559
36240 1974559 2353959 2131640 1690571 1806249 2308441 2135913 837789 -676570 -1201688
36231 -1201688 -579574 360255 869044 895199 777029 711160 659992 620551 738584 1046836
36221 1046836 1276722 1228230 1237995 1803622 2640578 2694663 1474471 -130212 -913341 -834016
36211 -834016 -739562 -894140 -664148 306810 1453131 2089600 2201841 2097234 1821511 1350399
36201 1350399 962543 960126 1210724 1294525 973351 317557 -426294 -875269 -621100 414717
36191 414717 1778829 2781228 2977644 2394342 1456058 708348 411931 365904 258287
36182 258287 96617 69299 149036 222905 489252 1198064 2003621 2168347 1557869 889227
36172 889227 781525 1070850 1294926 1317519 1165223 774703 290097 133490 366633 453435
36162 453435 107341 -140475 182705 515805 -44651 -1317598 -2114075 -1715816 -572708
36153 -572708 523800 1276582 1704246 1740360 1385069 916684 633840 552108 512972 411674
36143 411674 201192 -130122 -438077 -431001 25456 640848 863802 421568 -263831 -344580
36133 -344580 533814 1665626 2034708 1667607 1678607 2675537 3719388 3495478 2127619
36124 2127619 1024484 1032895 1568082 1724399 1485977 1413107 1649367 1799522 1614214 1348758
36114 1348758 1399972 1805594 2183466 2137474 1712136 1371367 1444456 1699039 1622420 1023818
36104 1023818 151638 -673998 -1252220 -1382179 -915387 -33099 768979 1098290 960046
36095 960046 638747 432056 467083 610474 603948 443954 503732 1041816 1727874 1997892
36085 1997892 1809055 1649844 1787609 1925407 1752454 1480930 1566071 2056651 2468532 2315417
36075 2315417 1663954 1076157 951346 1051396 923549 682717 848584 1302528 1128736
36066 1128736 -18161 -1049424 -751794 478288 1169573 825113 395872 696794 1388430
36057 1388430 1765736 1638357 1119354 388106 -20270 436240 1306184 1433079 702660
36048 702660 449774 1424595 2440683 2102299 967061 646781 1344907 1769957 1273126
36039 1273126 603390 440874 528449 591181 926471 1586344 1990369 1923377 2020967 2625234
36029 2625234 2988256 2392232 1366605 881827 841992 397438 -502439 -933699 -432153
36020 -432153 336978 618528 499515 396644 269278 -81948 -388649 -272301 -11959 -237653
36010 -237653 -832621 -838316 250933 1642783 2164056 1678359 1055738 930239 1099856 1150640
36000 1150640 1039890 850377 513074 122594 92541 574417 1069958 1099684 960490 1224095
35990 1224095 1662311 1407685 287849 -692689 -582707 265658 661996 77336 -789456
35981 -789456 -939868 -207112 680344 961384 566031 15030 -205373 -33376 308611 607242
35971 607242 745543 703274 613574 663059 796567 720164 398272 305953 836459 1622121
35961 1622121 1895663 1496595 1044016 1018366 1147542 951311 506535 302831 550152 988715
35951 988715 1301145 1406009 1343362 1123045 787815 516534 553682 976762 1501664 1607794
35941 1607794 1031409 137062 -402722 -350934 -99836 -5068 194209 973903 2159547 2852884
35931 2852884 2373885 1073336 8030 -127878 435398 1044245 1420793 1725335 1968287
35922 1968287 1815863 1182780 642133 786097 1311191 1269640 345885 -580455 -454474 651887
35912 651887 1623759 1593628 829091 299662 588377 1363410 1849927 1675129 1135300 659103
35902 659103 248687 -328102 -944305 -1094585 -531973 400155 1215271 1788728 2240881 2572792
35892 2572792 2653370 2392477 1740284 729087 -279797 -679448 -300871 206071 122698
35883 122698 -318776 -173377 914939 2139407 2457003 1716693 619127 -143066 -394401
35874 -394401 -329588 -218522 -248921 -434218 -629403 -703255 -632923 -385690 106308 696231
35864 696231 940982 553254 -148466 -538026 -411133 -117791 44013 184788 413505 457698
35854 457698 73645 -370113 -196912 652071 1399942 1331989 622580 -3516 -230421 -370308
35844 -370308 -615953 -530549 338544 1509736 1770205 592564 -976962 -1301944 37163
35835 37163 1874038 2943315 3169682 3156535 2970145 2176032 893840 -8524 33909 642718
35825 642718 1152922 1352886 1247699 677819 -245046 -717434 14610 1558860 2604882
35816 2604882 2315503 1080509 -126779 -705386 -662458 -329778 -75501 -62496 -115581 56634
35806 56634 473977 866262 1016818 926716 675117 361827 183631 320584 712533 1118182
35796 1118182 1352256 1302965 883027 254448 -70188 251987 884556 1230714 1208159 1092381
35786 1092381 769796 -90137 -1094190 -1234125 -258610 826676 1084613 788212 677598
35777 677598 719023 375823 -293063 -634258 -361489 146847 432003 301357 -250798 -885674
35767 -885674 -841022 306182 1829264 2480889 1986155 1250497 993757 933761 613678 286073
35757 286073 397901 712798 650134 277654 309858 1118278 2265445 3112220 3443341 3330416
35747 3330416 2807401 2026854 1454110 1440469 1678761 1563693 1167191 1310947 2327601
35738 2327601 3231989 2771871 1120322 -187930 -71531 995259 1859551 1977879 1466694
35729 1466694 543786 -430567 -778606 -114129 1001757 1604535 1466485 1203135 1321916
35720 1321916 1671881 1825739 1550573 890860 181399 -62984 319088 786588 736077 387731
35710 387731 456152 972248 1131550 478624 -432313 -879549 -878579 -794938 -548675 176673
35700 176673 1159063 1687871 1440556 892570 707481 977568 1262083 1256784 1179658 1403421
35690 1403421 1884504 2210140 2167278 1937498 1669606 1264511 781593 614953 901970 1144961
35680 1144961 871270 327951 37860 34564 93991 293103 622053 507034 -314046 -826798
35670 -826798 115255 1847373 2507081 1688835 941618 1206977 1428653 616862 -265703
35661 -265703 107299 1114228 1153538 245572 -83758 717608 1541114 1556356 1342533 1619525
35651 1619525 2059760 2040599 1733661 1720771 2008161 2023690 1390154 365970 -357596 -211613
35641 -211613 688033 1546490 1713348 1383821 1144901 1054159 726835 202750 43018 495914
35631 495914 1150013 1523996 1513248 1224186 882252 886364 1367628 1726590 1298322 470513
35621 470513 313584 991603 1479444 1161693 732073 943926 1350771 1073346 172853 -565949
35611 -565949 -755223 -526500 55477 870453 1331627 957834 215349 -3844 343948 477671
35601 477671 37229 -519661 -824303 -1052412 -1274227 -1185203 -834391 -820997 -1248789 -1227732
35591 -1227732 -157585 1064784 1056731 -109742 -961600 -603422 343723 1024340 1575783
35582 1575783 2434906 3185567 3059890 2265846 1843314 2198191 2659627 2677639 2594499 2782577
35572 2782577 2780229 2014929 915830 486813 954931 1595991 1864510 1962646 2166746 2285209
35562 2285209 2107006 1864564 1845747 1882993 1607342 997687 373585 18057 64219 558289
35552 558289 1313816 1810191 1564794 641207 -395277 -1023237 -1110558 -760180 -76628 754117
35542 754117 1297355 1101472 278723 -322605 108099 1329706 2162864 1835799 895808
35533 895808 441223 743878 1152505 1209101 1210941 1540807 1998338 2111528 1780765 1312904
35523 1312904 991368 820989 608380 215768 -188347 -204497 294149 868813 1007517 758828
35513 758828 518595 388614 249583 265770 621004 866313 407882 -292098 -24688 1311739
35503 1311739 2207707 1545226 187577 -322599 80159 226366 -339811 -863862 -766649
35494 -766649 -420017 -287861 -137676 477082 1450744 2198801 2270590 1773233 1357952 1681881
35484 1681881 2610037 3156008 2622495 1578263 1159049 1572093 1968608 1760984 1314234
35475 1314234 1151692 1169479 1030570 857196 1057325 1653192 2124648 1916634 1019221 74524
35465 74524 -180699 297236 807706 844297 783018 1231648 1985327 2236376 1690867 826005
35455 826005 75790 -535380 -870993 -553740 330367 992729 799663 -6912 -704345 -842191
35445 -842191 -413935 310893 899764 1048555 919626 870017 847669 550778 158350 189060
35435 189060 524084 413368 -243933 -518669 145023 1030622 1366417 1593173 2412270 3211498
35425 3211498 2697596 888953 -707974 -1003711 -432159 30001 77733 157 84860 453084
35415 453084 999390 1281077 953655 450874 638290 1577499 2269033 1972297 1197321 925668
35405 925668 1333249 1818747 1929279 1690958 1271900 881992 857281 1293459 1652214 1257560
35395 1257560 224775 -565990 -516855 67093 508171 504221 179132 -216291 -369638 14220
35385 14220 829640 1433294 1251291 469659 -161235 -150437 388728 1132034 1865587 2332713
35375 2332713 2187041 1408708 566996 373917 1018808 2078253 2961823 3300306 3054420
35366 3054420 2468132 1848180 1247275 499605 -290926 -573621 -12613 861659 1139693
35357 1139693 656069 156657 251164 661197 738799 337735 -177922 -528335 -708455 -672654
35347 -672654 -229074 620764 1449375 1716314 1330390 790575 654729 906891 1053149 887548
35337 887548 833058 1252954 1728798 1525625 676285 47242 231048 855572 1172231 914469
35327 914469 353127 -135755 -300752 -85192 322864 718684 1213896 2003309 2772491 2859670
35317 2859670 2185587 1472336 1256799 1249220 1043768 871628 1108672 1542629 1754840 1813631
35307 1813631 1942489 1909877 1494908 1193308 1572268 2154316 1937077 993437 528656 1141602
35297 1141602 1982377 2041115 1463712 1037412 978126 855053 388082 -190129 -417018 2100
35287 2100 845801 1317079 771363 -299619 -565438 474467 1650818 1542785 365408
35278 365408 -287430 506955 1905429 2435610 1719066 709941 450667 980211 1554373
35269 1554373 1691892 1674066 1957874 2456409 2748122 2789119 2923195 3222574 3378379 3382717
35259 3382717 3739334 4622738 5256684 4652207 2839140 984053 277305 854099 1733463
35250 1733463 1747622 687225 -451794 -584895 182530 837364 942777 1064234 1495720
35241 1495720 1518703 639126 -226042 136671 1369175 1971667 1482284 1000612 1336167
35232 1336167 1850502 1731379 1396556 1703362 2399310 2419850 1531082 727857 880907 1703244
35222 1703244 2308865 2279336 1875094 1545542 1540727 1800446 1980604 1735242 1159519 791557
35212 791557 970363 1358416 1377986 1005089 770262 959414 1195414 980533 343467 -310425
35202 -310425 -750239 -985114 -941644 -500354 142844 554155 628529 750350 1195377 1634719
35192 1634719 1489454 640868 -421097 -1070385 -1018328 -423826 297540 803315 1041105
35183 1041105 1114423 1016523 719959 486485 707603 1318476 1751180 1665373 1321444 966976
35173 966976 357265 -620548 -1300192 -960307 1818 422052 -67966 -566270 -160695 1009742
35163 1009742 2224739 3084677 3547505 3593674 3341443 3122993 2997485 2532757 1533971
35154 1533971 626524 506170 850611 693441 -138628 -666061 -45921 1323457 2315587
35145 2315587 2326552 1656808 878077 234982 -295208 -626570 -477201 281368 1291438
35136 1291438 1952538 2089716 2150867 2532730 2948276 2825407 2180781 1631625 1565256 1794564
35126 1794564 2108162 2611849 3284630 3697185 3540967 3051685 2534974 1871795 974125
35117 974125 348910 532192 1143129 1229382 575131 -10075 162411 876143 1611863 2288145
35107 2288145 2966906 3338827 3088583 2498602 2144863 2128483 2071588 1767058 1368998 992522
35097 992522 604719 358439 576710 1241258 1844787 1948717 1642291 1298414 1127485 1156601
35087 1156601 1402349 1773199 1911777 1440253 436071 -490445 -709833 -172957 528529
35078 528529 739723 397109 45654 162316 581945 740620 403456 -66217 -163638 233717
35068 233717 839981 1278731 1364248 1214341 1138932 1292331 1438387 1250554 839203 676232
35058 676232 877289 892433 206935 -865458 -1467860 -1217278 -572157 -146063 -24072 48874
35048 48874 107816 -42416 -381718 -614265 -654637 -843597 -1412272 -1931501 -1681322 -590186
35038 -590186 538369 912419 642831 528731 1084512 2029146 2732947 2957684 3023585 3278681
35028 3278681 3551823 3352050 2679221 2297211 2777574 3465026 3090170 1549230 317592
35019 317592 610589 1772278 2233161 1634960 1083572 1433592 2277073 2793918 2782759 2513091
35009 2513091 2198703 2014663 2156592 2516060 2676321 2516122 2429076 2675081 2934912 2828308
34999 2828308 2471130 2145784 1769896 1112258 301642 -253195 -313827 35870 494257 668405
34989 668405 404167 121286 420216 1195176 1628505 1294581 708033 463336 469104 492313
34979 492313 780600 1469699 1958107 1696900 1176737 1261877 1862832 2180428 2041538 2013393
34969 2013393 2259246 2263172 1797223 1279859 995568 749794 476664 414272 484752 297702
34959 297702 8753 335782 1374642 2238332 2341922 2231353 2534661 2870762 2605968
34950 2605968 2077940 2106650 2634957 2818108 2344353 1769473 1493783 1243216 791285 471456
34940 471456 577922 790075 668362 385089 463217 934764 1226766 919428 266627 -152035
34930 -152035 -38717 498456 1179744 1679320 1693647 1191813 531290 38745 -444358 -1222112
34920 -1222112 -2003527 -2050589 -1220809 -289860 106310 317422 970084 1877612 2323784 2157990
34910 2157990 1914964 1968549 2192928 2378188 2395791 2065619 1469703 1236319 1788703 2466108
34900 2466108 2273956 1439196 1169636 1762233 2157224 1783686 1598664 2473416 3596924
34891 3596924 3609911 2637721 1977778 2121900 2290349 1881439 1296356 1105242 1244586 1390796
34881 1390796 1535958 1835924 2254687 2616195 2777629 2652013 2292845 1964247 1845837
34872 1845837 1698120 1177372 483551 265842 754719 1379567 1480435 1090363 706032
34863 706032 503974 208994 -256650 -423476 146074 1167707 1929420 2213976 2440854
34854 2440854 2778489 2715815 1947678 1160189 1223215 1903476 2203986 1858479 1580960 1772818
34844 1772818 1961744 1835129 1897032 2549414 3262003 3275403 2563896 1559951 505246
34835 505246 -348119 -484819 233970 1144668 1639408 1980737 2617335 3229322 3251524 2889647
34825 2889647 2747344 2804145 2644142 2376336 2399810 2527991 2322313 2059760 2295703 2619163
34815 2619163 2050279 729466 -28458 358180 959694 926448 741623 1174970 1894190
34806 1894190 2016301 1491964 1095405 1319621 1954329 2580569 2920647 2787613 2147181
34797 2147181 1255776 499148 112378 134572 468992 889939 1181112 1350889 1535660 1707435
34787 1707435 1755237 1833117 2248097 2929838 3365333 3182931 2548170 1942408 1782421 2174175
34777 2174175 2716518 2675565 1780710 739313 488848 1057726 1691392 1933678 1909152 1681837
34767 1681837 1196302 881569 1390010 2521423 3257996 3131189 2708005 2440229 2002037
34758 2002037 1254836 901668 1445724 2263647 2516397 2373690 2530499 3025671 3382813
34749 3382813 3537711 3786511 4046913 3917187 3327488 2543662 1726752 1028229 831916
34740 831916 1285267 1843847 1907595 1674785 1730033 2027297 1993805 1489834 946876 622227
34730 622227 394786 269478 429439 780556 1060803 1402379 2145580 3059235 3430678 3091401
34720 3091401 2731215 2958833 3590620 4128807 4431691 4562901 4402847 3866512 3303843
34711 3303843 3269859 3887739 4653211 4906472 4418410 3511288 2663172 2075877 1691291 1499321
34701 1499321 1554171 1696767 1632669 1409016 1432672 1821876 2148760 2082074 1833590 1635647
34691 1635647 1304165 808707 720577 1381535 2073996 1884947 1095805 747359 987428 954696
34681 954696 389997 200170 982859 1984453 2184607 1671897 1223859 1103473 1054900 1075561
34671 1075561 1341589 1557149 1214129 535100 414761 1200068 2129935 2345865 2011293
34662 2011293 1947526 2400466 2722663 2318449 1436221 778906 635423 738719 822547 917093
34652 917093 1075469 1162121 1056345 845311 694074 673238 750348 793013 651720 505350
34642 505350 972746 2378697 3958689 4477393 3801700 3131380 3334487 3825590 3651350
34633 3651350 2941575 2459841 2275729 1866170 1229808 916747 1061740 1285270 1511296
34624 1511296 2006770 2583948 2640897 2130379 1682971 1601641 1517736 1247698 1198963 1628953
34614 1628953 2228116 2760443 3410760 4132988 4366890 3890073 3348063 3397870 3792372 3824405
34604 3824405 3297424 2582935 2014845 1629043 1282925 798396 257580 222382 1150673 2477335
34594 2477335 2971463 2305748 1534503 1575006 2001463 2004354 1794362 2098160 2732875 2755822
34584 2755822 1925710 1083636 978603 1443499 1918246 2224413 2571383 3117926 3699400
34575 3699400 3880666 3363491 2471552 1982892 2254190 2813566 3081226 3077243 3036865 2812153
34565 2812153 2220092 1558208 1124199 631616 -144774 -563963 63943 1126786 1321708
34556 1321708 594569 276680 1074706 2125457 2525242 2648975 3162008 3659670 3326538
34547 3326538 2391494 1888370 2212433 2803550 3156099 3340771 3496986 3497381 3255850 2865575
34537 2865575 2329292 1578129 826680 509294 782934 1416263 2167211 2904860 3390958
34528 3390958 3405619 3152366 3087080 3249693 3237611 2983597 3024732 3695674 4523519 4840271
34518 4840271 4649008 4439802 4421794 4425014 4387108 4429591 4495937 4344401 3901780 3290531
34508 3290531 2586602 1930648 1747203 2316718 3156592 3446576 3174939 3181897 3779172 4051959
34498 4051959 3147149 1734073 1340050 2369380 3579522 3680580 2817462 2109259 2136190
34489 2136190 2380308 2099274 1345719 886727 1219340 1959445 2387765 2412483 2613036 3322198
34479 3322198 4111807 4402543 4185265 3797464 3339516 2802443 2536440 2961239 3776840
34470 3776840 4014702 3112645 1626546 665202 795684 1619578 2257821 2141298 1445496
34461 1445496 858769 914504 1539566 2203151 2366831 1825329 903538 397151 953151 2313457
34451 2313457 3521027 4053804 4259543 4393768 3953795 2656280 1466472 1634961 2956217
34442 2956217 3993371 3965845 3416579 2970377 2521498 1959962 1704615 1989891 2373635
34433 2373635 2448005 2394451 2413810 2304881 2094927 2371988 3363377 4294703 4351052 3775510
34423 3775510 3335409 3169591 2911810 2574298 2499031 2645671 2666290 2552443 2560272 2651458
34413 2651458 2657963 2818311 3401601 3911080 3532157 2479357 2029285 2842845 3959060
34404 3959060 4011232 2982799 2113458 2240274 2866985 3018386 2543447 2163518 2380007
34395 2380007 2830792 2942656 2838482 3096322 3709452 3873503 3023201 1666432 876475
34386 876475 1182069 2167478 2937130 2805271 1820008 840822 841531 1897753 3082724 3535864
34376 3535864 3337389 3126711 3220587 3429022 3455617 3147195 2568865 2098345 2190158 2795342
34366 2795342 3317822 3408317 3431887 3811681 4307784 4403674 4086494 3757664 3639983 3756626
34356 3756626 4205984 4877242 5126860 4426647 3276923 2805514 3365489 4118723 4199109
34347 4199109 3767623 3592699 3951430 4359090 4261518 3633566 2830134 2110117 1535575 1234296
34337 1234296 1407791 1939466 2309827 2193728 1906821 1925700 2224985 2523763 2899050 3551162
34327 3551162 4195622 4424939 4505847 4956280 5433699 5076276 4003258 3322163 3393015 3316105
34317 3316105 2634196 2299131 3155734 4520378 5187823 4999176 4519039 3963276 3395105
34308 3395105 3271383 3818491 4434400 4544212 4433137 4479823 4355457 3844918 3588652 3997980
34298 3997980 4313990 3873240 3406287 3781000 4333875 3955975 3095434 3037970 3760060 4177993
34288 4177993 4092442 4179376 4388998 4090072 3563025 3611857 3894496 3431359 2614889 2809595
34278 2809595 3996028 4793211 4890848 5356280 6265145 6242252 4950961 3925699 4114637
34269 4114637 4551102 4372233 4251149 4763078 5144490 4884137 4853237 5539429 5773765 4711756
34259 4711756 3628306 4056667 5298245 5530330 4557054 3776818 3961833 4587930 5040320
34250 5040320 5207984 5096873 4842004 4855162 5230152 5433083 5194619 5039895 5263996 5216132
34240 5216132 4441799 3700088 3877545 4637554 5129009 5315357 5582808 5710455 5301756
34231 5301756 4691919 4452545 4513674 4613201 4955260 5557100 5713637 5096174 4603253 5040967
34221 5040967 5728594 5592608 4909023 4678122 4937095 5067244 5197414 5825352 6465050
34212 6465050 6196068 5342347 5142111 5820724 6362613 6213350 5901730 5856242 5830757 5735059
34202 5735059 5942366 6452257 6647243 6212105 5605883 5383955 5609797 6064974 6551425
34193 6551425 6919015 7158744 7397146 7534847 7207876 6452834 5960000 6202375 6767228
34184 6767228 7011983 6869750 6570378 6215134 6104162 6687838 7611981 7718029 6700086
34175 6700086 5779354 5910541 6420223 6451316 6567042 7558248 8718059 8882789 8331145
34166 8331145 8011624 7671611 6553741 5319365 5325887 6326509 6775814 6243752 5718362
34157 5718362 5642282 5493064 5303200 5732136 6473439 6411477 5654157 5640398 6787255 7726676
34147 7726676 7496056 6936030 7124676 7716960 7710606 6919741 5934619 5274747 5080309 5138778
34137 5138778 5030985 4739110 4946432 6030768 7099745 7014500 6072175 5532373 5724929
34128 5724929 5889674 5727026 5757765 6152102 6474941 6632249 6921328 7208602 7177368 7164757
34118 7164757 7547665 7674678 6822261 5797423 5938861 6869709 7095660 6614771 6874318
34109 6874318 8095399 8765640 8132077 7222403 6941552 7009074 7241948 8054406 9159399
34100 9159399 9527169 9136540 9061048 9433165 9186879 8242536 7908563 8499449 8643157 7775835
34090 7775835 7267738 8044396 9015921 9025809 8601598 8576435 8605045 8274031 8199909 8816717
34080 8816717 9395993 9342330 9185681 9363874 9384477 9100060 9382003 10554587 11538209 11499818
34070 11499818 11021797 10782324 10497779 10044955 10169408 11137548 12039993 12256533 12252226 12274116
34060 12274116 11823626 11065512 11013569 11585865 11329816 9909227 8953595 9532129 10727883
34051 10727883 11623809 12597077 13601981 13404504 11841836 10745188 11249140 12188816 12433439
34042 12433439 12649148 13390966 13720605 13250631 13302507 14420790 15015908 14163359 13415737
34033 13415737 14034625 14805706 14540398 14335951 15246654 16073936 15667722 15100585 15354142
34024 15354142 15269160 14085174 13447679 14399403 15049191 13980162 13225768 14760349 16751763
34015 16751763 16782630 16228861 17587118 19720645 19880970 18604048 18441016 19347938 19418240
34006 19418240 18851834 19163141 19666615 18762418 17591870 18402872 20314816 20720433 19916967
33997 19916967 20265931 21626366 21787833 20793518 20755272 21880548 22590841 23034701 24596592
33988 24596592 26451070 26456734 25010686 24393281 24947767 25424288 26087192 27776741 29110140
33979 29110140 28510059 27646170 28845133 30742882 30812264 30239743 31502541 33247538 32938589
33970 32938589 32397344 34737647 37908229 37868824 36252475 37693104 41204370 41980604 40506347
33961 40506347 41652483 45532035 47754052 48229253 50924972 55259367 56961315 57195246
33953 57195246 61076667 67390339 70299483 70996693 76048088 84325536 88646284 90610183
33945 90610183 99021527 112750488 122010895 128138866 142196495 161355651 171684483
33938 171684483 180146739 210011125 245629585 217888492 83766066 -99222115 -221356640
33931 -221356640 -238134082 -201116355 -174616855 -166670683 -154597854 -136173360 -125435609
33924 -125435609 -121738645 -113183778 -100223574 -92945261 -91454242 -87438895 -80454667 -76907055
33916 -76907055 -76440388 -73095361 -67274904 -64432265 -64075667 -60989465 -55550483 -52837456
33908 -52837456 -52953701 -51418417 -47970684 -46429636 -46732588 -45121896 -41640860 -40037362
33900 -40037362 -40599308 -39901917 -37390687 -35901959 -35900091 -35102423 -33559779 -33513326 -34469318
33891 -34469318 -33738920 -31591554 -30783447 -31319382 -30674366 -28855869 -28270702 -28814007 -28007432
33882 -28007432 -25920182 -25145845 -25847470 -25519064 -23843844 -23181569 -23865194 -23492741 -21483231
33873 -21483231 -20095226 -20192887 -20014508 -18974704 -18871948 -20328956 -21514632 -21407192 -21172461
33864 -21172461 -21429584 -21143503 -20044378 -19329348 -19251992 -18680901 -17588224 -17321848 -17955097
33855 -17955097 -18019280 -17270530 -17072948 -17681092 -17826790 -17347010 -17476525 -18131941 -17694717
33846 -17694717 -16025866 -14977092 -15293748 -15624478 -15215721 -14993572 -15297905 -15089518 -14181227
33837 -14181227 -13868283 -14572258 -15082534 -14789151 -14510335 -14602277 -14451575 -14226992 -14785931
33828 -14785931 -15468638 -14494394 -12031093 -10315773 -10199808 -10225468 -9706292 -9840657 -10888688
33819 -10888688 -11172266 -10112775 -9519268 -10467642 -11500448 -11408892 -11247965 -11922291 -12234051
33810 -12234051 -11237286 -10294420 -10725874 -11384951 -10716321 -9511877 -9409806 -10060840 -9976272
33801 -9976272 -9103115 -8503733 -8331280 -8007154 -7730273 -8100719 -8760167 -8869056 -8488398
33792 -8488398 -8302103 -8494752 -8916629 -9692233 -10683240 -11085743 -10548686 -9967561 -10238796
33783 -10238796 -10971304 -11303356 -11191321 -11018115 -10750044 -10349279 -10203286 -10324529 -9971222
33774 -9971222 -8832370 -7679652 -7121180 -6751079 -6289062 -6363966 -7251030 -8070521 -8293059
33765 -8293059 -8773652 -10069564 -11007742 -10410183 -9133614 -8741939 -9060848 -8823794 -8057614
33756 -8057614 -7915006 -8445170 -8400459 -7360719 -6457531 -6646210 -7499448 -8106420 -8191618 -7938198
33746 -7938198 -7451083 -6840666 -6432871 -6561321 -7200321 -7803197 -7623934 -6612284 -5923145
33737 -5923145 -6766904 -8589531 -9364450 -8149254 -6345619 -5715218 -6131131 -6282073 -5788404
33728 -5788404 -5407610 -5599144 -6045504 -6417973 -6682491 -6750439 -6563749 -6385942 -6406713 -6311542
33718 -6311542 -5843637 -5491827 -5977758 -7281426 -8696019 -9563483 -9515529 -8457344 -6916001
33709 -6916001 -5977812 -6200883 -6889826 -7025770 -6566364 -6231887 -6364639 -6660706 -6784124
33700 -6784124 -6649994 -6281530 -5859723 -5705003 -5837316 -5852337 -5564688 -5364416 -5557229 -5806922
33690 -5806922 -5678614 -5313545 -5111443 -5120259 -5145981 -5112807 -5005833 -4848159 -4916298 -5423768
33680 -5423768 -5838483 -5279293 -3876271 -2895575 -3111241 -3911328 -4467521 -4832417 -5268998
33671 -5268998 -5460845 -5173071 -4854266 -4790548 -4499778 -3801301 -3595878 -4552883 -5794237
33662 -5794237 -6026229 -5382190 -4987844 -5171808 -5288780 -5022650 -4727873 -4572997 -4306024
33653 -4306024 -3878662 -3576814 -3544202 -3682576 -3866936 -3877968 -3478825 -2949160 -3040531 -3944734
33643 -3944734 -4866758 -5100029 -4891520 -4732244 -4517382 -4022539 -3505462 -3217092 -3019104
33634 -3019104 -3001279 -3583697 -4448780 -4482158 -3534072 -3044268 -3954419 -5214340 -5499547 -5174711
33624 -5174711 -5188591 -5217524 -4535317 -3731256 -3813967 -4387739 -4435663 -4189923 -4474646 -4900242
33614 -4900242 -4585909 -4056879 -4432592 -5220851 -5005698 -3989178 -3692446 -4305599 -4551821
33605 -4551821 -4204334 -4481643 -5659253 -6450306 -6231520 -5874769 -5827535 -5317373 -4121854
33596 -4121854 -3284501 -3317870 -3372247 -2893797 -2469266 -2365025 -1953453 -1337265 -1743275 -3350214
33586 -3350214 -4475414 -4062713 -3352000 -3796419 -4829018 -5152167 -4943109 -5171423 -5679118
33577 -5679118 -5514909 -4573983 -3589205 -2970783 -2717256 -2943924 -3520867 -3726629 -3163932
33568 -3163932 -2476073 -2361404 -2534731 -2479846 -2480262 -2939483 -3355419 -3036022 -2355511 -2308515
33558 -2308515 -3150273 -4271686 -5048719 -5144753 -4468902 -3530079 -3305486 -4057487 -4811292
33549 -4811292 -4650226 -3894280 -3319576 -2967180 -2569158 -2419611 -2834480 -3348672 -3428358 -3413806
33539 -3413806 -3778834 -4067921 -3673753 -3101273 -3200941 -3569348 -3083687 -1837041 -1168165
33530 -1168165 -1712867 -2682064 -3270860 -3612886 -3973135 -4038124 -3574494 -3048005 -3001110 -3280945
33520 -3280945 -3356276 -3086043 -2797613 -2791961 -3041987 -3296324 -3340107 -3180718 -3001317 -2939689
33510 -2939689 -2995558 -3126082 -3258372 -3269638 -3218267 -3447790 -4010015 -4176901 -3286855 -2041661
33500 -2041661 -1962973 -3302668 -4558095 -4577731 -4073685 -4260668 -5000512 -5353750 -5160668
33491 -5160668 -4847241 -4250239 -2977818 -1631029 -1337291 -2118678 -2908105 -3209271 -3553842
33482 -3553842 -4121661 -4099604 -2956419 -1493313 -962259 -1597266 -2519544 -2833146 -2471249
33473 -2471249 -2089483 -2291124 -2934187 -3309167 -3082040 -2711725 -2643321 -2550717 -1961978 -1269052
33463 -1269052 -1319575 -2125933 -2782573 -2729834 -2366333 -2227751 -2239762 -2129853 -2058647 -2376468
33453 -2376468 -2992244 -3384852 -3225729 -2758839 -2476880 -2520977 -2597536 -2561845 -2778417 -3534480
33443 -3534480 -4346116 -4475297 -4048572 -3864556 -4009339 -3642306 -2541247 -1841473 -2501247
33434 -2501247 -3843801 -4492644 -4120808 -3387098 -2715167 -2117056 -1780807 -1823977 -1778090 -1256037
33424 -1256037 -817213 -1227294 -2191710 -2836097 -3117217 -3618154 -4186852 -4056564 -3291487
33415 -3291487 -2853062 -3099264 -3398760 -3413641 -3558007 -3875228 -3666794 -2741522 -1959280 -1921966
33405 -1921966 -2056134 -1659779 -1047644 -935778 -1336598 -1769776 -2064962 -2324595 -2523294
33396 -2523294 -2711374 -3207608 -4033766 -4523192 -4066245 -2994846 -2211334 -2108910 -2303146
33387 -2303146 -2327333 -2216854 -2390339 -3106339 -4000984 -4207414 -3198289 -1516873 -326862
33378 -326862 -183404 -618989 -985403 -1216887 -1574083 -2080225 -2501844 -2607546 -2269189 -1606941
33368 -1606941 -1168796 -1586416 -2798558 -3882537 -3913116 -2875149 -1635206 -1144282 -1659110
33359 -1659110 -2551088 -2900119 -2442532 -1815738 -1693434 -1969189 -2140718 -2162289 -2363841 -2753962
33349 -2753962 -3025187 -3127460 -3248967 -3358574 -3357220 -3492511 -3942707 -4198091 -3658591 -2672765
33339 -2672765 -2071775 -1810001 -1149828 -192648 18153 -798698 -1565131 -1452557 -998800
33330 -998800 -987423 -1205809 -1102507 -870326 -1017609 -1432526 -1635031 -1514045 -1205361 -716104
33320 -716104 -233342 -271240 -900049 -1348244 -1031965 -525236 -834192 -2077061 -3496335
33311 -3496335 -4418896 -4626282 -4169696 -3454911 -3184026 -3589404 -3984336 -3612519 -2654556
33302 -2654556 -1882460 -1653659 -1787480 -2087329 -2389150 -2393502 -2053148 -1880317 -2305952 -2972601
33292 -2972601 -3195616 -2876903 -2452928 -2224618 -2258275 -2616793 -3102132 -3090683 -2268775 -1261417
33282 -1261417 -888172 -1070841 -1162238 -1061618 -1173426 -1432475 -1302268 -815642 -764333 -1579395
33272 -1579395 -2667070 -3185352 -3029772 -2746511 -2767408 -2996539 -3047789 -2777704 -2537063 -2711699
33262 -2711699 -3007945 -2649348 -1543206 -731223 -1160835 -2406750 -3227997 -3088924 -2463531
33253 -2463531 -1889457 -1497455 -1385422 -1675962 -2120403 -2297730 -2316697 -2737585 -3672180 -4501235
33243 -4501235 -4650778 -4204165 -3607134 -3154584 -2876790 -2614510 -2187619 -1769790 -1920300
33234 -1920300 -2777983 -3434511 -2832200 -1289497 -343974 -835654 -1865079 -2085006 -1432130
33225 -1432130 -947238 -1184653 -1496532 -995065 226186 1144596 990789 115029 -467779
33216 -467779 -244486 361925 664395 403346 -328389 -1349052 -2259783 -2495339 -1964442
33207 -1964442 -1340657 -1283421 -1662605 -1975668 -2135131 -2257842 -2048780 -1162677 13857
33198 13857 705485 764266 602151 247348 -624661 -1686549 -1967913 -1167696 -123719 405081
33188 405081 655312 1092863 1462377 1261026 654153 230924 163970 248149 544041 1294247
33178 1294247 2217098 2520600 1846877 786316 135217 -120621 -673571 -1740314 -2494088
33169 -2494088 -2040576 -748603 -8294 -537457 -1512242 -1738628 -1159432 -632983 -621242
33160 -621242 -830128 -958546 -1039089 -1042953 -850045 -694286 -983445 -1538060 -1646382 -1093343
33150 -1093343 -538178 -567726 -895811 -882177 -459811 -147220 -343988 -901115 -1299744 -1165095
33140 -1165095 -718640 -645745 -1283418 -2108230 -2411981 -2276374 -2300966 -2514430 -2328589 -1627539
33130 -1627539 -1079059 -1102713 -1281586 -1172021 -1002501 -1089419 -1172479 -913086 -592311 -716658
33120 -716658 -1242817 -1716460 -1929851 -1984833 -1940814 -1837769 -1875681 -2187960 -2604460 -2923149
33110 -2923149 -3166727 -3297975 -3031381 -2295968 -1539736 -1153224 -947389 -705969 -868151
33101 -868151 -1912425 -3209240 -3325492 -1704842 519479 1692218 1263822 19722 -976089
33092 -976089 -1303817 -1185395 -939240 -627450 -185626 267626 411646 44347 -679236 -1384980
33082 -1384980 -1796001 -1895610 -1859286 -1844169 -1789932 -1486494 -945724 -577392 -745859 -1220043
33072 -1220043 -1393828 -1080935 -737190 -761883 -912230 -672091 -11322 500922 315781 -524265
33062 -524265 -1464878 -2026169 -2225907 -2342081 -2365576 -2006250 -1299417 -766613 -691431 -657938
33052 -657938 -249516 179078 24922 -548838 -813539 -542624 -186873 -74748 -153412 -479472
33042 -479472 -1199515 -1988685 -2240796 -1893417 -1376406 -778344 82403 773506 506006 -522277
33032 -522277 -1143522 -942371 -840939 -1440360 -1925804 -1413725 -400302 63809 -157329
33023 -157329 -589129 -1215384 -2223826 -3200281 -3539707 -3282494 -2771190 -1992893 -1078384
33014 -1078384 -831840 -1725387 -2839462 -2888693 -1943929 -1065834 -585087 44076 871145
33005 871145 1200496 783204 157692 -340551 -944176 -1709260 -2324625 -2775456 -3291884 -3540394
32995 -3540394 -2837956 -1361447 -173139 244580 538553 1204696 1705237 1437184 808937
32986 808937 644311 990478 1160963 714462 -93666 -722897 -911015 -848310 -846178 -827243
32976 -827243 -416136 255084 336316 -559923 -1441923 -1114133 7231 347256 -596020 -1644411
32966 -1644411 -1775909 -1406221 -1371782 -1671976 -1880615 -1990254 -2142707 -2144191 -1899931 -1812080
32956 -1812080 -2144113 -2426581 -2036533 -1016376 77270 743121 667319 -165581 -1150682
32947 -1150682 -1450097 -1087611 -1019195 -1702183 -2345180 -2145798 -1494655 -1188584 -1145540 -815968
32937 -815968 -315155 -140549 -158802 89769 346676 -26435 -777886 -946144 -429664 -335213
32927 -335213 -1398043 -2879381 -3504568 -2913270 -1747215 -763438 -303170 -333057 -593221
32918 -593221 -790786 -842963 -854448 -844101 -717354 -545203 -599302 -1006247 -1576118 -2055807
32908 -2055807 -2365181 -2516281 -2470213 -2150125 -1512928 -641567 134796 344199 -187277 -1067590
32898 -1067590 -1701338 -1824017 -1511405 -899686 -250235 -84955 -708295 -1573240 -1656979 -671438
32888 -671438 504089 845361 301611 -404246 -798945 -1041023 -1364183 -1609011 -1521793 -1268294
32878 -1268294 -1324408 -1837240 -2328382 -2180415 -1313333 -238413 466840 565779 158961 -428269
32868 -428269 -757571 -604692 -279432 -342708 -894035 -1429897 -1528742 -1317399 -1062333 -718545
32858 -718545 -235756 75346 -19551 -154525 146069 628899 617368 113641 -132394 171525
32848 171525 297409 -435624 -1573616 -2086949 -1713222 -1152696 -1062725 -1443705 -2030436 -2683185
32838 -2683185 -3147912 -2938011 -1926956 -822964 -551288 -1150676 -1660911 -1207646 84840
32829 84840 1375611 2021860 2013042 1700157 1365177 1025400 514181 -232090 -956914 -1310268
32819 -1310268 -1324803 -1394292 -1645606 -1664698 -1128835 -418527 -209155 -644109 -1306849 -1847407
32809 -1847407 -2212458 -2397200 -2427957 -2472014 -2493612 -1981693 -655856 668731 737277 -490156
32799 -490156 -1637588 -1675739 -1142119 -1127865 -1692774 -1952479 -1379908 -388111 258714 187955
32789 187955 -355296 -790399 -829446 -866660 -1409661 -2129505 -2103903 -1205933 -499397 -783678
32779 -783678 -1455240 -1499661 -1022915 -933271 -1474588 -2000605 -2082271 -2004833 -2130987 -2441623
32769 -2441623 -2759788 -2872046 -2443338 -1391798 -356270 -205383 -1001896 -1953936 -2435311
32760 -2435311 -2545661 -2610136 -2667375 -2611079 -2405587 -2011299 -1441845 -965192 -891857 -1110811
32750 -1110811 -1181960 -918869 -546104 -300157 -247595 -466701 -990886 -1563591 -1846930 -1879502
32740 -1879502 -1957118 -2109606 -2103492 -1890730 -1611337 -1255596 -834082 -750583 -1355663 -2173677
32730 -2173677 -2303499 -1676680 -1200761 -1484831 -2119850 -2438305 -2282813 -1749544 -906542
32721 -906542 -160506 -198718 -1050353 -1797315 -1752585 -1372952 -1414895 -1710486 -1500453 -624964
32711 -624964 343382 943128 1156376 1073804 854588 894060 1410571 1930163 1783880 1093677
32701 1093677 646315 732597 746450 138464 -793718 -1383223 -1426957 -1175581 -821590 -428506
32691 -428506 -202928 -395430 -886543 -1167051 -856206 -115567 499982 491268 -295210 -1629456
32681 -1629456 -2996465 -3834236 -3879883 -3322066 -2525725 -1640758 -622333 407281 1067231
32672 1067231 1074966 511637 -335719 -1183744 -1742289 -1809399 -1561073 -1451616 -1594536 -1556229
32662 -1556229 -1058529 -526652 -496957 -789324 -832126 -597409 -559524 -800896 -852147 -510739
32652 -510739 -183232 -215274 -418140 -487454 -413313 -225972 227148 946105 1540391 1604600
32642 1604600 1146977 529740 179109 316020 649157 426660 -728763 -2086567 -2490607
32633 -2490607 -1794274 -979238 -792228 -1011833 -1220286 -1437017 -1619986 -1379946 -735268
32624 -735268 -426397 -881520 -1538128 -1815410 -2036434 -2587640 -2870701 -2177493 -1164608
32615 -1164608 -1231339 -2504977 -3572496 -3386144 -2460314 -1844665 -1751723 -1737031 -1663734 -1836618
32605 -1836618 -2348287 -2774448 -2616342 -1883901 -1140268 -933633 -1224347 -1495153 -1385130
32596 -1385130 -971068 -448465 59104 283214 -97201 -903742 -1474196 -1520938 -1470760 -1621661
32586 -1621661 -1578412 -1035405 -505869 -578761 -944347 -911093 -474132 -96529 161886 447847
32576 447847 437559 -190166 -926469 -1103127 -1094034 -1672862 -2388745 -1990076 -539169 382542
32566 382542 -17950 -643494 -370148 291931 334173 -37544 17458 412192 346076 -303129
32556 -303129 -866138 -980391 -890120 -721023 -262259 469210 1080985 1329853 1344766 1273976
32546 1273976 1074067 683208 143443 -426188 -818817 -864727 -732383 -825764 -1141073 -1074128
32536 -1074128 -251629 732603 875282 -91670 -1504241 -2575772 -3023727 -2994848 -2752154
32527 -2752154 -2466412 -2126802 -1683735 -1302157 -1225570 -1336894 -1258196 -1022998 -1121750 -1608746
32517 -1608746 -1780984 -1212599 -494050 -285854 -203275 484608 1450516 1637223 848133 -20735
32507 -20735 -390435 -635659 -1074926 -1276518 -845745 -188894 25269 -338816 -1017310 -1762887
32497 -1762887 -2245573 -2082471 -1434032 -1076789 -1362067 -1560770 -850447 427170 1180199
32488 1180199 974282 303960 -377875 -1088532 -1720346 -1818017 -1271475 -646513 -436451 -412613
32478 -412613 -112606 383165 632025 572581 593017 889520 1182945 1170317 935753 736888
32468 736888 591620 311616 -96473 -275534 87816 739719 936205 260072 -713938 -925937
32458 -925937 -143099 601990 249886 -872686 -1431737 -820284 147242 499043 412077 686459
32448 686459 1333994 1496112 770536 -120992 -308468 109456 399028 328666 388470 897761
32438 897761 1440989 1440533 937652 446541 217369 56139 -162625 -269762 -240795 -416949
32428 -416949 -946468 -1362223 -1203209 -807587 -864643 -1278366 -1217943 -423314 298317 218051
32418 218051 -365375 -799841 -1045865 -1312120 -1301123 -682356 42198 82990 -395993 -529271
32408 -529271 -206850 -269234 -1054622 -1723449 -1468072 -615857 -4378 122259 41050 -136681
32398 -136681 -507982 -1032062 -1573966 -2046887 -2235070 -1836750 -975474 -269370 -86835 -159733
32388 -159733 -220431 -463885 -960272 -1213892 -908578 -571111 -789383 -1211899 -1124346 -674179
32378 -674179 -605008 -939795 -907457 -272002 159466 -327684 -1376169 -2090183 -2105844 -1805325
32368 -1805325 -1751269 -2130997 -2585788 -2545553 -1930779 -1418001 -1670691 -2427682 -2815393 -2505149
32358 -2505149 -2027477 -1899082 -1993684 -1951174 -1739980 -1568837 -1555739 -1656461 -1692472 -1429862
32348 -1429862 -912294 -626302 -913934 -1326678 -1149628 -543391 -433064 -1101649 -1676699
32339 -1676699 -1401743 -701070 -404459 -501873 -418260 -170128 -410194 -1339386 -2261512 -2404164
32329 -2404164 -1740597 -819402 -125824 164595 50052 -344995 -674392 -495579 258921
32320 258921 966475 793409 -292266 -1228982 -956469 301071 1263134 1085277 160384
32311 160384 -650221 -1064116 -1358088 -1683658 -1826766 -1559419 -981139 -512471 -580351 -1200984
32301 -1200984 -1906023 -2249332 -2277234 -2243730 -2076453 -1596682 -1087006 -962503 -925646 -278779
32291 -278779 768167 1009661 -128937 -1706919 -2546695 -2595891 -2345185 -1723846 -567086
32282 -567086 436774 469051 -26939 134176 1008883 1342065 466219 -694303 -989757
32273 -989757 -561227 -360973 -727884 -1119022 -1023288 -610891 -477711 -984987 -1845360 -2326877
32263 -2326877 -1981327 -1138359 -515240 -464372 -865267 -1537585 -2273307 -2582310 -2048567 -1057004
32253 -1057004 -603837 -1152156 -2100773 -2587324 -2419501 -2012610 -1786031 -1847533 -1978321 -1778388
32243 -1778388 -1105195 -404837 -225004 -398565 -245254 337378 628270 158877 -605714
32234 -605714 -1004471 -984675 -750497 -240563 462821 752754 244500 -473559 -561259 -122427
32224 -122427 53853 -262215 -548805 -508059 -418384 -419772 -217654 249322 509428 283326
32214 283326 -24457 32686 247918 175447 -101059 -184718 -183423 -656231 -1612624 -2161878
32204 -2161878 -1614953 -595504 -411525 -1337239 -2215167 -2063527 -1385982 -1212269 -1391274
32195 -1391274 -920192 179914 614244 -183170 -1005819 -628609 378166 671960 255794
32186 255794 248647 871416 1065298 225083 -916835 -1489948 -1549910 -1484317 -1234658 -710773
32176 -710773 -336119 -550716 -1137348 -1475777 -1182640 -304232 686499 951141 -10263 -1454412
32166 -1454412 -1921324 -1072429 -241337 -585631 -1485740 -1623940 -981934 -649000 -1002182
32157 -1002182 -1301590 -1104929 -919983 -1106447 -1106806 -391430 479259 472218 -504811 -1440919
32147 -1440919 -1469112 -813959 -341844 -461563 -761720 -686825 -255313 91122 131571 -4472
32137 -4472 -267833 -783669 -1430872 -1805532 -1809947 -1816853 -1974174 -1851711 -1202922 -605450 -762814
32126 -762814 -1498589 -2052991 -2128305 -2007508 -1838911 -1519492 -1229045 -1366115 -1863707 -2181829
32116 -2181829 -2115342 -2053686 -2247781 -2303906 -1677226 -384326 939990 1522584 1028343 -78109
32106 -78109 -836374 -758542 -350254 -338034 -652052 -689415 -332220 -31840 -16435 -123775
32096 -123775 -353942 -844534 -1301264 -1223877 -767556 -631823 -1017114 -1452830 -1707186 -1990904
32086 -1990904 -2152172 -1669997 -722517 -258663 -602212 -945060 -692838 -338914 -441464
32077 -441464 -722619 -881263 -1333612 -2276946 -2864664 -2302909 -1120548 -393941 -260050
32068 -260050 -120111 173256 241075 -96277 -757335 -1599454 -2064637 -1352951 282990 1266390
32058 1266390 672904 -417957 -654091 -452493 -827504 -1191413 -314302 1134677 1254488
32049 1254488 13635 -535112 578357 1933704 2100792 1390049 535290 -509712 -1556167
32040 -1556167 -1685052 -852886 -490878 -1390981 -2401354 -2362126 -1895270 -1942527 -1946332 -1124031
32030 -1124031 -337933 -787740 -1687600 -1267374 351840 1251203 574722 -541306 -1055698
32021 -1055698 -1336442 -1935287 -2475320 -2418541 -1935298 -1446880 -1071650 -916441 -1190006 -1678800
32011 -1678800 -1759083 -1207281 -410314 359368 1159692 1710009 1346699 44211 -1197052
32002 -1197052 -1439883 -797152 11474 580250 908638 1014840 907966 721248 586595
31993 586595 533572 589088 697147 522863 -250945 -1353883 -2087846 -2149730 -1841640 -1401233
31983 -1401233 -729340 7130 169855 -491481 -1270172 -1337819 -822713 -519653 -760984 -1154589
31973 -1154589 -1352528 -1474710 -1634567 -1555251 -1010879 -372776 -272499 -729771 -1019197 -610204
31963 -610204 62705 139276 -507517 -1116958 -1056667 -499238 55414 414021 560981 393150
31953 393150 7600 -157154 50716 90124 -515564 -1343185 -1600254 -1227353 -815002 -626797
31943 -626797 -419475 -120194 57171 158707 455752 850976 1009822 1100577 1647157 2537665
31933 2537665 2943479 2428469 1438372 500372 -306073 -833797 -667394 104831 649921
31924 649921 474794 147986 372115 890361 967727 543434 228981 393912 808342 1026439
31914 1026439 712707 -179274 -1173127 -1515122 -1076584 -699791 -1165671 -2102013 -2450655
31905 -2450655 -1797843 -684293 239519 756839 825050 392707 -338269 -879079 -929528 -713750
31895 -713750 -702781 -1067971 -1454988 -1328664 -633829 -38116 -242660 -1059946 -1575030 -1314621
31885 -1314621 -774951 -580645 -672218 -724062 -839914 -1238327 -1618387 -1512695 -1067093 -811695
31875 -811695 -771288 -481856 94005 338244 -143332 -932230 -1338216 -1151705 -639596 -136688
31865 -136688 90589 -161237 -836380 -1488341 -1598733 -1088902 -431345 -222001 -657647 -1414203
31855 -1414203 -1979926 -2065650 -1746672 -1352378 -1238356 -1450916 -1514136 -848658 363229 1096147
31845 1096147 699381 -148375 -320493 219676 584583 453900 318754 225947 -408018 -1326504
31835 -1326504 -1146257 602602 2316893 2335462 1198967 621358 942060 1067318 497764
31826 497764 -147797 -523724 -995368 -1553044 -1601218 -1074487 -605228 -374938 24636 388564
31816 388564 -89277 -1174394 -1367436 -79133 1220909 1012685 -153600 -664332 -138603
31807 -138603 531052 870158 1214919 1574695 1301110 102673 -1364597 -2108432 -1607673
31798 -1607673 -152824 1181689 1221101 -49534 -1208021 -1055544 -230249 -321444 -1627194
31789 -1627194 -2833055 -2909617 -2223695 -1497207 -729246 259719 1020756 939247 31186 -1266569
31779 -1266569 -2610610 -3513833 -3194985 -1524378 217878 505086 -523788 -1201705 -546038
31770 -546038 541780 713221 36614 -314373 198756 891199 937204 309397 -512878 -1183449
31760 -1183449 -1544408 -1470424 -1042026 -671809 -753036 -1253712 -1784428 -1926685 -1447009 -481866
31750 -481866 355936 411419 -228408 -723539 -530108 -48613 176389 411685 1182530 2088679
31740 2088679 2114913 1166218 392430 660968 1430093 1586440 839720 -210575 -963467
31731 -963467 -1253292 -1195434 -1066671 -1142460 -1310588 -1115340 -521032 -241244 -786177 -1518598
31721 -1518598 -1371816 -395430 173797 -473339 -1690792 -2290897 -1990704 -1486733 -1352722
31712 -1352722 -1376576 -1047132 -359344 117731 -49595 -577388 -782463 -468340 -235604 -733111
31702 -733111 -1789776 -2573371 -2542917 -1964355 -1488802 -1493353 -1889891 -2332852 -2501343 -2346238
31692 -2346238 -2148668 -2203192 -2420388 -2430713 -2100893 -1678418 -1335816 -902387 -283107 158199
31682 158199 25097 -464461 -708243 -569015 -515601 -809335 -1053497 -862187 -550614 -665204
31672 -665204 -1080284 -1153844 -725256 -340974 -347227 -340210 141860 831231 1100642 851678
31662 851678 551919 515300 610980 678553 804555 1058298 1235776 1023467 303240 -727154
31652 -727154 -1615960 -1892733 -1443537 -663057 -84119 140382 283533 647264 1248323 1812724
31642 1812724 1966671 1562991 920767 528910 403417 107091 -353780 -170826 1146074
31633 1146074 2645527 2722468 1004606 -1206379 -2416709 -2271615 -1408062 -685986 -720017
31624 -720017 -1498937 -2195634 -1911598 -844234 -140654 -364047 -792572 -633084 -234848
31615 -234848 -464936 -1369442 -2177039 -2399506 -2293647 -2290229 -2429370 -2370325 -1714750 -427916
31605 -427916 894338 1424425 983123 251712 -89903 -82543 -112350 -257582 -379430 -478802
31595 -478802 -555398 -455261 -252432 -405092 -1086537 -1735613 -1763404 -1343189 -983881 -728887
31585 -728887 -405590 -266085 -589560 -929468 -643294 -42697 -76378 -824954 -1281594 -908432
31575 -908432 -501520 -961955 -1896964 -2163905 -1437133 -506551 -102215 -85801 -9637 39171
31565 39171 -336338 -935563 -930500 -47560 749788 421571 -580551 -794529 181861 1140630
31555 1140630 1161109 962188 1523119 2274291 1915674 565421 -281680 81266 702840
31546 702840 551477 -98002 -380224 -172588 -75580 -453385 -1011992 -1228123 -971445 -726144
31536 -726144 -1112236 -2043719 -2634396 -2268012 -1410747 -864613 -631493 -257430 79911 -146981
31526 -146981 -614562 -417056 332171 373090 -802130 -2024556 -2094717 -1460720 -1435168 -2371252
31516 -2371252 -3456316 -3910094 -3591449 -2632654 -1206473 302243 1356747 1630708 1215406
31507 1215406 567041 255235 477231 777036 588798 62930 -113248 262712 661299
31498 661299 700339 589803 472900 51689 -732590 -1299482 -1205629 -795832 -606812 -603548
31488 -603548 -465724 -167891 175697 586564 916654 772926 210150 -33566 471724 1128673
31478 1128673 1149066 592340 -54587 -785236 -1758470 -2490044 -2273294 -1260126 -351744
31469 -351744 -84133 -261675 -573098 -905104 -1103413 -1038661 -892291 -864572 -704200 -82423
31459 -82423 681624 898031 486851 74593 61657 163668 9545 -303433 -468707 -455099
31449 -455099 -528593 -923961 -1542568 -1930962 -1714561 -1141882 -893783 -1151150 -1228157 -463945
31439 -463945 877569 1986557 2429147 2250602 1536881 454114 -512121 -922241 -871078
31430 -871078 -728884 -642534 -661472 -959712 -1431480 -1488516 -865151 -215415 -235885 -630506
31420 -630506 -749620 -816721 -1477820 -2371506 -2316880 -1008663 497661 1194729 1116862 687793
31410 687793 -39571 -1061974 -1993627 -2413912 -2305984 -1948144 -1663875 -1657908 -1723422 -1287654
31400 -1287654 -269322 392897 -168748 -1360085 -1783532 -1200580 -734439 -989299 -1161244
31391 -1161244 -498208 384536 374034 -616199 -1655740 -1927318 -1394280 -674826 -520468
31382 -520468 -1077137 -1588050 -1300683 -601535 -510134 -1059902 -1177008 -407120 303577 78296
31372 78296 -576344 -632662 -10250 537484 494355 -69911 -791520 -1160345 -790981 64132
31362 64132 694390 855273 942900 1094852 942942 531535 485959 803338 562682 -461070
31352 -461070 -993142 -49753 1409971 1775463 979670 178393 -152526 -448264 -739860
31343 -739860 -480977 332391 994364 1109450 892234 488748 -131850 -655619 -644132 -267753
31333 -267753 -80497 -168986 -260937 -457539 -980500 -1395609 -1102539 -517025 -701397 -1756144
31323 -1756144 -2614456 -2597820 -2181961 -1979896 -1927270 -1821677 -1804717 -1896353 -1760111 -1285258
31313 -1285258 -789981 -442846 -166011 -228779 -1049145 -2161936 -2379376 -1437779 -529397
31304 -529397 -581558 -919139 -453647 579633 1094057 862135 668786 925963 1128194 801521
31294 801521 220853 -89965 -70802 -53992 -255977 -551240 -642478 -372756 92622 429388
31284 429388 524804 558632 662975 692404 461320 57446 -222088 -163640 184106 514898
31274 514898 469537 26175 -335942 -111995 576350 1052022 810471 -64591 -1142532 -1959046
31264 -1959046 -2149589 -1719397 -1219589 -1214320 -1512160 -1384678 -607901 253611 724659 963429
31254 963429 1159211 1003618 222830 -806379 -1455159 -1562394 -1379816 -1113157 -899842
31245 -899842 -938895 -1233304 -1442479 -1343065 -1171469 -1169638 -1123730 -785453 -435315 -494452 -787690
31234 -787690 -746358 -237350 318362 578604 531543 165542 -567551 -1388182 -1783018 -1623104
31224 -1623104 -1293014 -1050940 -665224 60127 746798 817028 265467 -306806 -437210 -281785
31214 -281785 -242897 -374946 -422494 -327754 -330140 -476939 -404220 114357 664695 620659 -63484
31203 -63484 -861026 -1339088 -1389732 -946173 -70393 676753 621028 -106409 -665838 -728740
31193 -728740 -887310 -1496951 -1898211 -1430027 -561702 -182093 -216749 105927 843984 1179825
31183 1179825 691616 -94528 -595792 -836351 -950357 -738697 -152743 308673 161315
31174 161315 -436807 -995297 -1327386 -1512263 -1508317 -1248615 -977187 -1057497 -1444145 -1671268
31164 -1671268 -1422346 -877817 -438962 -303258 -393518 -534220 -556753 -338949 62919 322290
31154 322290 90320 -544017 -1006630 -863724 -387368 -199308 -384275 -361003 230740 937851
31144 937851 1111766 788855 507693 457327 343910 57189 -104016 -18582 -39009 -384718
31134 -384718 -628376 -230322 607742 1088140 805066 174250 -233995 -404576 -639472 -894389
31124 -894389 -820281 -443900 -324765 -800107 -1411379 -1429526 -761650 19949 424385 435397
31114 435397 241765 17323 -14649 261569 559013 486225 222971 379347 1006776 1341891
31104 1341891 885466 169315 -55672 103724 59672 -204425 -243311 -90803 -224180 -583227
31094 -583227 -489777 212998 710173 346534 -375016 -486696 110906 585516 296463 -520106
31084 -520106 -1179059 -1247063 -739210 35352 626647 653820 125017 -470409 -570382 -97395
31074 -97395 487030 702516 478233 13410 -535118 -985707 -978093 -341146 406508 430659
31064 430659 -359563 -1060621 -869656 -64263 473780 408858 169320 176862 331154 293817
31054 293817 -32506 -401090 -485379 -260733 -105778 -313927 -545543 -232189 365549 174125
31044 174125 -1184437 -2548681 -2625255 -1793616 -1590981 -2577046 -3658607 -3619612 -2475213
31035 -2475213 -1058340 20573 621439 787923 614024 188587 -439596 -1023241 -993375
31026 -993375 -81047 1009539 1188178 312486 -676778 -1032818 -924455 -726157 -381194
31017 -381194 130325 363591 -22370 -722241 -1233345 -1419797 -1278958 -674328 225162 720255
31007 720255 362461 -375981 -713620 -508051 -95794 429285 1102867 1475998 883307 -558299
30997 -558299 -1768851 -1790480 -812608 80892 125898 -290749 -170302 690372 1226580 503534
30987 503534 -764887 -981650 85159 930553 551192 -110846 235437 1202003 1460725
30978 1460725 833106 295703 218123 -19862 -630966 -949497 -678873 -499845 -934093 -1486750
30968 -1486750 -1483862 -1047783 -645951 -261608 321900 810545 655064 -118723 -844246 -970928
30958 -970928 -600072 -311619 -619846 -1480196 -2224117 -2172388 -1413938 -730896 -651039 -909931
30948 -909931 -1035090 -1065720 -1308710 -1636119 -1505561 -673920 446869 1215700 1346295 1036781
30938 1036781 695446 605074 742235 829083 574884 -68626 -815337 -1182413 -821177 149825
30928 149825 1140895 1531954 1175809 465314 -57472 -152310 -55379 -259621 -986351 -1797372
30918 -1797372 -1907125 -1016383 322761 1292427 1539621 1183743 453599 -315568 -590841
30909 -590841 -61347 883753 1481737 1386189 846268 239229 -187462 -240274 76922 386938
30899 386938 350680 184422 285137 460941 181532 -432727 -645139 -272825 -16060 -298231
30889 -298231 -577436 -319776 95549 154920 255224 1031178 2010539 2011342 894970 -45645
30879 -45645 245221 1276694 1827858 1539910 1120903 1217069 1650501 1815888 1436248 746636
30869 746636 137268 -183249 -257885 -320134 -651256 -1269187 -1694810 -1320580 -245147 533077
30859 533077 179623 -853916 -1296459 -665190 175570 260837 -262189 -593270 -482155 -372035
30849 -372035 -562898 -830696 -874230 -688815 -446717 -328405 -455562 -678709 -510241 317449
30839 317449 1250936 1372289 583503 -156527 -61389 433382 283940 -750460 -1824960
30830 -1824960 -2101925 -1643461 -1081686 -822654 -873461 -1147141 -1493182 -1542896 -1016746 -250164
30820 -250164 57622 -194737 -278345 302403 994982 1000082 497950 297905 448589 138527
30810 138527 -897054 -1831978 -2025893 -1967893 -2278319 -2511160 -1883271 -747316 -289174
30801 -289174 -870368 -1653651 -1975980 -2158168 -2608842 -2930140 -2503076 -1476037 -581458
30792 -581458 -227505 -265330 -475176 -771020 -943337 -676785 -22837 412476 21824 -1092090
30782 -1092090 -2131072 -2397267 -1982530 -1547279 -1474879 -1470017 -1061835 -257363 504855 870552
30772 870552 793270 383607 -176398 -642789 -899693 -1075171 -1241667 -1175835 -767329 -467275
30762 -467275 -783661 -1402778 -1482095 -928256 -652826 -1215585 -1918598 -1836461 -1173258 -801664
30752 -801664 -825619 -580393 -28022 -124579 -1387489 -2857252 -3127523 -2018916 -646049
30743 -646049 -51094 -330930 -1004021 -1631471 -1932916 -1751757 -1203667 -657908 -372928 -279604
30733 -279604 -229450 -268337 -502642 -843189 -1064837 -1033772 -743561 -245361 294880 590575
30723 590575 509991 319168 455933 1054820 1805341 2222360 1967316 1091361 192064 126017
30713 126017 1147460 2376047 2580167 1596536 556861 513086 1219400 1568508 936580
30704 936580 -265131 -1202670 -1418754 -1057037 -566186 -253572 -67441 163748 351447
30695 351447 242825 -110012 -335055 -300825 -284947 -390439 -275606 173906 387123 -118101
30685 -118101 -865140 -998798 -503620 -74163 149621 833587 2210401 3386979 3402059
30676 3402059 2484482 1724966 1767093 2286106 2609744 2432417 1928868 1468538 1294832 1358686
30666 1358686 1422416 1312375 988750 415331 -418709 -1297772 -1838153 -1891226 -1732026 -1704074
30656 -1704074 -1779121 -1597517 -917325 28775 645262 539047 17579 -179227 197522 515426
30646 515426 112475 -711330 -1042228 -559075 184411 676096 1004677 1320656 1327445 683486
30636 683486 -423275 -1381588 -1623647 -941680 269835 1042361 627785 -594150 -1530514
30627 -1530514 -1789400 -1967786 -2340733 -2215815 -1164862 -30744 135798 -498925 -1067469
30618 -1067469 -1347219 -1579733 -1479858 -683084 95187 -272343 -1466780 -1897770 -1007962
30609 -1007962 -52326 -31991 -158262 691790 2015649 2379656 1495987 433573 4553
30600 4553 2179 30898 151637 464717 712322 605190 197477 -202716 -262221 163934 720001
30589 720001 607143 -553180 -1981836 -2428779 -1648389 -642225 -317706 -486493 -440484
30580 -440484 41098 660771 1125168 1217999 708906 -241718 -817880 -343684 679812 973336
30570 973336 76846 -1019505 -1154021 -426215 115967 -95172 -609231 -761967 -448741
30561 -448741 21449 371827 425281 103924 -332157 -344395 211842 693079 395414 -429551
30551 -429551 -795598 -271671 456306 530820 -15956 -513665 -638366 -654805 -807118 -982426
30541 -982426 -1062136 -1199390 -1552752 -2010483 -2364233 -2539253 -2470982 -1990943 -1123267 -341168
30531 -341168 -175454 -593008 -1094241 -1440013 -1868906 -2424557 -2527278 -1691211 -434991
30522 -434991 138627 -263737 -726038 -393085 359056 522867 -96186 -705910 -746981 -573577
30512 -573577 -672865 -834689 -610827 -185515 -117449 -360308 -249410 415151 921974 644306
30502 644306 -4404 -123450 447724 1021281 1080286 822786 595039 321334 -210152 -865737
30492 -865737 -1324865 -1500115 -1483827 -1264692 -855201 -587025 -875108 -1639569 -2256009 -2166901
30482 -2166901 -1371996 -338491 344809 268745 -508521 -1402523 -1804268 -1707478 -1568782 -1539229
30472 -1539229 -1272541 -662948 -281772 -661579 -1466253 -1876085 -1642368 -1250142 -1073821
30463 -1073821 -912730 -521128 -144482 -204219 -690596 -1185238 -1376422 -1272032 -944216 -380077
30453 -380077 271633 534107 6218 -1031078 -1695688 -1415889 -616054 -217578 -528597
30444 -528597 -972211 -936832 -478131 16409 463956 1008279 1532547 1677050 1320017 765141
30434 765141 463850 695265 1355750 1857245 1482431 197519 -1079757 -1438646 -1045440
30425 -1045440 -787936 -1013028 -1255647 -1211156 -1224113 -1548724 -1790437 -1532982 -1027245 -751893
30415 -751893 -660932 -409687 -69115 -39501 -357813 -610312 -528834 -243784 63359 349297
30405 349297 506824 367543 15113 -227941 -233541 -194995 -235733 -231793 -180003 -396427 -1078848
30394 -1078848 -1927246 -2501254 -2764047 -2948908 -3042201 -2800284 -2245623 -1734159 -1438575 -1128765
30384 -1128765 -635752 -208699 -153018 -357878 -480614 -427317 -348258 -307328 -294329 -434005
30374 -434005 -777292 -970827 -624739 -17714 120471 -332856 -642573 -319835 98736 -136315
30364 -136315 -842569 -1169926 -734626 85971 787133 1097385 893452 384952 259595 946429
30354 946429 1752787 1487813 99650 -1019018 -667467 788443 2010020 2168479 1475658
30345 1475658 634598 156329 19889 -203235 -722151 -1074474 -716198 13799 203371
30336 203371 -262733 -460350 134337 824999 865711 636014 857326 1289454 1169712 556785
30326 556785 266666 646990 1268253 1714552 1889089 1662938 1064100 749965 1386319 2480728
30316 2480728 2726805 1724289 535760 228766 623695 889626 710783 360362 123189
30307 123189 148645 519478 1038579 1231613 911759 480059 370355 465358 349197 -105739
30297 -105739 -666874 -1040435 -1032626 -630309 -97377 211988 232932 147500 -21549 -366237
30287 -366237 -622322 -305060 500261 1047259 915889 566239 585965 925066 1246906 1444281
30277 1444281 1326347 446681 -1037665 -1890541 -1120666 505952 1244105 563379 -410989
30268 -410989 -722189 -796502 -1392310 -2211796 -2349213 -1714743 -1224162 -1561003 -2282732 -2355359
30258 -2355359 -1329855 205864 1262980 1352807 702356 -211843 -1021256 -1384838 -1035454
30249 -1035454 -214564 286084 -36067 -699969 -829887 -297804 212980 203375 -139641 -473293
30239 -473293 -764974 -1061634 -1291311 -1516829 -1938519 -2397779 -2335712 -1584945 -786524 -584509
30229 -584509 -732626 -499678 262450 1007796 1363777 1536802 1748269 1756089 1222940 302547
30219 302547 -420420 -511184 -75487 386783 475141 289915 312491 783504 1297097 1263721
30209 1263721 747723 474453 847491 1323492 1123262 334804 -182110 32062 483101
30200 483101 546471 388003 621293 1271684 1613212 1108873 125181 -483477 -284889 405543
30190 405543 956644 1010840 713277 476086 524913 710934 835666 1019953 1479255 1988589
30180 1988589 1981052 1327753 653839 606221 1074083 1435191 1356680 1022158 731901 620310
30170 620310 655575 613564 201136 -457086 -661058 40096 983173 971026 -201402 -1407612
30160 -1407612 -1611220 -1070932 -741604 -935007 -1130893 -904682 -477243 -287155 -381243 -375456
30150 -375456 102078 960219 1609445 1506118 807044 268683 333781 563207 248688 -617524
30140 -617524 -1355718 -1478112 -1154910 -787557 -491054 -136335 335641 777040 891871 446622
30130 446622 -388881 -985946 -872285 -402276 -403515 -1053812 -1587765 -1389355 -885006 -845963
30120 -845963 -1174213 -1108701 -545452 -340304 -1027999 -1899190 -1859858 -820255 300055 720907
30110 720907 437043 -149166 -658940 -776353 -385559 165937 339251 90588 -94130 15544
30100 15544 59048 -187986 -269399 244578 869313 715938 -194919 -797856 -304110 866894
30090 866894 1706942 1742222 1233442 583305 -52975 -675155 -1286601 -1873314 -2368341 -2601867
30080 -2601867 -2368078 -1589793 -470457 470285 643754 -90274 -1157593 -1761212 -1687666
30071 -1687666 -1399524 -1299859 -1239045 -919673 -477248 -351044 -731244 -1396387 -1993254 -2256740
30061 -2256740 -2076940 -1611837 -1265940 -1307788 -1539370 -1549196 -1222163 -750774 -211182 525307
30051 525307 1394518 1976796 1920631 1338811 614493 -27713 -565823 -928233 -976511 -769166
30041 -769166 -608018 -663377 -670943 -225692 587417 1062916 566425 -700985 -1820706 -2066591
30031 -2066591 -1559180 -996195 -899873 -1196464 -1397930 -1132513 -613406 -559066 -1387314 -2465893
30021 -2465893 -2590565 -1447275 -160707 66001 -511163 -674985 -89700 246799 -412454
30012 -412454 -1393506 -1592240 -1025266 -614549 -728009 -781705 -320982 262648 382992 82816
30002 82816 -184238 -248788 -300571 -464889 -678589 -902639 -1127184 -1168639 -753358 95570
29992 95570 925386 1232129 942034 483497 379103 726029 1072139 892036 207852 -393111
29982 -393111 -411817 53492 531624 694183 486841 -10379 -565820 -808346 -596234 -284133
29972 -284133 -303194 -578790 -729515 -721034 -825115 -963620 -689540 49860 709933 925104
29962 925104 909533 796734 237390 -833865 -1610325 -1295148 -211430 654046 924023
29953 924023 934863 838416 468560 36739 68335 496622 603980 120753 -291744 36939
29943 36939 933056 1714332 1876649 1243853 -9531 -1239764 -1770687 -1667439 -1538172
29934 -1538172 -1473002 -976087 -172784 -55119 -936167 -1635419 -1078888 92390 542821
29925 542821 203627 10003 145451 -83940 -759320 -1087613 -782615 -496573 -572958 -483240
29915 -483240 55643 418085 103551 -410653 -475670 -223073 -82734 25238 360080 746940
29905 746940 933158 1080642 1266485 976907 -154681 -1480065 -2002046 -1667319 -1236547
29896 -1236547 -1085891 -990623 -996950 -1526691 -2402278 -2652322 -1775311 -587698 -243587 -762093
29886 -762093 -1078364 -419111 838849 1702585 1598932 713775 -499915 -1821409 -3102456
29877 -3102456 -3826772 -3339150 -1755483 -249923 65157 -588154 -986736 -464613 403600
29868 403600 759555 514759 148985 -50414 -77787 151504 700545 1222480 1151912 378651
29858 378651 -580097 -1169217 -1307890 -1233157 -1099351 -925932 -785337 -795440 -910001 -884739
29848 -884739 -571882 -205820 -231552 -730763 -1137599 -803547 109947 641376 184117 -651473
29838 -651473 -773598 -76863 403275 -83237 -1020968 -1467869 -1398023 -1571944 -2257860 -2783008
29828 -2783008 -2483931 -1552084 -670090 -217154 -160710 -424988 -948925 -1480087 -1656510 -1333113
29818 -1333113 -676066 18605 472390 507583 190603 -153045 -251247 -210791 -400153 -1002813
29808 -1002813 -1772424 -2246576 -2201171 -1914549 -1888797 -2187676 -2228481 -1549866 -622951 -346684
29798 -346684 -757588 -988583 -728330 -824927 -1834642 -2822418 -2611398 -1633634 -1273573 -1637325
29788 -1637325 -1420077 -164285 802175 339446 -769604 -1004675 -214005 500434 490301
29779 490301 98411 -291537 -755435 -1304450 -1603233 -1400703 -780716 79792 991567 1600663
29769 1600663 1623265 1316708 1319300 1886056 2561647 2713124 2183139 1369459 829865 818883
29759 818883 1073480 1068111 551121 -265768 -1055551 -1636361 -1805402 -1337372 -431052 228733
29749 228733 236303 -44763 -159996 -332546 -977078 -1773787 -1964368 -1452429 -885840 -632812
29739 -632812 -370434 175063 702369 792307 440092 -62463 -409707 -345850 162337 720593
29729 720593 837452 499225 58025 -361111 -812193 -969404 -352434 751737 1326970
29720 1326970 893038 103607 -245369 -172357 -72464 42701 305598 480002 283469 -121206
29710 -121206 -460767 -807385 -1184876 -1144337 -397749 459596 629505 327417 501133 1346076
29700 1346076 1921324 1450880 307515 -637478 -1080601 -1275520 -1384999 -1374144 -1365289 -1596772
29690 -1596772 -1981195 -2050587 -1507506 -671494 -200299 -381088 -829667 -959657 -645855 -262256
29680 -262256 -103105 -21970 229941 515963 415435 -219876 -991777 -1282611 -811406 100061
29670 100061 776504 773691 265910 -201434 -319639 -219325 -73277 206138 668560 930877
29660 930877 431891 -844404 -2100695 -2386141 -1581762 -613040 -492961 -1177420 -1678589
29651 -1678589 -1402928 -897088 -884687 -1067539 -642367 262805 648992 198240 -242695 -47125
29641 -47125 309121 306680 394284 1103374 1863134 1689142 616379 -491407 -1202074 -1620363
29631 -1620363 -1558626 -744397 218002 249114 -673321 -1415721 -1367780 -1183715 -1434434 -1542226
29621 -1542226 -764477 523307 1332417 1353735 997448 509583 -174319 -841562 -971166
29612 -971166 -383353 491519 1059242 1053801 655382 321421 375720 595399 419749 -230657
29602 -230657 -644141 -161323 914754 1654660 1601048 1134497 837147 908002 1222847 1598356
29592 1598356 1862041 1868501 1555680 924710 35702 -842177 -1215889 -795324 54404 539842
29582 539842 221064 -568060 -1150941 -1242064 -1136736 -1199146 -1308673 -1001008 -221684 277405
29572 277405 -390300 -2156443 -3851730 -4275731 -3258108 -1611145 -269038 391319 594508
29563 594508 775315 1122235 1434227 1449117 1221155 993592 805719 545121 325359 364978
29553 364978 443785 10435 -942553 -1603352 -1294341 -324194 463698 635195 294805 -316522
29543 -316522 -840727 -749771 96132 975252 977708 135602 -607023 -556487 30005 412854
29533 412854 146866 -614350 -1237972 -1059146 -37405 1099481 1668465 1791943 1941965
29524 1941965 2021985 1574205 755767 308091 486301 780594 842200 873712 833607 147850
29514 147850 -1227469 -2212735 -1843712 -627438 98441 -150658 -680003 -753248 -343319
29505 -343319 158548 334395 -130764 -1117888 -1873042 -1703256 -894906 -383304 -492621 -645381
29495 -645381 -436309 -268440 -568300 -994034 -959160 -528500 -224733 -204202 -203822 -195933 -522271
29484 -522271 -1286762 -2037861 -2225672 -1738104 -909360 -228134 -73664 -441443 -810352 -575481
29474 -575481 174365 556147 -125021 -1433843 -2201588 -1840727 -887575 -153447 217528
29465 217528 510716 632939 177274 -713403 -1202890 -802595 -70743 200095 122408 387708
29455 387708 976478 1001755 8708 -1307390 -2080373 -2339067 -2515550 -2427496 -1608293 -436770
29445 -436770 5302 -638183 -1484917 -1639899 -1276869 -1068193 -1099443 -941133 -462318 17320
29435 17320 223565 98844 -363156 -993843 -1331868 -1140333 -890751 -1140578 -1539423 -1197702
29425 -1197702 -112555 603453 259515 -403586 -308003 463616 1006551 1016472 985200 1105928
29415 1105928 924897 311723 -26655 490237 1367787 1673560 1352846 1236642 1729965
29406 1729965 2139893 1650878 548860 -74288 243589 745338 517369 -282401 -703836
29397 -703836 -317356 296507 441761 192531 92744 308000 476762 280502 -191806 -650684
29387 -650684 -930139 -1066911 -1195312 -1354539 -1329219 -819904 74290 731944 666948 209892
29377 209892 163738 744012 1212668 727736 -687987 -2209070 -3047710 -3010441 -2342180 -1339395
29367 -1339395 -256406 571969 809336 466920 18946 -108369 -151246 -756819 -1949283
29358 -1949283 -2719754 -2082174 -397729 830785 563762 -721738 -1687757 -1534119 -580762
29349 -580762 279308 450158 52030 -331643 -297317 -22544 13556 -383040 -1004032 -1635867
29339 -1635867 -2236712 -2638733 -2458037 -1600929 -623247 -197083 -276120 -156198 564965 1415880
29329 1415880 1640070 1129850 470477 134866 -10906 -293395 -632719 -625663 -76494 811864
29319 811864 1655724 2035432 1622729 646667 155716 1144852 3186183 4528087 3983127
29310 3983127 2261741 973283 763385 1048076 1190492 1108406 832419 292818 -307273
29301 -307273 -528708 -276463 128888 511193 953392 1330923 1341140 1098901 1080771 1331136
29291 1331136 1366439 1046581 829175 873033 633370 -214470 -1131142 -1517357 -1545418 -1612070
29281 -1612070 -1556401 -1114227 -652051 -673071 -945811 -891674 -575008 -541595 -843271 -963115
29271 -963115 -632407 -71308 507461 1034388 1328633 1291141 1197610 1199373 794170 -415364
29261 -415364 -1642885 -1583274 -189180 1176731 1518611 1187558 850490 515027 83422
29252 83422 -56564 280287 489002 43269 -543345 -362402 643670 1747170 2421603
29243 2421603 2593079 2193796 1227471 200695 -190573 124653 561220 648690 395925
29234 395925 -41528 -535922 -807503 -578043 -21387 349686 348633 270261 274769 65225
29224 65225 -571078 -1261440 -1440312 -1061169 -601400 -437904 -502309 -581427 -722303 -1157263
29214 -1157263 -1853502 -2312682 -2012863 -1082579 -336681 -457002 -1244359 -1908391 -2019833
29205 -2019833 -1840739 -1663005 -1245363 -254088 975928 1616955 1334040 670466 248260
29196 248260 -37256 -641113 -1443652 -1759582 -1284384 -500051 51793 426305 883312 1249075
29186 1249075 1142901 612050 75551 -233424 -352532 -264698 39063 268627 113775 -228940
29176 -228940 -326400 -266767 -537909 -1111488 -1357026 -1083887 -960887 -1500731 -2239064 -2439377
29166 -2439377 -2128891 -1862708 -1825000 -1759271 -1548234 -1294143 -967293 -477048 5565 228282
29156 228282 260720 335892 427734 370234 228148 129646 -87103 -573039 -969107 -778566
29146 -778566 -194957 26161 -386275 -807601 -524737 427054 1399264 1812283 1579013 1073880
29136 1073880 762478 736072 687724 473224 397895 606620 544320 -352212 -1598683 -2039927
29126 -2039927 -1348928 -485424 -473074 -1275302 -2088462 -2243306 -1599592 -518196 322881
29117 322881 477117 253062 309547 712453 951391 913409 1057136 1410780 1299899 563174
29107 563174 175247 890012 1919798 1868985 573660 -862437 -1569459 -1564410 -1102629 -333669
29097 -333669 346907 435858 -151 -403752 -560319 -699008 -699162 -5849 1335864 2265131
29087 2265131 1849856 433013 -816852 -1205613 -982346 -768293 -933441 -1454501 -2090779
29078 -2090779 -2659605 -3170573 -3596018 -3609670 -2896172 -1747157 -937916 -854197 -1103906 -1162773
29068 -1162773 -1005062 -847712 -665669 -311866 174498 709650 1344084 1989573 2282376
29059 2282376 2098134 1895602 2095638 2401798 2276321 1847685 1676919 1732492 1361329 393830
29049 393830 -445292 -526861 -117690 188882 316971 488824 571175 256926 -269213 -420246
29039 -420246 13211 580362 727990 364406 -133645 -238058 335215 1263856 1750383 1371231
29029 1371231 695964 585342 909565 613414 -725986 -2062147 -2098755 -885594 408273
29020 408273 997374 1056303 964477 797679 688311 920259 1325487 1226641 436236 -236199
29010 -236199 -38873 629363 877351 709624 884736 1529187 1871661 1519520 1071855 1083694
29000 1083694 1275362 1311233 1503054 1893559 1384141 -977081 -4117236 -5674371 -4783858
28991 -4783858 -2988993 -2031201 -1878076 -1599196 -1121187 -997134 -1066775 -620151 244143
28982 244143 549257 -122944 -1029659 -1353057 -1118997 -728487 -303481 50717 -58319 -770179
28972 -770179 -1506689 -1579223 -1009748 -312634 262653 777457 1116400 1030391 633323 373767
28962 373767 469410 749385 1078457 1543950 2123939 2498063 2337444 1600470 520719 -474326
28952 -474326 -865728 -414036 474318 1042951 969237 602406 340804 124118 -235821 -552637
28942 -552637 -486582 -117934 122590 117589 264105 813770 1300812 998048 -101558 -1133902
28932 -1133902 -1358372 -1005864 -811801 -907877 -697130 113804 912014 939672 261937 -461192
28922 -461192 -881086 -1109458 -1127990 -675618 202524 1021421 1443528 1581214 1561276 1251603
28912 1251603 691389 362030 607766 1053148 1050647 591820 339092 722503 1365282 1567587
$$ [...]
##END NTUPLES=NMR SPECTRUM
##END=
