##TITLE=31Pdec_LY-TMF-9.70.3
 D2O, 24 sc
 2.3.2020
##JCAMPDX= 6.0         $$ Bruker NMR JCAMP-DX V2.0
##DATA TYPE= NMR SPECTRUM
##DATA CLASS= NTUPLES
##ORIGIN= UXNMR, Bruker Analytische Messtechnik GmbH
##OWNER= root
$$ XWIN-NMR		Version 3.5
$$ Mon Mar  2 16:39:51 2020 Russian Standard Time (UT+4h)  she@DPX200
##.OBSERVE FREQUENCY= 81.013821
##.OBSERVE NUCLEUS= ^31P
##.ACQUISITION MODE= SIMULTANEOUS
##.ACQUISITION SCHEME= undefined
##.AVERAGES= 24
##.DIGITISER RES= 17
##SPECTROMETER/DATA SYSTEM= spect
##.PULSE SEQUENCE= zgpg30
##.SOLVENT NAME= D2O
##.SHIFT REFERENCE= (INTERNAL, D2O, 0, 182.463)
##AUDIT TRAIL= $$ (NUMBER, WHEN, WHO, WHERE, WHAT)
$$ ##TITLE= Audit trail, XWIN-NMR		Version 3.5
$$ ##JCAMPDX= 5.01
$$ ##ORIGIN= Bruker BioSpin GmbH
$$ ##OWNER= she
$$ F:/spectra/data/she/nmr/P31/1/pdata/1/auditp.txt
$$ ##AUDIT TRAIL=  $$ (NUMBER, WHEN, WHO, WHERE, WHAT)
(   1,<2020-03-02 16:38:58.40 +0400>,<she>,<DPX200>,
      <created by zg, POWCHK disabled, PULCHK disabled
       configuration hash MD5:
       00 E9 B6 7A A2 85 ED C7 34 08 36 98 17 FE 4E 26
       data hash MD5: 32K
       61 6F 6C 6F 6D ED 72 4F 02 A0 FF AE BC 98 05 77>)
(   2,<2020-03-02 16:39:01.00 +0400>,<she>,<DPX200>,
      <Start of raw data processing
       efp BC_mod = 2 LB = 1 FT_mod = 6 PKNL = 1 PHC0 = -1464.078 PHC1 = 359.6017 SI = 64K 
       data hash MD5: 64K
       5F 84 E3 2A 20 33 E2 60 EA 49 89 3D B6 05 42 D5>)
(   3,<2020-03-02 16:39:16.79 +0400>,<she>,<DPX200>,
      <pk PHC0 = 3.467841 PHC1 = 0 
       data hash MD5: 64K
       9C A0 72 45 E4 E3 18 18 5B 8E 0B FE 0B A4 F3 B4>)
(   4,<2020-03-02 16:39:20.39 +0400>,<she>,<DPX200>,
      <abs ABSG = 5 
       data hash MD5: 64K
       C2 C9 95 DA 68 D6 67 C3 25 BF 72 B1 FC BB 4B 48>)
$$ ##END=
$$ 
$$ hash MD5
$$ 37 68 42 0C 4D C2 A6 02 7D 28 DD A1 3B 54 A3 24
##$RELAX= 
##$RELAX= 
##$RELAX= 
##$RELAX= 
##$RELAX= 
##$RELAX= 
##$RELAX= 
##$RELAX= 
$$ Bruker specific parameters
$$ --------------------------
##$DU= <F:/spectra>
##$EXPNO= 1
##$NAME= <P31>
##$PROCNO= 1
##$TYPE= <nmr>
##$USER= <she>
##$AMP= (0..31)
100 100 100 100 100 100 100 100 100 100 100 100 100 100 100 100 100 100 
100 100 100 100 100 100 100 100 100 100 100 100 100 100 
##$AQSEQ= 0
##$AQ_mod= 1
##$AUNM= <au_zg>
##$AUTOPOS= <>
##$BF1= 81.014009
##$BF2= 200.13
##$BF3= 200.13
##$BF4= 200.13
##$BF5= 200.13
##$BF6= 200.13
##$BF7= 200.13
##$BF8= 200.13
##$BYTORDA= 1
##$CFDGTYP= 0
##$CFRGTYP= 5
##$CHEMSTR= <none>
##$CNST= (0..31)
1 1 145 1 1 1 1 1 1 1 1 1 1 1 1 1 1 1 1 1 1 1 1 1 1 1 1 1 1 1 1 1 
##$CPDPRG= <waltz16>
##$CPDPRG1= <>
##$CPDPRG2= <waltz16>
##$CPDPRG3= <>
##$CPDPRG4= <mlev>
##$CPDPRG5= <mlev>
##$CPDPRG6= <mlev>
##$CPDPRG7= <mlev>
##$CPDPRG8= <mlev>
##$CPDPRGB= <>
##$CPDPRGT= <>
##$D= (0..31)
0 1 0 0 0 0 0 0 0 0 0 0.03 2e-05 3e-06 0 0 0 0 0 0 0 0 0 0 0 0 0 0 0 0 
0 0 
##$DATE= 1583152737
##$DBL= (0..7)
120 120 120 11 120 120 24 19 
##$DBP= (0..7)
150 150 150 150 150 150 150 150 
##$DBP07= 0
##$DBPNAM0= <>
##$DBPNAM1= <>
##$DBPNAM2= <>
$$ [...]
##$SUBNAM3= <"">
##$SUBNAM4= <"">
##$SUBNAM5= <"">
##$SUBNAM6= <"">
##$SUBNAM7= <"">
##$SUBNAM8= <"">
##$SUBNAM9= <"">
##$SW= 369.568048894756
##$SWIBOX= (0..15)
0 1 3 0 0 0 0 0 0 0 0 0 0 0 0 0 
##$SW_h= 29940.119760479
##$TD= 32768
##$TD0= 1
##$TE= 0
##$TE2= 300
##$TE3= 300
##$TEG= 300
##$TL= (0..7)
0 120 53 12 22 120 120 120 
##$TP= (0..7)
150 150 150 150 150 150 150 150 
##$TP07= 0
##$TPNAME0= <>
##$TPNAME1= <>
##$TPNAME2= <>
##$TPNAME3= <>
##$TPNAME4= <>
##$TPNAME5= <>
##$TPNAME6= <>
##$TPNAME7= <>
##$TPOAL= (0..7)
0.5 0.5 0.5 0.5 0.5 0.5 0.5 0.5 
##$TPOFFS= (0..7)
0 0 0 0 0 0 0 0 
##$TUNHIN= 0
##$TUNHOUT= 0
##$TUNXOUT= 0
##$USERA1= <user>
##$USERA2= <user>
##$USERA3= <user>
##$USERA4= <user>
##$USERA5= <user>
##$V9= 5
##$VALIST= <valist>
##$VCLIST= <CCCCCCCCCCCCCCC>
##$VD= 0
##$VDLIST= <DDDDDDDDDDDDDDD>
##$VPLIST= <PPPPPPPPPPPPPPP>
##$VTLIST= <TTTTTTTTTTTTTTT>
##$WBST= 1024
##$WBSW= 4
##$XGAIN= (0..3)
0 0 0 0 
##$XL= 0
##$YL= 0
##$YMAX_a= 5652
##$YMIN_a= -6861
##$ZGOPTNS= <>
##$ZL1= 120
##$ZL2= 120
##$ZL3= 120
##$ZL4= 120
##$ABSF1= 182.463
##$ABSF2= -187.1042
##$ABSG= 5
##$ABSL= 3
##$ALPHA= 0
##$AQORDER= 0
##$ASSFAC= 0
##$ASSFACI= 0
##$ASSFACX= 0
##$ASSWID= 0
##$AUNMP= <proc_1d>
##$AZFE= 0.1
##$AZFW= 0.5
##$BCFW= 0
##$BC_mod= 2
##$BYTORDP= 0
##$COROFFS= 0
##$CY= -3
##$DATMOD= 1
##$DC= 0
##$DFILT= <>
##$DTYPP= 0
##$F1P= 0
##$F2P= 0
##$FCOR= 1
##$FTSIZE= 65536
##$FT_mod= 6
##$GAMMA= 0
##$GB= 0
##$INTBC= 1
##$INTSCL= 5.30512e-09
##$ISEN= 30
##$LB= 1
##$LEV0= 0
##$LPBIN= 0
##$MAXI= 10000
##$MC2= 0
##$MEAN= 0
##$ME_mod= 0
##$MI= 50
##$NCOEF= 0
##$NC_proc= -6
##$NLEV= 6
##$NOISF1= 182.463
##$NOISF2= 159.3651
##$NSP= 0
##$NTH_PI= 0
##$NZP= 0
##$OFFSET= 182.463
##$PC= 4
##$PHC0= -1460.61
##$PHC1= 359.6017
##$PH_mod= 1
##$PKNL= yes
##$PPARMOD= 0
##$PSCAL= 0
##$PSIGN= 0
##$REVERSE= no
##$SF= 81.0140089999434
##$SI= 65536
##$SIGF1= 159.3651
##$SIGF2= -187.1042
##$SINO= 113.3802
##$SIOLD= 16384
##$SREGLST= <1H.CDCl3>
##$SSB= 0
##$STSI= 65536
##$STSR= 0
##$SW_p= 29940.119760479
##$SYMM= 0
##$S_DEV= 0
##$TDeff= 32768
##$TDoff= 0
##$TI= <>
##$TILT= no
##$TM1= 0
##$TM2= 0
##$TOPLEV= 0
##$USERP1= <user>
##$USERP2= <user>
##$USERP3= <user>
##$USERP4= <user>
##$USERP5= <user>
##$WDW= 1
##$XDIM= 65536
##$YMAX_p= 383635724
##$YMIN_p= -29260183
$$ End of Bruker specific parameters
$$ ---------------------------------
##NTUPLES= NMR SPECTRUM
##VAR_NAME=  FREQUENCY,     SPECTRUM/REAL,   SPECTRUM/IMAG
##SYMBOL=    X,             R,               I
##VAR_TYPE=  INDEPENDENT,   DEPENDENT,       DEPENDENT
##VAR_FORM=  AFFN,          ASDF,            ASDF
##VAR_DIM=   65536,         65536,           65536
##UNITS=     HZ,            ARBITRARY UNITS, ARBITRARY UNITS
##FACTOR=    0.456856943014862, 1,           1
##FIRST=     14782.0589164792, 0,            0
##LAST=      -15158.0608439998, 0,           0
##MIN=       -15158.0608439998, -29260183,   0
##MAX=       14782.0589164792, 383635724,    0
$$ Real data points
##PAGE= N=1
##DATA TABLE= (X++(R..R)), XYDATA
$$ [...]
36625h91257p94954k65477K72143O87472J000447J175796R58053J98692o88361
36616A652554j041687q30116p52527j207984j562467q62044Q59634K376049K493397
36607A124809J309589N2876l04289K4876K38176M5630l10849p72606j376728j588539
36597a557055p55290O14704J136422N15396O0178N65219R36425L5337j226860
36588C24476j212870k82206l36555j711213k331044n80149K276525L444536J765887
36579A357387j141867k653039j663433N30347J743809J251435K95006J29303L36494
36570A85442j57292j051514r58602L71716J455507J121741R4566j57376N68779
36561A472967J144325O92175n02595j596038k094272j991163j412588n01226M31060
$$ y = [-891257, -1686211, -1951688, -1679545, -992073, 8374, 1184170, 2142223, 2340915, 1652554, 610867, -219249, -971776, -2179760, -3742227, -4604271, -3744637, -1368588, 1124809, 2434398, 2487274, 2182985, 2207861, 2446037, 2491667, 2180818, 1408212, 31484, -1557055, -2312345, -1697641, -561219, -45823, 14355, 579574, 1515999, 1551336, 324476, -888394, -1170600, -1507155, -3218368, -5549412, -6129561, -3853036, -408500, 1357387, 215520, -2437519, -4100952, -3570605, -1826796, -575361, -280355, -151052, 185442, 28150, -1023364, -1981966, -1610250, -154743, 966998, 1061564, 904188, 1472967, 2617292, 3309467, 2806872, 1210834, -883438, -2874601, -4287189, -4788415, -4357355]
36552d357355J012434J221382J390861J563347J202650K1870j223422j492073
36544f60306q45048k13915J52270Q79048J857639J748583q0724k107533k254793
36535a524779m53953J356075J537653K99114q87149p91529N38145J844880J895147
36526C813604P83734l13762o38324m41332j43697J06001n8039r34895j721864
36517D51426j155281L90807J053018L77266K01357J541258K561061J344537j002538
36508E762911k062448j555240q90374m22970M32336J146581O15291o50020j119353
36499A256714p03177n10465o09996k65736P8641m93392j086201j17439J515629
36490i35422J389378k69326o34641R48250J692020Q5576j453067n75702J212759
$$ y = [-4357355, -3344921, -2123539, -732678, 830669, 2033319, 2055189, 831767, -660306, -1505354, -1719269, -1566999, -687951, 1169688, 2918271, 2837547, 730014, -1524779, -1978732, -622657, 914996, 1214110, 326961, -464568, 73577, 1918457, 3813604, 4597338, 4283576, 3645252, 3203920, 3060223, 3166224, 3108185, 2173290, 451426, -703855, -313048, 739970, 1117236, 1318593, 2859851, 5420912, 6765449, 5762911, 3700463, 2145223, 1254849, 831879, 1264215, 2410796, 3026087, 2376067, 1256714, 553537, 43072, -566924, -832660, -754019, -1247411, -2333612, -2451051, -935422, 453956, 184630, -450011, 498239, 2190259, 2275835, 822768, 247066, 1459825]
36481A459825J190439l75005j241790q09640j68142L53295J208671J816213R70587
36472D404453j025059k380148k065603q30534K7453q682n11115o31193O9437J011150
36462a939841J226244O73306J50854j15176o25244j200578r12364J52462O59335
36453a931002K15775J06686R60298J450461N56333n60557m67859K00073L5790
36444E65998o82002o47936J63268N90570J95902l79946n95890l96476J30790N62059
36434d93663K37677o25427p88943J85112J018693N99447l63088o52228l22811
36425a205231P815L81870P38390K92734q74512j049933N91509K116589J441030
36416B440261n00088j334050p85502k54933L4557P48956J074676l55722k381186
$$ y = [1459825, 2650264, 2275259, 1033469, 223829, 55687, 408982, 1617653, 3433866, 4404453, 3379394, 999246, -1066357, -1896891, -1869438, -1878120, -2389235, -3020428, -2950991, -1939841, -713597, -40291, 110563, -4613, -629857, -1830435, -2742799, -2590337, -1931002, -1715227, -1608541, -648243, 802218, 1358551, 797994, 330135, 530208, 565998, -116004, -763940, -600672, -10102, 185800, -194146, -790036, -1186512, -1055722, -493663, -255986, -881413, -1670356, -1485244, -466551, 132896, -230192, -882420, -1205231, -1197416, -815546, -77156, 215578, -658934, -1708867, -1117358, 999231, 2440261, 1940173, 606123, -179379, -434312, -399755, 349201, 1423877, 1068155, -1313031]
36407a313031k184334L69072K053381Q34923j270525j179864J151092L051107
36399A511821K621837O81013n73589k08546M62421j49683j363525j075790O63702
36390B569661J124271q71607k582238j389301R60069J124543n16375q96839M20288
36381e7528Q99786k29503q16262J75528J079205Q14051M70175O16363J60291r57761
36371B154345r63765N48839J533519J003209O61312J381531J124200j406251l772942
36362B263997l172341o66081P02920L70301J05863O63760J235989J447471J505360
36353D457239R11481q17628k516815k418216o87917P13599O42609j17332l65565
36344a98545l970J54442m24984j106548n76209J264290K450680J319089p77268
$$ y = [-1313031, -3497365, -3128293, -1074912, -239989, -1510514, -2690378, -1539286, 1511821, 4133658, 4814671, 4241082, 4032536, 4494957, 4345274, 2981749, 1905959, 2569661, 3693932, 2822325, 240087, -1149214, -189145, 935398, 419023, -477816, -57528, 842258, 612755, -203507, -27979, 1051226, 1865277, 2335452, 2951815, 3112106, 2154345, 1190580, 1739419, 3272938, 4276147, 4937459, 6318990, 7443190, 6036939, 2263997, -908344, -1574425, -871505, -501204, -395341, 268419, 1504408, 2951879, 4457239, 5368720, 4551092, 2034277, -383939, -1071856, -358257, 284352, 167020, -198545, -202515, -48073, -473057, -1579605, -2155814, -891524, 1559156, 2878245, 2100977]
36335B100977j115709K73858P64528l92108r57774j1888J85597j472472k233893
36326b858884K5587K596447J784789j257204k428117r06251M78329K69314j06719
36317b402709K97037N70009J96041k14991o23587j397674j579645n6788J725856
36308c486451J252276q61082j412312K92008J337518P8378j311554o82426P70278
36299d023367J029056N59889Q31091J468566J203966L24186P1480N15788P86986
36290B767641O81044N33398J84943n71099j138453r41762n34508p81891j464503
36281a265190j681757j142375k04061Q00739J485608J323636M88170J02293P32397
36272F39460J286836M47394j321993k283774j625944j52342R99587J352866Q96997
$$ y = [2100977, 985268, 1259126, 2023654, 1631546, 673772, 661884, 847481, -624991, -2858884, -2833297, -236850, 1547939, 290735, -2137382, -3043633, -2565304, -2295990, -2402709, -2105672, -1535663, -1339622, -1554613, -2178200, -3575874, -5155519, -5212307, -3486451, -2234175, -3095257, -4507569, -4215561, -2878043, -2799665, -4111219, -4793645, -4023367, -2994311, -2434422, -1603331, -134765, 1069201, 1393387, 1464867, 1980655, 2767641, 3448685, 3982083, 4167026, 3595927, 2457474, 1515712, 981204, 199313, -1265190, -2946947, -4089322, -4293383, -3492644, -2007036, -683400, -195230, -92937, 639460, 1926296, 2373690, 1051697, -1232077, -2858021, -3010363, -2010776, -657910, 239087]
36263B39087j30183j090008j295864p85044k68287j33279L6460O51187J215025
36254a560906Q23955m10285j083690k02641J238531J334432p4765j022423k04283
36245a162075J113278J063269j5523l58308K55620K60991r09521j697803p81993
36236b232065Q74815J355364L11968q11767p07472L64084J042077M88008n90040
36227I4972q10212m0651L25543m97996j305901p20981N30074P14828j65834n82330
36217b458488j24955P9030k99238j06443J086979J951610J407555J52770o69162
36208A019658j000560j207151j060271l01403O20280J083320R59791M80863J17360
36199G11887M50983J203596Q93145j038901k394014p61812K428894L242150Q53126
$$ y = [239087, 108904, -981104, -2276968, -3062012, -3330299, -3463578, -3427118, -2775931, -1560906, -736951, -1147236, -2230926, -2433567, -1195036, 139396, 64631, -957792, -1162075, -48797, 1014472, 998949, 640641, 896261, 1157252, 247731, -1450072, -2232065, -1357250, -1886, 310082, -501685, -1209157, -845073, 197004, 685012, 94972, -715240, -755891, -430348, -928344, -2234245, -2955226, -2425152, -1710324, -1876158, -2458488, -2583443, -2504413, -2803651, -2910094, -1823115, 128495, 1536050, 1688820, 1019658, 19098, -1188053, -2248324, -2549727, -1929447, -846127, 113664, 594527, 711887, 1162870, 2366466, 3259611, 2220710, -173304, -935116, 1493778, 4735928, 5589054]
36190E589054j339164j061763k01547q09129j441530j48588J610231J233864o93490
36181B737938j525634p36974J137j8516j14591k16911o43917n42653Q78726K203066
36171B021671J496037m34944j131198k87996L22445K33561M98015P62168m81272
36162B998487k448242k329660J71152J854975Q28245p88293n86699N08531M05952
36153F14448o92942j264358j125515r45928n06608M97512J104452M95593k69636
36144b092982J74784J116751Q70129m82905j366597j183492o73921k21255L99424
36135c460064Q55983N92347J60671N31776J220389Q72358l28588p80809j60760
36126d96697J19049l21530P9271J762079K317947r4672l211697l202020n9061
$$ y = [5589054, 4249890, 3188127, 2986580, 2177451, 735921, 587333, 2197564, 3431428, 2737938, 1212304, 475330, 476467, 457951, 343360, 126449, -517468, -1060121, -181395, 2021671, 3517708, 3082764, 1951566, 1663570, 1986015, 2219576, 2717591, 3479759, 2998487, 550245, -1779415, -1608263, 246712, 1074957, 286664, -300035, 208496, 614448, -78494, -1342852, -2468367, -3414295, -3920903, -3423391, -2318939, -1823346, -2092982, -1918198, -801447, 68682, -414223, -1780820, -2964312, -3638233, -3859488, -3460064, -2604081, -2011734, -1851063, -1319287, -98898, 773460, 444872, -335937, -496697, -377648, -699178, -619907, 1142172, 3460119, 3365447, 153750, -3048270, -3107331]
36117c107331K318242J561355l62131o93198K57774N64907J31507K99975R83200
36108A954300O97283o80490j470871q99381k66535p03271j454607j329121m46569
36099d599262M62846J276503J947812J846922P44381m24778p60737n18793k30974
36090b56080K02283O65169L89117n25360o00294O27258J307900J81327q93175
36081A098145K51744K158564J672421r97899k489104j432121l5592o3245m82902
36072c19989j51816J18670l64841n55523K84784J037456P57142K87568L86699
36063A480150K32859o29075q81671K19899J068105L33248n02891L34323J495912
36054C150859M56659k176075l269583j689382M92686J295500Q95555J64266o58113
$$ y = [-3107331, -789089, 772266, 410135, -283063, -25289, 539618, 671125, 971100, 1954300, 2651583, 1971093, 500222, -399159, -665694, -1368965, -2823572, -4152693, -4599262, -4136416, -2859913, -912101, 934821, 1679202, 1254424, 493687, -25106, -256080, -53797, 611372, 1000489, 475129, -125165, 502093, 1809993, 1991320, 1098145, 1349889, 3508453, 5180874, 4182975, 1693871, 261750, 226158, 162913, -319989, -471805, -353135, -717976, -1273499, -988715, 48741, 805883, 1093451, 1480150, 1713009, 1083934, 202263, 422162, 1490267, 1823515, 1320624, 1654947, 3150859, 3607518, 1431443, -1838140, -3527522, -3034836, -1739336, -843781, -679515, -1337628]
36045a337628j297261j187862m16523L27065Q56905J322801J195106R794j106651
36036a634254n72056R80129J257666j42343r63964J65023J617047J479842M41867
36027B628957J87894M10861l79124j851585j999812l35010J137417Q28850k01511
36018D26937j32902O52644K21412j581945k355227m69347K268529K781276Q19452
36009B630829q98319n54138O67699R11761K73783r2883q2138l26744p14932p24352
35999A090566n63271n69619j80145R48612J517261K00870j776678j898910j50182
35990a381496Q08949k75693j393267n97893R51925J015854k04088o30848L39147
35981a367410J053358J71738j497571k126247r37490J198375K720625K705464
$$ y = [-1337628, -2634889, -3822751, -4239274, -3912209, -3055304, -1732503, -537397, -527603, -1634254, -2206310, -1226181, 31485, -110858, -1074822, -909799, 707248, 2187090, 2628957, 2816851, 3227712, 2848588, 997003, -1002809, -1337819, -200402, 628448, 426937, 294035, 946679, 1168091, -413854, -2769081, -3238428, -969899, 1811377, 2630829, 1732510, 1178372, 1846071, 2757832, 3031615, 2938732, 2856594, 2529850, 1814918, 1090566, 527295, -42324, -222469, 726143, 2243404, 2444274, 667596, -1231314, -1381496, -572547, -848240, -2241507, -2839400, -1887475, -871621, -1075709, -1706557, -1367410, -314052, -142314, -1639885, -3766132, -4703622, -3505247, -784622, 1920842]
35973A920842J534324L90247P8203M40136Q00369N72908m76432j907896k532447
35964H20254j528621J71813O53568l92020j053970k8808J198346N03638j419464
35955a075264j811182J6383J473366M90178j291976p95749K008064L906445K754958
35946E675223J75007q60707J53135J144223N59759q80398j643278j385126q76552
35937B061286o55236n30336k07251J89901L08978O4725j45492J66037Q46640J063806
35927C163058M18225k58657P848P18076N09685n97108r80980Q2781J149783P36391
35917D949102n46956j163837q87962n48425m35568l82868o78780j413688j622395
35908b731377o67621K17496m09572j602866j223344N99612J583204R41042M11664
$$ y = [1920842, 3455166, 3845413, 3923616, 4363752, 5164121, 5737029, 5260597, 3352701, 820254, -708367, -536554, 117014, -275006, -1328976, -1357784, -159438, 344200, -1075264, -2886446, -2870063, -1396697, -906519, -2198495, -2994244, -986180, 2920265, 5675223, 5850230, 4989523, 5142658, 6286881, 6846640, 5966242, 4322964, 2937838, 2061286, 1406050, 875714, 668463, 858364, 1167342, 1232067, 1086575, 1252612, 2099252, 3163058, 3581283, 3322626, 3330474, 4048550, 4558235, 3961127, 2980147, 3062928, 4212711, 4949102, 4402146, 3238309, 2350347, 1801922, 1366354, 983486, 304706, -1108982, -2731377, -3398998, -3181502, -3591074, -5193940, -6417284, -5817672, -4234468, -3293426, -2881762]
35899b881762J074319J598952P72485l76332m19931K10310L31144M647n9948L7371
35889B91255m2605J45248Q79547J205629K78159r65421r65031J24274O88137L876
35879A643068r42406j000970k69018J94168l76117j428490j359601N53353K568715
35870d17298K146592m74059k073157p64302J280652J055988q50442j330072N44571
35861h81527K365410J994139K00927r21914o75637o0732j84470r94122j358126
35852e16052l71024J272011J714471K03533j758511k191925q61856R72059K104119
35843E66825J804071j43764k510725k857870l95484K289302K235449O2357j176035
35834a25874m43733M40047J89710l72138m55376n15663o52321p9622R59737R31636
$$ y = [-2881762, -1807443, -208491, 563994, 187662, -232269, -21959, 309185, 313832, 253884, 291255, 248650, 393898, 1273445, 2479074, 2757233, 1791812, 826781, 951055, 1639192, 1643068, 700662, -300308, -569326, -375158, -751275, -2179765, -3539366, -2986013, -417298, 1729294, 1255235, -817922, -1582224, -301572, 754416, -96026, -1426098, -881527, 1483883, 3478022, 3678949, 2757035, 2081398, 2020666, 1836196, 842074, -516052, -887076, 384935, 2099406, 2302939, 544428, -1647497, -2509353, -1537294, 566825, 2370896, 2227132, -283593, -3141463, -3536947, -1247645, 987804, 1050161, -125874, -569607, -129560, 60150, -311988, -767364, -1283027, -1935348, -2014970, -1055233, -123597]
35824a23597l44356r36243Q0628Q62841k28820j803499j580590J18010J178007
35815b777619R62397N82212N43841K91774j45759p7006K40553k15954j150946
35806a746507q67549J033719K456725J463536r18864j901982n15653J324798J456583
35797A784806O9320r66241o55209K44902P45223Q72871R42732N82912n42029j613367
35787A465920j424215j06414R54640R17343K23306m38722q20080o62408K52409
35778C61779J269971J202986k2883j068778j002734m01511j13099j5334K66273
35769D76670M16708Q8991l17059l90979m79803q65634q88952J61121J782900K701441
35759B685404K196858N21505j365763k094747r25626R04915J085158o90119j938987
$$ y = [-123597, -467953, -1404196, -1323568, -460727, -689547, -2493046, -4073636, -3955626, -2777619, -1815222, -1233010, -689169, -397395, -543154, -620160, -379607, -595561, -1746507, -2614056, -1580337, 876388, 2339924, 1421060, -480922, -996575, 328223, 1784806, 1854126, 887885, 232676, 477578, 1222801, 2095672, 3038404, 3621316, 3079287, 1465920, 41705, -64709, 889931, 1807274, 2030580, 1591858, 771778, 109370, 361779, 1631750, 2834736, 2811853, 1743075, 740341, 338830, 225731, 210397, 476670, 893378, 982369, 665310, 274331, -205472, -1071106, -1960058, -1798937, -16037, 2685404, 4882262, 5403767, 4038004, 1943257, 1017631, 1922546, 3007704, 2317585, 378598]
35750C78598q95270P66901N59312q45881q22867P56804J256221l39369j664190
35741h49741o76328J275089J692968M53642p66439j309379j711110j722294l35175
35732c948767K053021L320843K188613j00803j447979j311416n77634J51441Q61371
35723A188690J112530K57651j124139j485838o08223j56933r27102j138038P19324
35714b162078K708602J799612j229513k427309m86368J439359Q82587l75161k922
35705A46809P87090n4776j179865j82611J556554P42072j950031k511241k33262
35696b879261J084531l29334j242393P12998K530965P25812k567008k691122L11368
35687d343444K077101P53866q73715m06996R01174J147106Q98419J428069K022166
$$ y = [378598, -516672, 250229, 809541, -36340, -859207, -102403, 1153818, 814449, -849741, -1526069, -250980, 1441988, 1895630, 1129191, -180188, -1891298, -3613592, -3948767, -1895746, 1425097, 3613710, 3512907, 2064928, 753512, 175878, 327319, 1188690, 2301220, 2558871, 1434732, -51106, -659329, -816262, -1743364, -2881402, -2162078, 546524, 2346136, 1116623, -1310686, -1797054, -357695, 524892, 149731, 146809, 933899, 879123, -300742, -483353, 1073201, 1815273, -134758, -2645999, -2879261, -1794730, -2124064, -3366457, -2653459, -122494, 603318, -1963690, -4654812, -4343444, -2266343, -1512477, -2386192, -2793188, -1892014, -744908, 153511, 1581580, 3603746]
35678C603746J176163p40832j902165j533068n42506N2936J33870q202j74496
35669F5446j49120K19364O41546N81259K4356l26679Q5659Q45210R82316K29734
35659C199091n46071m34852L14098O65063K20063l80339n72309o71824j143283
35650F49637j589175j087405N66859K321092K642513R69607j350728j920167J34021
35641A336254K608004K406597n55523l020535k506795k29577J141881J084275
35633B264581Q56433P42803n4662j223206j362750l80953J60479m78904j216321
35624f92500j143965p54191n05656L9075P64697N10031p95018j276115O7515J367495
35614b418632O75280p07057j86551J746571K012855k53027k270968j724123K07999
$$ y = [3603746, 4779909, 4039077, 2136912, 603844, 61338, 114274, 248144, 239942, 65446, -83674, 135690, 777236, 1358495, 1382851, 1056172, 1141831, 1987041, 2969357, 3199091, 2653020, 2218168, 2532266, 3197329, 3417392, 3037053, 2464744, 1792920, 649637, -939538, -2026943, -1460084, 861008, 3503521, 4473128, 3122400, 1202233, 1336254, 3944258, 6350855, 5795332, 2774797, 268002, 38425, 1180306, 2264581, 3121014, 3863817, 3809155, 2585949, 1223199, 842246, 1002725, 523821, -692500, -1836465, -2590656, -3096312, -3057237, -2292540, -1782509, -2577527, -3853642, -3786127, -2418632, -1743352, -2450409, -2636960, -890389, 1122466, 869439, -1401529, -3125652, -2917653]
35605b917653J196534J049862R31413Q58782O9465r24437p27580N99644J339941
35596A475971N54405o68074r08982k55940K75632L53321M56025P38408O54285
35587B675051j45546j100789j291395n38277L40334M37783k28238p68595m76080
35578a095752L46310P57001L22458l46079l91725J12335K62467k27558l15353
35569e75896Q79179K285353J880081l42555j917175j292023j74293q75554k499037
35560b631920k160038L98592K173569J394851o8495j07688L31474n10200j634311
35551b814166p73101J560360K447651Q57409j075601j440294q79904p59513r80713
35542c857872p11493J23263J068062J763718J665689L34499j314856j402895L37726
$$ y = [-2917653, -1721119, -671257, 260156, 1118938, 1188403, 263966, -463614, 136030, 1475971, 2030376, 1362302, 453320, 197380, 473012, 826333, 1282358, 2020766, 2675051, 2529505, 1428716, 137321, -400956, -60622, 377161, 148923, -619672, -1095752, -749442, 7559, 330017, -16062, -407787, -295452, -32985, -260543, -575896, 303283, 2588636, 4468717, 4126162, 2208987, 916964, 742671, -132883, -2631920, -4791958, -4393366, -2219797, -824946, -893441, -1001129, -669655, -1179855, -2814166, -3587267, -2026907, 420744, 1278153, 202552, -1237742, -2117646, -2877159, -3857872, -4569365, -4446102, -3378040, -1614322, 51367, 385866, -928990, -2331885, -1994159]
35533a994159J666389P39858j161840j317359O58293K305159J557416p90577k249351
35524e86171j512906L53404J399221J003452K31598R1076K55375M9044k06642
35515A077451N4624K89315k44952p78182q7784J091513R56520j43450j1911J492566
35505C695710J811808n1723j659908j131307n5987k98178p53609Q833N39503p70907
35495A334235k050609q03461J381561J097945j167343j945402o28658J77790j12704
35486b716646O75522K525123K414012k53387j984577q15965O46251L0397r74497
35477d53767l01085O70548J18236n97470K70039J194099J16953j493623j072193
35468a548263N15593P12917r1643L11584J414353P85821j228410j788090m45474
$$ y = [-1994159, -327770, 412088, -749752, -2067111, -1408818, 896341, 2453757, 1663180, -586171, -2099077, -1745673, -346452, 657000, 888598, 979674, 1235049, 1284093, 1077451, 1132075, 1421390, 1176438, 398256, 310472, 1401985, 2358505, 2215055, 2203144, 3695710, 5507518, 5455795, 3795887, 2664580, 2608593, 2310415, 1556806, 1565639, 2105142, 1334235, -716374, -1519835, -138274, 959671, -207672, -2153074, -2781732, -2603942, -2716646, -2041124, 483999, 2898011, 2644624, 660047, -155918, 490333, 520730, -453767, -754852, -84304, 33932, -563538, -293499, 900600, 1017553, -476070, -1548263, -1032670, -319753, -411396, -99812, 1314541, 2100362, 871952, -916138, -1361612]
35459a361612K91366l78593k77543J461400K528495J344780l06317l55812L87498
35450C333662P8559j100812j592632q57495L52664J127580Q66574l43115j263265
35441F01720p34865K68541m11784k578622l238314q01833K360955L135762J650971
35432B52531K30285j41236k11106l52841k37623j17878n04771p86310J06573J715013
35422d7363K319198J298550j82327j021711j351681j515315j192839k40612N90227
35413a343873O19462K94333M62530R90099R48945N5218q91228j142050q51794
35404h58358m39098K20251J260273J958337J426748J04966n59723k05988j60217
35395B747191j274525k313201j669112J31996J113117O34146n3049k398K57484
$$ y = [-1361612, -1070246, -1448839, -1726382, -264982, 2263513, 3608293, 3301976, 2946164, 3333662, 3412221, 2311409, 718777, -138718, 213946, 1341526, 2208100, 1864985, 601720, -133145, 135396, -276388, -2855010, -6093324, -6895157, -4534202, -1398440, 252531, 482816, 341580, 130474, -222367, -459990, -577868, -1082639, -1868949, -1762376, -47363, 2271835, 3570385, 3388058, 2366347, 1014666, -500649, -1693488, -1934100, -1343873, -724411, -430078, 32452, 1022551, 1971496, 2026714, 1135486, -6564, -858358, -1297456, -1077205, 183068, 2141405, 3568153, 3673119, 3113396, 2907408, 2747191, 1472666, -840535, -2509647, -2377651, -1264534, -630388, -683437, -685835, -428351]
35386d28351J39300J20305O29333R11990R5548j212347j493862l76520P93452
35377h21152P01001k27912m46870N62673J549153J304829M67403M51826J002102
35368D543053M28252j477644k606583j580696O9423K88574m10789k29863O53030
35359c23243N19035o76828j032794K09767J514834J459432M52423m35287p25862
35350I61477k24035R63693J757260J031680n15868j077139m54618j36177m61565
35341A844708q4809J114865J173425o43582k055535j053607R87274J473953L44955
35332C101647m28879j7530O25227O94088L83940P2077j47437l45347q18415j696821
35322A422550k186986j336723J22407L26942p71472j037781L37413J293295L51633
$$ y = [-428351, -289051, -168746, 460587, 1372577, 1468125, 255778, -1238084, -1614604, -821152, -120151, -348063, -794933, -232260, 1316893, 2621722, 3089125, 3540951, 4543053, 4971305, 3493661, 887078, -693618, -624195, -335621, -746410, -976273, -323243, 195792, -481036, -1513830, -1304063, 210771, 1670203, 2122626, 1687339, 961477, 737442, 1701135, 3458395, 4490075, 3974207, 2897068, 2442450, 2306273, 1844708, 1759899, 2874764, 4048189, 3404607, 1349072, 295465, 1282739, 2756692, 3101647, 2672768, 2655238, 3280465, 3974553, 4358493, 4430570, 4283133, 3937786, 3119371, 1422550, -764436, -2101159, -1978752, -1651810, -2423282, -3461063, -3123650, -1830355, -1478722]
35313a478722q05349l16430N79819l8383r83490J87660K761936L683485K178483
35304E769009L44527o38711j701863l089557l406203k161138p32176J3098Q55584
35295d747430K181496K826203J928731L57560n40482l81852M79109J358352J268432
35286D730119q7134j375346j230069n17931j006242k021505j113385J597981K746684
35277A723172O52676j817844j331634J091736J800251k35276k426968k427360
35269b971247p80298N51064O81968J49439l20666n55232n82218j55296Q76450
35260c106036J839550J653805L47205o62043m49501J63121J70453R8518P18781
35251G73853J129478J49189j127279o10674J221154J678972j0887j592424j427662
$$ y = [-1478722, -2284071, -2600501, -2020682, -2059065, -3042555, -2854895, -92959, 3590526, 5769009, 6113536, 5474825, 3772962, 683405, -2722798, -4883936, -5616112, -5603014, -4747430, -2565934, 260269, 2189000, 2546560, 2006078, 1624226, 2103335, 3461687, 4730119, 4642985, 3267639, 2037570, 1519639, 513397, -1508108, -2621493, -1023512, 1723172, 2375848, 558004, -773630, 318106, 2118357, 1883081, -543887, -2971247, -3751545, -3200481, -2518513, -2369074, -2689740, -3244972, -3827190, -3982486, -3106036, -1266486, 387319, 734524, 72481, -377020, -213899, -43446, 55072, 773853, 1903331, 2052520, 925241, 314567, 1535721, 3214693, 3203806, 1611382, 183720]
35242A83720o63548p11804r89978n95654j43537l23758l60594M73411J284270
35233a847472J067081M90807O59694J231732J196997N31864j61733o66574p55083
35224A747313L0708J181702J176729k59031j382595j143710q70665j631636j839822
35215b991007J99992K871597L114687Q85023r40595p70794J21040K44226k26357
35206B507812o25742r21857j078420p55425j19446J93032J44153K47600M20676
35197A2383O7699o30411p38509q2822L62687r7472r45368j188807l88315J075217
35187b553718K152238J741170r2219j712522j562987j00944P18172j27979j510404
35178c049193j483056N03177K749901K789812J74601k502808k432004k32323Q96586
$$ y = [183720, -479828, -1191632, -2181610, -2777264, -2920801, -3244559, -3605153, -3131742, -1847472, -780391, -289584, 370110, 1601842, 2798839, 3330703, 3168970, 2502396, 1747313, 1778021, 2959723, 4136452, 3877421, 2494826, 1351116, 480451, -1151185, -2991007, -2791015, 80582, 3195269, 4080292, 3139697, 2368903, 2489943, 2734169, 2507812, 1882070, 960213, -118207, -873632, -993078, -800046, -655893, -408293, 12383, 80082, -550329, -1288838, -1371660, -1008973, -1106445, -2051813, -3240620, -3628935, -2553718, -401480, 1339690, 1247471, -465051, -2028038, -2128982, -1410810, -1538789, -3049193, -4532249, -4029072, -1279171, 1510641, 1685242, -817566, -3249570, -3481893, -2585307]
35169b585307j90477j083710J34435J814526J526745j66911j024245n78151J65415
35160a987680J096193K421250K833270J067261j454897k238553j318399n86846
35152a68401l36031M87384J241961K76434j536808j516831L98457J496109R11195
35143A253469O36023J235286O24305j551133k407509o96636O69867n12799j956320
35134b705447r85432Q68703R57414L58179J505734L103310J908098j533381l324835
35125A52343k053395j91121L97785N69858J020251Q21569j70175m96132J67724
35116B18707J71559r68732j198085P14939K708532K240098j30757j893203k023912
35107a60854j370345n47467N73884J642143J793823R50742J8016l07839j39924
$$ y = [-2585307, -2775784, -3859494, -3725059, -1910533, -383788, -550699, -1574944, -2153095, -1987680, -891487, 1529763, 4363033, 5430294, 3975397, 1736844, 418445, -168401, -504432, -17048, 1224913, 1501347, -35461, -1552292, -1153835, 342274, 1253469, 1889492, 3124778, 3749083, 2197950, -209559, -906195, -236328, -749127, -2705447, -3690879, -2822176, -1864762, -1506583, -849, 3102461, 5010559, 3477178, 152343, -1901052, -2092173, -1694388, -1124530, -104279, 717290, 547115, 50983, 218707, 390266, -578466, -1776551, -1061612, 1646920, 3887018, 3756261, 1863058, -160854, -1531199, -2078666, -1504782, 137361, 1931184, 2881926, 2899942, 2592103, 2452179]
35098B452179J33835K69146R3725l69095p23704o12472k26522l9287k04519n70139
35088B03147j010765j304506r97218o942Q29675N47494n73239j141705m33651
35079c887710N86495N28325n19663j007051J47888K160755L162049K150773k9682
35070C292179j571328j443210k90543M02165M2914m49416l5810Q33589P98088
35061A578628l00540r87551k97801P19283N45042o07169j336234j204151r29171
35052b819664p37697r4905Q61468J183400P61522O36173J125208J098806q7749
35043A926562j291452j233854l12983L31647N24753O25934L64085m90406j030308
35034e86022l04937R57670J197247K87706m88424n42806n60524r33630j064494
$$ y = [2452179, 2586014, 2855160, 2948885, 2579790, 1856086, 1243614, 1017092, 977805, 773286, 203147, -807618, -2112124, -3109342, -3116284, -2286609, -1739115, -2312354, -3454059, -3887710, -3301215, -2772890, -3292553, -4299604, -4151716, -1990961, 1171088, 3321861, 3292179, 1720851, 277641, -12902, 389263, 432177, -17239, -53049, 780540, 1578628, 1278088, 290537, -7264, 712019, 1257061, 649892, -686342, -1890493, -2819664, -3557361, -3652266, -2790798, -1607398, -845876, -209703, 915505, 2014311, 1926562, 635110, -598744, -911727, -580080, -55327, 570607, 934692, 444286, -586022, -890959, 66711, 1263958, 1551664, 1063240, 520434, -40090, -973720, -2038214]
35025b038214n50318J20533M12826L38234J4367m28619m46989L02855Q89504k821
35015a388642j823826k295217m54929J850225K443885J498621N67848J39179k84547
35006B52597n02495J47330J149385J169500J56158n06897k33469m5544o07934
34997I78631j017644m63177L27084M92121N95913J245118J328030l00038k146205
34988A039833j647830O83070J481007m35405k104250j021459R86931R38936m12628
34979d91795j25407J731109K133639K53894j109276j34678J227622O90380p85541
34970C389947r30455K35613R46586N29782l18924j105107j533953q48465R61386
34961A326410K073655R14444j266683j910572q10935q7904o10836q07999M19092
$$ y = [-2038214, -2588532, -2467999, -2055173, -1716939, -1702572, -2131191, -2578180, -2275325, -1385821, -1388642, -3212468, -5507685, -5962614, -4112389, -1668504, -169883, 397965, 537144, 252597, -249898, -102568, 1046817, 2216317, 2372475, 1865578, 1632109, 1586565, 978631, -39013, -502190, -175106, 317015, 912928, 2158046, 3486076, 3186038, 1039833, -607997, 75073, 1556080, 1120675, -983575, -2005034, -1018103, -79167, -491795, -617202, 1113907, 3247546, 3501440, 2392164, 2257486, 3485108, 4175488, 3389947, 2459492, 2695105, 3641691, 4171473, 3852549, 2747442, 1213489, 365024, 1326410, 3400065, 4314509, 3047826, 1137254, 326319, 238415, -372421, -1180420, -761328]
34952g61328J741424J478124N1739r45602j076651j076942j151002o61320M68556
34943a933002J207140Q23812J61972O22398J993600K357766P17090j268700j372296
34934C309780L6825O21775l63980j266408j106368j062625j832074j925835l69839
34925c958749J061097O13313l06099M85422J971582J613329l9708j07726J558361
34916B890822J940993l5406j721561j262615m28730j125508k094942j386784K46328
34907b977403Q61598M58303K71694L52803P5111q8036N84837J336647J000173
34898A875727J1738m00132k11372q1622K10434R28749R31183p43674k536187k027827
34888b042983L37814J640206P05053m61301l8529J029932R44050j58006p27200
$$ y = [-761328, 980096, 2458220, 2509959, 1564357, 487706, -589236, -1740238, -2401558, -1933002, -725862, 97950, 259922, 882320, 2875920, 5233686, 5950776, 4682076, 3309780, 3346605, 3968380, 3604400, 2337992, 1231624, 168999, -1663075, -3588910, -3958749, -2897652, -2284339, -2590438, -2105016, -133434, 1479895, 1440187, 1332461, 2890822, 4831815, 4796409, 3074848, 1812233, 1383503, 257995, -1836947, -3223731, -2977403, -2115805, -1657502, -1385808, -1033005, -957894, -1045930, -461093, 875554, 1875727, 1887465, 1487333, 1275961, 1194339, 1404773, 2333522, 3264705, 2521031, -15156, -2042983, -1705169, -64963, 640090, 178789, 140260, 1170192, 2114242, 1956236, 1229036]
34879A229036j67262O15668O55639N532o11284p67691p78694j090477j319355
34870b228888n31476J175125K189778J311053n19904j428414r83774k06474K87468
34861i35506P39644J098699Q91121K84710n747N7627j10726m81918m96947l22759
34851G18198o08876j012920n74443L27089K07698r26267j165317K99602J640082
34842a095154J097739l95381q59573k70974j58567r62002j533886j039758K1708
34833e195848O76674M22422n37196j289375p89931Q71715K236932K162203J151353
34824b91051L56198Q0697J29129O36656J338402R88995q96071k469945j578156
34815a705146J062939K633550J971309N63048k33912p52251j334508j281555m20074
$$ y = [1229036, 1061774, 1677442, 2333081, 2338613, 1727329, 959638, 180944, -909533, -2228888, -2760364, -1585239, 604539, 1915592, 1395688, -32726, -1016500, -1222974, -935506, -195862, 902837, 1793958, 2078668, 2072921, 2130548, 2019822, 1537904, 1040957, 718198, 109322, -903598, -1478041, -1150952, -943254, -1869521, -3034838, -2735236, -1095154, 2585, -392796, -1252369, -1523343, -1681910, -2643912, -4177798, -5217556, -5195848, -4519174, -4096752, -4633948, -5923323, -6713254, -5841539, -3604607, -1442404, -291051, 65147, 145844, 274973, 911629, 2250031, 3239026, 2342955, -126990, -1705146, -642207, 1991343, 3962652, 4525700, 4291788, 3539537, 2205029, 923474, 503400]
34806E03400J48839n9522Q016Q32852J084206m5336j009581l18578P32792Q6110
34796A963198j425193j168398R49643K052130N53284j661704k178248j082765
34788a998053R0194P33266J116750J160398O12488k29263r36411j472480j648732
34779b571843r09215O32520J850491K045771J759783J409741L86114j349883k108296
34770A145183o33642J509136J693691j21819j536859j283052m87060j68829K41703
34761C58452J070401J156149j64127j397581r09149M49387N31182q19593j515100
34752a239979l14763J458100J857683P86545l10001n04609k09086j60679m12080
34743I51131n23337k66847J68745M43863K92463l11296r33447q82342j06045L20579
$$ y = [503400, 652239, 592717, 600733, 1433585, 2517791, 2472455, 1462874, 1144296, 1877088, 1963198, 538005, -630393, 319250, 2371380, 2924664, 1262960, -915288, -1998053, -1907859, -1174593, -57843, 1102555, 1715043, 1485780, 549369, -923111, -2571843, -3481058, -2848538, -998047, 1047724, 2807507, 4217248, 4603362, 3253479, 1145183, 511541, 2020677, 3714368, 3592549, 2055690, 772638, 285578, 116749, 358452, 1428853, 2585002, 2420875, 1023294, 114145, 563532, 1094714, 275121, -1239979, -1554742, -96642, 1761041, 2547586, 2237585, 1732976, 1523890, 1363211, 951131, 427794, 160947, 329692, 773555, 1066018, 754722, -178725, -1061067, -1167112, -846533]
34733h46533o12721k099685j958487N79972L369192L605681J110309j676765k670280
34724a199317j944554o48934N16300J258016J215651L83696n01567o82778k39036
34715a842523K20153M51789P10694J099485J225112O98759j55110m55303M5662
34706A998718K52207r43253k631771k516733j95526J695303R93682p18132n01941
34697b567446J246780J381936q07167k215693p48812J440817J440609q8728n34288
34688a451992M09102Q66801K32652k69931j80580m09189j089085j091033j48669
34679c131924N17100L26933K81931R63255J275668K94177j017392j222390n02988
34670b215630J6466K47648R31444J829600J683455J75681j318002j474563o72354
$$ y = [-846533, -1459254, -3558939, -5517426, -4937454, -1568262, 2037419, 3147728, 1470963, -1199317, -3143871, -3792805, -3276505, -2018489, -802838, -419142, -920709, -1603487, -1842523, -1622370, -1170581, -459887, 639598, 1864710, 2563469, 2408359, 1953056, 1998718, 2250925, 1307672, -1324099, -3840832, -4036358, -2341055, -1347373, -2065505, -2567446, -1320666, 61270, -745897, -2961590, -3710402, -2269585, -828976, -917704, -1451992, -1042890, -176089, 56563, -213368, -393948, -803137, -1892222, -2983255, -3131924, -2614824, -2287891, -2005960, -1042705, 232963, 527140, -490252, -1712642, -2215630, -2199164, -1951516, -1020072, 809528, 2492983, 2668664, 1350662, -123901, -796255]
34661g96255k44500o09183q62153j04924J356222K225766J430982p78675k743829
34652a126549k696519o11710J457810J534951O6196p59174l9785P44750J73634
34643a256396r85263j244482p98468p54547p63870M46833K357159K737108R37284
34634F75358r39241j011669L1410O30959P13815R34810R59888J78963p92228r17356
34624D64709l93863p3521J47101Q70488J605205J181291l85341j765263k009589
34615c58783j292779j37524R81236J387107P08744l10275m79899K75109Q35646
34606A608582M16379n36993j033167o07776K46470M51571n03838j595753j213098
34597b767623N55032J656871Q16078o73024r72040l11358p9189l03658J01845
$$ y = [-796255, -1040755, -1649938, -2512091, -2617015, -1260793, 964973, 2395955, 1617280, -1126549, -3823068, -4434778, -2976968, -1442017, -1375821, -2134995, -2174780, -1430030, -1256396, -2241659, -3486141, -4284609, -5039156, -5803026, -5356193, -2999034, -261926, 675358, -263883, -1275552, -1244142, -613183, 100632, 1035442, 1995330, 2174293, 1382065, 464709, 70846, -2675, 144426, 1014914, 2620119, 3801410, 3416069, 1650806, -358783, -1651562, -1789086, -807850, 579257, 1288001, 977726, 497827, 772936, 1608582, 2024961, 1487968, 454801, -152975, 93495, 545066, 41228, -1554525, -2767623, -2212591, -555720, 260358, -412666, -1384706, -1696064, -1775253, -2078911, -1977066]
34588a977066J114629J489770P67259j64940n18237l38990J06852N34257M27715
34579A441249l01791p88003l44223M32269P18130P60943Q76228K83460j369407
34570A708855k465171j515091J68403K85666p63459o81290P90292J660375J243306
34561D31886R24828J206989R32105j33782p63434p52532j104404j377377o1627
34552f97348J804547J048348k357728m148288j855595J418077J822327K35082
34544b730578r7389J160923J873751J362953O32520j47915j415972k303341j571841
34535c236889J61770J308160J620035J644489R84811o40765j698729p15565R61453
34526C88770Q39014q64249j606998m78821P46720N85627l37971p65069l91246
$$ y = [-1977066, -862437, 627333, 1394592, 1229652, 711415, 372425, 479277, 1013534, 1441249, 1139458, 351455, 7232, 439501, 1157631, 1918574, 2794802, 3078262, 1708855, -756316, -2271407, -2103004, -1817338, -2580797, -3262087, -2471795, -811420, 431886, 1356714, 2563703, 3495808, 3362026, 2598592, 1846060, 741656, -635721, -697348, 1107199, 2155547, -202181, -4350469, -6206064, -4787987, -2965660, -2730578, -2827967, -1667044, 206707, 1569660, 2202180, 2054265, 638293, -1665048, -3236889, -3075119, -1766959, -146924, 1497565, 2482376, 1841611, 142882, -572683, 388770, 1227784, 363535, -1243463, -1722284, -975564, -389937, -727908, -1492977, -1884223]
34517a884223K68360M07236m92920j623551j180878J044340K610893J631366l19803
34508D60820o52151K41214J49959q57964p32203O29470J104843J28563m66925
34499E626J13093M32615j38073j79204Q37682J175276j02578j214133n98749M10704
34489G42259j09162j450632j565751l69922M44324K47338J15662P50617J355462
34480A60195Q90691m81000j512623j114667M72826J672275J130007o29143j678122
34471a089561r32170P41638J770597J472673K56174r37947j147708j68669Q77559
34462H42586N35368j097666k212838j387649P69712K381959K197941N37025j167182
34453A399256j614277p75077K46897O71043Q39089J148679J080361K33391n14949
$$ y = [-1884223, -1615863, -1208627, -1701547, -3325098, -4505976, -3461636, -850743, 780623, 460820, -191331, 49883, 199842, -658122, -1390325, -760855, 343988, 472551, 5626, 118719, 551334, 413261, 234057, 1071739, 2247015, 2144437, 930304, 331555, 742259, 633097, -817535, -2383286, -2753208, -2308884, -2061546, -1945884, -1195267, 160195, 1050886, 569886, -942737, -2057404, -1584578, 87697, 1217704, 588561, -1089561, -2021731, -1280093, 490504, 1963177, 2219351, 1281404, 133696, -34973, 842586, 1377954, 280288, -1932550, -3320199, -2550487, -168528, 2029413, 2566438, 1399256, -215021, -990098, -743201, -72158, 766931, 1915610, 2995971, 3229362, 2714413]
34444B714413k02600N24260M02494l14699l96034J10763L7697o72201q77502m52456
34434H74135n83635j529207j997727j277197k50922K36369L99940M59089K08533
34425c460622K3903N43423J034731J18970j451013j156606J266327K757301J382123
34416A058537n83597j47003J798778J975086l40613k515034k368086n90269P91378
34407i20823P52393k47167j080705r62615j10180O21965Q54524R07171Q99511
34398G14074O09950L72007P95149J248922K34523k039323l191083j872350K11489
34389b916642Q46385L07065J67869N27269L75086k71266n60645m46350l51621
34380b322850J21243J349379K218534J455915k8915j80891J045995J645799P12882
$$ y = [2714413, 2511813, 3036073, 3438567, 3123868, 2727834, 2838597, 2876294, 2204093, 1326591, 874135, 290500, -1238707, -3236434, -4513631, -4764553, -4528184, -4128244, -3669155, -3460622, -3436719, -2893296, -1858565, -1739595, -3190608, -4347214, -3080887, -323586, 1058537, 474940, 327937, 2126715, 4101801, 3761188, 1246154, -1121932, -1712201, -920823, -168430, -415597, -1496302, -2458917, -2569097, -1947132, -1092608, -185437, 714074, 1324024, 1696031, 2491180, 3740102, 3974625, 1935302, -1255781, -3128131, -2916642, -2070257, -1763192, -1595323, -1068054, -692968, -964234, -1524879, -1971229, -2322850, -2201607, -852228, 1366306, 2822221, 2793306, 2612415, 3658410, 5304209, 6017091]
34371F017091m38140o90950p15212j366906k100227j962100j046334p0664O23570
34362a749872R00418M87101l67286n59297N81935K005111J888220n2741j966489
34353A167100j954106k76534J098402R47164O184m33780k36067l5685O9583L43797
34343F96058M20195j96895q63758m61002P06700J193385O83267K90965L50934
34334B819849j17807j117760r99974P17693J857065N60558j862636k895307k241833
34325c280152j350026p04017K07182J024926Q87829K86595M80839J245372J148023
34316e3429L8122o43104k28377K58952l6183n50346m85601m5513J29325o9179
34306a685333k95484k62244O0947L99972L97835J94139L93642J050220J317475
$$ y = [6017091, 5578951, 4888001, 4172789, 2805883, 705656, -1256444, -2302778, -2373442, -1749872, -849454, -362353, -729639, -1288936, -707001, 1298110, 3186330, 3133589, 1167100, -787006, -1063540, 34862, 982026, 988210, 554430, 318363, 282678, 352261, 696058, 1116253, 919358, 55600, -405402, 301298, 1494683, 2177950, 2468915, 2819849, 2702042, 1584282, 584308, 1302001, 3159066, 3719624, 1856988, -1038319, -3280152, -4630178, -5334195, -5127013, -4102087, -3214258, -2927663, -2446824, -1201452, -53429, -15307, -658411, -886788, -627836, -664019, -1214365, -1699966, -1745479, -1616154, -1685333, -1980817, -2243061, -2182114, -1782142, -1384307, -1190168, -796526, 253694, 1571169]
34297A571169P03158q9039l10325k71042l67023k1441J122163J870196R11520
34288E119336j034764k065405j637926p98981l35580k19442m69965r98513r50779
34279c392019K27993J441284J264577K00654j41465L11100K87368k85249k17389
34270c03146M20661J37076j147373j486792m6104J317719Q92427k88240k19233
34261g23005J058537J847462J347064L03839m70172r64260j421239j765184j660300
34252b447258q16338O11190J796845J835223P74799l39455o58524l69625j52355
34243B34502k02729j48643J88861K91901m54701j597236j687405k14912J190722
34234b399640Q38842k28124L97820K327800K364026m03787k532051j266002J181819
$$ y = [1571169, 2274327, 2185288, 1874963, 1603921, 1236898, 1215457, 2337620, 4207816, 5119336, 4084572, 2019167, 381241, -417740, -753320, -972762, -1442727, -2441240, -3392019, -3164026, -1722742, -458165, -257511, -398976, -87876, 199492, -85757, -303146, 117515, 254591, -892782, -2379574, -2425678, -1107959, -215532, -503772, -723005, 335532, 2182994, 3530058, 3833897, 3363725, 2399465, 978226, -786958, -2447258, -3263596, -2652406, -855561, 979662, 1754461, 1415006, 756482, 386857, 234502, 31773, -116870, 71991, 363892, -90809, -1688045, -3375450, -3590362, -2399640, -1560798, -1788922, -1391102, 936698, 3300724, 2896937, 364886, -901116, 280703]
34225B80703J287195k66421l95302Q09525N91547j190261j721239k63032O86933
34216a80352p1852p30458l23679l91920j301625p46048J941919L511471J595768
34207C303224j165861j022460J132742J424026r63650k931692k264846k24762
34199b713279R72016R34524O59872Q38553J326898J568482J152415K26329o71388
34190D294422j219444j357674q81482J39751O62379l16527j908371j988048r6209
34181b671203J806998J978183P60004o45336j529298j233910O26626K604322K206856
34172C903242n01799k232068r84810R42656N74215j143603j145235P23848J659329
34163A795775M48284r61997q18421N3267J22650m85628o87769l14071j17637m23598
$$ y = [280703, 1567898, 1301477, 906175, 1715700, 2307247, 1116986, -604253, -867285, -180352, -252204, -982662, -1306341, -1698261, -2999886, -3745934, -1804015, 1707456, 3303224, 2137363, 1114903, 2247645, 3671671, 2708021, -223671, -2488517, -2713279, -1741263, -806739, -146867, 691686, 2018584, 3587066, 4739481, 4965810, 4294422, 3074978, 1717304, 835822, 975573, 1637952, 1321425, -586946, -2574994, -2671203, -864205, 1113978, 1873982, 1228646, -300652, -1534562, -907936, 1696386, 3903242, 3401443, 1169375, 184565, 1127221, 1701436, 557833, -587402, 136446, 1795775, 2244059, 1282062, 463641, 516908, 639558, 153930, -533839, -847910, -965547, -1389145]
34153a389145o58449k09621O88026J149734P39019J00644R5402M98317L03947
34144A317874o27320j153798m57437P69847J312944R72381M93223L44449J36541
34135C108704p65877k198816k878168j619291Q65468K220044J217312o25842j227185
34126a903651o46306j20545M20629J660501K538459J334994j048200j717393o8897
34117D49591J255283M36895j018691r53235M09790J351238R84436k79220j357507
34108A278580j164538J27818O99860m67816j515465m03317J293837O13405j456413
34099i94049j080914J890537L184066Q86485j725697j816959q59009o51438P912
34090a159066J810670K272517m6329k264774j605893J46571R9831r30267o92245
$$ y = [-1389145, -2047594, -2257215, -1569189, -419455, 319564, 420208, 515610, 1013927, 1317874, 690554, -463244, -920681, -150834, 1162110, 2134491, 2627714, 2972163, 3108704, 2342827, 144011, -2734157, -4353448, -3487980, -1267936, -50624, -676466, -1903651, -2549957, -2670502, -2249873, -589372, 1949087, 3284081, 2235881, 518488, 449591, 1704874, 2141769, 1123078, 169843, 579633, 1930871, 2915307, 2636087, 1278580, 114042, 241860, 941720, 473904, -1041561, -1444878, -151041, 462364, -994049, -2074963, -184426, 2999640, 3886125, 2160428, 343469, -515540, -1166978, -1159066, 651604, 2924121, 2877792, 613018, -992875, -846304, -746473, -1676740, -2368985]
34081b368985K27540J07542m23013j12357J30935m86862k37094J817715K930618
34072A586039Q63156j800805j558758M52626J007794K97743M15944P74919k69359
34063A769299j378343n41122O29762l35578j806201q41046J140570Q00570r00136
34054a462225n51653J250119J156555n06132n57289P58798M02001j236450r13715
34045a659991J029353J036405r15140j129122J026377K236237J452071R02672
34037C978862O00286j741354m707702l832011N72436K882047J025929p36179K24379
34028a733307R41065n77133j402813L62709J656522J33498j514934o29720Q19193
34019a944920L76016n31626M0028P73370R2758o41509l1398O21465J57968j74564
$$ y = [-2368985, -2141445, -2033903, -2456916, -2569273, -2438338, -2925200, -3162294, -1344579, 1586039, 2449195, 648390, -910368, -457742, 550052, 847795, 1263739, 2038658, 1769299, 390956, -150166, 479596, 144018, -1662183, -2503229, -1362659, -562089, -1462225, -2013878, -763759, 392796, -113336, -670625, 88173, 490174, -746276, -1659991, -630638, 405767, -509373, -1638495, -612118, 1624119, 3076190, 3978862, 4579148, 2837794, -1869908, -5701919, -5129483, -2247436, -1221507, -1957686, -1733307, -792242, -1369375, -2772188, -2409479, -752957, -619459, -2134393, -2764113, -1944920, -1568904, -2100530, -2060502, -1287132, -1194374, -1835883, -1867281, -1245816, -1087848, -1262412]
34009a262412M00941M82135l46410k80301R72729J115566m16811j196016l91670
34000i22249j43299q94168l15242J546370J483265o69601r00785J668377K546314
33991C398982k27028k283619n29969J622323O47155j262691j016212J03621K05635
33982F58197O63713K161744K008135o75462k302060j060895k34842j629732j831397
33973b242599R55546K775679J053363o63613L24245R16220r77137j756810O15657
33964A000551J990822o3717j391946L53033Q35366j725215j764128K708208M555015
33955F497989L27218k296949J536423M206445l3775l458561O33048M657713J394570
33946A3464121j496001L286701P391897M097573M495034J5413550K0577145J2489919
$$ y = [-1262412, -861471, -379336, -725746, -1006047, -33318, 1082248, 665437, -530579, -922249, -1065548, -1959716, -2274958, -728588, 754677, 85076, -815709, 852668, 3398982, 3171954, 888335, 358366, 1980689, 2627844, 1365153, 348941, 452562, 658197, 1321910, 3483654, 5491789, 4816327, 2514267, 1453372, 1218530, -411202, -2242599, -1287053, 1488626, 2541989, 1878376, 2202621, 3118841, 2141704, 384894, 1000551, 2991373, 2927656, 1535710, 1888743, 2724109, 998894, -765234, 1942974, 6497989, 6825207, 4528258, 6064681, 10271126, 10237351, 6778790, 7411838, 12069551, 13464121, 11968120, 15254821, 22646718, 26744291, 31239325, 46652875, 67230020, 79719939]
33938G9719939K2005908P2993585J20268077Q8648215j9097310j07712990j05145690
33931A51679734m6122885r444989j4079961k1424932j1273579k536342p156192
33924C9640854j0718224m034938J318285k412566n907802k555945K80776k371244
33916A3239196l910498n90534R76159k460533l965972J20600K891584m25256m006255
33907A868491k151182J525350J701410m03443j641849k240461k238896K40833
33899c339747L752003L578897k10323j938443J91634J463538k09941p23547J712614
33890D276685K695018j13260k493417j343999K66464l90454r63107K71935N68276
33881B774141j350075j847613R29108K978448J343375p47068l7763J073007l41170
$$ y = [79719939, 101725847, 174719432, 294987509, 383635724, 364538414, 256825424, 151679734, 105556849, 96111860, 82031899, 60606967, 49333388, 46797046, 39640854, 28922630, 24887692, 26205977, 23793411, 17885609, 15329664, 15610440, 13239196, 9328698, 8738164, 9714323, 7253790, 3287818, 3408418, 6300002, 5874746, 1868491, -282691, 1242659, 2944069, 2540626, 898777, -1341684, -3580580, -3339747, 412256, 3991153, 3780830, 1842387, 2034021, 3497559, 3287618, 2564071, 4276685, 6971703, 6858443, 4365026, 3021027, 3287491, 2897037, 1933930, 2205865, 2774141, 1424066, -423547, 505561, 3484009, 4827384, 4080316, 4042553, 5115560, 4774390]
33872D774390k160009j550806j46929k64026m51886O52588N80293k073957l425742
33863d066084k23277L899457L626274J86466j242513J95835J029363L7682n88056
33854B855147K1015J82717q24674j576223r93523L95029J486348J335465k40927
33845B640374j683462r92527J006107J181378r15276j803532L27949K355538J257558
33836C374107j010418j067205M34897O95684k90006o09371l82950r32618j414367
33827a202247r7412J948411K030070J34986j152784o94569J06940P3382l75187
33818G71590n75506m06683J25158O67041M58535l40626l49932P78876J299517
33809B427970N7239j419992j292156k19274J70234L7904M13975R21313O14710
$$ y = [4774390, 2614381, 1063575, 916646, 652620, 200734, 853322, 1433615, -640342, -4066084, -4289361, -389904, 3236370, 3422836, 2180323, 2376158, 3405521, 3443203, 2855147, 2876162, 3058879, 2234205, 657982, -335541, 59488, 1545836, 2881301, 2640374, 956912, -35615, 970492, 2151870, 1236594, -566938, -238989, 2116549, 3374107, 2363689, 1296484, 1731381, 2427065, 2137059, 1527688, 1144738, 212120, -1202247, -1299659, 648752, 2678822, 2813808, 1661024, 966455, 1073395, 1146777, 771590, 196084, -210599, -85441, 581600, 1040135, 699509, 349577, 1128453, 2427970, 2485209, 1065217, -226939, -446213, -275979, -238075, 175900, 1097213, 1711923]
33800A711923p1158k08185n5110p7798K98169J124169P73126j484630l329418
33791a318912k261885O34774K215250J488565J5094q96534j093845n36482M83204
33782a270771P87323j65126j053879o48698J78968J24242k46707J97636R33571
33773a163441R44724P43771J083795J032477l72805j849473j620349k54277N39611
33764i15967O89288R64809P68541o52922j976645j492160k4350M38663J2551J73302
33754b014890Q04456P55155L85371P45438J116302J97306j137607j132362k72522
33745e53353j74029l71092N77528J750862J155756m10636n12670M65909k1802
33736A906473j810650j981812L8666J474514R63659L19125N59115J48470j383132
$$ y = [1711923, 1640765, 1432580, 1377470, 1299672, 1597841, 2722010, 3495136, 2010506, -1318912, -3580797, -2946023, -730773, 757792, 772886, -123648, -1217493, -1753975, -1270771, -483448, -648574, -1702453, -2351151, -2172183, -2047941, -2294648, -2097012, -1163441, -218717, 525054, 1608849, 2641326, 2268521, 419048, -1201301, -1455578, -915967, -226679, 738130, 1506671, 853749, -1122896, -2615056, -2639406, -2200743, -2188192, -2014890, -1210434, -455279, -69908, 675530, 1791832, 1989138, 851531, -280831, -553353, -727382, -1098474, -520946, 1229916, 2385672, 1975036, 1462366, 1928275, 1906473, 95823, -1885989, -1847323, -372809, 590850, 909975, 1469090, 1617560, 234428]
33727B34428j836831k20947J097039J96247j330388j271948k36420L1951l40176
33718c677045k31082K38220L12329J65401K72893L55493J49826P7996K72900K28528
33708a834541M2722M56459J145221Q32287l24990n68916N31735J290140R28576
33699B498693Q65015J691201J492934r18988l373674l208076j086246K81547m2666
33690a800260p85319q61770k89028O16714J368636J224269J97719n45716k89615
33681a164370J86589J05867N2409O87891J273178P68163n25073j553842j850279
33672b019467j349856J6856J575598J945568Q71975j65360j58019m768o20347
33663I2180j137627m81063N93350O76944r5029n57496l37460K00748R07558J460331
$$ y = [234428, -1602403, -1823350, -726311, -530064, -1860452, -3132400, -3368820, -3336869, -3677045, -3908127, -3669907, -3357578, -3192177, -2919284, -2563791, -2413965, -2335969, -2063069, -1834541, -1791819, -1335360, -190139, 642148, 317158, -251758, 279977, 1570117, 2498693, 3363708, 5054909, 6547843, 5628855, 2255181, -952895, -2039141, -1757594, -1800260, -2585579, -3447349, -3736377, -3119663, -1751027, -526758, -329039, -874755, -1164370, -977781, -871914, -819505, -131614, 1141564, 1909727, 1384654, -169188, -2019467, -3369323, -3352467, -1776869, 168699, 1040674, 875314, 717295, 712527, 92180, -1045447, -1526510, -933160, -256216, -351245, -908741, -1246201, -1045453, -137895, 1322436]
33653A322436J021818m36134j510174j295117p36142p87971o96245K73597R09521
33644a934411r6829j597598j516226k4978J004808R68359P13341M14247l77903
33635b447190r63801j74379J281648J440374J47464o75887p0274P62100P27507
33626B7562L32862K56630J55434l17418o91793o11120m64230n27449m60214n7810
33616b357546L87652O74328P47063K33847r57133j728949q96886Q16447J463021
33607a618156O83055R0440M68948N28944o23335j595540p77858R67571J417470
33598d58461J81056q57973k76934J028579J199033j08039j276279p68469Q63334
33589d74153J577660N02742q18129m91959J111090J918336R66578o40316j528795
$$ y = [1322436, 2344254, 1908120, 397946, -897171, -1633313, -2421284, -3117529, -2843932, -1934411, -2031240, -3628838, -5145064, -5170042, -4165234, -3196875, -2483534, -2069287, -2447190, -3410991, -3585370, -2303722, -863348, -715884, -1391771, -1462045, -699945, 27562, 360424, 617054, 772488, 455070, -236723, -847843, -1312073, -1839522, -2299736, -2357546, -1969894, -1295566, -548503, -314656, -1271789, -3000738, -3897624, -3081177, -1618156, -935101, -844661, -375713, 153231, -470104, -2065644, -2843502, -1875931, -458461, -277405, -1135378, -1412312, -383733, 815300, 707261, -569018, -1337487, -474153, 1103507, 1606249, 788120, 296161, 1407251, 3325587, 4292165, 3651849, 2123054]
33580B123054j448409o66467O05071J614580J207521n47018j845796j261174L33086
33571A14448R32260J1263j035377q68974K60516J052006O66722m67589j160793
33562d95518p41161J86461M94284j4062l92905J07318J079429J601597J274636
33553C100079K70157j060655k096068j988060n59710J050975J378667L09886p91535
33544c86264p71338J3077L99284O3723j24141N33968J411560J333993L16688k66596
33534B523954M56190J543172J437601n821j523874k191339k180758j808698r54803
33525b704376J37218M46199o15728k071877k277881q19179J083694K011466J667220
33516c143244P42736J6738j09847M59478J477147K129439J396700p54326k689194
$$ y = [2123054, 674645, 8178, 613249, 2227829, 3435350, 2888332, 1042536, -218638, 114448, 1046708, 1057971, 22594, -846380, -585864, 466142, 1132864, 665275, -495518, -1236679, -1050218, -555934, -569996, -962901, -855583, 223846, 1825443, 3100079, 3370236, 2309581, 213513, -1774547, -2334257, -1283282, 95385, 405271, -386264, -1157602, -1144525, -745241, -681518, -805659, -271691, 1139869, 2473862, 2790550, 2523954, 2980144, 4523316, 5960917, 5955096, 4431222, 2239883, 59125, -1749573, -2704376, -2567158, -2120959, -2736687, -4808564, -7086445, -7905624, -6821930, -4810464, -3143244, -2400508, -2383770, -2493617, -2034139, -556992, 1572447, 2969147, 2214821, -474373]
33507d74373k451683j35526J833332J453963m22608j364904n75908N03178P10011
33498i24518O17274Q61911O36313p65352k007793j232343Q32142J340609o28568
33489a270325k424147j435649J127751J944264L11037j084111l00502J182987
33481a948695J062494l03819q43119j67921J41944n73392j033546l53859M50616
33472c569297K25459n08287o17429r0279M72943J085205J739341J449906l88666
33463b01104k204623j701746Q44536K527492J536611o02239j341872m01191M42613
33454a101523R8380o27029n11549L83020R12217L62760o74923j073143o06981
33445b838771j86327m85032r00361m67147O11936J223977R67903N22461L28044
$$ y = [-474373, -2926056, -3061582, -1228250, 225713, -196895, -1561799, -2137707, -1634529, -924518, -307244, 554667, 1190980, 425628, -1582165, -2814508, -1982366, -641757, -1270325, -3694472, -5130121, -4002370, -2058106, -1747069, -2831180, -3131682, -1948695, -886201, -1190020, -2033139, -2201060, -2059116, -2632508, -3666054, -4019913, -3569297, -3343838, -3852125, -4469554, -4559833, -4086890, -3001685, -1262344, 187562, -201104, -2405727, -4107473, -3262937, -735445, 801166, 198927, -1142945, -1544136, -1101523, -1003143, -1630172, -2141721, -1758701, -846484, -483724, -1158647, -2231790, -2838771, -3025098, -3510130, -4410491, -4877638, -4265702, -3041725, -2073822, -1551361, -1223317]
33436a223317K274n40873m78781O29250J754365J593753L75712n40709n98100
33427I73574m74640n72896k68117P91481J575059Q42819r54905j991656j357145
33418a436426j06426L86342K72333N83287J278295J151966j97416j426905j089533
33409e84483M83080J644509J379252J40628r98501j411161j198960q59105o91341
33400b096082m07489M27203J497557J855380J227142N19095M92461O55717K53416
33391D424400l28984k44152J69471k97382j797866k992913k768037j458134j09501
33382e403098O78422R09832Q77817R65723J291217J497842J336133J196939J385558
33373D736385J247127M7477j545709k139277j671146j317016j257523l17652J584172
$$ y = [-1223317, -1221043, -1761916, -2240697, -1611447, 142918, 1736671, 2112383, 1571674, 973574, 498934, -73962, -342079, 449402, 2024461, 2867280, 1912375, -79281, -1436426, -1542852, -1156510, -884177, -300890, 977405, 2129371, 1931955, 505050, -584483, -101403, 1543106, 2922358, 3062986, 2064485, 653324, -545636, -1404741, -2096082, -2503571, -2076368, -578811, 1276569, 2503711, 3022806, 3515267, 4170984, 4424400, 4095416, 3851264, 4020735, 3723353, 1925487, -1067426, -3835463, -5293597, -5403098, -4724676, -3814844, -2937027, -1971304, -680087, 817755, 2153888, 3350827, 4736385, 5983512, 6030989, 4485280, 2346003, 674857, -642159, -1899682, -2217334, -633162]
33364f33162K473754J042615j110624j531542k49896N94507n1291r89177p86999
33355a241815M08005J378612J260841J80657r54784j187482m25556M71606Q40059
33346G30143J010301J413810J472013L48966j474341k462473j914250o88666Q3169
33337a481328K05691J58506L38894P71180J020684L97580j065706j946752q06374
33328b407625J573563K552522Q83648j497600j941597m55594P34878M68396j43367
33319b32776J20606Q13155R01359M05828m1761m30807j014610j265506m67906
33310a212418Q10092J102802P3190r66418r09046k15724O5450k78716p92290j110029
33300c433107q83840K33192J734830K189956R98671m73107o18838J73636L08095
$$ y = [-633162, 1840592, 2883207, 1772583, 241041, -8855, 585652, 534361, -454816, -1241815, -833810, 544802, 1805643, 1986300, 1031516, -155966, -581522, -109916, 730143, 1740444, 3154254, 4626267, 4975233, 3500892, 1038419, -875831, -1564497, -1481328, -1275637, -1117131, -778237, -7057, 1013627, 1411207, 345501, -1601251, -2407625, -834062, 1718460, 2602108, 1104508, -837089, -1292683, -557805, -89409, -232776, -112170, 700985, 1602344, 2008172, 1966411, 1535604, 520994, -744512, -1212418, -402326, 700476, 773666, -192752, -1101798, -1317522, -1252072, -1530788, -2323078, -3433107, -4316947, -4083755, -2348925, -158969, 839702, 366595, -252243, -78607, 229488]
33291B29488m91536r82959n81308j20239k09213k88241K02047Q91280J190218
33282a60463R18130o5967j692251k830834k007126M21541K161547J867708Q21931
33273e65784P31062J173541O59963p56349j595927j211758m09378L8297J99272
33264a737061K96874K89267K16264J49305j64834q68128j353390q66640L60132
33255c678211J327546J486954J047600L45263k62089j68625P73709J480035P12951
33246C065133j014475j803824r12170K54167K48639m02190k62195O32196P15105
33237E20386p37697k223524j688516P76230K742285K221187J345j468069j111869
33228i68242q1465L68962M44855O58541N07577m41439j118919k10413J570229
$$ y = [229488, -262048, -1245007, -1826315, -1946554, -2155767, -2444008, -2241961, -1350681, -160463, 757667, 691700, -1000551, -3831385, -5838511, -5416970, -3255423, -1387715, -565784, 165278, 1338819, 1998782, 1242433, -353494, -1565252, -1974630, -1936333, -1737061, -1440187, -1150920, -934656, -785351, -950185, -1818313, -3171703, -4038343, -3678211, -2350665, -863711, 183889, 529152, 267063, 98438, 872147, 2352182, 3065133, 2050658, 246834, -665336, -411169, -162530, -564720, -826915, -194719, 520386, -217311, -2440835, -4129351, -3353121, -610836, 1610351, 1611696, 143627, -968242, -1049707, -680745, -235890, 422651, 930228, 488789, -630130, -840543, 729686]
33219G29686K088505O87446r78828j272523m24081M03792P40997P82637N43342
33210C300973j64499j202030j982107j789693l62110J440647J905850K77177j890396
33201d66188k256831n92455J000034R05650k14191q08305l42870P26905J689850
33192c58401J664950K01953j479048j232164J032031K556451J296209j146460
33184B535521j943301j093612o57659q30474J62970K189729K470197o2326k405474
33175C65571j491334J419162K659895J188772p37180j217015n87281K32348R68602
33166B801540J185089K37288j282005j707735o60269K53981j23569q77139p86826
33157i59645k20749p78K33632R69163J301462K89162j052192j059763r1615J87729
$$ y = [729686, 2818191, 3505637, 2526809, 1254286, 830205, 1233997, 1974994, 2757631, 3300973, 3136474, 1934444, -47663, -1837356, -2199466, -758819, 1147031, 1424208, -466188, -2723019, -3315474, -2315440, -1409790, -1623981, -2432286, -2775156, -2048251, -358401, 1306549, 1508502, 29454, -1202710, -170679, 2385772, 3681981, 2535521, 592220, -501392, -1159051, -1989525, -1826555, 363174, 2833371, 2771045, 365571, -1125763, 293399, 2953294, 4142066, 3404886, 2187871, 1600590, 1832938, 2801540, 3986629, 4223917, 2941912, 1234177, 573908, 827889, 704320, -172819, -959645, -1180394, -1181172, -947540, 21623, 1323085, 1612247, 560055, -499708, -591323, -403594]
33147d03594k66196q234R35901Q28095n76840j170144Q2845J214476L36016j342425
33137c70100j514418k72120N26527L16549Q2857K15493K14379K12963Q14182J505057
33127A731369J130964N1518l5357J195533J898405O76908j418724k392539j745162
33118A092915n41989J81480K26923r8566m15122n06179m27552k76116O0347N61967
33108a41892P18914J59204n38834m73743K10679N10933J80361J37328R42084J799596
33098C504630J606071L21422j178767k082924k076625j305208l31348K15650K49459
33089a077640K12868L45700L73997Q0989k23747o0103N76164J037939N40422q69629
33079I36960j870672j118320P55570J416639j21720j837143j398534M71461J178424
$$ y = [-403594, -669790, -678024, 257877, 1085972, 509132, -661012, -578167, 636309, 972325, -370100, -1884518, -2156638, -1630111, -1313562, -1230705, -1015212, -800833, -587870, 226312, 1731369, 2862333, 2913851, 2878494, 4074027, 5972432, 6649340, 5230616, 2838077, 1092915, 550926, 732406, 959329, 860763, 445641, -60538, -488090, -764206, -703859, -141892, 577022, 736226, 197392, -276351, -65672, 445261, 625622, 762950, 1705034, 3504630, 5110701, 5432123, 4253356, 2170432, 93807, -1211401, -1542749, -1327099, -1077640, -864772, -519072, -145075, -64086, -287833, -347936, 228228, 1266167, 1806589, 936960, -933712, -2052032, -1296462, 120177, -1543, -1838686, -3237220, -2765759, -1587335]
33070a587335J66976n88964N3443Q86463P01501K6544l30176n86261q40753l68183
33060b466745Q09885J256067K49687r06160r50855m76090k74858L98938K026730
33051c33401K826819R79002k113114l299919j934462k07359M86202Q93357J417354
33042a285521R82435o69689j803680j154650J64445O27311O58596J376382K167446
33033A063075J547470p9019o00281O50858J728512Q43138j050083j631989m27264
33024B044417P53795M47347p15323j302604j042264o64557m91353j95457L44785
33015h21214Q97645J411394J777076J278101n16007k295950j932014N99609K566125
33006B964765J741212o94083j727536l86274J271085R71080j016869k365582j560353
$$ y = [-1587335, -1420359, -2009323, -1955880, -1069417, -367916, -341372, -671548, -1257809, -2098562, -2466745, -1656860, -400793, -151106, -1057266, -2008121, -2484211, -2759069, -2360131, -333401, 2493418, 3472420, 1359306, -1940613, -3875075, -4082434, -3596232, -2702875, -1285521, -303086, -972775, -2776455, -3931105, -3766660, -3139349, -2480753, -1104371, 1063075, 2610545, 2531526, 1931245, 2582103, 4310615, 5153753, 4103670, 2471681, 2044417, 2798212, 3245559, 2530236, 1227632, 185368, -479189, -970542, -1165999, -821214, 76431, 1487825, 3264901, 4543002, 4026995, 1731045, -200969, 398640, 2964765, 4705977, 4011894, 2284358, 1898084, 3169169, 4140249, 3123380, 757798, -802555]
32997h02555K01132M43385j213395k204046o16428J513741Q21985j925020k265396
32988f046597J205066M071846K418934j220514j785666O74405J726013q6392j466473
32979e09378l78205Q40709N8331r65556k0411J566201J382323O9586j74359L82513
32969B251754k09106j664071j630827L21533J837361J347762J0918o52117q69299
32960G43908j300997j400566m68271P73992R47222j94693j571094j942808q22323
32951e235630J167188K450909J769930k44783j515136r75953K78033Q20462P77084
32942g07896R80344J271345R56378K92056Q1546J48316l39858j168585j189616
32933C24030k41183N14269M91769M69893R33682J074755L03514n22329m78923
$$ y = [-802555, -601423, -158038, -1371433, -3575479, -4191907, -2678166, -1856181, -3781201, -6046597, -4841531, -769685, 1649249, 428735, -1356931, -682526, 1043487, 957095, -509378, -887583, -46874, 11457, -954099, -974510, 591691, 1974014, 2043600, 1869241, 2251754, 2042648, 378577, -1252250, -930717, 906644, 2254406, 2265324, 1613207, 743908, -557089, -1957655, -2425926, -1651934, -704712, -899405, -2470499, -4413307, -5235630, -4068442, -1617533, 152397, -92386, -1607522, -2583475, -2305442, -1484980, -707896, 272448, 1543793, 2500171, 2792227, 2873773, 3022089, 2682231, 1513646, 324030, 82847, 597116, 1088885, 1558778, 2492460, 3567215, 3870729, 3348400, 2869477]
32924B869477j39507n36692j397302j697780j323687q58119k50100R03943K081774
32915c47993K231845J315778K33442n97484j333038j609340p97206O70797J588238
32906A355039J592434J201694M36714r92277k230591j899824l64708N33830L12109
32897e5580L43010J067305J059138k10963j062992m08059L77956J6388m02520
32888G23683L17069R87582J92953q40562k58032R43103M63198j193958j368876
32879c3840L22954J371961M64223o98032m25459N42655P01764J1106n85731n74942
32869A096659p6863L98904J55085p82517j168176j79092R38199N27824p20439
32860A89584q41884n7208m90473k256007k735903o78162J647734J806278M83033
$$ y = [2869477, 2729970, 2193278, 795976, -901804, -2225491, -3083610, -3333710, -2429767, -347993, 1883852, 3199630, 3433072, 2835588, 1502550, -106790, -903996, -233199, 1355039, 2947473, 4149167, 4585881, 3593604, 1363013, -536811, -901519, -367689, -55580, 287430, 1354735, 2413873, 2202910, 1139918, 731859, 1109815, 1126203, 723683, 1040752, 2028334, 2221287, 1380725, 1122693, 2065796, 2528994, 1335036, -33840, 289114, 1661075, 2125298, 1427266, 1001807, 1544462, 2246226, 2257332, 1671601, 1096659, 1019796, 1418700, 1573785, 791268, -376908, -556000, 382199, 910023, 189584, -652300, -709508, -1199981, -3455988, -6191891, -6870053, -5222319, -3416041, -2933008]
32851b933008k16422O7750K48962p1285m15045m77110j32409P59171J650686J435246
32841h3464J10974q12671l96303M51069N96444K62284N5567k28838p76092r79251
32831a800281n49831j87152j77974L05811J450675J830959N33222j085060j220902
32822i00533r6574P65536O90159l326r16584j400596o15084J020624J672065N88322
32812H04009o62430p12914m18168p75110p76724M94530J464006M38289j101349
32803a245861o12417J165676J284952n23896j460688k55590J121668J015711M06313
32794H95868N92290J008194O49219j98368q16476j151123j168407n10762M86846
32785b12719P85351K27782k06481j56162l77496j037850j161643m09021K26617
$$ y = [-2933008, -3149430, -3081680, -2832718, -2904003, -3319048, -3796158, -3928567, -3169396, -1518710, -83464, 27510, -785161, -1181464, -730395, -133951, 128333, 183900, -44938, -821030, -1800281, -2350112, -2537264, -2715238, -2409427, -958752, 872207, 1405429, 320369, -900533, -997107, -231571, 458588, 455262, -461322, -1861918, -2477002, -1456378, 215687, 804009, 141579, -571335, -989503, -1764613, -2541337, -2046807, -582801, -144512, -1245861, -1858278, -692602, 592350, 68454, -1392234, -1647824, -526156, 489555, 895868, 1488158, 2496352, 3145571, 2947203, 2130727, 979604, -188803, -699565, -212719, 572632, 800414, 593933, 437771, 60275, -977575, -2139218, -2548239, -2321622]
32776b321622K40395N02917J412498J725383L93689j662854k743976k347451j083967
32767e884988L42939J230559J031769K93913L96457J517047K018580Q35417p28526
32758A053167q13338M01750J269932J042059K58679o16706j491515j877231j223374
32749a996577k6770N18444R1789m38552l82658p5246j07925l84710l48606J81670
32739b969141P69038R15879O45811L61255J93765j06601m46470j24813J099786
32730C38509K151140J756275J79293j157335j600149j635986j426971m76102R20994
32721i50332J441808O89630N251L81501Q45362J43119j046311j087339J18876
32712E41565J164181J269147Q65926K23186q88611j932030j585737K64848J741932
$$ y = [-2321622, -2081227, -1578310, -165812, 1559571, 1953260, 290406, -2453570, -4801021, -5884988, -5542049, -4311490, -3279721, -2985808, -2589351, -1072304, 946276, 1781693, 1053167, 239829, 641579, 1911511, 2953570, 3212249, 2595543, 1104028, -773203, -1996577, -2023347, -1504903, -1413114, -1851666, -2234324, -2309570, -2417495, -2802205, -3150811, -2969141, -2200103, -1284224, -638413, -277158, -83393, -189994, -636464, -761277, 338509, 2489649, 4245924, 4425217, 3267882, 1667733, 31747, -1395224, -1871326, -950332, 491476, 1181106, 1186357, 1567858, 2413220, 2556339, 1510028, 422689, 541565, 1705746, 2974893, 3840819, 4064005, 3175394, 1243364, -342373, -77525, 1664407]
32703A664407J226183m03438r65196J5309Q34301K38972q32951q68859q1035J38120
32693I65813m63364o82355P3922Q15788N83704j34570l38809O6148N50090Q01794
32683B238161N60832m40768j551555j341597K70727J291233M67229n05804M28409
32674A416867K044970J381388j583649l585262k581834o3065J608404J771132
32666D08951P70883r18890k003598j061057J033150J552582j11781j266652j15481
32657a711893J326132N89245j139879r54305J150149K419455J467832k94240j203393
32648A649103j142018o70907j55203m8775o90009j518733j442226j10353J757626
32639b371495L051041K799266P71396j705462k427656q34562J000296R86666l03913
$$ y = [1664407, 2890590, 2487152, 1521956, 1537265, 2371566, 2610538, 1777587, 908728, 827693, 965813, 502449, -179906, -105984, 709804, 1293508, 1158938, 820129, 886277, 1436367, 2238161, 2798993, 2358225, 806670, -534927, -264200, 1027033, 1494262, 988458, 1416867, 3461837, 4843225, 3259576, -325686, -2907520, -2970585, -1362181, 408951, 1179834, 260944, -1742654, -2803711, -1770561, -217979, -329760, -1596412, -1711893, -385761, 203484, -936395, -1890700, -740551, 1678904, 3146736, 2852496, 1649103, 507085, -163822, -319025, -367800, -1057809, -2576542, -4018768, -4129121, -2371495, 679546, 3478812, 4250208, 2544746, 117090, -717472, 282824, 1269490, 965577]
32630I65577q50066j06084Q56617J348589J434113Q09247q43029k508111k533733
32621a426880q10495J035058J664769J127988R3733p91314q53276R7028J117116
32612A253727R49512m45009j806180j850113k29122K123787L143726J268211k228096
32603B180443l869239k148091L83789P12443n81932r58019n4545N32627N23234
32594c279290R24217J302354K87156j327724j219914M64434R76030n53363j709687
32585d135787r09222K25727Q5334k52151N39219J468017J271588Q80926J518830
32576F92481K112973J073024o70290q82556N42921J641208J368690N11052j29329
32567F260174o24339j007107r63108n80197l47948l55315k61563J5937J66383
$$ y = [965577, 115511, 9427, 866044, 2214633, 3648746, 4457993, 3614964, 1106853, -1426880, -2237375, -1202317, 462452, 1590440, 1684173, 892859, 39583, 136611, 1253727, 2203239, 1758230, -47950, -1898063, -2127185, -3398, 3140328, 4408539, 2180443, -1688796, -3836887, -3453098, -2740655, -3322587, -4280606, -4335151, -3802524, -3279290, -2355073, -1052719, -765563, -2093287, -3313201, -2848767, -1872737, -2426100, -4135787, -5045009, -4819282, -4733948, -4986099, -4446880, -2978863, -1707275, -826349, 692481, 2805454, 3878478, 3208188, 2325632, 2868553, 4509761, 5878451, 6389503, 6260174, 5635835, 4628728, 3665620, 3085423, 2737475, 2382160, 2120597, 2136534, 2302917]
32558B302917j20715r00464j703815j525873L1622J616132J464057J8926n48682
32549F34105K05800L12509r41755j345309M01743J806750L31199k071299j663589
32540b329846J118823K323452P21042o27331L44810J651094J032931l83686m35767
32531C415522M06565K20961r97416j596074j117661o96477q62933q17504l7649
32522b082666Q21017R84558N76972K53719L86127P60609P74886O9719p91303p55811
32512I97827J65309M95984p04960k119767j749100J29167J172226K98643q74952
32503b189623o21600M54582Q28227O34714J071875J917654J670526J49040r76218
32494B939177o93255N5351L04294N81588J370667J616828L33701j465099k169124
$$ y = [2302917, 2182202, 1281738, -422077, -1947950, -1916328, -300196, 1163861, 1182787, 634105, 839905, 1152414, 210659, -1134650, -732907, 1073843, 1405042, -666257, -2329846, -1211023, 1112429, 1833471, 1206140, 1550950, 3202044, 4234975, 3851289, 3415522, 3822087, 4043048, 3045632, 1449558, 331897, -364580, -1227513, -2045017, -2082666, -1261649, -277091, 299881, 553600, 939727, 1700336, 2475222, 2544941, 1753638, 997827, 1163136, 1659120, 954160, -1165607, -2914707, -2785540, -1613314, -1314671, -2189623, -2811223, -2356641, -1528414, -893700, 178175, 2095829, 3766355, 3915395, 2939177, 2245922, 2301273, 2605567, 3187155, 4557822, 6174650, 6508351, 5043252, 2874128]
32485B874128k008752k223779k524181j586113J86663P62686l39680j169138l43077
32476f371243J024984J357984Q38302M42158K59817R0909M60320J622964K504514
32467B230709K002888O21500m02768q64374j242078j306772n22783N49897O57172
32458A723391l92470j449157j501122o25924M24991Q91600M49649l86217n85892
32449a451151J19271P31364L51925n35638q85145n62530j23497K77982P36161
32440a341258Q53131K66147m37868m37573l9114k14299r43822j135687k18193
32431c648536J130236J906132J678289O13496o59479j295310j017043n06638m22934
32422b221787m21580P0904N93809K62972o23010q17847j3164O55389K75803n98529
$$ y = [2874128, 865376, -1358403, -3882584, -5468697, -5282034, -4519348, -4859028, -6028166, -6371243, -5346259, -3988275, -3149973, -2707815, -2447998, -2357089, -1896769, -273805, 2230709, 4233597, 4855097, 4452329, 3587955, 2345877, 1039105, 516322, 1066219, 1723391, 1330921, -118236, -1619358, -2245282, -1820291, -928691, -479042, -865259, -1451151, -1331880, -600516, -248591, -784229, -1669374, -2231904, -2355401, -2077419, -1341258, -488127, -221980, -659848, -1097421, -1136535, -1350834, -2294656, -3430343, -3648536, -2518300, -612168, 1066121, 1679617, 1020138, -275172, -1292215, -1798853, -2221787, -2643367, -2572463, -1978654, -1715682, -2338692, -3156539, -3169703, -2514314, -2238511, -2837040]
32412b837040q02067j1703J062176J551132J179485L26075m36962p65469m92425
32403a226798M47249J527105J492103k29279k149190k171286n26819M52193q9418
32394b474140k72599J164366K464932J598436m28425j196042m12513M38711P99703
32385A682429J016133O73780n27307j165527k2615J258988L75210j555171j470303
32376B65617M96811J129866m49927j431738k59314R45128M27177k95210M13166
32367A241576J377012J091471L55923R1147q01831k767836l320530o09165K727839
32358f14394K745092q2633j796815q75560K72370k84023j333116j047371K67044
32349b749406J057973O76604k02637m68380M14117J669375J748182K88089j105586
$$ y = [-2837040, -3639107, -3650810, -2588634, -1037502, 141983, 468058, 31096, -734373, -1226798, -779549, 747556, 2239659, 2010380, -138810, -2310096, -2836915, -2384722, -2474140, -2746739, -1582373, 882559, 2480995, 2052570, 856528, 444015, 882726, 1682429, 2698562, 3372342, 2845035, 1679508, 1656893, 2915881, 3291091, 1735920, 265617, 762428, 1892294, 1442367, 10629, -248685, 696443, 1123620, 828410, 1241576, 2618588, 3710059, 4065982, 4157129, 3355298, 587462, -2733068, -3342233, -614394, 2130698, 2048065, 251250, -624310, -351940, -635963, -1969079, -3016450, -2749406, -1691433, -1014829, -1217466, -1685846, -1271729, 397646, 2145828, 2433917, 1328331]
32340A328331r74694n1129P4646n41347o05723J50940Q15692R77024R53103O89042
32330B815885r409m88131o2282N23554N7590j062620j397095p84156k97446j33599
32320h37709M94648J376373J223688j40277j311634j374441q26105k12635M85250
32311a122842Q90307M26744k57583O1171Q21857J14459j942631k632546n97970
32302d239034J854894K032688N30974l20944j29888k19222o94060k42135J249576
32293a77151K069920J138734n39354j511353j694491j727770j428511n9608K013751
32284a915833K971023J468867j408677k937075j741494O61105J826396J226398
32276A50710K46210j05741j53095l14559l35991j03970k1801j14068J65921P92478
$$ y = [1328331, 353637, 302508, 377154, -164193, -769916, -618976, 196716, 1173740, 2126843, 2815885, 2806476, 2318345, 2256063, 2779617, 2837207, 1774587, 377492, -406664, -704110, -837709, -343061, 1033312, 2257000, 2116723, 805089, -569352, -1395457, -1608092, -1122842, -232535, 194209, -63374, -2203, 819654, 934113, -1008518, -3641064, -4239034, -2384140, -351452, 179522, -141422, -271310, -490532, -1184592, -1426727, -177151, 1892769, 3031503, 2492149, 980796, -713695, -2441465, -3869976, -3929584, -1915833, 1055190, 2524057, 1115380, -1821695, -3563189, -2902084, -1075688, 150710, 396920, 291179, 138084, -176475, -512466, -616436, -638237, -752305, -586384, 206094]
32266B06094R72410O13978P21208J538763J593321k35256k685889l523601k345083
32257c144055o73693L09566Q09517J333270J746358J594615O90503o24454j413971
32248F27656p86141Q29956J679784P88873n86103o87159K07699M00487m82538
32239A992514j076119o50501j47616l28065m45762L51044J494672J845997J180102
32230D216266j5831j335837k163424j569810L10826J649321J105891j2471M75107
32221B660038K056718J901358q36020l305676k782955m09979O85655j76333q58335
32212a065529k9666J108479J116798M22269J79693L79203K34057l59328p98646
32203A187330p32194k12876O92582J700929K070874J303453r2092j076203j158601
$$ y = [206094, 1178504, 1792482, 2513690, 4052453, 5645774, 5410518, 2724629, -798972, -3144055, -3817748, -3508182, -2698665, -1365395, 380963, 1975578, 2666081, 2041627, 627656, -158485, 671471, 2351255, 3140128, 2554025, 1866866, 2074565, 2475052, 1992514, 916395, 265894, 118278, -209787, -655549, -304505, 1190167, 3036164, 4216266, 4200435, 2864598, 701174, -868636, -557810, 1091511, 2197402, 2184931, 2660038, 4716756, 6618114, 5782094, 2476418, -306537, -716516, -30861, -207194, -1065529, -1095195, 13284, 1130082, 1552351, 1732044, 2111247, 2345304, 1985976, 1187330, 455136, 242260, 934842, 2635771, 4706645, 6010098, 5918006, 4841803, 3683202]
32194C683202o58907k03425k46385o67085o60360L03811J268603O53921j217571
32185B255804j919036k89471J474380P76267j509579k301663p75452Q73588J040372
32176c74790N87185O00129N86876l9705n40502j72141M56601M99829J75549m9860
32166A729171l99422q93477p21331L48683J052838L82196p50247q99692k18159
32157c69440K05371K81482O37882J048827P86698J42365j523J42545l87560j361808
32147A124839j400732j66789R77638R26377J86226k30378k00952j87978l42026
32138F86225m74338m18809j12659K65369K26916l84564q16760k79490P08261Q49496
32128B49647q017o14571k46869K70015j5489p92211j212265j123087q08475k49250
$$ y = [3683202, 3024295, 2820870, 2574485, 1907400, 1247040, 1550851, 2819454, 3473375, 2255804, 336768, 47297, 1521677, 2297944, 788365, -1513298, -2288750, -1415162, -374790, 212395, 812524, 1399400, 1359695, 819193, 647052, 1103653, 1603482, 1779031, 1729171, 1329749, 436272, -285059, 63624, 1116462, 1498658, 748411, -151281, -369440, -164069, 117413, 755295, 1804122, 2590820, 2733185, 2731662, 2874207, 2486647, 1124839, -275893, -442682, 534956, 1461333, 1647559, 1417181, 1216229, 1028251, 686225, 211887, -206922, -319581, -54212, 172704, -211860, -1028620, -1308110, -599849, 249647, 241630, -372941, -619810, -349795, -365284, -1157495, -2369760, -3492847, -4301322, -4550572]
32118d550572N38831J046960R68989P94635Q79746N52021p56369j967556j384000
32109c877315P42610K128111J420829l8016k71360N91316Q94006J19963n81682
32100A128462m68443k23827m29933m61237J62358N31199k10337j085827o42876
32091a700461M39063J31863j498252j859701L16199K714542K524627K75510j266808
32082G6582j026928l65682l29158k89727L95629J131951J154097O21187J0395
32073A378346o27091j212819j225732l56808Q89086J638606J383127K34229j052343
32064A048601j395836m56498O34810M24868r39589j807145j146784L27915J326861
32055a982797J344465O26373k78160o34128q6584O31656M61589l75033o35773
$$ y = [-4550572, -4011741, -2964781, -1995792, -1201157, -321411, 230610, -525759, -2493315, -3877315, -3134705, -1006594, 414235, 376219, 104859, 696175, 1590181, 1710144, 1128462, 660019, 436192, 6259, -454978, -292620, 238579, 28242, -1057585, -1700461, -1261398, -1129535, -2627787, -4487488, -4171289, -1456747, 1067880, 1343390, 76582, -950346, -1316028, -1645186, -1934913, -1539284, -407333, 746764, 1367951, 1378346, 751255, -461564, -1687296, -2044104, -1155018, 483588, 1866715, 2100944, 1048601, -347235, -803733, -168923, 255945, -683644, -2490789, -3637573, -3309658, -1982797, -638332, -11959, -290119, -924247, -1010831, -379175, 82414, -292619, -928392]
32046i28392n5859L13201O5998P4044N39610L00228q44198j062161O02396K051925
32036A056792J070311j007197j233682K80872P04752p39180j558170j91514J543559
32027g3457J543928M90831R2863K25581j76553p95374n78755J72463K94498k14499
32017I81526l73933n228K60509L86070P32066P67947k84408j617952j477100J51306
32007d79197J242874O13929n48444p23807r8054L31798L37070J00901n36823j360768
31997a120521j375060l16451M37794j80152j039977m93033Q69434J099558J03323
31988b015085k36581P32801J334865L94608q07294o08900N49863J145036R20494
31979A409807O67399M34079l79161j431396j506001l18330R36344J138369M46251
$$ y = [-928392, -984251, -671050, -605052, -531008, 8602, 308830, -535368, -1597529, -995133, 1056792, 2127103, 1119906, -113776, 167096, 871848, 132668, -1425502, -1617016, -73457, 1470471, 1961302, 2054165, 2279746, 2103193, 1307819, 729064, 901527, 1196025, 981526, 607593, 602365, 862874, 1248944, 1981010, 2748957, 2464549, 846597, -630503, -479197, 763677, 1377606, 829162, 105355, 7301, 339099, 676169, 777070, 240247, -1120521, -2495581, -2812032, -2374238, -2554390, -3594367, -4087400, -3217966, -2118408, -2015085, -2251666, -1518865, -184000, 210608, -596686, -1205586, -655723, 489313, 1409807, 2077206, 2511285, 2132124, 700728, -805273, -1123603, -187259, 951110, 1397361]
31970A397361l27444p34607p22210l11216K72919N46174K81886j03375k631O00561
31960H97418J040449P56344P0013j23020L44228L07706j284630l404498l534001
31951d929991p98716K453932L217171J342123o84121j098382n90150n79617j163670
31942b831421j412748p58428O50671K312791L368269K779525M26656k139319k906497
31933e10501j601103r6525k18699j508376j812237j24766J942334K161967O30552
31924a137354m27956J98220J136079O90083n62967p80177K58099Q84936J00875
31915C59838j092361j272684l66627O51084R62612L68214p31935j431983j033014
31906c586856N0493P12559O27502N28981Q72228J169090R71255N36420Q8797n78362
$$ y = [1397361, 1069917, 335310, -386900, -698116, -425197, 120977, 402863, 299488, 296857, 897418, 1937867, 2694211, 2764224, 2641204, 2985432, 3293138, 2008508, -1395990, -4929991, -5728707, -3274775, -57604, 1284519, 600398, -497984, -1088134, -1667751, -2831421, -4244169, -5002597, -4351926, -2039135, 1329134, 4108659, 4535315, 2395996, -510501, -2111604, -2208129, -2426828, -3935204, -5747441, -5872207, -3929873, -1767906, -1137354, -1565310, -1367090, -231011, 459072, -103895, -884072, -625973, 258963, 359838, -732523, -2005207, -2371834, -1720750, -758138, -389924, -1121859, -2553842, -3586856, -3536363, -2823804, -2196302, -1667321, -795093, 373997, 1345252, 1881672, 1970469, 1392107]
31896A392107j237467j042990N9271P87829L02020m57224k80606L77912L09373
31887B10225l44171m46583P0400J42008m58190o53822J15795R84284J091696P78362
31877A490004O81247N86404N698p30017q07007j02170O39842P63966M07837J61699
31867C097503K24409J11672n87851j283202q66862N32757J118306l19600k336162
31858c09030k404182l42855J412724J173646p0445p23763q28471j000685o96988
31849c790049O17958J648040Q08857r01164r32655Q57581J759388M31083q96706
31840c97667L1152J838863J691499k35863j157144n5198J094360P92326J16101
31831C718429L08799M79490o30421k144964k237664r14760K22829M77080N47047
$$ y = [1392107, 154640, -888350, -829079, -41250, 260770, -196454, -477060, -99148, 210225, -133946, -580529, -510129, -368121, -826311, -1480133, -1364338, -380054, 711642, 1490004, 2171251, 2757655, 2763353, 2033336, 1226329, 1124159, 1764001, 2527967, 2935804, 3097503, 3321912, 3433584, 2845733, 1562531, 695669, 1228426, 2346732, 2027132, -309030, -2713212, -3056067, -1643343, -469697, -540142, -1263905, -2092376, -3093061, -3790049, -3172091, -1524051, -715194, -1616358, -2549013, -1691432, 67956, 499039, -397667, -366515, 1472348, 3163847, 2927984, 1770840, 1715642, 2810002, 3602328, 3718429, 4027228, 4506718, 3876297, 1731333, -506331, -1421091, -1198262, -721182, -174135]
31822a74135P78769O79236K47916J43725K43796l50973j362828j049961J143082
31813B98627L065667K398931k06316k056425j952369j153159q59578m98967P04204
31804b59385J771088J039488j161808k382469j122172J003457J248959n69183
31796d32025j790276n89778J517053J914289N46023l09747M90585J580081J475388
31787D401593O22951J63525j5458p39648j845682k296999j684808n84142M20579
31778a558089J176484J522307J260858O59227K94071K53911N4507m98340r09367
31769B255569p60082m31696n43478q29599k64961J335322K421807J338310j224792
31760C296400k579358j356148O90329J189079L46189M2843N69904M34819p40420
$$ y = [-174135, 604634, 1283870, 1531786, 1675511, 1919307, 1568334, 205506, -844455, 298627, 3364294, 5763225, 5556909, 3500484, 1548115, 394956, -464622, -963589, -259385, 1511703, 2551191, 1389383, -993086, -2115258, -1111801, 137158, -432025, -2222301, -2812079, -1295026, 619263, 1165286, 855539, 1346124, 2926205, 4401593, 5024544, 5188069, 5172611, 4432963, 2587281, 290282, -1394526, -1978668, -1558089, -381605, 1140702, 2401560, 3060787, 3354858, 3608769, 3663276, 3164936, 2255569, 1495487, 1063791, 520313, -309286, -574247, 761075, 3182882, 4521192, 3296400, 717042, -639106, 51223, 1240302, 1586491, 1629334, 2199238, 2634057, 1893637]
31751A893637j492871j151881q96157j257051q25102J094956K582988J800267
31743A748786m0859n84217R9181K50381k73233j54885M15966j49359j604671j618691
31733a911601L99941J826373O24231j459524j402552P89245K367453J774266K91467
31724C299299k94969j8881o2695p80657j325792r83245j12854M66003N87703P56620
31714A530532J160990J241078M75462p82116j544275j088404M14686J821249J671809
31705D901011l79724k752199l397246k195826q74262l78153K14468J586565K650698
31696f24668K289266J193489N35370O3065q90231j683244j457537q97259r62137
31687b433886q97204L05753J460686Q04451o75967m89138J120472J383100l73032
$$ y = [1893637, 400766, -751115, -1647272, -2904323, -3729425, -2634469, -51481, 1748786, 1707927, 1123710, 1222891, 1473272, 1200039, 1045154, 1461120, 1311761, -292910, -1911601, -1511660, 314713, 938944, -520580, -1923132, -1133887, 1233566, 3007832, 3299299, 3004330, 2985449, 2922754, 2142097, 816305, -166940, -279794, 186209, 773912, 1530532, 2691522, 3932600, 4408062, 3625946, 2081671, 993267, 1407953, 3229202, 4901011, 4521287, 1769088, -1628158, -3823984, -4698246, -5076399, -4861931, -3275366, -624668, 1664598, 2858087, 3393457, 3456522, 2566291, 883047, -574490, -1471749, -2433886, -3331090, -3025337, -1564651, -760200, -1436167, -1925305, -804833, 578267, 205235]
31678B05235j616985q46319L22395M71403O31263J523653J523216l49526j889670
31669b5335q36016J343068J617258K6534p53351K34362J149089O13146m34457
31660B934298p01181m59033n93413r22856m90987Q27227J757467R96520r74942
31651B373100k096197j232983K61888N28538n6145J73528J073232R22444k99367
31642A648038o47006K39726L02115j088923j563670J29179J471915K23964j568900
31633h53562q26934J420808J800295R2163q56968l1101P04702L87653K68628Q78505
31623B984189Q97428k63130j358952j549630j411834j110068P2184J646272J740366
31614A646825J3478j395692r50047K05871M27662q679m5917J68210m6499m00080
$$ y = [205235, -1411750, -2258069, -1935674, -1464271, -833008, 690645, 2213861, 1864335, -25335, -861351, 481717, 2098975, 2125509, 1372158, 1606520, 2755609, 3368755, 2934298, 2233117, 1774084, 1180671, 257815, -233172, 594055, 2351522, 3348042, 2373100, 276903, -956080, -694192, -165654, -221799, -48271, 1024961, 1947405, 1648038, 1001032, 1240758, 1542873, 453950, -1109720, -980541, 491374, 715338, -853562, -1680496, -259688, 1540607, 1632770, 775802, 744701, 1449403, 1837056, 2105684, 2984189, 3881617, 3618487, 2259535, 709905, -701929, -1811997, -1739813, -93541, 1646825, 1660303, 264611, -685436, -479565, -51903, -60582, -106499, 61711, 15212, -384868]
31604c84868k36201J56903K0056o83873j409288j765803j500122m76611P56896
31595e522911J200326P67272N52697J134509J546796P40365p50029j544365j287880
31586c163220q45522q52784q83822k03519J063493J820390J194414k47911r45091
31577c063572j94890J025016J465779J089491N32616m5536o51525q12513l71662
31568a026796j79707p60749j085189j03241J320487J697038J358386J622731K147833
31559D990793J424731l64953j385571j083203p62786j049794j086815n66191k65252
31550a49041j97414M22197J021548R9552j643825j502591Q98097K402783R81602
31541B332908j189683j253845J87945P40711J2031o54392p20652m88097J78697
$$ y = [-384868, -621069, -464166, -444110, -1127983, -2537271, -4303074, -5803196, -6279807, -5522911, -4322585, -3555313, -3002616, -1868107, -321311, 419054, -330975, -1875340, -3163220, -4008742, -4861526, -5745348, -5948867, -4885374, -3064984, -1870570, -2118481, -3063572, -3258462, -2233446, -767667, 321824, 854440, 808904, 157379, -655134, -1026796, -1206503, -1967252, -3052441, -3155682, -1835195, -138157, 1220229, 2842960, 4990793, 6415524, 6050571, 4665000, 3581797, 2819011, 1769217, 682402, 116211, -149041, -346455, 75742, 1097290, 1196842, -446983, -1949574, -1051477, 1351306, 2332908, 1143225, -110620, 77325, 818036, 830067, 175675, -544977, -1033074, -854377]
31532h54377J166645J326218J98241p06281j38098P34559L18579o50958n14627
31523H79901L96710N90157J45532K00926M71806k42497j531277j747639p37420
31514a573801m935j76766k94482K80747J026050J411058J363112O41652p71232
31505A901403j825118j464902l61133o4083o55070q41177k17501K57254O3521
31496c206806j97548o6024K33960O06007J142207J374532P54436j66217l31563
31487A42984J25994J43136l95482m80176K38247Q85966Q25859M50544K35336M8693
31477B221101l10130o97940r04130p54385j03913P02018Q26982J18223l59059
31468G38767J53076P93651L83903o90474j115640n27750M18635J173205J357853
$$ y = [-854377, 312268, 1638486, 1836727, 1130446, 992348, 1726907, 2045486, 1394528, 879901, 1276611, 1866768, 2012300, 2213226, 2685032, 2442535, 911258, -836381, -1573801, -1578736, -1755502, -2049984, -1769237, -743187, 667871, 2030983, 2672635, 1901403, 76285, -1388617, -1749750, -1813833, -2468903, -3310080, -3527581, -3270327, -3206806, -3404354, -3470378, -3236418, -2630411, -1488204, -113672, 640764, 474547, 142984, 268978, 412114, 16632, -463544, -225297, 660669, 1486528, 1937072, 2172408, 2221101, 1910971, 1213031, 308901, -445484, -549397, 152621, 979603, 1097826, 738767, 891843, 1685494, 2069397, 1378923, 263283, -264467, 154168, 1327373, 2685226]
31459B685226N67801p27621j119592l24163O615j036074j801005q52149K79115
31450b321847l29683j379746m71799J508304J712930J76833m77927K36790K14264
31441a131881r44168j177197j5653N12849j74999j86235R45783J160642q5925
31432a096784n43636N65352R45345k84375n91557J136739J911680j59167j947357
31423f3760l75041K076571J386456j262212j691866K27023R20317m39286r56437
31414a78235M61551J343416K72260q56501n62710k58209j230431j985958o86235
31405c681052J714771K762106J749714P6532q94372j028079q16047n42136j52062
31396h10625L40795N10749m3178q23064p42963K71756R37086N44751J27187O43829
$$ y = [2685226, 3253027, 2525406, 1405814, 1081651, 1088266, 52192, -1748813, -2600962, -2321847, -2651530, -4031276, -4503075, -2994771, -1281841, -1105008, -1582935, -1346145, -1131881, -2076049, -3253246, -3268899, -2756050, -2931049, -3117284, -2171501, -1010859, -1096784, -1640420, -1075068, -129723, -414098, -1005655, 131084, 2042764, 1883597, -63760, -438801, 1637770, 3024226, 1762014, 70148, 297171, 1217488, 778202, -178235, 283316, 1626732, 1898992, 1042491, 479781, 221572, -1008859, -2994817, -3681052, -1966281, 795825, 2545539, 2622071, 1727699, 699620, -116427, -658563, -810625, -469830, 40919, -2259, -825323, -1568286, -1296530, -359444, 185307, 312494, 956323]
31386I56323J170158L98692r68238j107864J31283J060992O06956n72222j371411
31377C04669j381188p82362j12465P028l33480k71889M13483P18061J16217l27171
31367a649097K27177P64780K03447m60274K56638J657177J933056J007636Q6387
31358D026927p58645k058503k729189j232379J307087K020963M71044q18165l17605
31349h8465O87451P82320L46114r226n78827j237539j058880r2374M29953L04537
31339e14936O74417J514063J165710o79249j928377j253939n3707J49333M5366
31330h81319O01149Q82488j45737j356472j207930m44175p71381j741364j307258
31321f371999P88935K294399J458552o91405j709701o44245J014025J292886K81630
$$ y = [956323, 2126481, 2525173, 1556935, 449071, 580354, 1641346, 2248302, 1676080, 304669, -1076519, -1858881, -1971346, -1964318, -2297798, -2569687, -2156204, -1438143, -1321926, -1649097, -1421920, -657140, -453693, -913967, -657329, 999848, 2932904, 3940540, 4026927, 3268282, 1209779, -1519410, -2751789, -1444702, 576261, 1047305, 229140, -88465, 598986, 1381306, 1727420, 1718194, 1139367, -98172, -1157052, -1249426, -819473, -514936, 159481, 1673544, 2839254, 2160005, 231628, -1022311, -1076018, -926685, -881319, -280170, 602318, 456581, -899891, -2107821, -2551996, -3323377, -5064741, -6371999, -5583064, -3288665, -1830113, -2521518, -4231219, -4875464, -3861439, -2568553, -2286923]
31312b286923n3026J124308J987722Q06212j055382j082188L43458O73305m50866
31303F620r10315l00269o24542j980925j652483Q06538J748480o94849k862037
31294f463782j132621K243309K975556J392494O07737N09714j092882k946214
31286c906689j720432J649899K652602M29666j176507m91193k49313j519491j220146
31277e551604J656243K841844l62307l736963k334374J674490K641695L42127
31269b828849n01990J633731L123800J581291q37142j612201j166813n41208N96734
31260e52647J860850J287399j312156k860127j250873J206242J228720m36381
31252h28973n52559J223014J937933K46758j552920j310612j56586k00716j027964
$$ y = [-2286923, -2339949, -1215641, 772081, 1578293, 522911, -559277, -215819, 457486, 6620, -903695, -1203964, -1828506, -3809431, -5461914, -4655376, -2906896, -3601745, -6463782, -7596403, -5353094, -2377538, -985044, -377307, 132407, -960475, -3906689, -5627121, -3977222, -1324620, -894954, -2071461, -2562654, -2811967, -4331458, -5551604, -3895361, -1053517, -1415824, -5152787, -7487161, -5812671, -3170976, -2828849, -3330839, -1697108, 1426692, 3007983, 2170841, 558640, -608173, -1149381, -552647, 1308203, 2595602, 1283446, -1576681, -2827554, -1621312, -392592, -828973, -1381532, -158518, 1779415, 2026173, 473253, -837359, -993945, -1194661, -2222625]
31243b222625o12045J237071K492433J894770N09210j93048l90856j079953k045365
31234d10408j951999m13776J097047R50933n78258j671906j259171j69076L10594
31225d096020K64732O61594J404998J209600j88587j021660J47769J929934J655071
31216A967431p72907k430726j324167R50536J670595P04515L3059M04547N78720
$$ y = [-2222625, -2834670, -1597599, 894834, 2789604, 3298814, 3105766, 2714910, 1634957, -410408, -2362407, -2776183, -1679136, -728203, -1306461, -2978367, -4237538, -4406614, -4096020, -3831288, -3169694, -1764696, -555096, -743683, -1765343, -1617574, 312360, 1967431, 1194524, -1236202, -2560369, -1609833, 60762, 765277, 798336, 1202883, 1781603]
$$ [...]
##END NTUPLES=NMR SPECTRUM
##END=
