##TITLE=31Pdec_LY-TMF-9.70+TMF
 D2O, 24 sc
 2.3.2020
##JCAMPDX= 6.0         $$ Bruker NMR JCAMP-DX V2.0
##DATA TYPE= NMR SPECTRUM
##DATA CLASS= NTUPLES
##ORIGIN= UXNMR, Bruker Analytische Messtechnik GmbH
##OWNER= root
$$ XWIN-NMR		Version 3.5
$$ Mon Mar  2 16:28:01 2020 Russian Standard Time (UT+4h)  she@DPX200
##.OBSERVE FREQUENCY= 81.013821
##.OBSERVE NUCLEUS= ^31P
##.ACQUISITION MODE= SIMULTANEOUS
##.ACQUISITION SCHEME= undefined
##.AVERAGES= 24
##.DIGITISER RES= 17
##SPECTROMETER/DATA SYSTEM= spect
##.PULSE SEQUENCE= zgpg30
##.SOLVENT NAME= D2O
##.SHIFT REFERENCE= (INTERNAL, D2O, 0, 182.463)
##AUDIT TRAIL= $$ (NUMBER, WHEN, WHO, WHERE, WHAT)
$$ ##TITLE= Audit trail, XWIN-NMR		Version 3.5
$$ ##JCAMPDX= 5.01
$$ ##ORIGIN= Bruker BioSpin GmbH
$$ ##OWNER= she
$$ F:/spectra/data/she/nmr/P31/1/pdata/1/auditp.txt
$$ ##AUDIT TRAIL=  $$ (NUMBER, WHEN, WHO, WHERE, WHAT)
(   1,<2020-03-02 16:27:06.01 +0400>,<she>,<DPX200>,
      <created by zg, POWCHK disabled, PULCHK disabled
       configuration hash MD5:
       00 E9 B6 7A A2 85 ED C7 34 08 36 98 17 FE 4E 26
       data hash MD5: 32K
       9E D5 1A 47 D5 A9 A7 ED CA DF 22 4D 98 7E 83 93>)
(   2,<2020-03-02 16:27:08.15 +0400>,<she>,<DPX200>,
      <Start of raw data processing
       efp BC_mod = 2 LB = 1 FT_mod = 6 PKNL = 1 PHC0 = -1463.042 PHC1 = 359.6017 SI = 64K 
       data hash MD5: 64K
       55 72 E6 F5 5F 85 CB 30 4F 89 39 68 6E 34 5A 8E>)
(   3,<2020-03-02 16:27:20.15 +0400>,<she>,<DPX200>,
      <pk PHC0 = 2.163446 PHC1 = 0 
       data hash MD5: 64K
       A3 E3 9F 98 AD E2 35 CE AE 32 9A 83 10 C4 70 99>)
(   4,<2020-03-02 16:27:24.00 +0400>,<she>,<DPX200>,
      <abs ABSG = 5 
       data hash MD5: 64K
       C7 C8 53 A0 46 81 2E B7 A8 F1 7E 28 12 73 D8 3C>)
$$ ##END=
$$ 
$$ hash MD5
$$ 0B 4A FD 2C B9 46 4B 51 AF 36 80 6D 53 53 EF B1
##$RELAX= 
##$RELAX= 
##$RELAX= 
##$RELAX= 
##$RELAX= 
##$RELAX= 
##$RELAX= 
##$RELAX= 
$$ Bruker specific parameters
$$ --------------------------
##$DU= <F:/spectra>
##$EXPNO= 1
##$NAME= <P31>
##$PROCNO= 1
##$TYPE= <nmr>
##$USER= <she>
##$AMP= (0..31)
100 100 100 100 100 100 100 100 100 100 100 100 100 100 100 100 100 100 
100 100 100 100 100 100 100 100 100 100 100 100 100 100 
##$AQSEQ= 0
##$AQ_mod= 1
##$AUNM= <au_zg>
##$AUTOPOS= <>
##$BF1= 81.014009
##$BF2= 200.13
##$BF3= 200.13
##$BF4= 200.13
##$BF5= 200.13
##$BF6= 200.13
##$BF7= 200.13
##$BF8= 200.13
##$BYTORDA= 1
##$CFDGTYP= 0
##$CFRGTYP= 5
##$CHEMSTR= <none>
##$CNST= (0..31)
1 1 145 1 1 1 1 1 1 1 1 1 1 1 1 1 1 1 1 1 1 1 1 1 1 1 1 1 1 1 1 1 
##$CPDPRG= <waltz16>
##$CPDPRG1= <>
##$CPDPRG2= <waltz16>
##$CPDPRG3= <>
##$CPDPRG4= <mlev>
##$CPDPRG5= <mlev>
##$CPDPRG6= <mlev>
##$CPDPRG7= <mlev>
##$CPDPRG8= <mlev>
##$CPDPRGB= <>
##$CPDPRGT= <>
##$D= (0..31)
0 1 0 0 0 0 0 0 0 0 0 0.03 2e-05 3e-06 0 0 0 0 0 0 0 0 0 0 0 0 0 0 0 0 
0 0 
##$DATE= 1583152025
##$DBL= (0..7)
120 120 120 11 120 120 24 19 
##$DBP= (0..7)
150 150 150 150 150 150 150 150 
##$DBP07= 0
##$DBPNAM0= <>
##$DBPNAM1= <>
##$DBPNAM2= <>
$$ [...]
##$SUBNAM3= <"">
##$SUBNAM4= <"">
##$SUBNAM5= <"">
##$SUBNAM6= <"">
##$SUBNAM7= <"">
##$SUBNAM8= <"">
##$SUBNAM9= <"">
##$SW= 369.568048894756
##$SWIBOX= (0..15)
0 1 3 0 0 0 0 0 0 0 0 0 0 0 0 0 
##$SW_h= 29940.119760479
##$TD= 32768
##$TD0= 1
##$TE= 0
##$TE2= 300
##$TE3= 300
##$TEG= 300
##$TL= (0..7)
0 120 53 12 22 120 120 120 
##$TP= (0..7)
150 150 150 150 150 150 150 150 
##$TP07= 0
##$TPNAME0= <>
##$TPNAME1= <>
##$TPNAME2= <>
##$TPNAME3= <>
##$TPNAME4= <>
##$TPNAME5= <>
##$TPNAME6= <>
##$TPNAME7= <>
##$TPOAL= (0..7)
0.5 0.5 0.5 0.5 0.5 0.5 0.5 0.5 
##$TPOFFS= (0..7)
0 0 0 0 0 0 0 0 
##$TUNHIN= 0
##$TUNHOUT= 0
##$TUNXOUT= 0
##$USERA1= <user>
##$USERA2= <user>
##$USERA3= <user>
##$USERA4= <user>
##$USERA5= <user>
##$V9= 5
##$VALIST= <valist>
##$VCLIST= <CCCCCCCCCCCCCCC>
##$VD= 0
##$VDLIST= <DDDDDDDDDDDDDDD>
##$VPLIST= <PPPPPPPPPPPPPPP>
##$VTLIST= <TTTTTTTTTTTTTTT>
##$WBST= 1024
##$WBSW= 4
##$XGAIN= (0..3)
0 0 0 0 
##$XL= 0
##$YL= 0
##$YMAX_a= 62366
##$YMIN_a= -67721
##$ZGOPTNS= <>
##$ZL1= 120
##$ZL2= 120
##$ZL3= 120
##$ZL4= 120
##$ABSF1= 182.463
##$ABSF2= -187.1042
##$ABSG= 5
##$ABSL= 3
##$ALPHA= 0
##$AQORDER= 0
##$ASSFAC= 0
##$ASSFACI= 0
##$ASSFACX= 0
##$ASSWID= 0
##$AUNMP= <proc_1d>
##$AZFE= 0.1
##$AZFW= 0.5
##$BCFW= 0
##$BC_mod= 2
##$BYTORDP= 0
##$COROFFS= 0
##$CY= -3
##$DATMOD= 1
##$DC= 0
##$DFILT= <>
##$DTYPP= 0
##$F1P= 0
##$F2P= 0
##$FCOR= 1
##$FTSIZE= 65536
##$FT_mod= 6
##$GAMMA= 0
##$GB= 0
##$INTBC= 1
##$INTSCL= 5.30512e-09
##$ISEN= 30
##$LB= 1
##$LEV0= 0
##$LPBIN= 0
##$MAXI= 10000
##$MC2= 0
##$MEAN= 0
##$ME_mod= 0
##$MI= 50
##$NCOEF= 0
##$NC_proc= -2
##$NLEV= 6
##$NOISF1= 182.463
##$NOISF2= 159.3651
##$NSP= 0
##$NTH_PI= 0
##$NZP= 0
##$OFFSET= 182.463
##$PC= 4
##$PHC0= -1460.879
##$PHC1= 359.6017
##$PH_mod= 1
##$PKNL= yes
##$PPARMOD= 0
##$PSCAL= 0
##$PSIGN= 0
##$REVERSE= no
##$SF= 81.0140089999434
##$SI= 65536
##$SIGF1= 159.3651
##$SIGF2= -187.1042
##$SINO= 113.3802
##$SIOLD= 16384
##$SREGLST= <1H.CDCl3>
##$SSB= 0
##$STSI= 65536
##$STSR= 0
##$SW_p= 29940.119760479
##$SYMM= 0
##$S_DEV= 0
##$TDeff= 32768
##$TDoff= 0
##$TI= <>
##$TILT= no
##$TM1= 0
##$TM2= 0
##$TOPLEV= 0
##$USERP1= <user>
##$USERP2= <user>
##$USERP3= <user>
##$USERP4= <user>
##$USERP5= <user>
##$WDW= 1
##$XDIM= 65536
##$YMAX_p= 495607991
##$YMIN_p= -1025007
$$ End of Bruker specific parameters
$$ ---------------------------------
##NTUPLES= NMR SPECTRUM
##VAR_NAME=  FREQUENCY,     SPECTRUM/REAL,   SPECTRUM/IMAG
##SYMBOL=    X,             R,               I
##VAR_TYPE=  INDEPENDENT,   DEPENDENT,       DEPENDENT
##VAR_FORM=  AFFN,          ASDF,            ASDF
##VAR_DIM=   65536,         65536,           65536
##UNITS=     HZ,            ARBITRARY UNITS, ARBITRARY UNITS
##FACTOR=    0.456856943014862, 1,           1
##FIRST=     14782.0589164792, 0,            0
##LAST=      -15158.0608439998, 0,           0
##MIN=       -15158.0608439998, -1025007,    0
##MAX=       14782.0589164792, 495607991,    0
$$ Real data points
##PAGE= N=1
##DATA TABLE= (X++(R..R)), XYDATA
$$ [...]
37217b02972L1527Q9279L1743l0409l861P5477J03009L7888m9385o3340J35N3936
37205G3027L5123k5647o6765p5422o8375l9728K0393Q1578R3935M2292m3235j11294
37193h4118j13652m1640M7860Q2186N7688L0145K3439J4840J1293M9514J00413
37182A77968P4316l6578j18527r4596l0051j4349k9063j5439O942j3344n0736
37171a43457l8747J5797M0006M706l6627j9472N3319J04718O1139m1046o4982
37160f4646M5411J45203O9794r9595j22341M3356J66933R0016n4999p9855j2126
37149A27151J4522q990j4564k0067p2985j14901o4868K6573N4173K7717K3447
37138b2792K8022k0305q3200o4116K9363R5233Q5635L5970j8491n2016k4173M7749
$$ y = [-202972, -171445, -82166, -50423, -80832, -84693, -9216, 93793, 131681, 82296, 18956, 19091, 73027, 108150, 82503, 15738, -59684, -128059, -167787, -147394, -65816, 28119, 70411, 27176, -84118, -197770, -239410, -191550, -109364, -51676, -21531, 1908, 16748, 28041, 77555, 177968, 252284, 215706, 97179, 2583, -27468, -41817, -70880, -86319, -79377, -92721, -143457, -182204, -166407, -126401, -121695, -158322, -177794, -124475, -19757, 41382, 336, -64646, -19235, 125968, 195762, 96167, -26174, 17182, 184115, 274131, 219132, 139277, 127151, 141673, 132683, 118119, 98052, 25067, -89834, -154702, -128129, -73956, -46239, -22792, 5230, -15075, -98275, -162391, -133028, -37795, 47840, 83810, 65319, 13303, -10870, 36879]
37126C6879N3365n6948j51437q6807O3605J06420J0299p1458m2780K8073N0068
37115f0721K0999k1991n3049m2271K1196Q4656Q4170L2890n863p444J0737L0439
37103I3748K0034n4455j44994j35959j6439O9038L2720k0195J5664N9886J0498
37092g0454m6628R545R4355N5793m4308l7333L5918j0265j56944j78600j0260
37081c59181J46624J37327L9807k3388m4672l5666K8387R6656N9365n5585q1157
37070i1483K7750J12973O6892j2889j1300L1922L8184K4788J9202k3647j13190
37059F9202j54180q7372P095L7136K8960M6043P3569O5783K7924j5664o0228q1483
37047d3215m1260L1345N4552J7726o872N591L777k0235j0388K9249K5331j8726
$$ y = [36879, 90244, 33296, -118141, -204948, -141343, -34923, -24624, -96082, -138862, -110789, -60721, -39722, -61713, -114762, -157033, -135837, -51181, 32989, 65879, 60016, 52572, 63309, 93748, 113782, 59327, -85667, -221626, -238065, -169027, -136307, -156502, -140838, -80952, -70454, -117082, -107537, -13182, 42611, -1697, -39030, -3112, -13377, -170321, -348921, -359181, -212557, -75230, -35423, -58811, -103483, -139149, -110762, -14106, 45259, -10326, -91483, -63733, 49240, 116132, 103243, 91943, 123865, 162049, 186837, 206039, 182392, 69202, -84978, -172350, -165255, -128119, -99159, -53116, 20453, 86236, 114160, 98496, 38268, -43215, -84475, -53130, 1422, 19148, 12276, 17867, 21644, 1409, -8979, 20270, 45601, 26875]
37035B6875r852O2382Q7201J5956n8728o0468k8058q616Q322R431l8564o9330
37023f3449K4069J69550J57917k9195j53912q4713O339m6192j19158k9885J37048
37012c1581J66922N4657k4751p476J3560q870k1888o671r497m1442o5477p0643
37000e3157o6800l8428J4655M0635J7359M040L3986M2070j0619l9400K3874R1161
36988E9376N1404m2047o2072j5562q535n5110p4362m6936l0293l2532j188O5799
36976a92058J08635J01852O9853K0617m8149r5261p4798j4128K0559J7206J3082
36965g2590K5473M4196N7536M0057l1088j05574q4611L0250J07813P3846J8177
36954A03485L0171M9878J98n3008k1465K8223j2667q7526o5059K0664J8100p9541
$$ y = [26875, 17023, 79405, 166606, 182562, 123834, 63366, 35308, 26692, 35014, 44445, 5881, -63449, -39380, 130170, 288087, 258892, 104980, 20267, 26606, -19586, -138744, -168629, -31581, 135341, 189998, 165247, 157771, 171331, 162461, 140573, 133902, 124405, 82963, 17486, -53157, -119957, -158385, -143730, -103095, -85736, -81696, -47710, -5640, -16259, -55659, -31785, 59376, 110780, 68733, 6661, -8901, -17436, -72546, -146908, -193844, -224137, -256669, -257857, -192058, -83423, 18429, 88282, 108899, 60750, -34511, -109309, -123437, -102878, -85672, -72590, -47117, -2921, 54615, 94672, 63584, -41990, -126601, -96351, 11462, 85308, 103485, 133656, 183534, 183732, 130724, 109259, 137482, 124815, 37289, -27770, -7106, 10994, -68547]
36942f8547j17988l7126M2030K4835k2500n639N8061R8236R3911N7230j2025j00892
36930I586j58754j38849m5709O3869J12622O2212l1428o1959l835N7425O3582
36919g1238O6593J07000J09481R937r6331p3153M0858Q2367O890o2147l2953L7521
36907A24825N4985J1479m0799o3584m6295K073M9965O2505L1774k4407p5591q3069
36895C861l3900J8013M510m9862n0997J8099P0439N7652K3731j2292q5047j50118
36883a85911r2788N7454J09320R644m5116O1022J44610L5546j05717m9811R7396
36872C5649O5532j21324j89140o2748N5519M8743K1157M4691M9410J2668P755
36861c2088K0476m6565j51207j33743P66O9204K3202J5181R1223R3988k8522q7546
$$ y = [-68547, -186535, -223661, -181631, -156796, -179296, -184935, -126874, -28638, 65273, 122503, 110478, 9586, -149168, -288017, -333726, -269857, -157235, -95023, -126451, -188410, -192245, -134820, -71238, -4645, 102355, 211836, 221773, 125442, 52289, 93147, 175514, 182404, 120257, 87304, 124825, 179810, 191289, 150490, 86906, 40611, 42684, 92649, 155154, 186928, 162521, 86930, 3861, -30039, -12026, -7516, -57378, -108375, -90276, -19837, 37815, 61546, 49254, -35793, -185911, -278699, -221245, -111925, -102281, -147397, -86375, 58235, 93781, -11936, -61747, 35649, 101181, -20143, -209283, -272031, -216512, -167769, -146612, -101921, -52511, -39843, -32088, -11612, -58177, -209384, -343127, -342361, -273157, -249955, -234774, -143551, -49563, -78085, -165631]
36849a65631L4034J73955J52077K8854n6877j11177j74179j64668k4977J17888
36839a90701J17658K6512j0842K0757L8319K0907L25k5918n4135l3843K8025K5579
36827c7357p5470j39317n4396Q4749J23257O9809L2770K6683m395m2229k4227
36816d0123L0574N5245M9753M8751K9141l6769r1483o9651j2332N484L492L7866
36804I948P3639M1154k6923m2847j2264r630l2415p166O8430J07786O6037q008
36792B27741n6736o9048m9075l539L6258L8924J7141L056j287n739M057L5549
36780A77302N5615L6436n55k8156n3468p3940n7352j5897k2645q5521r0098L4733
36768a23546J68714J40528k8782j50063j17199j4961L0012J316l0958j1878N0637
$$ y = [-165631, -131597, 42358, 194435, 223289, 166412, 55235, -118944, -283612, -308589, -190701, -73043, -46531, -57373, -36616, 1703, 22610, 22935, -2983, -57118, -90961, -62936, -37357, -112827, -252144, -306540, -221791, -98534, -28725, 4045, 30728, 26333, -15896, -40123, -9549, 45696, 95449, 144200, 173341, 136572, 45089, -24562, -36894, -31410, -27918, 9948, 83587, 124741, 97818, 54971, 42707, 33077, 662, -6504, 61926, 169712, 235749, 227741, 171005, 101957, 52882, 49343, 85601, 124525, 141666, 144722, 143435, 137696, 141753, 177302, 232917, 269353, 268798, 240642, 187174, 113234, 55882, 39985, 17340, -68181, -158279, -123546, 45168, 185696, 156914, 6851, -110348, -125309, -95297, -93981, -124939, -136817, -86180]
36757h6180R9438Q0800J0321k9938P453O5661N7153k2592r9826j12049n1096M7666
36745c3189J14638Q4605k3727j04771r0471l3692j7313l4614k8086J224N157j9486
36733a79725k8324m939K3816L5761K7366q4k5481r314M6389P7728M4973o280k1755
36720a9869k2318m4181m9608J4980J07072J27460N7782k3254n4457m8071l3474
36709A2062j6839n680j4045k9439j8454K4543O6771P7907N5195J2154l1319n1019
36697H1837l2200J7108O9868Q9389M7905l4104q0589l9554L7819N5746N952l0677
36685A88500j5907j231k5100n1876m5660k3308p26L2224N2870J2998n8879o2327
36673A578K0759P9654L9931k9992m5037k8386k7674j2558M2752O8676O002p3101
$$ y = [-86180, 13258, 94058, 104379, 74441, 81894, 147555, 204708, 182116, 82290, -29759, -80855, -33189, 81449, 166054, 142327, 37556, -52915, -86607, -103920, -138534, -166620, -165396, -160239, -179725, -208049, -212988, -189172, -153411, -126045, -126129, -151610, -160924, -114535, -36807, 8166, 1886, -19869, -42187, -86368, -135976, -120996, -13924, 113536, 171318, 148064, 93607, 45536, 12062, -4777, -10457, -24502, -53941, -72395, -47852, 18919, 96826, 152021, 164175, 132856, 81837, 49637, 66745, 136613, 226002, 273907, 239803, 159214, 119660, 157479, 213225, 219177, 188500, 172593, 171362, 146262, 94386, 48726, 25418, 24692, 56916, 109786, 122784, 63905, 1578, 22337, 101991, 141922, 111930, 66893, 38507, 10833, -1725, 41027, 109703, 115705, 42604]
36661D2604o6116j199J8543j7019k9514M531K3413j2923o7383p7931j7643Q2714
36649a17923J45003J12318K4984k4884k0363k0739l3997m693N2045M3718l1509
36638A23960n9361o249K0699k3134l8645Q395Q97q9597r7004M5553J33772K2090
36626D1376r8464j5606J16548L0588j70848j60184O7545J81312M6205j00115o1698
36615a23341N5794R7773Q7270Q1593M3741k6485l9280R078J223q0024r9177j7174
36603i009K4743l3009m8867N1141J08236k18j24311p1257Q2139J16588M367q7817
36591A2726o9289j4664n352l0512m6950l5120L667M1528L6009q904l6712k6444
36579a80017j8788j9417K8989J20726J39432K7105r2387p4229L0357M9097n1085
$$ y = [42604, -23512, -24711, -6168, -23187, -52701, -48170, -24757, -37680, -105063, -182994, -200637, -117923, 27080, 139398, 164382, 139498, 119135, 98396, 64399, 59706, 111751, 155469, 123960, 64599, 58350, 79049, 55915, 17270, 25665, 26562, -63035, -160039, -114486, 19286, 41376, -57088, -72694, 43854, 74442, -96406, -256590, -189045, -7733, 38472, -61643, -123341, -67547, 30226, 117496, 199089, 242830, 216345, 177065, 186143, 187366, 107342, 8165, -9009, 15734, -17275, -66142, -15001, 93235, 93017, -31294, -102551, -20412, 96176, 100543, 12726, -56563, -71227, -76579, -107091, -154041, -189161, -185494, -143966, -107957, -116861, -153573, -180017, -198805, -218222, -189233, -68507, 70925, 98030, 5643, -68586, -38229, 10868, -40217]
36568d0217j16170l8203P9342O3862p5829j42934j8870J52076J41408l8681j37601
36557a71817k5261J21712J01977n306l267P7477M1986j13718j76464o1672O5009
36546a49344P2338L9328N4007M7690m3280j23754q8142Q728N6061N1764M9000
36535b5604L9636Q3l1420j7606J0251J4774N232j3393m5765l6579P1310J84117
36523A55036J34543m0472j02189K5212J14609l419j61479j31989O826K2772q6677
36512f7227j22056k1068P5895P5300L2115J798k7197m1875L03O9817Q3573L1201
36500I0579k1096m0559m4228l2329l013L316k7930k4809N6233J17375N0260p7565
36488D6234j12092m4609o96k6711m4954j2266K6407M5112O1214N2838j3785p5371
$$ y = [-40217, -156387, -194590, -115248, -51386, -127215, -270149, -289019, -136943, 4465, -34216, -171817, -197078, -75366, 26611, 21305, 18038, 95515, 137501, 23783, -152681, -214353, -149344, -77006, -37678, 16329, 64019, 20739, -103015, -191157, -182429, -126368, -74604, -25604, 14032, 14115, -17305, -34911, -24660, -9886, -4654, -18047, -63812, -100391, -29081, 155036, 289579, 249107, 146918, 172130, 286739, 283320, 121841, -10148, -3322, 19450, -67227, -189283, -210351, -134456, -59156, -27041, -25243, -52440, -94315, -94012, -24195, 59378, 90579, 69483, 28924, -15304, -47633, -50646, -47330, -75260, -100069, -43836, 73539, 123799, 46234, -65858, -110467, -111163, -137874, -182828, -195094, -168687, -123575, -62361, -9523, -23308, -98679]
36476i8679k9730Q8558J29130M0565o7667r8583p2601l5178P091K4290k9600j01317
36464b43721o1334R5767J98184J25390j8014n4852K1406O6678M036q5633q8680
36453d0773N38Q5098P9621J466n3425k5910L6625N0541R373k1679q990J3375J2440
36440A38300J648J765L382j2133m3970p3032p1697k2756M6259P1239L0521j4185
36428E5341l740K7126J0394l5661l2975K5784O7237N9573M7748M8628J2476o6634
36416B15297r5951j4767Q5024O0390q6444j97597j50781M385J22019J21510L9148
36405A02233m6569r0430q7523n4600k2616j4155q729L4854R9122R9477K074r5712
36393h2574p4261M7183J37461J22626M2219m6414j15624j22808l9829N3605L4117
$$ y = [-98679, -128409, -39851, 89279, 129844, 62177, -36406, -109007, -144185, -137094, -112804, -142404, -243721, -305055, -209288, -11104, 114286, 96272, 41420, 62826, 129504, 133540, 47907, -40773, -40235, 44863, 124484, 125950, 72525, 46615, 83240, 133781, 143154, 121475, 112485, 125860, 138300, 139948, 141713, 145095, 132962, 88992, 15960, -55737, -78493, -32234, 39005, 69526, 55341, 51601, 78727, 89121, 53460, 20485, 46269, 113506, 173079, 220827, 269455, 281931, 215297, 119346, 104579, 189603, 249993, 163549, -34048, -184829, -180444, -58425, 63085, 102233, 55664, -34766, -122289, -176889, -199505, -213660, -222389, -187535, -88413, 11064, 13138, -82574, -156835, -109652, 27809, 150435, 192654, 146240, 30616, -92192, -132021, -78416, -44299]
36382d4299o8537p5965P1000J90502J13455o4615j26540l8263M9249N0480K9358
36371H5825L8346K9554l4154r6174r2587m7038k5149l9974m9292k4631J3532K9705
36359b12037K2578K2247L7547L7935J2946Q931N1356P1491j093j00960r7492K346
36347a44205N5398N243m2035j2168J8274k1060n6473J661J01938J33946Q1261
36336A21780j044p3813r5350j8608J03035J19655n054j07104n8007M2525M4518
36325G2533j4609j5768J8377k654l5128K1196J09893Q9143k6039r0847o9831n5576
36313F90p0092m2838J7929K2059k3843j2755O8803J09773O2392O773Q85P771k710
36300A44837r232j3846m2828p1160o1003n2058q3495p1936O2526J91076J12685
$$ y = [-44299, -112836, -188801, -117801, 72701, 186156, 121541, -4999, -43262, 5987, 56467, 85825, 124171, 153725, 119571, 23397, -69190, -116228, -141377, -181351, -230643, -255274, -241742, -212037, -189459, -167212, -129665, -91730, -78784, -69853, -18497, 52994, 51901, -49059, -146551, -144205, -88807, -83564, -125599, -137767, -119493, -140553, -197026, -195365, -93427, 40519, 121780, 120736, 46923, -48427, -67035, 36000, 155655, 150601, 43497, -14510, 28015, 72533, 57924, 42156, 60533, 57879, 22751, 43947, 153840, 242983, 216944, 126097, 56266, 690, -69402, -112240, -94311, -72252, -96095, -108850, -40047, 69726, 132118, 138891, 139776, 147547, 144837, 135605, 121759, 78931, 7771, -53232, -105290, -188785, -260721, -198195, -7119, 105566]
36289A05566j08386j79758k981J75574J32499k4491n8000N0918J24195O3717m8748
36278B30105r7324o5201j6823l906p031K4086P2477N3028m5503r6399p158J15701
36266A56052J01366l8930j42444j32276p3077j8637L6232O4958K7387k6323j5911
36255f1603K0797q899o7543l6513O8860J13928O4640J0990j7195o6509j04182
36244h3229n1690L1354J1807p1505n5950N1082P7865J927j3806O4913P9069j2388
36232B9449n0408R846N279j02291j12512M3704J33158J3395j01836o154J43114
36221D744J06378l3445m9183K9636O449j17084j63007q6477l509L0513M6030K9770
36209a99185k2139j402J49680K57310J29647j15558j81291j6089J30624P8809
$$ y = [105566, -2820, -182578, -185559, -9985, 122514, 98023, 40023, 90941, 215136, 278853, 230105, 132781, 67580, 50757, 46851, 39820, 63906, 136383, 189411, 143908, 47509, 40351, 156052, 257418, 218488, 76044, -56232, -129309, -147946, -111714, -46756, -19369, -45692, -61603, -40806, -49705, -117248, -153761, -84901, 29027, 93667, 104657, 87462, 20953, -83229, -134919, -103565, -91758, -163263, -219213, -168131, -90266, -88339, -102145, -37232, 41837, 29449, -20959, -11113, -5834, -108125, -220637, -176933, -43775, -30380, -132216, -138370, 4744, 111122, 77677, 28494, 58130, 64579, -52505, -215512, -301989, -305498, -274985, -228955, -199185, -221324, -222726, -73046, 184264, 313911, 198353, 17062, 973, 131597, 210406]
36199B10406p5792j56241j20458l3277L8897N6391J7936l1823n3983m9386p956
36188b05286R2172J80073J12584j01032k30009j17377Q1085J19411J0289m2549
36178a00639K3724P7634L3481m7564q6878o4291K0675J30818J64144P0362m5666
36167A75800n7606Q42J4167k3179l5051j9153k4820l2765m082J0656m0380q0131
36155a15702j9711O2687L3172o7513q7544r438N3139O3528P7383Q0021L074j07374
36143c4278j25318m8908N58j6681k0807J9318M1778K4366J4551K1825J3267N278
36131a05051K8369K9680m6170j17970p0207M4521Q0596M1145N1070J12246R7777
36120A46006m628n5872l401M1669J0204k5201j0176q11l6525o7170n8448l7834
$$ y = [210406, 134614, -21627, -142085, -175362, -136465, -80074, -62138, -93961, -147944, -197330, -205286, -113114, 66959, 179543, 78511, -151498, -268875, -187790, -68379, -58090, -100639, -76915, 719, 34200, -13364, -100242, -164533, -143858, -13040, 151104, 221466, 175800, 118194, 119036, 133203, 110024, 74973, 55820, 31000, -1765, -5847, 4809, -35571, -115702, -135413, -72726, -39554, -107067, -194611, -204049, -150910, -87382, -9999, 70022, 73096, -34278, -159596, -208504, -207946, -224627, -245434, -226116, -184338, -159972, -145421, -123596, -110329, -105051, -76682, -47002, -93172, -211142, -281349, -236828, -156232, -115087, -64017, 48229, 146006, 141378, 85506, 82105, 123774, 133978, 108777, 98601, 97790, 61265, -5905, -64353, -102187]
36108a02187l359P4112J33079O1395j06960j89117r9577M1222R6203P3123L8746
36097A6680R98n0135q1744o2122j636P3169J21658P9965n7847j72684j46171k9735
36085c09604L3486K2963L1902P2884O3579L817q078M4309O3304J5175j4449K1060
36073D0348N8133M6610J5490j2231m8282o6305k1241N1464P3994N3339M7023L3199
36061B71541l7723r8259m3771O8151Q2075q576o8154n5607n4294p7122n2489M98
36049g3730k182j8661N2756J31620M5399j35236j47839L5009J40694L8512o5085
36038A257L735J15944R8597M236m8181p2382r2789m0952P0065Q2285m2987j15405
36026c6577k4232P2196L3456k4418K9810R7798O5331L3890R7664J07583o7243
$$ y = [-102187, -105546, -31434, 101645, 163040, 56080, -133037, -232614, -191392, -95189, -22066, 16680, 17678, -32457, -114201, -176323, -177959, -104790, 16868, 96833, 38986, -133698, -279869, -309604, -276118, -253155, -221253, -148369, -84790, -80973, -89051, -44742, 18562, 33737, 19288, 40348, 98481, 145091, 160581, 148350, 100068, 33763, 12522, 63986, 137980, 191319, 238342, 271541, 233818, 135559, 91788, 159939, 242014, 233438, 165284, 109677, 55383, -21739, -74228, -73730, -75912, -94573, -41817, 89803, 135202, -34, -147873, -112864, 27830, 66342, 1257, 4992, 120936, 219533, 223769, 175588, 103206, 10417, -30535, 39530, 121815, 78828, -36577, -60809, 11387, 44843, 20425, 50235, 148033, 213364, 247254, 344918, 452501, 385258]
36015C85258k35932j50005P8457J40367M853q7349m0971k850n4958r5108n1319
36004a09557J5426N2174O8938M4353m6947j18973o6126L8902K7326q4893r8258
35993b77635N6152J96445J55139N347p4656m7634j6922l9407m8817K3281J19203
35982E0496J12177r312r4594l2150P6560O5201l1585l5478O8627R7339j9191j14916
35970A33174p0017P12k6138o7589j0905O6281L7806m6702o3082k3658j2530j4869
35958i7517K0281M3328p083o7847n3298k809P494l221j138k3539n9716l744J34060
35945a14749J58199M240q9671M6337J91256P3163j62952j77794J3829J01783O240
35934D9881n3564M737J6851o3791o3739O3454J24393L1229m4768P812M9704l4825
$$ y = [385258, 149326, -679, 77778, 218145, 222998, 135649, 94678, 91828, 36870, -58238, -109557, -94131, -41957, 26981, 71334, 24387, -94586, -160712, -121810, -94484, -179377, -277635, -221483, -25038, 130101, 135448, 60792, 13158, -3764, -43171, -91988, -68707, 50496, 162673, 153361, 58767, 26617, 103177, 168378, 136793, 101315, 169942, 267281, 248090, 133174, 63157, 63869, 37731, -29858, -40763, 25518, 63324, 16622, -46460, -70118, -82648, -97517, -77236, -33908, -40991, -108838, -162136, -164945, -157451, -160672, -161810, -185349, -245065, -248809, -114749, 43450, 47690, -41981, 4356, 195612, 268775, 105823, -71971, -58142, 43641, 49881, -3683, 1054, 17905, -45886, -109625, -46171, 78222, 109451, 64683, 72495, 122199, 87374]
35922H7374j28463j07501n2755o4819o9635J3370Q5508M0770k1872M4009J68602
35911e412J58261o943j46928j34480k8891M8863O0558M3302L0702J9674n353l4599
35899a246l2491J1142M8387K6591l8495q1176o5666j2876L4254M0454J063l6885
35887a06944j7343L8443N1997J8255K1795Q0609R3385J5403m4565p769K7098m4710
35875A25654j38796j17534j4405M7621O3934R4272R4445R73r3639n8356M4971
35864D9140N5527j6956l1614K3270L3992r401j5416J200n5983j46232j27582p917
35852b47972O5114O0011P5798J06307L9716r2627j20571k1281M3798J3374o8L9204
35840c9197K4738n0430m7485N0282Q1732K194k8842M9092P6366k2824q4267m101
$$ y = [87374, -41089, -148590, -201345, -266164, -335799, -322429, -236921, -196151, -218023, -174014, -5412, 152849, 145906, -1022, -135502, -164393, -115530, -54972, -11670, 19032, 38706, 33353, -1246, -33737, -22595, 25792, 52383, 13888, -67288, -132954, -145830, -111576, -71122, -70059, -106944, -124287, -85844, -33847, -15592, 6203, 86812, 180197, 195600, 151035, 143266, 170364, 125654, -13142, -130676, -145081, -97460, -33526, 60746, 155191, 156164, 62525, 4169, 49140, 104667, 87711, 56097, 79367, 113359, 103958, 88542, 89742, 33759, -112473, -240055, -247972, -182858, -122847, -47049, 59258, 98974, 6347, -114224, -135505, -91707, -78333, -78401, -39197, -14459, -64889, -112374, -62092, 19640, 21834, -7008, 42084, 118450, 95626, 11359, 7258]
35828G258O1171k1685j11244l3002J20273J47153M5696m2259p2460r2675r3420
35817h5194l6190M0689P5415P0946M1442k7508r0977n1921O2995R1544q877p1521
35805A0843K921P4838J8068n1163J3936J19910R0096l9126j01369q1369r2459
35794c4874j38440j09739R607J09445J18878O8591P903k8268m546O2443Q2924
35783A43924J5119n4037l6171K6243M4424J4979k3920p1016j00910l6675J04939
35772B6899J60625M4245r5614r0636n630n50m9692j2207Q6805P7827o2799j59184
35760g9911j03625K913L3065Q342J8143O8329R0920N0680j7368n5511l7851J5521
35748f353O6743R3308Q4189K8816n1011q7341m7844j270j8302m6754k695N4904
$$ y = [7258, 68429, 46744, -64500, -97502, 22771, 169924, 215620, 173361, 100901, 8226, -85194, -121384, -80695, -5280, 65666, 107108, 79600, -11377, -63298, -303, 91241, 82364, 10843, 13764, 88602, 106670, 55507, 69443, 189353, 279449, 240323, 138954, 57585, -34874, -173314, -283053, -273446, -164001, -45123, 23468, 31371, 3103, -1443, 61000, 143924, 159043, 105006, 68835, 95078, 139502, 154481, 130561, 59545, -41365, -78040, 26899, 187524, 231769, 136155, 45519, 39889, 39339, -10353, -22560, 64245, 142072, 79273, -79911, -183536, -180623, -147558, -139216, -121073, -52744, 38176, 88856, 71488, 15977, -21874, -6353, 60390, 153698, 237887, 266703, 215692, 128351, 80507, 79237, 60935, 14181, 11486, 66390]
35736F6390M050j03612q8028N2676J02486l1842j59255j02383M0654Q1117J8725
35725a19022k6470k3960j3475J1585N4062M8074k5244o2134K099P0478M5185j2365
35713e1187j0698J0524j3366l0389J9124P0748N3099J6045R587k6084j08556j08905
35701a70058L3337J47784P3852q3853j36829r8811p7649l5728R5089J94040J16536
35690E7710k6040k3023Q7342J02960J4752j3613K7662j0870j29699j56256m5937
35679a15012N4485O7648O6286P3083K0228o3308n5858L2181N5262j9375p3873
35668D1747o4891o3761o1192K6005J33173R3112n7247q8097M2057J02533j3299
35657I0140j01146p592R7803K0138j21792r9548N0445J13052M6551j056K7744
$$ y = [66390, 70440, -33172, -121200, -68524, 33962, 2120, -157135, -259518, -218864, -137747, -119022, -145492, -169452, -182927, -171342, -117280, -69206, -94450, -156584, -154485, -84007, -38822, -51187, -61885, -51361, -64727, -95116, -75992, -5244, 47855, 63900, 73487, 47403, -61153, -170058, -136721, 11063, 84915, 1062, -135767, -234578, -312227, -347955, -252866, -58826, 57710, 31670, 8647, 95989, 198949, 213701, 200088, 227750, 216880, 87181, -69075, -115012, -60527, 7121, 73407, 146490, 166718, 103410, 47552, 79733, 134995, 115620, 41747, -23144, -86905, -148097, -122092, 11081, 104193, 46946, -41151, 906, 103439, 90140, -11006, -18598, 79205, 99343, -22449, -121997, -71552, 41500, 88051, 86995, 114739]
35646A14739L6964j1197k5861L3495O8669j544j08884j31240n1371M5612Q8210
35635E7592O6418q664j11605j61829o9201J20439K07356P2279j28029j42720K4703
35624g3261J29894N7640l6578j9938J3785l5751p0199P867P9916J4795p6194l1199
35612c9223N8961J3996q7901l5503J16942J12940o0554j31851M026J15727K2721
35601I0281j29452j27863l102P9799P7065N8409N4616M2532J7605j534P1K7546
35589A85973N0187N889r5899j34375m8071L4772j4663r6250l8708R1713Q6116
35578B6684m6417q7007K1480R0594J8886o0559m2346r809l5185m3710J2692M5336
35566a09361J897k9439J0331M5626K2984R567M7094O5517K5302o306N682N5m1954
$$ y = [114739, 151703, 140506, 114645, 148140, 216809, 215265, 106381, -24859, -76230, -30618, 57592, 124010, 115346, 3741, -158088, -227289, -106850, 100506, 172785, 44756, -97964, -73261, 56633, 114273, 77695, 57757, 71542, 35791, -34408, -26541, 53375, 68170, -8024, -39223, 19738, 33734, -54167, -89670, 27272, 140212, 79658, -52193, -48167, 67560, 90281, -39171, -167034, -170136, -90337, -13272, 45137, 99753, 142285, 159890, 158356, 158427, 185973, 236160, 242049, 146150, 11775, -36296, -1524, -16187, -112437, -151145, -59432, 26684, -19733, -106740, -85260, 5334, 24220, -36339, -78685, -88494, -123679, -167389, -154697, -109361, -107464, -136903, -126572, -80946, -57962, -48395, -1301, 64216, 89518, 83212, 88894, 88949, 46995]
35553D6995m8927o656M576l2038l8854q029j8573n8564k7980M9586L7456n2885
35541a53893n1740O2858J08013K1770k5386N0659R4043R511n4115J6180R0552
35530A68452N0064M466O0111J00231R623r2713o7032m121l6642q2792j5782P7139
35518A71004N1852k1463N172P3054K2004j13957j60155q3994l909K8575N4240
35507B2423O3000J1590n4416n5222j0671J2273K0503L9913K6372m0007o9895p620
35495d1757M8502Q675m2837N30O8321L6419n6735r2931p6761q0532p7970r136
35483c16212P0883P8722N8648Q7836J11645M3716n1658n3319J1015K3578k1627
35472D3227l9308j8198j2405j8964m10K3735K3117K6823N0960M7929J3358J8256
$$ y = [46995, -1932, -8588, -4012, -36050, -74904, -82933, -101506, -160070, -188050, -138464, -101008, -153893, -205633, -142775, -34762, -12992, -38378, 12281, 106324, 115835, 61720, 77900, 168452, 218516, 222982, 283093, 383324, 392947, 300234, 233202, 229081, 192439, 109647, 93865, 171004, 222856, 201393, 206565, 279619, 301623, 187666, 27511, -56483, -60392, -31817, 22423, 85423, 97013, 42597, -12625, -23296, -11023, 9480, 49393, 75765, 35758, -34137, -41757, 6745, 15420, -27417, -26887, 41434, 77853, 21118, -71813, -148574, -229106, -307076, -316212, -245329, -166607, -107959, -20123, 91522, 135238, 83580, 30261, 41276, 64854, 43227, 3919, -14279, -26684, -45648, -46058, -22323, 794, 27617, 78577, 126506, 139864, 158120]
35460A58120M9828j2043j54699j75622r856J13239K9979p8390o450J10310M9883
35449G4299q2664m3056J06648J11006k4259o4294K8485O5563K352j7009J8326
35438A75397l4429j48253j19678O3909J65792P7239l8126n1134m0318p4405q2542
35427a06548l3812r901j7189M4040J50706J36073k0789j23028o5118K2413L6621
35416A3468O4518J52270J52676k3051k00638j82339l8526K8396r216k2880K7820
35405c7502N4144J3230k6885q245L3120L3049n292j7070K7942O5088J6589p4618
35393G3550q1257J2624P2165L2107J0796Q8593J29844L310j59234j49407j9962
35382A3129J7156m8240m5314L8801M1191n1152n9764N3057J00545L704o5167J4459
$$ y = [158120, 207948, 195905, 41206, -134416, -144272, -31033, -1054, -79444, -85894, 24416, 74299, -8365, -51421, 55227, 166233, 141974, 77680, 106165, 171728, 174080, 157071, 175397, 140968, -7285, -126963, -63054, 102738, 179977, 141851, 90717, 50399, -24006, -106548, -140360, -150261, -167450, -123410, 27296, 163369, 142580, 19552, -45566, -23153, 13468, 77986, 230256, 382932, 359881, 159243, -23096, -61622, -33226, -42442, -65322, -37502, 16642, 29872, 2987, -5258, 27862, 60911, 55619, 38549, 66491, 131579, 148168, 73550, -7707, 4917, 77082, 109189, 119985, 208578, 338422, 341732, 182498, 33091, 13129, 30285, -17955, -63269, -24468, 16723, -34429, -94193, -41136, 59409, 63113, -2054, 12405]
35370A2405J11884Q6541J2337J0095M0345J8555j6789k526R936m4218j06640q8883
35358D3042j8198J9162R428l503j874O359J5838Q718k9406o2115m6123j9861m9203
35345a27736r4352n5230N3162J10213P9688M1586K5706k1181p9374m6716O5620
35334d8614J02552J372j01370q2091m178J2464k9449n1844k8937J7897P4881J18719
35322a8598J09081M3113l5318r1432j05764m9141O1270J18881N4308l5256j5718
35311C5426O9337P0197k2882q3598p1453n6222l6914N4483J63521J41031j1942
35300B50984j26372j20787p9947n7199o616N6607M2014k7151k1401N5646N3505
35289A9283m9840q8465M939Q0027K7283n6329o0936k9866l1930m2025l6425m4057
$$ y = [12405, 124289, 210830, 223167, 233262, 273607, 292162, 275373, 272847, 282783, 238565, 131925, 43042, 24844, 44006, 53434, 49931, 48057, 54416, 70254, 78972, 49566, -12549, -58672, -78533, -127736, -222088, -277318, -224156, -113943, -34255, 7331, 33037, 11856, -67518, -114234, -48614, 53938, 55310, -46060, -128151, -132329, -119865, -149314, -201158, -230095, -212198, -137317, -18598, 90483, 133596, 98278, 6846, -98918, -148059, -86789, 32092, 86400, 51144, 35426, 104763, 174960, 152078, 68480, -2973, -59195, -96109, -41626, 121895, 262926, 250984, 124612, 3825, -76122, -133321, -139937, -83330, -41316, -68467, -89868, -34222, 19283, -30557, -119022, -114083, -34056, -6773, -63102, -124038, -153904, -185834, -227859, -264284, -308341]
35277c08341l9427M3124J42855J15147j5852o3324J3458M3169m6271j00013j6587
35266b32062Q5213R2362O3716N6967J2232p5784q7554L643N7077J3354m531N8370
35254D3003P6401n425n3847m310J4963n5461q0969o405J9453n3991m3305J19195
35242c0698J96780L3876j49826j05001O0659J09472N5771M0476L1146o1814j41661
35231C9180p8167M2419P1563N0996P2213N3296q7381j99583j16714M2021N8091
35220e2066k8892k4265P5959J14401N6892k667m0607q2200p1165L1043J14700
35209I1133Q2368J8386J4190j6690j41738k07028p6938R3572R1324q235k676Q0063
35197A7731P6115J291k1207k1370p8703r1572M3143J55052L7870j60173j41331
$$ y = [-308341, -347768, -304644, -161789, -46642, -62494, -125818, -112360, -69191, -115462, -215475, -232062, -146849, -54487, 9229, 66196, 78428, 2644, -84910, -81267, -24190, -10836, -15367, 43003, 119404, 113979, 60132, 55822, 70785, 15324, -65645, -72050, -52597, -106588, -149893, -30698, 166082, 199958, 50132, -54869, 5790, 115262, 171033, 211509, 242655, 180841, 39180, -38987, 3432, 74995, 125991, 198204, 251500, 164119, -35464, -152178, -110157, -52066, -80958, -105223, -29264, 85137, 142029, 139362, 98755, 16555, -54610, -23567, 91133, 173501, 191887, 206077, 189387, 47649, -159379, -236317, -142745, -51421, -59656, -62332, 17731, 93846, 95137, 73930, 52560, -26143, -117715, -74572, 80480, 118350, -41823, -183154]
35186a83154M5266R3265l7598q4723L9822J22139M2269n0845l7051P60j5289k8469
35174i3608l192K044k6764k9216k862q1n407K1038K6827l1572n2926M3350J20926
35161c1443L2011r3751m2199J07567J11785j1775k8867Q1966J00747k8202j04017
35150I3822k5878O4863N4206k327m9230r6372r7799o788N9588l2779j57132q4496
35138b80322J14139J50650q276j01761k2775N5746M5968O6549J23309M1843j63907
35127B1163k15918j9310J47763P0603q0987o9733M3661P4614K9245J7969K6278
35116D5348j7986p3048n3761J8343O1992M9627n787q0411j05772k2112R7343J04854
35104A8630r651r9863p4907J0987Q6167J28843J10057K5137l3405O480M5784l8980
$$ y = [-183154, -137888, -44623, -82221, -166944, -127122, -4983, 37286, -13559, -50610, -49850, -65139, -93608, -96800, -94756, -121520, -150736, -153598, -153679, -159086, -138048, -111221, -142793, -195719, -152369, -31443, 568, -93183, -135382, -27815, 83970, 72195, 43328, 125294, 226041, 197839, 93822, 67944, 132807, 187013, 184686, 135456, 39084, -58715, -65503, -5915, -38694, -195826, -280322, -166183, -15533, -23809, -125570, -148345, -92599, -46631, 19918, 143227, 185070, 21163, -194755, -214065, -66302, 4301, -76686, -146419, -102758, -28144, 1101, 19070, 45348, 27362, -45686, -99447, -81104, -19112, 30515, 24728, -55683, -161455, -183567, -86224, 18630, 8979, -90884, -165791, -154804, -68637, 60206, 170263, 195400, 161995, 168475, 214259, 175279]
35092A75279j58073j31165J0516Q3126N6911M6556M9240k4600j04416m8006N9104
35081A4472J5978j12062p6564J00852J39843j1792r8052j7989L2021l1440k8272
35070g3005R8608J35485m794j00887j1756R1976O0834M408J8896m511j14147j46691
35058d5584k8980N9490L127n8115j9618M646m2663j5931J23684J68290K7161q4227
35046I1280k0920M5313k8370q9275p436N7134l4175j19209l5394Q4874Q5844P2331
35034A01997J49652J66564J1450j11757j5472J22048N9417r8098j19106n0092
35024B16603o3288j06206m1882M1584p561r5301m9114N8816N7396o822O861M5372
35012E6458j3011r4547p0832j0751k3121j9696Q8794J49031J6890j36131q7592
$$ y = [175279, 17206, -113959, -103443, -20317, 36594, 83150, 132390, 107790, 3374, -44632, 14472, 30450, -81612, -158176, -57324, 82519, 70727, -27325, -45314, -13293, -44733, -73005, 25603, 161088, 156294, 55407, 43651, 135627, 196461, 200869, 219765, 215254, 101107, -45584, -74564, -15074, -11947, -70062, -89680, -85034, -127697, -143628, -19944, 148346, 175507, 91280, 70360, 115673, 87303, -1972, -9408, 47726, 13551, -105658, -141052, -56178, 29666, 101997, 251649, 418213, 429663, 317906, 302434, 424482, 483899, 385801, 266695, 216603, 153315, 47109, 5227, 46811, 39250, -56051, -105165, -46349, 11047, 4225, 11086, 56458, 43447, -51100, -121932, -132683, -155804, -175500, -86706, 62325, 79215, -56916, -144508]
35001a44508M7928L4430n7171l555J34639J16173m1964j02812j9843L5782M439
34990C538k2770l7623r0062r8735K3585J37520O4619q3227o7283P6064J15878
34979B1504K8089j1216L1011L3225k511K2508N1404l8641j50198r2503N7369N6212
34967F253q0941j05704K8753J07688M6072K509N7903R0582L2582k4205l3581n9569
34955F8342r6367n7529K9967M5351m014l220L7387N364p1225n1181N4977R3195
34943E1047L7260J0309L8762K7820j9443k028N8254L5502n8028q2901k5586p596
34931F3372m4393l0544L3394L2125m1347p7161o3077q8241j37486j00016J9188
34920d34186J00772J08661R4077M6121n7505j13148k7383Q0135M7249m1307l72
$$ y = [-144508, -96580, -62150, -119321, -122876, 11763, 127936, 85972, -16840, -36683, -901, 3538, -19232, -56855, -146917, -245652, -222067, -84547, -19928, -103155, -170438, -94374, 21504, 49593, 38377, 69388, 102613, 100102, 122610, 174014, 135373, -14825, -107328, -49959, 6253, -74688, -180392, -151639, -43951, 2121, 4630, 62533, 153115, 185697, 161492, 127911, 68342, -28025, -85554, -55587, -10236, -14250, -17470, 19917, 25281, -45944, -97125, -42148, 51047, 88307, 98616, 137378, 165198, 145755, 143727, 201981, 237483, 179455, 96554, 70968, 63372, 18979, -11565, 21829, 53954, 12607, -64554, -127631, -215872, -353358, -453374, -434186, -333414, -224753, -130676, -84555, -142060, -255208, -282591, -202456, -155207, -196514, -196886]
34909a96886J06257O6674q9765j27235k206Q9171N7099Q173j0805o2145j06331
34898b67999l2858R2180R2131r304k7675M5699M8485k1773q05J09501J22318O358
34886A56258o4727l3263k5533p1666n8324J2777J5932l2777j428O5960O385j16670
34874a47076p7547R1526J22032j6575o2332N4602Q5221o8686j62743m6102Q2656
34863a45024M0573n1216l6462J5548O312o41M2321M1781l3434n8307J1651M7312
34851a19586o01m402P9381J10126L0637k4114J3232L4915P57J4406P1063K1901
34839B27715j17346j31431J6379R1980m663p3131R774Q2241L1677K922Q0894Q7647
34827C04658q2634k18883j20358Q2631J60092J09215M5212j9163r0568r0533p174
$$ y = [-196886, -90629, -23955, -113720, -240955, -243161, -153990, -96891, -88718, -99523, -161668, -267999, -300857, -208677, -116546, -125850, -153525, -107826, -59341, -81114, -81919, 27582, 149900, 156258, 91531, 58268, 32735, -38931, -97255, -84478, -68546, -101323, -102751, -36791, -30406, -147076, -224623, -133097, -11065, -27640, -89972, -35370, 49851, -18835, -181578, -227680, -145024, -104451, -155667, -192129, -176581, -170269, -170910, -128589, -86808, -120242, -178549, -166898, -119586, -120187, -124589, -45208, 64918, 95555, 71441, 84673, 119588, 120345, 134751, 205814, 227715, 110369, -21062, -4683, 87297, 82634, 9503, 19277, 101518, 133195, 136117, 217011, 304658, 222024, 3141, -117217, -34586, 125506, 234721, 279933, 260770, 170202, 79669, 72495]
34816G2495L5040q144j7471M7567N8634k0952m4094L6224O3301k2974o8670j3517
34804A17439j1278j06040j11256K9554R4405k3621j10292k0765O1172j6922q8307
34793a85911O261J18037Q5870L3478R1112J09059n1179k05867j41438J7674M1617
34782h1287k0068Q669Q6836O7097j4221l4671k5113o5718r1839k5810N1666N7411
34770h7048N9743J00654P1129n5884j00178K3628J23934N7389k2292L7112J07075
34759C15262M1846m4228k2038q172j09202j67800n1685O0341j5633j24029m7785
34748a73123J03196J08643K5133K5968N7429j3331r7114n6449L438n9869j17701
34737a93780j902J38773O9267j01699q6122J07077K10666J30022J7174k3589k8778
$$ y = [72495, 107535, 99391, 81920, 129487, 188121, 167169, 123075, 159299, 222600, 199626, 130956, 117439, 106161, 121, -111135, -81581, 12824, -10797, -121089, -141854, -80682, -97604, -185911, -179650, -61613, 24257, 57735, 148847, 257906, 206727, 860, -140578, -122904, -81287, -101355, -92686, -5850, 61247, 47026, 12355, -12758, -78476, -170315, -196125, -144459, -87048, -27305, 73349, 144478, 88594, -11584, 12044, 135978, 193367, 171075, 208187, 315262, 357108, 312880, 290842, 282670, 173468, 5668, -46017, 14324, -1309, -125338, -173123, -69927, 38716, 63849, 89817, 147246, 133915, 36801, -19648, -16210, -76079, -193780, -195682, -56909, 12358, -89341, -175463, -68386, 142280, 272302, 289476, 265887, 237109]
34726B37109l0376l8487r1776j54914r8663O4641J20410o089q9578J6088J16367
34715D4732L3978o4190J4806J28493P4488l7312k0936K8794m3862j20936l9840
34704a785P7196N8350K716L4986J4640j54986k24723m657K24858J41994o3661
34693A04928l5690J26065R6200o5262p0388K8766k4043j50243p9154J05133R9147
34682A35459n0981m8323Q5846P3974o6629o3925P4237Q1444n1763p9598J7890
34671A07631L2854l4639m805P6400K4896o7275J5078J40500K7595j87399j36127
34660e291J06341J24855r6144j54210L8028J25398j7966r7246J1097N3868p0551
34649A8179j20111r74N6466l0762l7669J01626J38860j4262j09307k0133N5685
$$ y = [237109, 206733, 168246, 76470, -78444, -177107, -112466, 7944, 1855, -87723, -71635, 44732, 78710, 14520, 29326, 157819, 232307, 194995, 174059, 202853, 158991, 38055, -1785, 75411, 133761, 136477, 171463, 186103, 31117, -193606, -198263, 26595, 168589, 104928, 69238, 195303, 291503, 226241, 155853, 184619, 160576, 10333, -68821, 36312, 135459, 84478, 36155, 122001, 195975, 129346, 65421, 139658, 221102, 169339, 89741, 107631, 140485, 105846, 101041, 177441, 202337, 135062, 150140, 290640, 318235, 130836, -5291, 101050, 225905, 129761, -24449, 13579, 138977, 121011, 23765, 34862, 88730, 18179, -101932, -102906, -46440, -77202, -114871, -13245, 125615, 111353, 2046, -18087, 37598]
34638C7598J0261J4022J31678J60861J8311r6530p2079n0474r6687p1255M7679
34627C3385P9238j4019m9790J5729J3060q4132r7117j933K3295l5450O42J20549
34615C457J10068l4950q4702K38L0345j1190L8431J21561K0697j69569j27985
34604a03599J09828J71834n265q9839K4644O8309m9796r2955n986j5408j15766
34593a03999l0297K01202J94387q2131j97647j1659R7845m4506j10481O5877J64837
34582A43428J5801o5099J03184K01871J7022j56585p4756L2503m4157j00253J8749
34571I1708P5339p1840j42523L2853J54930N657j37982k7070J08124K7225p2148
34560D4273K1602J16404K1264p3456l091L2034r3857j23429P2713J69018k6525
$$ y = [37598, 47859, 61881, 193559, 354420, 372731, 276201, 204122, 153648, 56961, -14294, 33385, 112623, 98604, 48814, 64543, 77603, -6529, -103646, -105579, -82284, -117734, -117092, 3457, 113525, 78575, -6127, -5889, 24456, 13266, 51697, 173258, 193955, 24386, -103599, 6229, 178063, 172798, 82959, 107603, 175912, 126116, 33161, 27175, 11767, -103999, -134296, 66906, 261293, 179162, -18485, -30144, 67701, 23195, -87286, -21409, 143428, 159229, 94130, 197314, 399185, 416207, 259622, 184866, 217369, 173212, 72959, 91708, 167047, 95207, -47316, -14463, 140467, 146124, 8142, -18928, 89196, 116421, 44273, 65875, 182279, 203543, 130087, 126996, 159030, 65173, -58256, 14457, 183475, 156950]
34549A56950j64107K6219K13143N1934j90806j23874R8165J23162J6715Q036M725
34538B20262j26827j72266L2991J91331L4708j52065k4141J86312Q3870j85941
34528H8234k19467l9825N9749P9398J74652K16074K2257k02071j66246l412p316
34517B027j06000o4327M2395K0464l0382N4802J29888K4107p9573J7235J20710
34506A31346J2757j05698N343J46707N4895r5555m7431M4439l3380r0332O2789
34495H5880J55913m3300k05721j2330J96283P406k67086j26146J90325J23945
34485A05169j83142j59240J52402K06892l6982r9019J03871J58559k6600q6469
34475A35441P5048J38696Q099n9219q644o2480j99473j47204P2289J43947K4392
$$ y = [156950, -7157, 19062, 232205, 284139, 93333, -30541, 67624, 190786, 207501, 215537, 220262, 93435, -78831, -45840, 145491, 180199, 28134, 3993, 190305, 274175, 88234, -131233, -171058, -111309, -31911, 142741, 358815, 381072, 179001, 12755, 9343, 2027, -103973, -168300, -125905, -105441, -135823, -81021, 48867, 72974, -6599, 10636, 131346, 144103, 38405, 43748, 190455, 245350, 149795, 102364, 146803, 113423, 23091, 85880, 241793, 198493, -7228, -19558, 176725, 184131, -82955, -209101, -18776, 105169, -77973, -237213, -84811, 122081, 85099, -13920, 89951, 248510, 221910, 135441, 210489, 349185, 357284, 298065, 289421, 226941, 27468, -119736, -47447, 96500, 120892]
34464A20892k2147N4271M7273m8002l5797O0038N3835J48O8484J39109J1481j41846
34452C07739m6196J32452O4213j24497r4159N2541j1085j65970p0627J30714L7167
34441B12292k23527j78399J32498K24661J8756j10650p0882j05924j73799m819
34431b79793K60864K22007m1907j00320K9153l0573k09193r0321K24632K12172
34421A96721j05714j62932J26134K25471k8683j66735J5151J35219O908n7868
34411A83672O1370O0914j22107j43719N8701J29162J172J1422J72671J05619j64779
34400C54098j60155J39057J79574j60997l25282q6195P2374j02705j82692P7505
34390a95418K58062P8076j00981l543P4166o8007j12136R7334J68950r0570k46385
$$ y = [120892, 98745, 153016, 200289, 152287, 116490, 176528, 230363, 230511, 298995, 438104, 449585, 307739, 261543, 393995, 458208, 333711, 239552, 292093, 281008, 115038, 44411, 175125, 212292, -11235, -189634, -57136, 167525, 186281, 75631, 4749, -101175, -274974, -279793, -18929, 203078, 161171, 60851, 90004, 59431, -149762, -240083, -15451, 196721, 91007, -71925, 54209, 279680, 250997, 84262, 99413, 234632, 241540, 183672, 245042, 305956, 183849, 40130, 98831, 227993, 229165, 240587, 413258, 518877, 354098, 193943, 333000, 512574, 351577, 26295, -59900, 12474, -90231, -272923, -195418, 62644, 140720, 39739, 36196, 110362, 42355, -69781, 27553, 196503, 105933, -140452]
34379a40452j5001K06113O8020j25580l8610R6012J241r8245M1202J85216Q4277
34368B64193n9918k1344L9479k4299k8422J08615J26190n9673j34842J5792O8154
34357B93925r3010j17488J07254J70278r3504k42149k6728J48789m836j39315
34347C216K1420J48691j1738j16026Q6223K07558n7996l09507j31638J79632J82757
34336B02592K5529K6796N9446o8800j33095M6917J66249p008j47091K7263K00191
34325C98989M9988j45914n6366Q3781k9434j67160l7669J34282N8267p0983m630
34314B13151O7100m2804r9811L9224N5301j96764k90545J0844K42861N3406j47753
34303i5790K7488K07352m199k36699n4818J96110M8147j92399m2202K28379J23084
$$ y = [-140452, -155453, 50660, 118680, -6900, -45510, 50502, 51743, -46502, -5300, 179916, 264193, 204275, 182931, 222410, 198111, 169689, 278304, 404494, 344821, 209979, 225771, 293925, 200915, 83427, 190681, 360959, 267455, 25306, -1422, 147367, 142531, 3216, 24636, 173327, 161589, 45563, 131786, 339344, 281348, -28159, -159797, 19835, 202592, 228121, 254917, 314363, 245563, 112468, 159385, 325634, 318626, 171535, 198798, 398989, 448977, 303063, 246697, 330478, 301044, 133884, 96215, 230497, 288764, 217781, 213151, 280251, 237447, 137636, 176860, 232161, 35397, -255148, -244304, -1443, 51963, -95790, -68302, 139050, 134851, -101848, -156666, 39444, 87591, -104808, -147010, 81369, 204453]
34292B04453j36635o7500J45476M7214j86194j07471J30166J00188o8818n891
34282E4988J31010P7j79754l1016K06456J03462j27771l7959J97673J40227o0583
34271C96810m529J35318k6409k59237j16468J72625Q8595k12765k04330L5919
34261E529M2332j13714j1937K38158J90022p0311r6878O9732M9631r0451r578
34250B02535J63512O1951j65444j24083M4293n2985k51453j24718J69914J68023
34240I1545l4922k0104J18709J6404j62026k2801K26395J21885j53515j00546
34230H1024J43837R3901j27404o0036J39415p665l05897j88996J98065K33188
34220A99432n4363j03149J00528Q0297j34303q2995J70222J48931q0784m1267
$$ y = [204453, 67818, 318, 145794, 193008, 6814, -100657, 29509, 129697, 60879, 54988, 185998, 186075, 6321, -24695, 181761, 285223, 157452, 119493, 317166, 457393, 396810, 392281, 527599, 501190, 241953, 125485, 298110, 386705, 173940, -30390, 5529, 47861, -65853, -77790, 160368, 350390, 280079, 183201, 252933, 302564, 212113, 202535, 366047, 427998, 262554, 138471, 182764, 129779, -121674, -246392, -76478, 91545, 56623, 36519, 155228, 171632, 9606, -13195, 213200, 335085, 181570, 81024, 224861, 318762, 191358, 131322, 270737, 263072, -42825, -231821, -33756, 199432, 145069, 41920, 142448, 222745, 88442, 5447, 175669, 324600, 243816, 202549]
34210B02549J94661J44894j13517r6274J12001K5743k47353j89999R7069P7974
34200B07748j59024p4821K33393J92674j26130j36685J29008J10583j62500j48072
34190F6174J11046P8561j81352j21828J74652J36892j50357j01412J87080J04810
34180C04266k34711j66273K16810K06388j45912j22568K40276J96606k45011k96399
34170d6528J14164K19535j15215j96116R9066J22774j88090j62331K27428K44048
34160C18735j65884k22226J81186K58624j40275k42439J34826K46743r2816j55607
34150A20867K28386L08852j02064k41855J17433K46738q2669j77863J39104J52317
34140G09246k74365l45663J07357K41219j72857k91276J46222K94011j31646k76511
$$ y = [202549, 397210, 542104, 428587, 332313, 444314, 470057, 222704, 32705, 129774, 207748, 48724, -26097, 207296, 399970, 273840, 137155, 266163, 376746, 214246, 66174, 177220, 255781, 74429, -47399, 127253, 264145, 113788, 12376, 199456, 304266, 69555, -96718, 120092, 326480, 180568, 58000, 298276, 494882, 249871, -46528, 67636, 287171, 171956, -24160, 74906, 197680, 9590, -152741, 74687, 318735, 152851, -69375, 111811, 370435, 230160, -12279, 122547, 369290, 276474, 120867, 349253, 658105, 556041, 314186, 431619, 678357, 595688, 417825, 556929, 709246, 434881, 89218, 196575, 437794, 264937, -26339, 119883, 413894, 282248, 5737]
34130E737J71063L48244r4413l03036R7225K67362j64398l30023J77856M65343
34120F40960L7841k72615M7989K33663j72912l80774N1760K85641j47836l74052
34110e0335J17650M13746p9622m44795K0888M63535J00195l32628n0254L13696
34100D72076L1873l06570k9979K86932J8839k61368K2671K76788l0567k49448
34090B31247J40711M15633o66l64504l7365K80744m3051l28439K1127K92210j04884
34079E02763m11110q152L30411k4211k79187J82233M88202l2967m48154J7286
34069C17114M30117p2526n77774j25134M56651J65796k82483M3280M36830K0806
34059H12677m40821m6829M14948J6019m35176K6354N68597J51912m27552r3868
$$ y = [5737, 176800, 525044, 430631, 127595, 224820, 492182, 327784, -2239, 175617, 640960, 678801, 406186, 454175, 687838, 514926, 134152, 185912, 471553, 323717, -50335, 67315, 481061, 401439, -43356, -22468, 441067, 541262, 208634, 158380, 472076, 503949, 197379, 167400, 454332, 473171, 211803, 234474, 511262, 480695, 231247, 371958, 787591, 786925, 422421, 385056, 665800, 622749, 294310, 315437, 607647, 502763, 91653, 83501, 413912, 389701, 110514, 292747, 780949, 747982, 299828, 317114, 747231, 674705, 96931, -28203, 428448, 594244, 311761, 355041, 791871, 812677, 371856, 325027, 739975, 755994, 320818, 347172, 915769, 1067681, 640129, 546261]
34049E46261M05930J5417n08701j04049M49167N2652n08592r9980M94655J00750
34039H43510n10114j23029N26413K11834l73500n1045M57313J1179n62187o0511
34029C69863O13896J33690o11719j97928N47892J77368n13024q5593O20584J24906
34019A179935o77037j85330P24531L41545n50368k23939N81606J49622p54661
34010E85904l57021N94283K84978n66380j60967P28366K61202p18710k62815P56588
34000A145428K66875q57969l98434Q28827M77447p53032m76967P02213M37791
33991A372179o60476k71448Q83956L84759r57139n16355R33785O12880p93918
33982I88223m50719R55033N00393j068273o24851J112304P99811r68759p26738
$$ y = [546261, 952191, 967608, 458907, 354858, 804025, 856677, 348085, 248105, 742760, 843510, 333396, 210367, 736780, 948614, 575114, 524069, 981382, 992561, 430374, 369863, 983759, 1117449, 505730, 307802, 855694, 1033062, 520038, 434445, 1055029, 1179935, 502898, 317568, 1042099, 1383644, 833276, 609337, 1190943, 1340565, 585904, 228883, 823166, 1108144, 541764, 380797, 1109163, 1370365, 651655, 388840, 1145428, 1412303, 554334, 155900, 984727, 1462174, 709142, 232175, 934388, 1372179, 711703, 440255, 1324211, 1708970, 751831, 235476, 1169261, 1782141, 988223, 537504, 1492537, 1992930, 924657, 299806, 1412110, 2211921, 1243162, 516424]
33973E16424J036151P88266j000624p00818J186363Q53650j180452q67737J312671
33964A943894J059649j230627j017837J403968J282826j162759r69429J657431
33956B967116J460970j364426j178339J888698J775014j477266j338295K260763
33948D994235K279309j455112j320835K921635K951929j421352q18928N007614
33940A3138495N304217l25747P65764R557211J1386327M938773P905028K1919583
33932G4589651K5064299J9052329M4144518J09616537J45055100P8085557n5196291
33925D40411700j38795511j17506857n1639234j9493826k3487392k2630644q640113
33918E8218123l736042j0717515j1178263k475303L05093n283081o436847p12175
$$ y = [516424, 1552575, 2340841, 1340217, 639399, 1825762, 2679412, 1498960, 631223, 1943894, 3003543, 1772916, 755079, 2159047, 3441873, 2279114, 1309685, 2967116, 4428086, 3063660, 1885321, 3774019, 5549033, 4071767, 2733472, 4994235, 7273544, 5818432, 4497597, 7419232, 10371161, 8949809, 8130881, 13138495, 18442712, 18116965, 18882729, 28439940, 39826267, 44765040, 52670068, 74589651, 99653950, 118706279, 162850797, 272467334, 417522434, 495607991, 440411700, 301616189, 184109332, 132470098, 112976272, 89488880, 66858236, 58218123, 54482081, 43764566, 32586303, 30111000, 30416093, 25133012, 18696165, 17983990]
33910A7983990J014969l422876m423302N5255J425075k273613l282394L14425
33902G391529J492412j584015k505647M52854J367837j369631k170964N49073
33894C623448J495198r62457j841746N30162J474347p34322j734259K38359J174471
33885C263201o32616j454597L27355J174653m97652j334563K40277J083240l41526
33876A827772j099338K50398R21108m20308j059046K80544R30907l78425j044005
33867B09607K21781R05034k93721r62729J94030Q67606k12265q19136K75619Q74976
33857A260802k55467r45154J01129Q05323j57617q20553J29753Q12891o3438o86549
33847A81120K07107Q27253j15106q67189o1574O84261m884o65409o221N85865
$$ y = [17983990, 18998959, 15576083, 11152781, 11208036, 12633111, 10359498, 7077104, 7391529, 8883941, 7299926, 4794279, 5247133, 6614970, 5245339, 3074375, 3623448, 5118646, 4156189, 2314443, 2844605, 4318952, 3584630, 1850371, 2088730, 3263201, 2630585, 1175988, 1503343, 2677996, 2180344, 845781, 1086058, 2169298, 1827772, 728434, 978832, 1899940, 1479632, 420586, 701130, 1632037, 1253612, 209607, 431388, 1336422, 1042701, 79972, 274002, 1141608, 929343, 110207, 385826, 1260802, 1005335, 60181, 161310, 966633, 809016, -11537, 118216, 931107, 867669, 181120, 388227, 1215480, 1100374, 233185, 171611, 855872, 850988, 185579, 179358, 765223]
33837G65223q7510o41693Q7470P03897N673o74188j20120M48333r5440n59642
33827a67997R2007O04880o7983o35264J7490O32870M6014n56431J950O02172P3539
33816F43247n34712q5168M31625m5390n11426M8482N63010k4580o09680l8485
33806a63077O33010J72144m81152j05668M36776k9122o44393k03656M83790J76416
33796B75068m28488j32961M39701J56522l95987j43974L49234Q5565l35705N6976
33786g4049O06936K72799l45496j94751K24353k2847l91527p296M69299Q0602
33776F18023m95854k03846L55381J06026m17714j63497L56837J01886m15243j21401
33766b79402M96491L07362l12530k60738J90935O9935l18145o7808M19048J76495
$$ y = [765223, 677713, 36020, 123490, 827387, 833060, 158872, 38752, 487085, 391645, -167997, -75990, 528890, 460907, -174357, -156867, 476003, 522017, -34414, -32464, 569708, 643247, 108535, 23367, 454992, 409602, -101824, -53342, 509668, 485088, -124592, -163077, 469933, 642077, 160925, 55257, 492033, 462911, -181482, -385138, 98652, 275068, -153420, -286381, 153320, 309842, -86145, -230119, 119115, 204680, -131025, -74049, 532887, 805686, 460190, 265439, 489792, 466945, 75418, 68122, 537421, 618023, 122169, -81677, 273704, 379730, -37984, -201481, 155356, 257242, -158001, -279402, 217089, 524451, 211921, -48817, 142118, 212053, -106092, -173900, 245148, 421643]
33756D21643l78516j97692L68655K42460l11128k36311K64407J82799l02734k17136
33746a63553K73129K08779k63171j95642K93143K73633j76673j76534K08078J43017
33736D24206k86920k53710J69197J72278j89474j52880K08561J60489j85174q6677
33726b0104L11746K15297k63674k99090P8796J01660k21510j86544J67615J59699
33716D3891j45177p9072K51025J47909k67414k42479J60586K02943r9396p5587
33706a02771K21268J33558k42269k07718J58701J53479j60186r6994K56515J93690
33696C07273j97554j84729J63521J10417k72225k10932K52682L11333p0733j26715
33686H2338K04847J98694j90352k28951J44809J98668j59083k24393R9211J29881
$$ y = [421643, 43127, -154565, 214090, 456550, 145422, -90889, 173518, 356317, 53583, -163553, 109576, 318355, 55184, -140458, 152685, 426318, 249645, 73111, 281189, 424206, 137286, -116424, 52773, 225051, 35577, -117303, 91258, 251747, 66573, -20104, 291642, 506939, 243265, -55825, 22971, 124631, -96879, -283423, -115808, 43891, -101286, -180358, 70667, 218576, -48838, -291317, -130731, 72212, -27184, -102771, 118497, 252055, 9786, -197932, -39231, 114248, -45938, -142932, 113583, 307273, 109719, -75010, 88511, 198928, -73297, -284229, -31547, 279786, 209053, 82338, 287185, 485879, 295527, 66576, 211385, 410053, 250970, 26577, 125788, 255669]
33676B55669k17338k55988J10659K04227q7288j22054J74936J49938k37577k63910
33666b88726J55268K59464j16397k38834J11386K51558o4943k19851K4872J12468
33656a3735j38149j79072J15730J62599j46272j88122J45355J90549j72885k23302
33646d47304K13141L62232p0753l42844l6788K47868R6350k3342J75806J96701
33636C71067j87125l77228n8700J85181l5239k25425l925J97925L6149r3794R7951
33625i3163K05979l5855k03921j8470J26127k0911p7143J50537K22611o2573k23829
33614c0611o600J35237n7306j50277R4496K26257l426j45948M9590J39465j14758
33603A36119k48913j0770J33993o7284j35782J78774L43440L1091k41958p1613
$$ y = [255669, 38331, -217657, -106998, 97229, 9941, -112113, 62823, 212761, -24816, -288726, -133458, 126006, 9609, -229225, -117839, 133719, 68776, -151075, -126203, -13735, -151884, -330956, -215226, -52627, -198899, -387021, -241666, -51117, -224002, -447304, -234163, 128069, 57316, -285528, -322316, -74448, 21902, -1440, 174366, 371067, 183942, -193286, -251986, -66805, -102044, -327469, -331394, -133469, -97320, -191114, -93163, 112816, 76961, -126960, -145430, -19303, -40214, -117357, 33180, 255791, 193218, -30611, -37211, 98026, 40720, -109557, -15061, 211196, 207770, 61822, 111412, 250877, 136119, -112794, -123564, 10429, -56855, -192637, -13863, 329577, 360668, 118710, 47097]
33593D7097J27143j8833j52125J7582R9799j49041k46095J05088L65226J02727
33583B98568k31797j54852L1563m6828j06520J14547K32302k8278k20312l772
33573a15379J88169n873j67026N9001K30369k4213k29702M0119K97837K8491l30251
33562b8458j91432J20526L6989j98421q1390J60397O6263j29788O209K16160O0813
33551C7868j83209l5506K59633K00392m0206j9071R6633p4326k92025j31920J56737
33540b5000R1607j41033p5163J36794O5299j35084n5479J37695M4605j47253k2524
33529a25536K22538J37459j13041p1289J37120Q0840j26828q3726Q5605o416k11167
33518g4441j24378J08510P7262q0578L1264K44248J26398j53560j11495J40468
$$ y = [47097, 174240, 155407, 3282, 20864, 120663, -28378, -274473, -169385, 195841, 298568, 66771, -88081, -56518, -103346, -209866, -95319, 136983, 108705, -111607, -115379, 72790, 66917, -100109, -41108, 189261, 165048, -64654, -24535, 273302, 301793, -28458, -219890, -99364, -62375, -260796, -342186, -181789, -115526, -245314, -239105, -22945, 37868, -145341, -180847, 78786, 279178, 238972, 219901, 316534, 242208, -49817, -181737, -25000, 66607, -74426, -149589, -12795, 52504, -82580, -138059, -364, 44241, -103012, -125536, 97002, 234461, 121420, 50131, 187251, 268091, 141263, 57537, 143142, 136726, -74441, -198819, -90309, -13047, -93625, -62361, 181887, 308285, 154725, 43230, 183698]
33508A83698J20697j00973p1298J44586R5642j65757j76940O0564J15843n0740
33498A55322q1796M6622L6377q1629k6407J11965K9402j52049r7095O1688k8393
33487b5993k07057p0846K17518J81643q0025p4653J64608J72751n1508q7276O1065
33476B00227M227k07340j47824J28007J37677j24707j72745O4069J44536k4994
33466A133n2665J38545J65188n5530j52101j8339L0152q1564o7165R2337Q8184
33455H8175p2119m6019J54708J48321q2298j42495K2098M1913j32308j30358R1339
33444e9043J33531q6097j70881Q869J02578k9209q6287M4169Q6730l5615n0663
33433a41918Q2771P6716p7767n1249J55667J54353r1959j60618M6350J15312r6815
$$ y = [183698, 304395, 203422, 132124, 276710, 372352, 206595, 29655, 90219, 206062, 155322, 73526, 120148, 156525, 74896, 48489, 160454, 189856, 37807, -59288, 2400, -25993, -233050, -303896, -86378, 95265, 15240, -59413, 105195, 277946, 226438, 139162, 200227, 204454, -2886, -150710, -22703, 114974, -9733, -182478, -118409, 26127, 1133, -51532, 87013, 252201, 196671, 44570, 26231, 56383, -25181, -92346, -9, 88175, 16056, -29963, 124745, 273066, 190768, 48273, 70371, 112284, -20024, -150382, -59043, 74488, -11609, -182490, -173621, -71043, -100252, -186539, -142370, -55640, -91255, -141918, -59147, 17569, -60198, -111447, 44220, 198573, 106614, -54004, -7654, 107658, 10843]
33422A0843j99798j3336J16896J093o1511R2114J65802j225j15577J35Q2327m3629
33410C4134j43946n5029L0049n344J6063J36646J24151m6595q5618O6810J16578
33399A87899r258k5817J17469J02763j25196k06002l3645M3962r6322j16239J03725
33388e6661J96533k947j38024J209J10673j1611r4189L1997Q7921p6505j49004
33377a00608M0536J59244j0259j53743j7071J32233L7825p5105K6404J35540M0619
33366B15615o3910N988N6993n6838j08913L2056Q8817r2127j85216L4489K40661
33355A67615J14700j05203q0047N5603K7423o7697l0221K6600m7701r5240K5720
33344h448J13098r769j42912q1704J5396k6535n4345O8534J48504L4973o8705
$$ y = [10843, -188955, -202291, -85395, -84302, -145813, -53699, 112103, 110878, -4699, -4564, 77763, 34134, -109812, -164841, -134792, -140136, -124073, 12573, 136724, 90129, 4511, 71321, 187899, 178641, 152824, 270293, 373056, 247860, 41858, 8213, 52175, -44147, -160386, -56661, 139872, 136925, -1099, 110, 110783, 99172, 4983, 36980, 124901, 48396, -100608, -60072, 99172, 88913, -64830, -81901, 50332, 88157, 13052, 39456, 174996, 215615, 151705, 157693, 214686, 157848, 48935, 80991, 169808, 77681, -107535, -73046, 167615, 282315, 177112, 97065, 152668, 180091, 112394, 82173, 108773, 61072, -34168, -8448, 104650, 94881, -48031, -129735, -114339, -140874, -195219, -126685, 21819, 56792, -11913]
33333a1913J484N4105n4771j10407L3848J35947J4824j01021k0171M8938o6197
33322g5334j45995j8303R6284L8429L6351K06963K34327m6710k60769j24917N0639
33311i035l6761j20937P0179K28017K9981k07089p4170J82707J22855r2604m8780
33300D4363J37852P8782j39698j48710J3714M7601r493N6498J14016o2684k53327
33289a21086j18454J53806J41937p7530j09898M2664O9547j6641M1021J75157
33279A80523J08262q5567j07309K641j7588j07755j9966J43611R3828p7423n8052
33268E5205Q6696M9166j13872r0673P7854Q0913o4971p2722M9048N0309l3184
33257G3769K4266J14887l8049k79472k03428J17814K09243j7710j67546o8314
$$ y = [-11913, -10429, 43676, -11095, -121502, -87654, 48293, 63117, -37904, -58075, -9137, -75334, -221329, -239632, -143348, -104919, -68568, 138395, 372722, 326012, 65243, -59674, -9035, -45796, -166733, -96554, 131463, 161444, -45645, -119815, 62892, 185747, 93143, 44363, 182215, 260997, 121299, -27411, -13697, 33904, 24411, 80909, 194925, 132241, -121086, -239540, -85734, 56203, -21327, -131225, -88561, -19014, -35655, 5366, 180523, 288785, 203218, 95909, 98550, 80962, -26793, -46759, 96852, 190680, 113257, 55205, 141901, 191067, 77195, -13478, 64376, 145289, 80318, 7596, 56644, 106953, 73769, 98035, 212922, 174873, -104599, -308027, -190213, 19030, 1320, -166226, -234540]
33247b34540K6761m593K4588J49932J51097J423n8748K8211N9656j6084m3198
33236H4505j8472p4465j28265M124J88947J41166n0774o3441O8601L4772j36328
33225E0370j18722Q0087J20154l5404p9131K6053j194j50121q7808J72379K05026
33214A81689q3061k55888q0430J24351Q5819j7733J0191M2733k9986n7128M6438
33203c3005J19985Q4594P2443R5233j3953k10113k13706J312J29475N7033J2766
33192A02064Q2454N2756j16810j52032L0706J44316L8980o4333k7774k3840j19549
33181e3062r8896Q8336J56280j3293j39361m3829N2506k2246p9922K9333J18582
33170e572L5858m8030J2766O7609o274o5623j9724k2378j21943j01327J00647
$$ y = [-234540, -207779, -212372, -187784, -37852, 113245, 114668, 55920, 84131, 143787, 127703, 84505, 66033, -8432, -136697, -132573, 56374, 197540, 146766, 83325, 151926, 186698, 50370, -68352, 11735, 131889, 96485, 17354, 43407, 42213, -107908, -195716, -23337, 181689, 98628, -157260, -237690, -113339, -27520, -45253, -35062, 7671, -22315, -79443, -33005, 86980, 171574, 244017, 339250, 325297, 115184, -98522, -97210, 32265, 89298, 102064, 184518, 237274, 120464, -31568, -862, 143454, 182434, 118101, 90327, 66487, -53062, -151958, -63622, 92658, 79365, -59996, -103825, -51319, -73565, -153487, -124154, -5572, 30286, -17744, -4978, 62631, 56357, -9266, -28990, -51368, -173311, -274638, -173991]
33159a73991K02561O3767m7010O1731J52714L871j78885j33273J5427K9002k7527
33148c1613J3613P3857R598q6979o5261J2187K5501J4479K9974K205n9010j000
33136f2449J60132J72343k2109j30793N26J08014k4465j83617j13050N5228Q2422
33125D2182L2733O6966R9045p547j38964j37224q2557r0217o6208O0405J18288
33114a03098q011j18970l1075R3673N1447l3110L6132J49571J11519R623K2107
33103A79808O6050j7351j20580o0423O2361L6977p6263p1577L1222O1818K4169
33092A16211M0719Q0558L0911n7904o1808j8774l6015o9592k3481M4361K8044
33081G3230l1689n0730o5391j14963j15495k3093M8101L1844L3597R2164O0376
$$ y = [-173991, 28570, 92337, 45327, 107058, 259772, 263643, 84758, -48515, -33088, -4086, -31613, -18000, 55857, 65455, -21524, -86785, -74598, -49097, -34618, -4644, -2439, -61449, -62449, 97683, 270026, 247917, 117124, 117650, 225664, 201199, 17582, -95468, -40240, 42182, 74915, 141881, 240926, 233379, 94415, -42809, -125366, -215583, -281791, -221386, -103098, -111109, -230079, -261154, -167481, -116034, -149144, -113012, 36559, 148078, 157701, 179808, 245858, 228507, 107927, 47504, 109865, 146842, 70579, -998, 30224, 92042, 116211, 156930, 237488, 268399, 210495, 148687, 129913, 93898, 24306, 825, 45186, 73230, 41541, -9189, -74580, -189543, -305038, -328131, -280030, -248186, -214589, -122425, -62049]
33070f2049r6105j52144R339J61589J06838k71K9524P1011l7952j47164o3645
33059a81029P7208O0432j8167L2367J12428L5469q4049l2575Q9992N0223q3007
33048E9292p6761K7216R300j00928q7524M0642P8160N263j2885L7023J5916o6841
33036g2127o5390J9074N1447K1797K7395M8681q35o2737k0370P0338P2557J0799
33024A00629k591J6992M712J6496R4678J07800l4085j60178r0507N6960P6726
33013A87632J6301K0036J9878r8113j93908q3901J01179J14614P076p597M2381
33002A25578j6590j25476q9011M4782O4692k5852n3215p765l517o575O7293J04329
32990G8673j9938j41707n3291J02271O2472q3395o9426M9720K7614p8591k4041
$$ y = [-62049, -158154, -310298, -300959, -139370, -32532, -32803, -3279, 67732, 29780, -117384, -181029, -103821, -43389, -61556, -29189, 83239, 118708, 34659, 2084, 92076, 142299, 59292, -17469, 9747, 19047, -81881, -169405, -128763, -50603, -45340, -58225, -21202, -5286, -72127, -137517, -118443, -66996, -45199, -17804, 30877, 30042, -32695, -53065, 17273, 89830, 100629, 98038, 115030, 119742, 136238, 230916, 338716, 304631, 144453, 53946, 110906, 187632, 203933, 223969, 243847, 145734, -48174, -132075, -30896, 83718, 90794, 83197, 125578, 108988, -16488, -105499, -60717, 3975, -21877, -75092, -82857, -86374, -92949, -25656, 78673, 58735, -82972, -136263, -33992, 28480, -54915, -124341, -74621, -47007, -125598, -149639]
32979a49639J14974N6057j30874j04896J27847K03409K7611j00898m6802j3573
32969a6784q1616o1347P8012R6409o3237j38429o331J21044R7888N4642P3260
32958A53511L1377q9248j04223K0173O4825n1919j23348l2543N4715J9745r870
32947f6805N8978J07687N4808K864J2060k660m9180j1253R0712Q1112m9800j04692
32935A23831l0715J360n7370m0657R1992J54353P4701J3698M2494K7661o7437
32924C33911r6729l9448n4997j41122r6411P7264J14361n0236j42429k0099J00402
32913a5533N3092k1238p567l0275j36092j30264N3899J70283O6491n9793k9264
32902h6261K9960j3311l7342M3249O2328o9168j39154n369J18094K5829j17483
$$ y = [-149639, -34665, 21392, -109482, -214378, -86531, 116878, 144489, 43591, -3211, -16784, -98400, -159747, -81735, 14674, -48563, -186992, -193323, -72279, 25609, 80251, 153511, 184888, 95640, -8583, 11590, 76415, 24496, -98852, -131395, -76680, -56935, -66805, -7827, 99860, 154668, 157532, 169592, 166932, 117752, 106499, 197211, 278323, 228523, 123831, 93116, 94476, 37106, -3551, 88441, 242794, 317495, 331193, 373687, 401348, 333911, 237182, 197734, 142737, 1615, -94796, -17532, 96829, 46593, -95836, -115935, -15533, 37559, 16321, 8754, -21521, -157613, -287877, -233978, -63695, 2796, -56997, -86261, -56301, -69612, -106954, -63705, -1377, -70545, -209699, -215068, -96974, -71145, -188628]
32891a88628p2984P6900J18589N8889J5159k5854r0050p4359M9671J15638M7305
32880C0276O927O4808K8495j67497k39205j2662K19169J38844q9178j23296M454
32869a38865L6308k8109k930Q8939Q0833M539J2710O1467N96j13758j08648r890
32857a16808K3450p480R545M5855j217p6961o1662m227j9664n4468L110Q6245
32845a74282O6902rQ597M2739j602m7276K2156J08888N8856m4665k6628N0024
32833F3700j660j34969j32958J8671J13284N9373k3032l3723J793M3306O5068
32822C8853J3787r4862j15984J4988J24198N0233p5916l8982R5125R6442l6728
32811G1154r3670j3335M9073O746n6753p5673p7869o7171j2726M9566N9200M5058
$$ y = [-188628, -261612, -184712, -66123, -7234, 7925, -17929, -107979, -182338, -132667, -17029, 30276, 37203, 102011, 130506, -36991, -276196, -288858, -69689, 69155, -20023, -143319, -138865, -102557, -130666, -133596, -44657, 36176, 40715, 53425, 114892, 115488, 1730, -106918, -116808, -93358, -100838, -91293, -45438, -46655, -123616, -185278, -189505, -209169, -263637, -260527, -174282, -107380, -107389, -98792, -56053, -57655, -104931, -82775, 26113, 84969, 40304, 13676, 63700, 62040, -72929, -205887, -187216, -73932, -14559, -37591, -71314, -69521, -26215, 38853, 52640, -42222, -158206, -143218, -19020, 31213, -44703, -83685, 11440, 107882, 71154, -22516, -35851, 13222, 19968, -36785, -112458, -190327, -257498, -270224, -220658, -161458, -116400]
32799a16400O1519P3675M1692K6966O8726P0521k9148j07075n6620R399l8912
32788D343j00562l1966P2497N0299k5264L990O4527m71q8912M318J77049J42306
32776B72154p5433j54828j2447O0149j07390k71486j46286J78302L72562K75130
32766C90427K5102j31652q5317M8020O6986n9939j51059p9992M0768N6387L242
32755A22973j0723j1548n5836o5918J7693N9913n5757j75126r6141Q5613J39063
32744d5794Q4231J02157J61500Q2444q8731j26616k4413P214o1889m0881R3148
32733A42370J23228j4448j01661j4303P7729K5248n5461j5748O7310M0160p5290
32722A99134j33634p1754M5075J15071Q1721j8293p8752n1937j4608l5237n8656
$$ y = [-116400, -54881, 18794, 60486, 87452, 156178, 226699, 197551, 90476, 33856, 43255, 4343, -96219, -128185, -55688, -5389, -30653, -26663, 37864, 37393, -51519, -47201, 129848, 272154, 196721, 41893, 29446, 89595, -17795, -289281, -435567, -257265, 115297, 390427, 415529, 283877, 198560, 246580, 313566, 253627, 102568, 22576, 63344, 119731, 122973, 112250, 100702, 44866, -21052, -3359, 56554, 797, -174329, -270470, -184857, -45794, 38437, 140594, 302094, 384538, 295807, 169191, 144778, 151992, 90103, 49222, 142370, 265598, 251150, 149489, 135186, 212915, 238163, 182702, 166954, 234264, 274424, 199134, 65500, -6254, 38821, 153892, 235613, 217320, 138568, 86631, 72023, 36786, -21870]
32711b1870k6715l908m3175m9621M9435J27119N2191o5970n4172K8386K0568l8836
32699b6568j6071K8383m1096j30484n5665J00186J10653J2996K6847J23753P1153
32688B04087j13476j60010k0581N4366k9050p0388K1068O4644k9088q4626Q779
32677a54275J05488Q0745J9463M419k1939p8816q2505m1359o1232j04207k2841
32666c57059J24810J13798m0273o1593J14558K14667R0146n3356l8121K2777J2006
32655A42360J9514Q4207N0970j14335j78424j9873J40141J01801m215M632N0478
32644B77256R24o4140l4640M428m1398p6669j6630K4062m7859j05495l1994N7791
32632e4364L1697k8177j0901J1753l6675n2037M9383J38988Q7616j8349n7284
$$ y = [-21870, -48585, -52493, -95668, -145289, -95854, 31265, 83456, 17486, -36686, -8300, 12268, -26568, -42639, -14256, -55352, -185836, -241501, -141315, -30662, -17666, 9181, 132934, 204087, 90611, -69399, -89980, -35614, -64664, -135052, -113984, -49340, -78428, -163054, -154275, -48787, 31958, 51421, 55840, 33901, -44915, -127420, -168779, -230011, -334218, -357059, -232249, -118451, -158724, -220317, -105759, 108908, 199054, 145698, 107577, 130354, 142360, 161874, 246081, 297051, 182716, 4292, -15581, 124560, 226361, 222146, 226778, 277256, 278180, 214040, 179400, 183828, 142430, 65761, 49131, 73193, 25334, -80161, -112155, -54364, -22667, -50844, -61745, -49992, -86667, -138704, -89321, 49667, 137283, 118934, 61650]
32621F1650o9205r6831n3384O4782P4660p9560j60696j4193J48292R9410k4212
32610d9287J1510J23603R0423m5908q9257m9536o7479j04954k6812J06731J26199
32599B5233M9243K1301M4687K2176j8755M208K6645m7630j25759o8369M3128L5191
32587A1299n3228n3257K6757L6297l8008p5113m7235j7193K8979J25896J78627
32576A23821R2764k2508q624O8267L5998p3693r0653j6024k058o4905p5791j4704
32564d8110J2355n454K1568P6671M7298n6097r6507l0486M7106O9704M7743j7293
32552F8498j04362j08593K0586J37138Q2346n2064n3074P2399J11623j5744j49821
32541H932j37090q896J05943J14617J1095j03618r5178K1475O7903k8514r6835
$$ y = [61650, -7555, -104386, -157770, -92988, -18328, -97888, -258584, -272777, -124485, -25075, -49287, -37777, 85826, 176249, 130341, 41084, -8452, -75931, -180885, -207697, -100966, 25233, 74476, 95777, 140464, 162640, 143885, 148093, 174738, 127108, 1349, -67020, -23892, 11299, -41929, -95186, -68429, -32132, -70140, -145253, -192488, -209681, -180702, -54806, 123821, 216585, 194077, 185453, 253720, 289718, 216025, 125372, 109348, 107290, 42385, -33406, -48110, -35755, -41209, -19641, 57030, 104328, 48231, -48276, -78762, -31656, 38048, 85791, 68498, -35864, -144457, -123871, 13267, 95613, 43549, -9525, 62874, 174497, 158753, 8932, -128158, -137054, -31111, 83506, 94601, -9017, -104195, -82720, -14817, -43331, -140166]
32530a40166m80J16602O4626p1250q9756j5789j0878n1436J0186J36408J50773
32519I8840N1460j596J6581j4646r4691r3647p202L5727J9242M6429J00778N3325
32507B10600p8569j22563k9288N9110M2143l2224r5387j05919J073K09062L12604
32496C70642J47049j21682j91901o4921l030p9863r8779J8228R2957K1683n7184
32485C3199l4097n85l1722l7229M0821R1572K8969n4350m7847J0850L3829J8516
32473E1926M258M303L0347P7583P2309l9324j57311j33338p36O7850K3640j6769
32461a5262J0990M7236N7983P1939O4854j1297q9028o0857K1634J9518m8216m5095
32449B4399K3617K6057l9050m5743P630L221m5556j3111O8390L8140q2564r9792
$$ y = [-140166, -140646, -24044, 40582, -30668, -120424, -136213, -147091, -198527, -188341, -51933, 98840, 150300, 148704, 165285, 150639, 55948, -37699, -44901, -9174, 10068, 56497, 157275, 210600, 132031, 9468, -19820, 39290, 81433, 49209, -46178, -152097, -151024, 58038, 370642, 517691, 396009, 204108, 139187, 136157, 56294, -42485, -24257, 68700, 90383, 33199, -898, -1483, -33205, -70434, -29613, 61959, 90928, 36578, -11269, -419, 33410, 51926, 56184, 60487, 90834, 168417, 240726, 201402, 44091, -89247, -89983, -22133, 1507, -15262, -4272, 42964, 100947, 172886, 237740, 226443, 137415, 76558, 98192, 117710, 69494, 24399, 48016, 74073, 35023, -10720, -3090, 131, -45425, -58536, 9854, 47994, -34570, -134362]
32437a34362Q299N6572k369j1983N9088M8989o2737q7425Q825J5805j21213j60709
32425c83220J1519J56039P9746n2370l5362L5801J243m6090M1770J60019J22820
32414I1915j6486p5955m2481k0674n295O5736J30897R1895J666k1967M108j5757
32402A87602p2455q1978l8211j570R237Q299j0697l6601k7696J827j8443p9264
32390a59950q0059k031N1129L5867K9791N7056L6089l3516l0630O1360R4330J0148
32378F9584n9565m3568m6392j01346o4068R8385J72708M2078q4108l858J42803
32367A22653J23030n444l5120K6273J6726o5848q5586l5126l0143p7986o9811
32356a16382J6322Q3292P1714J3711m1728n5721n888N4411K8278o3734p5479L5567
$$ y = [-134362, -126063, -69491, -71860, -83843, -24755, 24234, -38503, -125928, -117103, -101298, -222511, -383220, -371701, -215662, -135916, -188286, -223648, -187847, -186604, -232694, -190924, -30905, 91915, 75429, -526, -43007, -63681, -68976, -3240, 127657, 219552, 221218, 199251, 203359, 187602, 115147, 33169, -5042, -6612, 2625, 10924, 227, -36374, -64070, -62243, -80686, -159950, -240009, -242040, -190911, -155044, -125253, -68197, -32108, -65624, -96254, -34894, 59436, 69584, 10019, -33549, -79941, -181287, -245355, -146970, 25738, 67816, -16292, -20150, 122653, 245683, 240239, 205119, 231392, 248118, 182270, 96684, 61558, 31415, -46571, -116382, -100060, -16768, 54946, 68657, 26929, -28792, -34680, 19731, 48009, -15725, -91204, -55637]
32344e5637J19565O8288k4915m6466l0187k4562K1212J01908Q1665o8624j54954
32333a2707n4557O9633L8901n4239m2630K1001L426m3647p075M3770j2846j03266
32321a54236q5489q798p690m6413o403P3449P6174L0246L2141M6011j517l5613
32309h8138L4000J06128M5181o4387n6711K9780M5626L437J1304L5005k1287r0169
32297a0231m7308M6820N3708P125J4412K2205o1077j31019n4112N4449J6714p1259
32285a59573j4519R4637L4701j02592l9350J71220J89165l9251j82201o6315Q2421
32274c1657N7702k9995k3808K3445K2129J6355L8608J6685n7047o9271P830N3471
32262B4447J4724j5251O989J0407j0364L1103J12087R9877j411l6827J9750J7815
$$ y = [-55637, 63928, 132216, 107301, 60835, 30648, 6086, 27298, 129206, 210871, 142247, -12707, -67264, 2369, 41270, -12969, -55599, -34598, -31172, -74819, -81894, -38124, -50970, -154236, -239725, -248523, -256213, -302626, -309029, -235580, -159406, -129160, -97019, -51008, -52525, -88138, -54138, 51990, 97171, 32784, -23927, 5853, 51479, 54916, 66220, 101225, 79938, -10231, -57539, -10719, 42989, 50114, 64526, 86731, 25654, -105365, -159477, -105028, -88314, -159573, -174092, -79455, -44754, -147346, -186696, -15476, 173689, 134438, -47763, -114078, -31657, 26045, -3950, -27758, -4313, 17816, 34171, 72779, 89464, 32417, -36854, -29024, 24447, 39171, 23920, 30909, 41316, 30952, 62055, 174142, 274019, 272608, 235781, 255531, 273346]
32250B73346q1345j22726l8300L9673L1026L1461R2242J09565L1616m0761m6827
32239B78970m9516o1279j1855N5286N726j07281o7268J22388J85092J8645j19301
32228B49607l9238P2856p378j67676j73043m2711L9470K9171N262j7454n5076
32217a06210n1876J4937M7982k787k6223M8158R6082J4880o9518n391J20285J26768
32205B07087K8459k8444j9192k6641n0677k5347K6444K6037j4996k5072l718Q68
32193I4808q549j0526l1914q1792r6001m3416L543j023J2932Q4599J12194K1644
32181E6499p5938m6666N2585Q1312L8760J4219J791n5698j05285n2175N1222O4393
32169B5019j3299m5241J2434M8682p133p4387o2404j0186p872m5902k8915O9988
$$ y = [273346, 192001, 69275, 30975, 70648, 101674, 133135, 225377, 334942, 366558, 325797, 278970, 229454, 168175, 156320, 211606, 217332, 110051, 42783, 165171, 350263, 368908, 249607, 210369, 283225, 275847, 108171, -64872, -107583, -68113, -38942, -33680, -51134, -106210, -158086, -143149, -95167, -97954, -124177, -76019, 20063, 34943, -34575, -39966, 80319, 207087, 235546, 207102, 187910, 161269, 110592, 85245, 111689, 137726, 122730, 97658, 93940, 94808, 86259, 75733, 43819, -37973, -133974, -177390, -173847, -174870, -161938, -77339, 34855, 56499, -19439, -66105, -13520, 67792, 106552, 120771, 122562, 66864, -38421, -90596, -39374, 25019, 11720, -33521, -21087, 27595, 20462, -53925, -116329, -126515, -134387, -180289, -209204, -139216]
32157a39216J41878P6570o7135j12523q382Q4940L0801p3204n8535L4469L3244
32146e7093o5443r6642j8615L6698K8173O9396J67530J54553j6591j47744r9452
32135d5230K240P121k5146M203L1253j7475n0925J6922Q6596M9922j2314K88N645
32122E3100q4595j48315m8362R6182Q7316j8896j9734Q3858J14926M0226m735
32111A50971J6604K008o5168q3703l6655j6172l5889j6050L5095K0403n0343n5112
32099a34011K4715O6780J8501l0234k4192k1962m7595k6835N9868J05577L9755
32088C0367n4248o6889j4696J3671o926l0072k2380K049J4162O838L485K7601
32076i7038N9343N3045J2148m891J9558K8102p996l0403L31K5023p553l6493J0624
$$ y = [-139216, 2662, 79232, 12097, -100426, -108808, -23868, 6933, -66271, -124806, -90337, -57093, -122536, -219178, -237793, -201095, -172922, -103526, 64004, 218557, 201966, 54222, -45230, -42990, -35869, -61015, -56812, -25559, -43034, -93959, -77037, 9559, 59481, 47167, 47455, 53100, -31495, -179810, -228172, -131990, -44674, -63570, -83304, 554, 115480, 155706, 150971, 167575, 169583, 104415, 20712, -15943, -32115, -68004, -84054, -48959, -28556, -78899, -134011, -109296, -42516, -24015, -54249, -78441, -100403, -147998, -174833, -114965, -9388, 30367, -23881, -90770, -105466, -91795, -98721, -128793, -151173, -149124, -134962, -128124, -124639, -97038, -37695, 15350, 27498, 22607, 42165, 70267, 62271, 31868, 32199, 57222, 49669, 13176, 23800]
32063B3800Q3894Q5610K2455k2332k0743l872J8087M1595K3934m9770j00820n6247
32051D5591L1639N9591K0436j6330k1099r710J6463M7897L8348j9739n6169l6257
32039A00661k8365p2544q6224j0209O0986K8218l7257j9732L6175J7762l9738
32028e0267j6021P0464Q9599J9530l6481l3654k0625n806N0035J13072R9512K0582
32016B99940l1403l7387n9797j01711r0711j1933N6777N5165J415n1864n7915
32005b9424l680M9870J9933n7999n2830L5621L3956j09447j76807r173K00029
31994i9951J78790n783p9706K077N4294K1337K0160N3022l806j14645r6247M5664
31982b4794Q7092m4346j52173j06198k4599j7645n256Q0503J38550Q6818J4037
$$ y = [23800, 107694, 193304, 215759, 193427, 172684, 168812, 186899, 228494, 252428, 202658, 101838, 45591, 77230, 136821, 157257, 140927, 119828, 110118, 126581, 174478, 212826, 193087, 136918, 100661, 72296, -248, -86472, -96681, -35695, -7477, -44734, -64466, -28291, -10529, -50267, -66288, 4176, 93775, 113305, 76824, 43170, 22545, 16739, 66774, 179846, 279358, 299940, 268537, 231150, 171353, 69642, -21069, -33002, 23775, 78940, 80355, 28491, -29424, -33104, 16766, 36699, -21300, -74130, -38509, -4553, -114000, -290807, -299980, -99951, 78839, 73056, -6650, -4573, 49721, 71058, 91218, 144240, 140434, 25789, -70458, -24794, 62298, 17952, -134221, -240419, -265018, -282663, -287919, -207416, -68866, 17952, 31989]
31971C1989P941O499m9639q2091k6445L0475J078m4532l273Q6369J18257P8835
31959A55463K7538o921k3673j2692J0337k961n8075j00372r7252o2968j239Q0797
31947i2018J14990N1997j6978L2374J37928J15808m4967j46539q1022K8048M6926
31936A46547J0960J208P295J123L020p69o5434j49365j20366L2642J48613J24435
31924A39909L9418j7808p4216j38426j19260N865R5153M0322o6684q0468k665
31913a78860O8699Q7053O2799J5779q135K9614O6794R41j24525j45991l2446N8989
31901i9289L4454j5230j3167j6920n0301j9319Q9559J27113K8141n3537L7P3514
31889H5055L6706k7280L939O0984K6156m0658k6645J1165m1999j30542j19468
$$ y = [31989, 39930, 46429, -3210, -85301, -111746, -81271, -80193, -124725, -127998, -41629, 76628, 155463, 183001, 176080, 152407, 139715, 150052, 147091, 89016, -11356, -108608, -171576, -172815, -92018, 22972, 74969, 57991, 90365, 228293, 344101, 299134, 152595, 71573, 99621, 146547, 157507, 158715, 166010, 167133, 170153, 169384, 103950, -45415, -165781, -133139, 15474, 139909, 179327, 161519, 87303, -51123, -170383, -164518, -69365, -29043, -95727, -176195, -178860, -110161, -23108, 39691, 55470, 47335, 76949, 143743, 144684, 20159, -125832, -158278, -99289, -64835, -80065, -93232, -110152, -160453, -179772, -90213, 36900, 65041, 11504, 11541, 85055, 121761, 94481, 98420, 159404, 185560, 144902, 118257, 129422, 87423, -43119, -162587]
31878a62587k6298L2686M6938P3030P1055k2972j23704r2909L1355Q6431L7565
31867d9410N069N3230J10681J03086L6268n3719j30800j48990r4604j6019M6232
31856a38976J04599J47386J06659k2727j29163j31143p7088k3726N4662J42662
31846C3145J22943l0073j42499q0861L6525L5041m1473l9812L5284O6913M7481
31835D2614N0801N7360N304m9751j9785L2383j1263j02184r6653r40N2201L3266
31823f647K7484M8309L1790n552J1308N5364L6382k2271k2196J9732P59o9065
31811A05397q0946k5628K416j3471l334L1329K8376J4647N9895J03324K8233j02675
31799A47563j04239K9973J04534L0350o2110o7268m9044o8195o2490P438O1668
$$ y = [-162587, -188885, -156199, -109261, -36231, 34824, 11852, -111852, -204761, -173406, -86975, -49410, -44341, 8889, 119570, 222656, 258924, 205205, 74405, -74585, -169189, -185208, -138976, -34377, 113009, 219668, 196941, 67778, -63365, -140453, -164179, -109517, 33145, 156088, 126015, -16484, -97345, -60820, -25779, -67252, -107064, -71780, -4867, 42614, 93415, 150775, 156079, 106328, 86543, 118926, 107663, 5479, -91174, -92114, -39913, -6647, 20837, 69146, 100936, 95384, 106692, 162056, 198438, 176167, 153971, 173703, 174462, 105397, 24451, -1177, 1239, -12232, -15566, 15763, 44139, 58786, 118681, 222005, 250238, 147563, 43324, 73297, 177831, 208181, 146071, 78803, 29759, -38436, -100926, -93488, -31820]
31788c1820M6523L0757O5612Q1408J5536o8931p9667k2331L3949M3958K149n3438
31776F3705m3747N3744J22858M5541r6233j12022M836O1748k3421r5416k4408
31765d2815Q6143P4268l7256j03009o4425J8954P8300Q0117J8227o2487q4110
31754c8093l4170P859j1703l9783n227O6824Q4303K514j21370j70246p1817J04246
31742b26663J85447R0438n8878r6777k9915J5325N999J5078M9990L5402k9672
31731d4226n8533l7122l9732o5054k5995O2942P0076k0968m6945P4068J88814
31720E7325J37596j0463r0015q4875q5801r5248m3036M7886P0647P807l3244J8543
31708a02878R8949J09486N1209P534K2523M8163K3985l0162m7856k7800l8175
$$ y = [-31820, 14703, 45460, 111072, 192480, 208016, 139085, 59418, 37087, 71036, 114994, 117143, 63705, 19958, 73702, 196560, 242101, 145868, 33846, 38682, 100430, 77009, -18407, -42815, 43328, 117596, 80340, -22669, -87094, -68140, 10160, 90277, 108504, 46017, -38093, -72263, -64404, -76107, -115890, -121117, -54293, 30010, 32524, -88846, -259092, -330909, -226663, -41216, 49222, -9656, -106433, -136348, -121023, -115024, -99946, -49956, -14554, -44226, -102759, -139881, -179613, -244667, -270662, -207720, -137644, -158612, -205557, -131489, 57325, 194921, 184458, 94443, 9568, -76233, -171481, -214517, -166631, -95984, -88177, -121421, -102878, -3929, 105557, 156766, 164300, 186823, 234986, 258971, 228809, 180953, 153153, 114978]
31697A14978r1271j02151k6691M8006L6914q68L3757J00957Q2839j8602q5290
31686I2578o3341o569M1456P4827N5128m0875j16716n5580P7730R8724j9936j05418
31674C2008n3156L3335L2869j8993k8944M832K6390J3028k9187q1573r0097j3939
31662a73427Q2838Q7791L501n4139l2677K144K069j444J0001J5105L3135R5061
31650F9958J28446L0837j26219j48089j1991P9036M971r7199o7639L8475P2270
31639b7144J6697l5608l2816J2006O8305Q5081K2142o3490n7283M4386J12924
31628A45200P2040j4509p2715j03123j01290l9338L1857J4671n8810m7062N9697
31617a13382J02864J9717n3911k6820N155l5620o2865j1847K2857k2791l9398
$$ y = [114978, 23707, -78444, -105135, -57129, -20215, -21083, 12674, 113631, 196470, 177868, 92578, 29237, 22668, 64124, 138951, 194079, 153204, 36488, -19092, 58638, 157362, 137426, 32008, -21148, 12187, 45056, 26063, -2881, 1951, 28341, 41369, 12182, -69391, -159488, -173427, -90589, -2798, 703, -53436, -86113, -83969, -81900, -83344, -73343, -58238, -25103, 69958, 198404, 229241, 103022, -45067, -57058, 21978, 26949, -70250, -137889, -99414, -27144, -10447, -46055, -78871, -66865, 1440, 86521, 108663, 45173, -12110, 32276, 145200, 217240, 202731, 130016, 26893, -74397, -113735, -81878, -67207, -126017, -173079, -113382, -10518, 9199, -44712, -71532, -66377, -101997, -164862, -176709, -153852, -176643, -216041]
31606b16041N1842J25741N6566o0341p0801r541k858m1704l4315J0510K2859J4237
31594a53846L2344N1801L7293K7761M5358K8018l8364n0419L1144P6288k233q4672
31582D73m5438L7212M2436J9546M9028M7618o8556j66417q3397Q0115J05473L694
31570B1787l5908K1074L1912m2931q3832l8010J0725Q278j2350l7792p7538p8209
31558c12794J0074J10626J15538O2555O1814R8518P4870l317n1696o6036q8691
31547A1461q3634k1703o326j08350j64336J0214K69264K81872J7421k00889j59945
31536a54951l66P4387P5059R4005J03339L4373p1035j12987o3810K4359Q2526
31525H4899O8053O697j4543L5799O4787o533r9202r3096k0794L380j4092J6500
$$ y = [-216041, -164199, -38458, 18108, -42233, -113034, -122575, -125433, -167137, -201452, -190942, -168083, -153846, -121502, -69701, -32408, -4647, 40711, 68729, 30365, -20054, 11090, 87378, 85145, 473, -44965, -7753, 34683, 54229, 103257, 150875, 82319, -84098, -167495, -87380, 18093, 21787, -14121, 6953, 38865, -4066, -87898, -125908, -115183, -106905, -119255, -157047, -234585, -312794, -302720, -192094, -76556, -14001, 47813, 146331, 221201, 217884, 166188, 100152, 11461, -72173, -93876, -100202, -208552, -372888, -362674, -93410, 188462, 205883, 4994, -154951, -155317, -80930, -5871, 88134, 191473, 225846, 154811, 41824, -21986, 2373, 84899, 152952, 159649, 145106, 180905, 245692, 239159, 139957, 46861, 26067, 29447, 15355, 31855]
31513C1855P7148O9118j171l8014k8413k9984k8819J4370K9272n7722j38439o2641
31501a63440Q6816R8860k0863o8569R479N8873J6850n093K7622R180o7643p2814
31489i0742j692j4697j38136j82885n3618J05062J64451J72071J64812P6071o0246
31478A40451p0299O2241J08862m4085j91673j37746M248L1611l0895m1204N396
31467a63093L4540N9883J05732R8153M810n4195p53M2481l7447j23506n5482R2467
31455C590J28795L8491l9550m7653l3932r815M1573O9992K5705l0643j8438K7946
31443A56061L5248J8763J1955l1729j31939j81168r9640J0568K0488j9330P785
31432b02938O8788O2969K7235N8382J03432L8511r1592j24249m4206N699k8838
$$ y = [31855, 109003, 178121, 176950, 138936, 110523, 80539, 51720, 66090, 95362, 37640, -100799, -163440, -76624, 22236, 1373, -67196, -57717, 1156, 18006, 12913, 40535, 49715, -17928, -90742, -92434, -107131, -245267, -428152, -481770, -376708, -212257, -40186, 124626, 200697, 140451, 70152, 132393, 241255, 197170, 5497, -132249, -128001, -96390, -127285, -168489, -163093, -128553, -68670, 37062, 135215, 140025, 85830, 85077, 127558, 90111, -33395, -88877, 3590, 132385, 170876, 131326, 83673, 49741, 39926, 81499, 151491, 177196, 146553, 128115, 156061, 191309, 210072, 222027, 190298, 58359, -122809, -222449, -211881, -191393, -210723, -202938, -134150, -71181, -43946, 14436, 117868, 156379, 64787, -59462, -103668, -97969, -126807]
31421a26807n2128j3068K3665K6476M8247R2625Q0974k120o1687l6971J8977M3868
31409D2051M7738N1806L7772k328l8570n3324n7463m5757j571M7908M8549L11
31397G7122l8091l1011j133J3458r926p5895j47678j47835m2276R3086J49032
31386a61147J12810O5194O1954P6818O0477Q578l8150m2289j8225k4324q1061
31375B0635j21241q2326k0241l0228o9242k8J65032K29742R6961p1762q8855O053
31363C4500N7700L7765K1472J6754j8475n2447k9300N043k6307p8456n1810K3254
31351f0307K5219m9965p4235O955R2677Q1242m544q1515j07463q5243l3103J9840
31339b70442M9804O0806O6438O4458N3445M2931K5044j6151m9302k2732L0425
$$ y = [-126807, -178935, -192003, -168338, -141862, -93615, -990, 79984, 77864, 16177, -20794, -1817, 42051, 89789, 141595, 179367, 177039, 138469, 85145, 27682, -18075, -19646, 28262, 76811, 77122, 39031, 8020, 6887, 20345, 10419, -65476, -213154, -360989, -403265, -310179, -161147, -48337, 16857, 78811, 155629, 216106, 224684, 186534, 144245, 126020, 101696, 20635, -100606, -182932, -203173, -233401, -302643, -302671, -137639, 92103, 189064, 117302, 28447, 34500, 92200, 129965, 151437, 168191, 149716, 97269, 67969, 73012, 46705, -31751, -83561, -60307, -35088, -85053, -159288, -152333, -59656, 21586, 17042, -64473, -171936, -257179, -290282, -270442, -220638, -159832, -93394, -28936, 24509, 67440, 92484, 76333, 27031, 4299, 34724]
31328C4724J4429o1532o2853N1972J28757M3957r3336j06531j1606M6651L1205
31317A5837J3596K225m9756r9927n5010N5235R9108M0277k5009l1224j3565n782
31305e3995J1634M3759N9731N1016L4925Q459l0588m4811j4441P060k5770o5144
31293a8165n1548j6684r042Q595P2710J06977L0547q7573j20813o8964j0139N6024
31281a08075J54795J97691Q7238q5569j41521p8206l9412m9306K790J10184J11766
31270A62375m0528j76217j44182N89J14208J31638O3113m8877j18518p6382K3136
31259a09645N9467K3782J8511P1913R1570K4630p0648j38353j78729j67272n8675
31248d33449R4425J56808Q6026j5038m3850N644R2846J60698J25660l0939j70314
$$ y = [34724, 49153, -12379, -75232, -23260, 105497, 149454, 56118, -50413, -62019, -15368, 15837, 29433, 31658, -18098, -118025, -173035, -117800, -18692, 21585, -3424, -34648, -48213, -53995, -42361, 1398, 61129, 112145, 147070, 155529, 124941, 80130, 65689, 72749, 46979, -18165, -69713, -86397, -95439, -86844, -14134, 92843, 123390, 35817, -84996, -153960, -164099, -108075, 46720, 244411, 331649, 246080, 104559, 26353, -13059, -62365, -59575, 50609, 162375, 121847, -54370, -198552, -197963, -83755, 47883, 110996, 62119, -56399, -132781, -109645, -50178, -26396, -7885, 64028, 155598, 180228, 109580, -28773, -207502, -374774, -433449, -339024, -182216, -96190, -111228, -155078, -149434, -56588, 104110, 229770, 198831, 28517]
31237B8517j35940K2185J09515N9508j6560l8823l8456k8830J7149N1107n233
31226B4139r2031p9372l76j702o2425j2703J41931J89132O5893l1727J0527N2656
31214B03942p487m7184J6601M2434o2700j33059k9261Q8430K1092j22945j09817
31203a39954L9858J21594Q5552M1724J2294o2611j26829o3573P5069J14243K0823
31192A18190p1950q9416p8847o0055L185P8961Q1895K1538j1917r279m1540r8196
31180a57431q1072K2528J02820R2437M5555K5546K6084L0103M2997M0958j5994
31169A74531r1305q5107K1879J15394Q5500l3139j01937l8585Q7961J27199J8915
31158B81306j22094j40465m6544J314o5631j26946p1506K7142M0013j1266r969
$$ y = [28517, -107423, -85238, 24277, 83785, 67225, 28402, -10054, -38884, -21735, 29372, 24139, -67892, -147264, -147640, -149342, -211767, -224470, -82539, 106593, 172486, 140759, 151286, 203942, 196455, 149271, 165872, 208306, 145606, 12547, -16714, 71716, 92808, -30137, -139954, -100096, 21498, 107050, 148774, 161068, 98457, -28372, -91945, -16876, 97367, 118190, 46240, -43176, -122023, -182078, -178893, -99932, -18037, 3501, -8416, -17695, -59235, -157431, -238503, -215975, -113155, -20718, 24837, 50383, 76467, 106570, 149567, 190525, 174531, 83226, -1881, 19998, 135392, 220892, 187753, 85816, 47231, 135192, 262391, 281306, 159212, 18747, -27797, -26483, -92114, -219060, -290566, -263424, -223411, -234677, -244646]
31147b44646N8587J03354Q6921N9561M6734J7952l0295n7313n2397m9516o1411
31136a22469o0172k6506K4969O2849N6826P625k5244J6977Q5994O5488m8237j13587
31124g5487n3904K1837L720l8697M225P1619L3397o9386p4666L7541J16110Q0200
31112E6509J8936J3971J5358l9167j00646q8934k1564J6392o406l8024k3607K5699
31100a71483N4082L6822J1262J6999L2992J9423j532K1374O7583O8810L3480L7789
31088B27601Q0726P4671P730k7252r681l5283j14309j05664L6951J32596L8770
31077C06856j10558j11907M31N1637J4545j1250j5017m9183n9786L2469J34242
31066A82479R0662m1021o1847M0016O9808m9333j64915j54463q5674n1214k7732
$$ y = [-244646, -186059, -82705, 4216, 63777, 110511, 128463, 98168, 40855, -11542, -61058, -122469, -182641, -209147, -184178, -121329, -64503, -56878, -82122, -65145, 20849, 86337, 38100, -75487, -129391, -107554, -103834, -142531, -138306, -66687, -33290, -102676, -177342, -139801, -23691, 56509, 75445, 89416, 104774, 65607, -35039, -123973, -145537, -129145, -135551, -173575, -197182, -171483, -117401, -80579, -69317, -52318, -19326, 97, -1435, 19939, 87522, 156332, 189812, 227601, 308327, 382998, 390728, 363476, 353795, 318512, 204203, 98539, 135490, 268086, 306856, 196298, 84391, 84822, 136459, 151004, 139754, 124737, 75554, 15768, 48237, 182479, 273141, 232120, 170273, 210289, 280097, 230764, 65849, -88614, -174288, -225502, -253234]
31055b53234K3781O8223P5834O7460L9525l2157r2698n1756N2527Q0617N054n6067
31043g2891m1089j5839j2598K6541R7563J00188J7862l3313N41L3720K2174M0606
31031A63465R7913P0134o8761j41259m0296O8267R80j34873j06672P1462J67916
31020A48276R3169Q42J3663N2175M602q6473j05074l7679K5744K3205j9703m6697
31008F6050l5757n669J0973n213m0858n1546m936O4957P7337J2738l3883K2365
30996G6558J03585N2360j20558k11462j10797K9314K9952m5764k5472P3900R0490
30985e7894J0988o853Q4827J33637L5790j01645j27996m3810M7825P9153M6391
30974A00413j0638j9352N1794J19534Q2832j6238n3652k9400n1507j16161r6387
$$ y = [-253234, -229453, -161230, -85396, -17936, 21589, -10568, -103266, -155022, -102495, -21878, -16824, -72891, -113980, -129819, -142417, -115876, -18313, 81875, 99737, 66424, 66965, 100685, 122859, 163465, 261378, 331512, 262751, 121492, 81196, 149463, 150443, 15570, -91102, -19640, 148276, 241445, 242287, 255950, 308125, 312727, 226254, 121180, 83501, 109245, 132450, 112747, 66050, 30293, 24624, 35597, 30384, -10474, -62020, -66956, -1999, 75338, 88076, 54193, 76558, 180143, 232503, 111945, -99517, -210314, -181000, -151048, -196812, -222284, -148384, -57894, -46906, -53759, 31068, 164705, 200495, 98850, -29146, -72956, -25131, 54022, 100413, 89775, 70423, 122217, 241751, 324583, 308345, 254693, 225293, 173786, 57625, -38762]
30963c8762J7436O9941R5n3073J707N0652j0939q8868o3789K051m282m0416m455
30950a62702P0117Q4996N6122N9422P2988L3489j6245L169M5564Q557p7780r4777
30938H2920m0000k4052o9731p5504J426P0892N9866J7386J6930M5873M8391J4360
30926A48757k5522n3258p1316p6886n7323j3138K1973K908o0919q2190N539J33320
30914a28055J60429O5694j6148J4078Q4969P0881l6138j39299j58448p8658N7475
30903a03220J49701J05871l0673r7724k4822O1632K6903p3021r3196k2665K7259
30892g3955R794j6165j0628M544K2749O2964R5774N6255n0152j31050j18221m0771
30880a88862K6232M3649L0863L4563P3068J00215N1422n9807j34859j04862p886
$$ y = [-38762, -21326, 48615, 48710, -4363, -2656, 47996, 37057, -51811, -115600, -113549, -117831, -158247, -162702, -92585, -7589, 48533, 107955, 180943, 214432, 198187, 201356, 246920, 255477, 177697, 82920, 42920, 18868, -50863, -126367, -124941, -54049, 5817, 23203, 40133, 86006, 134397, 148757, 123235, 69977, -1339, -78225, -135548, -148686, -126713, -123805, -184724, -266914, -261375, -128055, 32374, 98068, 81920, 95998, 180967, 251848, 215710, 76411, -82037, -160695, -103220, 46481, 152352, 121679, 23955, -867, 60765, 87668, 14647, -78549, -101214, -73955, -64161, -80326, -90954, -86410, -63661, -697, 95077, 151332, 101180, -29870, -148091, -188862, -162630, -118981, -88118, -53555, 19513, 119728, 171150, 111343, -23516, -128378, -136264]
30869a36264P2197R1881N2116j7778n3606p397O7384O6804j773k0683L4381L2035
30857A79297r2594j98355j44290q430M9002L2144M5843P1788P312j14875j44657
30846c17815m7446N9190J06905J38270J48761N4990j18441j92238p2341R4534
30836a45631J16828J0680o1580l3743J3657J5734O845K0694J2842n3057j05253
30825b01984m0112J12952J93908J13797k2104n8121N985M6153R849l5920m0579
30814H3824k8239p991M5503R2258M2625p6632j09923k001R4042L8195q7812j15564
30802c1715l6065K4036O178k9478k1563K5680O8393N3809l0056r8728m9804O5941
30790e3372P6569m9030j26099l6516Q2956P2720L014J4330N6277K710r0205p6339
$$ y = [-136264, -64067, 27814, 79930, 62152, 8546, 1149, 68533, 135337, 133564, 112881, 147262, 179297, 86703, -111652, -255942, -264372, -215370, -183226, -137383, -65595, -58283, -173158, -317815, -365261, -306071, -199166, -60896, 87865, 142855, 24414, -167824, -240165, -145631, -28803, -18123, -79703, -113446, -99789, -84055, -77210, -56516, -43674, -96731, -201984, -242096, -129144, 64764, 178561, 156457, 98336, 104321, 150474, 160323, 124403, 83824, 55585, 47594, 93097, 185355, 227980, 151348, 41425, 39424, 133466, 171661, 83849, -31715, -67780, -43744, -37566, -67044, -88607, -62927, 5466, 59275, 29219, -69509, -119313, -53372, 23197, -25833, -151932, -188448, -105492, -32772, -29758, -15428, 40849, 43559, -46646, -122985]
30778a22985J4125L8811J0694N7380J52340J36721L273p8949l9300J2991L361
30767A88462j9200l2537p9364j25254p4056M1513P3588m310o0563l2427K813J0249
30755a11086M5761Q7534L5350p4035p6347L2376N5797o6290j29829n846J30099
30744g6516Q3734m6407m9156O3125J12471M4204m0874p5812p8862o2543k8799
30733a55435j1155j4466K5366J22386J64234O9858n8165o9649J2016M2576j6895
30722A10671o7197m6056q503j9878o0095n9357J4975J14855J45740P1043k2652
30711A73546k7191K7116J3977p6766j04667n540R0686N9703k7960l5667K5565
30700A12802M5710L430k9991k7310k2950k4072j1973r913n1864r8163p0235L3205
$$ y = [-122985, -108860, -70049, -59355, -1975, 150365, 287086, 290359, 211410, 172110, 185101, 188462, 169262, 136725, 57361, -67893, -141949, -100436, -26848, -31158, -91721, -124148, -121335, -111086, -65325, 22209, 57559, -16476, -92823, -60447, -4650, -70940, -200769, -206615, -76516, 7218, -39189, -88345, -25220, 87251, 131455, 90581, 14769, -64093, -126636, -155435, -166590, -181056, -155690, -33304, 130930, 200788, 142623, 72974, 84990, 127566, 110671, 43474, -2582, -11085, -30963, -91058, -150415, -135440, -20585, 125155, 196198, 173546, 146355, 173471, 187448, 110682, 6015, 475, 91161, 150864, 122904, 87237, 112802, 158512, 161942, 131951, 104641, 81691, 57619, 45646, 35733, -16131, -114294, -184529, -151324]
30688a51324J22955J24128M9639k6135m0616k264J6785k7478q3294q0355m3746
30677a41705l9928l9317L4492J28621J01130l7560j06832l9614Q406o7682j32096
30666c32085l9319J11566J33822L8714k2863r880K878j909J6196L2164k502l5472
30654a08690J3083R0421P6950j9041p9266o1433k5934l157K5068L5409n041l8161
30642i9792J3839R7980R7080K8009J6026P4731P7851k4729j18710j01548j6854
30631D3883M1270M9439K7918j4360n5045n1243k24M7024N5221L6889R536k3473
$$ y = [-151324, -28369, 95759, 145398, 119263, 78647, 76383, 93168, 65690, -17604, -97959, -141705, -181633, -220950, -186458, -57837, 43293, 5733, -101099, -140713, -132307, -199989, -332085, -371404, -259838, -126016, -87302, -110165, -120045, -117167, -119076, -102880, -70716, -73218, -108690, -95607, -5186, 71764, 52723, -26543, -87976, -113910, -117067, -91999, -56590, -61631, -99792, -85953, 12027, 109107, 137116, 153142, 227873, 305724, 280995, 162285, 60737, 43883, 85153, 134592, 162510, 148150, 93105, 41862, 41638, 88662, 143883, 180772, 190308, 166835]
$$ [...]
##END NTUPLES=NMR SPECTRUM
##END=
