##TITLE=31Pdec_LY-TMF-9.5.R.t
 D2O, 24 sc
 28.2.2020
##JCAMPDX= 6.0         $$ Bruker NMR JCAMP-DX V2.0
##DATA TYPE= NMR SPECTRUM
##DATA CLASS= NTUPLES
##ORIGIN= UXNMR, Bruker Analytische Messtechnik GmbH
##OWNER= root
$$ XWIN-NMR		Version 3.5
$$ Fri Feb 28 16:06:40 2020 Russian Standard Time (UT+4h)  she@DPX200
##.OBSERVE FREQUENCY= 81.013821
##.OBSERVE NUCLEUS= ^31P
##.ACQUISITION MODE= SIMULTANEOUS
##.ACQUISITION SCHEME= undefined
##.AVERAGES= 24
##.DIGITISER RES= 17
##SPECTROMETER/DATA SYSTEM= spect
##.PULSE SEQUENCE= zgpg30
##.SOLVENT NAME= CDCl3
##.SHIFT REFERENCE= (INTERNAL, CDCl3, 0, 182.463)
##AUDIT TRAIL= $$ (NUMBER, WHEN, WHO, WHERE, WHAT)
$$ ##TITLE= Audit trail, XWIN-NMR		Version 3.5
$$ ##JCAMPDX= 5.01
$$ ##ORIGIN= Bruker BioSpin GmbH
$$ ##OWNER= she
$$ F:/spectra/data/she/nmr/P31/1/pdata/1/auditp.txt
$$ ##AUDIT TRAIL=  $$ (NUMBER, WHEN, WHO, WHERE, WHAT)
(   1,<2020-02-28 16:05:43.48 +0400>,<she>,<DPX200>,
      <created by zg, POWCHK disabled, PULCHK disabled
       configuration hash MD5:
       00 E9 B6 7A A2 85 ED C7 34 08 36 98 17 FE 4E 26
       data hash MD5: 32K
       C2 BF 38 66 4D 2C 16 89 BE B0 91 5C 74 1C 20 C5>)
(   2,<2020-02-28 16:05:46.18 +0400>,<she>,<DPX200>,
      <Start of raw data processing
       efp BC_mod = 2 LB = 1 FT_mod = 6 PKNL = 1 PHC0 = -1611.926 PHC1 = 671.0013 SI = 64K 
       data hash MD5: 64K
       77 85 46 06 B4 3F 00 1E 6B 4D BA 6E A3 63 F2 1C>)
(   3,<2020-02-28 16:05:58.68 +0400>,<she>,<DPX200>,
      <pk PHC0 = 1.173316 PHC1 = 0 
       data hash MD5: 64K
       0A B2 5A FB C9 F7 B3 DF 9C 2B 84 04 72 0D B6 C6>)
$$ ##END=
$$ 
$$ hash MD5
$$ A8 52 F2 64 CE E5 99 39 28 AF FD 07 31 67 5E 10
##$RELAX= 
##$RELAX= 
##$RELAX= 
##$RELAX= 
##$RELAX= 
##$RELAX= 
##$RELAX= 
##$RELAX= 
$$ Bruker specific parameters
$$ --------------------------
##$DU= <F:/spectra>
##$EXPNO= 1
##$NAME= <P31>
##$PROCNO= 1
##$TYPE= <nmr>
##$USER= <she>
##$AMP= (0..31)
100 100 100 100 100 100 100 100 100 100 100 100 100 100 100 100 100 100 
100 100 100 100 100 100 100 100 100 100 100 100 100 100 
##$AQSEQ= 0
##$AQ_mod= 1
##$AUNM= <au_zg>
##$AUTOPOS= <>
##$BF1= 81.014009
##$BF2= 200.13
##$BF3= 200.13
##$BF4= 200.13
##$BF5= 200.13
##$BF6= 200.13
##$BF7= 200.13
##$BF8= 200.13
##$BYTORDA= 1
##$CFDGTYP= 0
##$CFRGTYP= 5
##$CHEMSTR= <none>
##$CNST= (0..31)
1 1 145 1 1 1 1 1 1 1 1 1 1 1 1 1 1 1 1 1 1 1 1 1 1 1 1 1 1 1 1 1 
##$CPDPRG= <waltz16>
##$CPDPRG1= <>
##$CPDPRG2= <waltz16>
##$CPDPRG3= <>
##$CPDPRG4= <mlev>
##$CPDPRG5= <mlev>
##$CPDPRG6= <mlev>
##$CPDPRG7= <mlev>
##$CPDPRG8= <mlev>
##$CPDPRGB= <>
##$CPDPRGT= <>
##$D= (0..31)
0 1 0 0 0 0 0 0 0 0 0 0.03 2e-05 3e-06 0 0 0 0 0 0 0 0 0 0 0 0 0 0 0 0 
0 0 
##$DATE= 1582891542
##$DBL= (0..7)
120 120 120 11 120 120 24 19 
##$DBP= (0..7)
150 150 150 150 150 150 150 150 
##$DBP07= 0
##$DBPNAM0= <>
##$DBPNAM1= <>
##$DBPNAM2= <>
##$DBPNAM3= <>
##$DBPNAM4= <>
##$DBPNAM5= <>
##$DBPNAM6= <>
##$DBPNAM7= <>
##$DBPOAL= (0..7)
0.5 0.5 0.5 0.5 0.5 0.5 0.5 0.5 
##$DBPOFFS= (0..7)
$$ [...]
##$SUBNAM2= <"">
##$SUBNAM3= <"">
##$SUBNAM4= <"">
##$SUBNAM5= <"">
##$SUBNAM6= <"">
##$SUBNAM7= <"">
##$SUBNAM8= <"">
##$SUBNAM9= <"">
##$SW= 369.568048894756
##$SWIBOX= (0..15)
0 1 3 0 0 0 0 0 0 0 0 0 0 0 0 0 
##$SW_h= 29940.119760479
##$TD= 32768
##$TD0= 1
##$TE= 0
##$TE2= 300
##$TE3= 300
##$TEG= 300
##$TL= (0..7)
0 120 53 12 22 120 120 120 
##$TP= (0..7)
150 150 150 150 150 150 150 150 
##$TP07= 0
##$TPNAME0= <>
##$TPNAME1= <>
##$TPNAME2= <>
##$TPNAME3= <>
##$TPNAME4= <>
##$TPNAME5= <>
##$TPNAME6= <>
##$TPNAME7= <>
##$TPOAL= (0..7)
0.5 0.5 0.5 0.5 0.5 0.5 0.5 0.5 
##$TPOFFS= (0..7)
0 0 0 0 0 0 0 0 
##$TUNHIN= 0
##$TUNHOUT= 0
##$TUNXOUT= 0
##$USERA1= <user>
##$USERA2= <user>
##$USERA3= <user>
##$USERA4= <user>
##$USERA5= <user>
##$V9= 5
##$VALIST= <valist>
##$VCLIST= <CCCCCCCCCCCCCCC>
##$VD= 0
##$VDLIST= <DDDDDDDDDDDDDDD>
##$VPLIST= <PPPPPPPPPPPPPPP>
##$VTLIST= <TTTTTTTTTTTTTTT>
##$WBST= 1024
##$WBSW= 4
##$XGAIN= (0..3)
0 0 0 0 
##$XL= 0
##$YL= 0
##$YMAX_a= 10956
##$YMIN_a= -12043
##$ZGOPTNS= <>
##$ZL1= 120
##$ZL2= 120
##$ZL3= 120
##$ZL4= 120
##$ABSF1= 0
##$ABSF2= 0
##$ABSG= 0
##$ABSL= 0
##$ALPHA= 0
##$AQORDER= 0
##$ASSFAC= 0
##$ASSFACI= 0
##$ASSFACX= 0
##$ASSWID= 0
##$AUNMP= <proc_1d>
##$AZFE= 0.1
##$AZFW= 0.5
##$BCFW= 0
##$BC_mod= 2
##$BYTORDP= 0
##$COROFFS= 0
##$CY= -3
##$DATMOD= 1
##$DC= 0
##$DFILT= <>
##$DTYPP= 0
##$F1P= 0
##$F2P= 0
##$FCOR= 1
##$FTSIZE= 65536
##$FT_mod= 6
##$GAMMA= 0
##$GB= 0
##$INTBC= 1
##$INTSCL= 5.30512e-09
##$ISEN= 30
##$LB= 1
##$LEV0= 0
##$LPBIN= 0
##$MAXI= 10000
##$MC2= 0
##$MEAN= 0
##$ME_mod= 0
##$MI= 50
##$NCOEF= 0
##$NC_proc= -5
##$NLEV= 6
##$NOISF1= 182.463
##$NOISF2= 159.3651
##$NSP= 0
##$NTH_PI= 0
##$NZP= 0
##$OFFSET= 182.463
##$PC= 4
##$PHC0= -1610.753
##$PHC1= 671.0013
##$PH_mod= 1
##$PKNL= yes
##$PPARMOD= 0
##$PSCAL= 0
##$PSIGN= 0
##$REVERSE= no
##$SF= 81.0140089999434
##$SI= 65536
##$SIGF1= 159.3651
##$SIGF2= -187.1042
##$SINO= 113.3802
##$SIOLD= 16384
##$SREGLST= <1H.CDCl3>
##$SSB= 0
##$STSI= 65536
##$STSR= 0
##$SW_p= 29940.119760479
##$SYMM= 0
##$S_DEV= 0
##$TDeff= 32768
##$TDoff= 0
##$TI= <>
##$TILT= no
##$TM1= 0
##$TM2= 0
##$TOPLEV= 0
##$USERP1= <user>
##$USERP2= <user>
##$USERP3= <user>
##$USERP4= <user>
##$USERP5= <user>
##$WDW= 1
##$XDIM= 65536
##$YMAX_p= 332958533
##$YMIN_p= -11330972
$$ End of Bruker specific parameters
$$ ---------------------------------
##NTUPLES= NMR SPECTRUM
##VAR_NAME=  FREQUENCY,     SPECTRUM/REAL,   SPECTRUM/IMAG
##SYMBOL=    X,             R,               I
##VAR_TYPE=  INDEPENDENT,   DEPENDENT,       DEPENDENT
##VAR_FORM=  AFFN,          ASDF,            ASDF
##VAR_DIM=   65536,         65536,           65536
##UNITS=     HZ,            ARBITRARY UNITS, ARBITRARY UNITS
##FACTOR=    0.456856943014862, 1,           1
##FIRST=     14782.0589164792, 0,            0
##LAST=      -15158.0608439998, 0,           0
##MIN=       -15158.0608439998, -11330972,   0
##MAX=       14782.0589164792, 332958533,    0
$$ Real data points
##PAGE= N=1
##DATA TABLE= (X++(R..R)), XYDATA
$$ [...]
36807I5514P18732K7372j060545p82582P34469J444654M12366q09709o05727L92319
36797E66863O20094M2389k05848R2290J24624k75207l94204r3805p5597m79454
36787g7855n29581M1103M32534J69182q4068K19730M77876M1207n21534l02394
36777a33800M23989O50481K10371j93466l03982n24914q20453n25450M39474J111499
36767C33749P55246r9519m42590r7292L20759L92863K37819L8493j96313l81898
36757H61317l20799l2240J95449K11921K16281L99002N69421L76519j75418o77789
36747A623664q17727p06083n90538m53168j35717K59504M17648K60401L4849r3602
36737b00769j98064k48828l1736L72377M63088L9929l60435k40267K4886j93921
$$ plain form
36807 95514 814246 841618 -218927 -1001509 -267040 1177614 1589980 780271 174544 566863
36797 566863 1186957 1229346 1023498 1115788 1240412 965205 571001 477196 401599 -77855
36787 -77855 -607436 -566333 -133799 35383 -48685 171045 648921 690128 168594 -133800
36777 -133800 290189 940670 1151041 957575 653593 128679 -691774 -1217224 -777750 333749
36767 333749 1088995 989476 546886 449594 770353 1163216 1401035 1439528 1243215 861317
36757 861317 540518 508278 703727 915648 1131929 1530931 2100352 2476871 2301453 1623664
36747 1623664 805937 99854 -490684 -943852 -1079569 -820065 -402417 -142016 -107167 -200769
36737 -200769 -398833 -647661 -679397 -307020 156068 195997 -164438 -404705 -379819 -573740
36727e73740n98865l04178O38426J040923K81000o55059m89570N78277J199782
36718A116996O60260m24431j086462r79531l22792M86889R65615P24502p2117
36709A068929o63834m41892L26012P70064M39265j79274l27622P931J41602j91275
36699I49906l08807L54900J119704Q33104l72216j108177p01813p5028j73659
36690E17914n79820n03225k03427l12525m82245k4340O05075M16782k87070k57755
36680a110636N51931Q12609M6508o05976l71352Q608j06119m1377P08308J189445
36670A081949N26675m11783l77250J81200R836p29205q59604l13292p5784k80326
36660a247584j44456K64402K5094p12056o19225N50498J325859Q04709j5179l4343
$$ plain form
36727 -573740 -1172605 -1476783 -838357 202566 483566 -171493 -661063 -82786 1116996
36718 1116996 1777256 1352825 266363 -713168 -1035960 -549071 416544 1141046 1068929
36709 1068929 405095 -36797 289215 1059279 1498544 1319270 991648 999579 1141181 949906
36699 949906 641099 995999 2115703 2948807 2576591 1468414 766601 691573 517914
36690 517914 -61906 -565131 -768558 -1081083 -1563328 -1587668 -982593 -565811 -852881 -1110636
36680 -1110636 -558705 253904 300412 -305564 -676916 -668308 -774427 -815804 -107496 1081949
36670 1081949 1608624 1196841 819591 1000791 1010627 281422 -578182 -891474 -967258 -1247584
36660 -1247584 -1392040 -1127638 -1102544 -1814600 -2433825 -1883327 -557468 247241 232062 197719
36650A97719K90316J19699k23833q0606K15475O9876j34731K24503O89042L78260
36640A745720m89588r14068o42066l05884k54237k36664j16630l0110N2603J93179
36630i97745J27240k52498l72119K61092J074466J074682K36419n97482r27523
36621c73468q14516k19252P84100J346007O15603q04804j353002n85324L74011
36612a030645O35874N73547O74271N96579M5457m23436k83054L0938j44905o10550
36602F4076p02067l51202m1984N277P522J51806L94291N84917N29678J42649l03190
36591D81773l90360j40635J0523r5671j79106j25819j30521j18645K25892O61534
36581A98965M93075j92267l73651K78670O63673m4364r28941p00832K27042L99378
$$ plain form
36650 197719 488035 607734 383901 303295 518770 588646 453915 678418 1367460 1745720
36640 1745720 1256132 342064 -300002 -605886 -860123 -1096787 -1213417 -1243527 -1190924 -997745
36630 -997745 -870505 -1123003 -1495122 -1234030 -159564 915118 1151537 554055 -373468
36621 -373468 -1187984 -1407236 -623136 722871 1338474 533670 -819332 -1404656 -1030645
36612 -1030645 -394771 178776 853047 1449626 1495083 1071647 788593 819531 674626 64076
36602 64076 -637991 -989193 -1031177 -1025900 -1018378 -866572 -472281 112636 642314 784963 481773
36591 481773 91413 -49222 -38699 -134370 -313476 -439295 -569816 -688461 -462569 198965
36581 198965 692040 499773 126122 404792 1068465 1024101 95160 -605672 -378630 20748
36571B0748l69565q01835k39382M59799M23628k142q8167Q0003n6835m91085o25679
36560a690512j44673N52106Q25447N07672N5651p613K78411M39765L03004K14245
36550A333503L77328M44374J07773l24587l89269j46189O0139J61613K02876O215
36540A833776m37015o33904k93090K9401k70735p67917n94743J67205O34995N02102
36530A70075K82856K39793P6298k41559l25042j39440l3509N7676M45712O99926
36520A232786L7687j096955j201269N2532J097135P23301k24018l86308L2495
36511B67386p020m58403m21223K01688O22046M96308J75230j77288o10157p07978
36501f19411m1405P67900O10117l91801q85972k76154M23686J97717n01713n85300
$$ plain form
36571 20748 -348817 -1150652 -1390034 -930235 -506607 -508749 -596916 -516913 -573748 -1064833 -1690512
36560 -1690512 -1835185 -1283079 -457632 50040 105691 98078 376489 816254 1119258 1333503
36550 1333503 1710831 2155205 2262978 1938391 1549122 1402933 1463072 1624685 1827561 1833776
36540 1833776 1396761 762857 469767 499168 228433 -539484 -1134227 -967022 -332027 170075
36530 170075 452931 692724 769022 527463 202421 62981 29472 87148 532860 1232786
36520 1232786 1270473 173518 -1027751 -975219 121916 845217 621199 234891 267386
36511 267386 260366 -198037 -619260 -417572 204474 700782 876012 698724 88567 -619411
36501 -619411 -660816 107084 717201 325400 -560572 -836726 -413040 -215323 -717036 -1302336
36491a302336Q7859P17845P42537L31114j06123l67383m48584l93583j81072K70875
36481f48851Q49785J083742N96693k66206p13441m95573j48260j12475j55092
36472i678N0800K86328J65473k10363m32527l79096k23950n2970J39357K33547
36462d33079J51259J23625M21684Q78003J013969O34385K8777m04537n14454m15997
36452A483635l50581m71657o18293m46752L1963K94512P859l70529j99567L01007
36442c38403K87334l66507p10905q1088Q12238P83098j97432r80387p53599R3382
36432a452269P06114P54204M24674n9631m86487n25402k7998O20979Q12284L78720
36422A145188k75923o69947o39796l06899P2554K15889K9614k19910j43329L07852
$$ plain form
36491 -1302336 -1214477 -496632 245905 577019 470896 103513 -345071 -738654 -919726 -648851
36481 -648851 200934 1284676 1881369 1615163 901722 406149 257889 145414 -9678
36472 -9678 41122 327450 492923 282560 -149967 -529063 -753013 -805983 -666626 -433079
36462 -433079 -281820 -158195 263489 1141492 2155461 2789846 2818623 2414086 1899632 1483635
36452 1483635 1133054 661397 43104 -403648 -371685 -77173 -69314 -439843 -639410 -338403
36442 -338403 -51069 -417576 -1128481 -1209569 -397331 385767 188335 -792052 -1545651 -1452269
36432 -1452269 -746155 8049 432723 373092 -113395 -638797 -666795 -45816 766468 1145188
36422 1145188 869265 199318 -440478 -747377 -674823 -458934 -429320 -649230 -792559 -484707
36412d84707P59897Q17189M15846j80346n73764m96777r2389J54893P795j52593
36402A75044J05667N05657M16350j07322l46499r8424l7074n25291q57538l39101
36392a108531N12089O75389J17840l27575l17929k65410l15261p6757M35042N28248
36382a42855q8690p12491o12308R549N12248P32504Q53477P96678L65680k49366
36372A464426o45602p27731o44224m16146m7734K16010J95180J38873L15149M45091
36362B93292J04269m46550m71927J66798P50462O69025J50257j88462j15207J11042
36352A022999J08233l12107r21451j100505m53093N26197Q53999K94395l13764
36343b95097k46302J45087J52205j01859O4033O60872R12426M49932j28807k01899
$$ plain form
36412 -484707 275190 1092379 1508225 1327879 754115 257338 164949 319842 327637 175044
36402 175044 280711 786368 1202718 1095396 748897 650473 613399 88108 -769430 -1108531
36392 -1108531 -596442 78947 196787 -130788 -448717 -714127 -1029388 -1106145 -671103 -142855
36382 -142855 -231545 -944036 -1556344 -1546795 -1034547 -302043 551434 1348112 1713792 1464426
36372 1464426 818824 91093 -553131 -969277 -1017011 -801001 -605821 -466948 -151799 293292
36362 293292 397561 -48989 -520916 -354118 396344 1065369 1215626 1027164 911957 1022999
36352 1022999 1131232 819125 -102326 -1202831 -1655924 -1129727 -275728 18667 -295097
36343 -295097 -541399 -396312 -244107 -345966 -281933 378939 1291365 1741297 1612490 1410591
36333A410591q060j14465m52155m99769k10065p3649k23273j43771M10183P66161
36323H61728K07143p82598r09704J78430J248751J025464j54035q85987n91152
36314A98040k1414J12572Q6759L42491N34578J54234l89886k24210N91878R95627
36304B380669L85557n79167r26846n23527O7855L64448J99526l74899r62606r60060
36294i29050l00043K56243Q6444l44380j45658O13576R75632N41671J4338N8350
36284H27123L78828L69502O1028j35543j72645k41788k36397J3277J94447r4908
36274I62924n06035k63592N74943R66090L18732o05089p59958k40924O5490j03319
36264D09262j84559N4321Q1604l63981o05207l1097P55978O32540l76253r84179
$$ plain form
36333 1410591 1402531 1288066 835911 336142 126077 52428 -170845 -314616 95567 861728
36323 861728 1068871 286273 -623431 -445001 803750 1829214 1675179 789192 198040
36314 198040 176626 289198 375957 718448 1253026 1407260 1017374 793164 1385042 2380669
36304 2380669 2766226 2187059 1260213 736686 804541 1168989 1368515 993616 31010 -929050
36294 -929050 -1229093 -972850 -886406 -1230786 -1376444 -762868 212764 754435 768773 827123
36284 827123 1205951 1575453 1636481 1500938 1328293 1086505 850108 863385 1057832 962924
36274 962924 456889 193297 768240 1734330 2053062 1447973 688015 447091 512581 409262
36264 409262 224703 279024 360628 -3353 -608560 -639657 116321 748861 372608 -611571
36254f11571l82774O48686Q24348K9221o90859n79597J4636L04803M3543l70801
36244g70365m76776k13253J04531J61431p72o0194J17033K91295K91308L42184
36234b13578N95945O40381P8359n78712m05516M84410Q98285L18508k70879L930
36224A551133L97843k20525j268627j087450M13952J333811M72845r33500j075379
36215d15897q5723M97204J06532l63997k29451J19308J81157J00344R1830l0887
36205b9580l19139l91272j23306Q447k43925l74216r137L18453M7976l13390N5854
36194a373235Q10161Q41083O9571l57068J42615P49390O50882K11734N8210m2441
36184A760902m69344o96673r2252P22949N51237n19653j137789o42507J39745
$$ plain form
36254 -611571 -994345 -345659 478689 507910 -182949 -762546 -747910 -443107 -399564 -770365
36244 -770365 -1247141 -1460394 -1355863 -1194432 -1195204 -1255398 -1138365 -847070 -555762 -213578
36234 -213578 382367 1022748 1101107 522395 116879 601289 1499574 1818082 1547203 1551133
36224 1551133 1948976 1728451 459824 -627626 -213674 1120137 1592982 659482 -415897
36215 -415897 -501620 -4416 102116 -261881 -491332 -372024 -190867 -90523 1307 -29580
36205 -29580 -348719 -739991 -863297 -854850 -1098775 -1472991 -1482128 -1163675 -1115699 -1429089 -1373235
36194 -1373235 -563074 278009 347580 -9488 133127 882517 1533399 1745133 1803343 1760902
36184 1760902 1291558 594885 502633 1225582 1776819 1257166 119377 -523130 -383385
36175c83385L28905J51050J61901K27773r501k95195j52722K61951L69759K5769
36165F86305l63986m31206j40795L23263O07830L53353l12031o75293k60272M50623
36155B37791N71115m8165o93610p39603k82802J93676M01927L82540K97506K08666
36145E29041J2812l55936o58755n24037Q809M15424L46989N5116p6635p6554j44075
36134d67801k08854j17168L5443J33799K80963M19479J42149n85551r58597l15729
36124a641867P37791J024817M18010j27293r0395K6578k41465n96662o32660m58936
36114a582082l12851j73898o8800j59096k64879M3116O01380O50031N4712k72363
36104a484730K57651Q99996P23197J09538J04976O68364P07167j59736r47386
$$ plain form
36175 -383385 -54480 96570 258471 486244 476743 181548 28826 290777 660536 686305
36165 686305 322319 -108887 -249682 73581 681411 1034764 722733 47440 -212832 237791
36155 237791 808906 760741 67131 -672472 -955274 -761598 -359671 22869 320375 529041
36145 529041 541853 185917 -472838 -996875 -988066 -572642 -225653 -170537 -247172 -323726 -467801
36134 -467801 -676655 -793823 -758380 -624581 -343618 75861 218010 -367541 -1326138 -1641867
36124 -1641867 -904076 120741 538751 411458 321063 347641 106176 -490486 -1123146 -1582082
36114 -1582082 -1894933 -2068831 -2137631 -2296727 -2561606 -2518490 -1917110 -1267079 -1212367 -1484730
36104 -1484730 -1227079 -327083 396114 505652 610628 1278992 1986159 1826423 879037
36095H79037p46186Q092K62604j55494m18667N3373P88960R06422K56247m29816
36085A404572n07532j67428P331q4680q8379M4328q1158n40671p62802l16289
36075a092708L81665N86989K13922j57445j57023n7404k35903n33592m27200K11867
36065a266832Q14005P88455L36939J50369K94381P4609o64012r16904Q817J087013
36055G06840Q27062m48607j011018l46740K31083q3570l45413K42889P77159K64516
36045H14201m89218j70968P45706P00616m34230j212400q66648j79552J2087j46969
36035a227375k40905k19871n8640L07502N55195L35135N7217L60900Q88787P47158
36025A505103J45898J66987P28940M11506j108318k076288j146326N33925J029228
$$ plain form
36095 879037 132851 140943 403547 248053 -170614 -117241 671719 1578141 1834388 1404572
36085 1404572 897040 729612 736943 652263 563884 608212 527054 -13617 -776419 -1092708
36075 -1092708 -711043 -124054 89868 -67577 -224600 -282004 -517907 -1051499 -1478699 -1266832
36065 -1266832 -452827 335628 672567 822936 1117317 1191926 527914 -388990 -380173 706840
36055 706840 1533902 1085295 74277 -272463 -41380 -124950 -470363 -227474 549685 814201
36045 814201 324983 154015 899721 1600337 1166107 -46293 -912941 -1092493 -1080406 -1227375
36035 -1227375 -1468280 -1688151 -1746791 -1439289 -884094 -548959 -491742 -130842 757945 1505103
36025 1505103 1651001 1817988 2546928 2958434 1850116 -226172 -1372498 -838573 190655
36016A90655L16151k14095j43764k35081o25860n29278J67079N04294N4184l29824
36006h45539N0949N79560L63484l02125l82365L65400J108879J094468M64955
35997B497666j13957j95715J53198M66956K27030o07366j356655j228778k90072
35988d47693N02626M52912k8113q8326L29646M74571n0170p13277q19548l47701
35978g35073K39583N94611N81097J63313m26218p24101n92213m10977l87969j33674
35968a831621N73828J082844O63075l01010p31026l27275J96499L02327J94469
35959a77890R7906j75374o37629p95068k89944N90915J300862J519118J146416
35950B579312L23099m29346o09710l89055l39263n00296l94120m766J00967j70542
$$ plain form
36016 190655 506806 292711 148947 -86134 -711994 -1241272 -1074193 -569899 -515715 -845539
36006 -845539 -794590 -215030 148454 -153671 -536036 -170636 938243 2032711 2497666
35997 2497666 2383709 2187994 2341192 2808148 3035178 2427812 1071157 -157621 -447693
35988 -447693 54933 507845 479732 391406 721052 1195623 1145453 432176 -387372 -735073
35978 -735073 -495490 99121 680218 843531 417313 -306788 -899001 -1309978 -1697947 -1831621
35968 -1831621 -1257793 -174949 488126 187116 -543910 -871185 -674686 -372359 -177890
35959 -177890 -79984 -255358 -892987 -1688055 -1977999 -1387084 -86222 1432896 2579312
35950 2579312 2902411 2473065 1863355 1474300 1135037 634741 240621 235855 336822 166280
35940A66280j63173L76079P29778L04831m68966q84315q86259o86174j77555N73681
35930a115793R11136M35973k39459l20390N8710K60616J96123J78495J63086o2681
35920D65816k83835k13211q1637j30729L2723P01466J143112M90026p31691j133275
35910B58765m37369K48297K00597n5631O0917K36217J7600l42539l84936j61485
35900c59567M4031J92652K68978Q2350l12233m72084k36133n1342j96902j82689
35890a222939M80661J268438J125742q3722j244503j295514m51206J80597j2249
35881a254695n11227m76806J33068N87106M21007M583q3787J62477L62370M14012
35871b41892N21601O70401N24119o8179p24051q25353j69866O44975O58553l13260
$$ plain form
35940 166280 3107 379186 1108964 1413795 944829 60514 -825745 -1511919 -1689474 -1115793
35930 -1115793 -204657 231316 -8143 -328533 -269823 -9207 186916 365411 528497 465816
35920 465816 181981 -31230 -112867 -243596 -210873 490593 1633705 2123731 1392040 258765
35910 258765 -178604 69693 270290 214659 275576 511793 529393 186854 -198082 -359567
35900 -359567 -315536 -122884 146094 228444 -83789 -555873 -792006 -843348 -1040250 -1222939
35890 -1222939 -742278 526160 1651902 1568180 323677 -971837 -1423043 -1242446 -1254695
35881 -1254695 -1765922 -2242728 -2109660 -1522554 -1101547 -1096964 -1180751 -1018274 -655904 -241892
35871 -241892 279709 950110 1474229 1406050 681999 -143354 -313220 331755 990308 677048
35861F77048j150620o82090N69467Q47498l36528j313896o47544P06476Q94716
35852d35473k4240m10835K30406O93932L28728K8261M02002N92307j29551r02036
35842C73501o14451K19307K43565o08515j057742m15682N41808Q12137M36240
35833f9832J60354L16392M66104P2559p23001j158788p27940J93195Q11824Q27000
35823A67867N22684J64628j50398j73328K68135O95746L94073m50131q09590k91216
35813C38470K61127O7433m62308m99280m3539K93802K78003J27830n6813l06978
35803b253m56601l30790o4097J63369M15133O51865M99500j54352p11177n59558
35793e48961P4270N02105N16431M14434L35944J59577q9704k49921l46796m91307
$$ plain form
35861 677048 -473572 -1155662 -586195 261303 -75225 -1389121 -2036665 -1330189 -435473
35852 -435473 -459713 -870548 -640142 53790 382518 410779 812781 1405088 1275537 373501
35842 373501 -240950 -21643 221922 -386593 -1444335 -1860017 -1318209 -506072 -69832
35833 -69832 90522 406914 873018 945577 222576 -936212 -1664152 -1470957 -659133 167867
35823 167867 690551 855179 704781 531453 799588 1495334 1889407 1439276 629686 338470
35813 338470 599597 667030 204722 -294558 -338097 -44295 233708 361538 304725 -2253
35803 -2253 -458854 -789644 -853741 -690372 -275239 376626 876126 721774 10597 -548961
35793 -548961 -474691 27414 543845 958279 1294223 1453800 1364096 1114175 767379 276072
35783B76072n62296l44395J36053O54229R52264P19024j47622j012879q44365
35774a73915M54998J627660J558277O49520L3901m0590j84180o28216r59405r11056
35764A426994n96839j08898L64065K56436o71156j538749j222408K9020Q19157
35755a242378M94887j49876k09546K47739P13156R73066R15201L60942m45147
35746A658044p86138l62831K41464L44934k3269l92947m79375k41967K48625O85207
35736H91747O33532O1109n28778o85464m56517j52274j131r7088l19155k87485
35726i41504J86299O55616N64253J38079Q4307M24388M40053r6756n21402l87624
35716E45709j13153j08893j10695R4073R0823l47350o04323j58269M47765M27272
$$ plain form
35783 276072 -286224 -630619 -494566 159663 1111927 1830951 1683329 670450 -173915
35774 -173915 281083 1908743 3467020 4116540 4150441 4109851 3925671 3297455 2338050 1426994
35764 1426994 830155 721257 1085322 1341758 670602 -868147 -2090555 -2061535 -1242378
35755 -1242378 -747491 -897367 -1106913 -859174 -146018 827048 1742249 2103191 1658044
35746 1658044 871906 509075 750539 1095473 1072204 679257 199882 -42085 206540 891747
35736 891747 1525279 1586388 1057610 372146 -84371 -236645 -237776 -334864 -654019 -941504
35726 -941504 -755205 -99589 464664 602743 687050 1111438 1551491 1454735 933333 545709
35716 545709 432556 323663 212968 307041 397864 50514 -553809 -712078 -264313 162959
35706A62959K6856L9325M14069L86479j45709m08012l9880K95071o2230p70569
35696a01641r65994l88219L56303N51728J64792j71072M7987N24671N27846q7534
35686D58867o52977o33733l00295j15827K9085M20495P71884N69679m5353m32682
35676F9143l87732k58372j74151J27348O05487P32549K67628l16511m78412k70034
35666h3057p6669m4294n1768N097J43791L10214L12061k0717m72251n39503r9141
35655f16237L24282K39269j25882j93452P3024J21183l01698o62005l31690M82045
35645i91161R04485M98584j68940k79522J76506M48482N8930o00548q05804l28904
35635a087892M21683Q47561O02580j54780p62618n59165L69942J140383R96522
$$ plain form
35706 162959 189815 229140 643209 1029688 883979 475967 436087 731158 668928 -101641
35696 -101641 -1067635 -1455854 -1099551 -547823 -383031 -554103 -506116 18555 546401 458867
35686 458867 -194110 -827843 -1128138 -1243965 -1214880 -794385 -22501 547178 501825 69143
35676 69143 -318589 -576961 -751112 -623764 -18277 714272 981900 665389 186977 -83057
35666 -83057 -159726 -204020 -255788 -250691 -106900 203314 515375 494658 22407 -517096 -616237
35655 -616237 -291955 -52686 -178568 -372020 -298996 -177813 -479511 -1141516 -1473206 -991161
35645 -991161 -86676 411908 242968 -36554 139952 588434 647364 46816 -758988 -1087892
35635 -1087892 -666209 181352 783932 629152 -133466 -692631 -322689 817694 1814216
35626A814216J08477p57896j107054r62957n26841q855L37927M19884M69559O79876
35616D66336Q01671M88135r0206m25960l90060k83409k19533n801L04710L12902
35606I58785r2356m91304n36845l55936j54562Q0997K35147k9188o15281p87513
35596a788056j88709M02071Q3115o85748n33826Q39962K042183J730816K99087
35587B200895p61842p37322k46845j07609l47214m93661l15641N2235M18988O25175
35577B87159M83150j1294m38636k87154L49153O95173J79841p53564j052401k97323
35567h45896P59131J068242M85770j81357k35519J63995M10947K71059J036j54659
35557A742749k07657k02287j18713o3145k02696l86812k05393L54970O79710K84321
$$ plain form
35626 1814216 1922693 1164797 57743 -905214 -1432055 -1440910 -1102983 -683099 -213540 466336
35616 466336 1268007 1756142 1665936 1239976 849916 566507 346974 341173 645883 958785
35606 958785 866429 375125 -161720 -517656 -672218 -591221 -356074 -385262 -1000543 -1788056
35596 -1788056 -1976765 -1574694 -1491579 -2177327 -2711153 -1871191 170992 1901808 2200895
35587 2200895 1439053 701731 454886 347277 63 -493598 -809239 -757004 -338016 287159
35577 287159 770309 759015 320379 33225 382378 1077551 1257392 503828 -548573 -845896
35567 -845896 -86765 981477 1467247 1285890 1050371 1214366 1625313 1896372 1897408 1742749
35557 1742749 1535092 1332805 1214092 1150947 948251 561439 356046 711016 1390726 1675047
35547A675047n00727r83979r57075o28486l5026Q14193J386492J035925M3799
35538A850163n19610j84938L86339N23595M04316L54181J08834n26011r58382
35529A438487o35956r8029k19894p26731n58919L59028Q74232L64713l40473l21496
35519A34962O9827j0829m04874k23163N98175R95607K82599p57923q37446J05738
35509d7327P99919L49288n72123p27632j07700J38111m33819p79801k881J096490
35499b87475J091190N8294n41689k3011O88807O45404K00488J58825M55933M67726
35489B914492J06559j73700j91788j81915k53482k70329k20020k41535k88988
35480A199294j53179J36118K27947j23517o88814r07652m44938L50276O80378
$$ plain form
35547 1675047 1174320 190341 -766734 -1395220 -1430246 -616053 770439 1806364 1850163
35538 1850163 1330553 1145615 1531954 2055549 2459865 2814046 2922880 2396869 1438487
35529 1438487 802531 704502 484608 -242123 -801042 -442014 432218 796931 456458 134962
35519 134962 204789 193960 -210914 -434077 164098 1159705 1442304 684381 -153065 -47327
35509 -47327 752592 1101880 529757 -197875 -305575 -167464 -601283 -1381084 -1383965 -287475
35499 -287475 803715 862009 320320 297309 986116 1631520 1832008 1990833 2446766 2914492
35489 2914492 3021051 2847351 2655563 2473648 2220166 1949837 1729817 1488282 1199294
35480 1199294 1046115 1182233 1410180 1286663 597849 -309803 -754741 -404465 275913
35471B75913K17086l68716j91749O35127J125196P55454K712n90746j074131j426751
35461f40605j083937J51717J333836J358120L75885n38671q10821o54148k40010
35452g48634M44523R73751P10686j52482o15268k07848M15567N32352K93172J69293
35442A815112R0354k45566o02196m38987J83959N26411J28116n48581p08379k73388
35432g3145K5402k90970o74466l03325N58038P06780k54495j117047o48419O46391
35422a425256J245104P05966m613j57982j08100l01425m90407l78020k11965k23244
35412a349942j45353K15115N34974N73565O10005P82413O24526j14060p62688
35403I68555n96752J8486J47448l30393o47317l32692K60517O15070O21146M24082
$$ plain form
35471 275913 492999 124283 -67466 567661 1692857 2448311 2451023 1860277 786146 -640605
35461 -640605 -1724542 -1572825 -238989 1119131 1495016 956345 145524 -508624 -748634
35452 -748634 -304111 669640 1380326 1227844 612576 404728 820295 1352647 1645819 1815112
35442 1815112 1905466 1659900 1057704 618717 802676 1329087 1457203 908622 200243 -73145
35432 -73145 -47743 -338713 -1013179 -1316504 -758466 -51686 -306181 -1423228 -2071647 -1425256
35422 -1425256 -180152 525814 521201 363219 255119 -46306 -536713 -914733 -1126698 -1349942
35412 -1349942 -1495295 -1280180 -745206 -171641 438364 1220777 1845303 1731243 968555
35403 968555 371803 390289 537737 207344 -439973 -772665 -512148 102922 724068 1148150
35393A148150J80148L1889j3496j60298n00471p47735n99261j77425K00282M33745
35383b04472M81590J56692m43990o89809k10518L99039L77039j5200M4166N06355
35373D00892N10834j11362m71474n2871M67938L25153k13185m34025k72242j47034
35363B624j29442M9184L53527L88902q438m78356m92717R4194P93988Q29079k7107
35352A375438r94604j036234p9665R18066J157219P58273K54084j10308l31758
35343A910511m02209m10345n18132o32272m86361j74202j05314k89163k56302
35334a363789J00187K65117j1636k46599l7320L14244M28110M12894L28645j44068
35324D5785q63766q58951L32444J620943J655253O39102j75545l68354n54159
$$ plain form
35393 1148150 1328298 1360187 1346691 1186393 685922 -61813 -661074 -838499 -638217 -204472
35383 -204472 277118 433810 -10180 -699989 -910507 -511468 -134429 -149629 -105463 400892
35373 400892 911726 800364 328890 276019 743957 1069110 855925 421900 149658 2624
35363 2624 -126818 -77634 275893 664795 656357 178001 -314716 -220522 573466 1402545 1375438
35352 1375438 380834 -655400 -735065 183001 1340220 2098493 2352577 2242269 1910511
35343 1910511 1508302 1097957 579825 -52447 -538808 -713010 -818324 -1107487 -1363789
35334 -1363789 -1263602 -998485 -1010121 -1256720 -1294040 -979796 -551686 -138792 189853 45785
35324 45785 -817981 -1676932 -1344488 276455 1931708 2570810 2395265 2026911 1472752
35315A472752r55256j010447m68627J87013N71145P70154P62718L19519l61872
35306A287099p01347n62968l33971j35209K69297P36567P77883M30938K27874
35297A996163J78170k59668r89701j099109k61895O35162P63486L90182J39236
35288A492026N7579j9749J6825N9853m01534j295805j574570o11538O78245R96586
35278f02082L78008j59550j85457p6528m892K38044N08272L67096o7003j58251
35268B37657K03085L24959k50883r90610r95858j09256Q75687J048988L44565
35259F88334l83548l49189K29500N31805L47132K23602L34736R5177o54671r75007
35249H7871j22257J145255J461186N98052n42932j260403j432635r53523J04804
$$ plain form
35315 1472752 517496 -492951 -961578 -774565 -203420 566734 1329452 1648971 1287099
35306 1287099 585752 22784 -311187 -446396 -177099 559468 1337351 1768289 1996163
35297 1996163 2174333 1914665 924964 -174145 -436040 199122 962608 1352790 1492026
35288 1492026 1549605 1529856 1546681 1606534 1205000 -90805 -1665375 -2276913 -1598668 -602082
35278 -602082 -224074 -383624 -569081 -645609 -650501 -412457 95815 462911 395908 237657
35268 237657 440742 765701 514818 -475792 -1471650 -1580906 -705219 343769 688334
35259 688334 304786 -44403 185097 716902 1064034 1287636 1622372 1717549 1062878 87871
35249 87871 -34386 1110869 2572055 3170107 2627175 1366772 -65863 -1019386 -914582
35240i14582R25809O56774k87529o53763j66328J46628l22031p95615m03393M61792
35230a352238Q02082M49435Q7391J21956K18020j4144l41142j77701N46804J062105
35220A402568N97491n06558j038953m73500L17010L45384j40563l21834k19680
35211c8635l98301o40983j90616P34114R66267J95530m69807k26354K54714Q2905
35201B68834l77024k08273N03809P91309K18210o12460q99586m38438L82916R63874
35191E93171Q94707K84067l23137n04442l48817k02407j94545j41227J71556O44243
35181H73169P86120J93748p44545j013599k41860O04095M21991m77204q37041
35172d35126k49849M63664O16690M00992J49384j84263n56998o83770n81467n14735
$$ plain form
35240 -914582 11227 668001 380472 -273291 -439619 -292991 -615022 -1410637 -1814030 -1352238
35230 -1352238 -550156 -100721 -13330 108626 326646 312502 -28640 -206341 340463 1402568
35220 1402568 2000059 1493501 454548 -18952 298058 643442 502879 181045 -38635
35211 -38635 -436936 -1077919 -1268535 -534421 431846 627376 157569 -68785 185929 268834
35201 268834 -108190 -316463 187346 978655 1196865 584405 -315181 -753619 -370703 593171
35191 593171 1487878 1771945 1448808 944366 595549 393142 198597 57370 228926 873169
35181 873169 1659289 1853037 1108492 94893 -146967 457128 879119 401915 -435126
35172 -435126 -684975 -221311 395379 796371 945755 761492 204494 -479276 -1060743 -1575478
35162a575478l35469K41181P31173L99943k67323k5610R47261R74408l97374j345264
35152f52552n19658P79486O59714m80709r05213l87386j46467m75250l98955L75900
35142b151090R10106O41579J46354J5989J12099J70281J91467J09882q1979N3819
35132A18507P47003J177638M16831r22049j267171l76236L14195j12885q52503
35123g56670q65599l39844K9033K03692M56509N96066L10607j91866m57948l36497
35113a352517P3489N70413P41173K89513l38887l53470J55480K19817m66535r55470
35103a416994n17325K35423M48350M01019P96471J298419R42621k27466j033359
35094I27159p48183O0611M77409L17860m0193l39447n21652m43714J1756N76592
$$ plain form
35162 -1575478 -1910947 -1669766 -938593 -538650 -805973 -831583 115678 1090086 692712 -652552
35152 -652552 -1172210 -392724 266990 -213719 -1118932 -1506318 -1652785 -2128035 -2526990 -2151090
35142 -2151090 -1240984 -599405 -453051 -437062 -324963 -154682 36785 146667 64688 118507
35132 118507 865510 2043148 2459979 1537930 270759 -105477 208718 95833 -756670
35123 -756670 -1622269 -1962113 -1933080 -1729388 -1272879 -676813 -366206 -558072 -1016020 -1352517
35113 -1352517 -1279028 -708615 32558 322071 -16816 -370286 -214806 5011 -461524 -1416994
35103 -1416994 -1934319 -1698896 -1250546 -849527 -53056 1245363 2187984 1960518 927159
35094 927159 178976 239587 716996 1034856 994663 655216 133564 -310150 -298394 278198
35084B78198P02621J78181n41815q26023n90938k58437k8925L52657R19529J083242
35074A268290L98043o19814j049052p57343l97839l04310j11027M20338Q70946
35065b81768P56003J89107l12165l77657m814M77243O08210K56526j61657k54834
35055H94194k74717o59125j140987j015350k57722L82271M91617M51900O28205
35046d99714Q33333Q18210O04565J37068o49977j222120p84091M17886J050470
35037G05630M71904l30032k43271L92643N98321L88572M52866O49518J07200j152460
35027B040891j849392j120131K29835P26847O4556o59489m70055K63027M48290
35018c25621j50532n67628n9204P28592O38759k97044q72065l85569N20387Q98462
$$ plain form
35084 278198 980819 1159000 617185 -208838 -799776 -1058213 -1087138 -734481 185048 1268290
35074 1268290 1666333 1046519 -2533 -759876 -1157715 -1462025 -1573052 -1152714 -281768
35065 -281768 474235 663342 351177 -26480 -31294 445949 1054159 1310685 1149028 894194
35055 894194 619477 -39648 -1180635 -2195985 -2453707 -2071436 -1579819 -1127919 -499714
35046 -499714 333619 1151829 1756394 1893462 1243485 21365 -762726 -344840 705630
35037 705630 1177534 847502 604231 996874 1595195 1983767 2436633 3086151 3193351 2040891
35027 2040891 191499 -928632 -698797 28050 92606 -566883 -1036938 -773911 -325621
35018 -325621 -476153 -1043781 -1102985 -374393 264366 -32678 -904743 -1290312 -769925 128537
35008A28537O35616K27521K342n6690j02369k68701m29737j62154N87439J017740
34998A579544M35790m77298m33215M46811O84883k25368r81956n81217J46403
34989E94377N1169n26247o23980l08014j70212k3459N33760R14210L41014o00489
34979A82129o43515J83845O37638J89658m50104p38520r10621j006729n34802
34970c091021M79026J112558P54781j2214k15001L05978Q52303P15891j35034
34961G67267j024449j206318o69780j15937K803j6956J52571K69581J07665r503
34951a743056J44766K00870J4681J75099Q22009Q88483k55038j266218n28237
34942a546641J212282J708033M57821p75758p48622j73397q362o1988M1323Q110
$$ plain form
35008 128537 764153 991674 994016 937326 834957 566256 136519 -25635 561804 1579544
34998 1579544 2015334 1538036 1104821 1551632 2236515 2011147 1029191 447974 594377
34989 594377 645546 119299 -504681 -812695 -982907 -1006366 -472606 441604 782618 182129
34979 182129 -461386 -277541 360097 549755 99651 -638869 -1549490 -2556219 -3091021
34970 -3091021 -2611995 -1499437 -744656 -756870 -971871 -665893 186410 902301 767267
34961 767267 -257182 -1463500 -2133280 -2249217 -2246414 -2263370 -2110799 -1841218 -1733553 -1743056
34951 -1743056 -1598290 -1397420 -1382739 -1207640 -385631 502852 247814 -1018404 -1546641
34942 -1546641 -334359 1373674 1831495 1055737 307115 133718 125356 63368 104691 112801
34932A12801k44993j34167M21576N44988j32298o77130l68757M1260m35547j353673
34922b225940j438689l74918Q66381J210046M53482o45066r64358j12615R71294
34913b260383J088395M01568R3743M41119M85194j35356m68815L6564N15259K54876
34903D52164j9857M71771J046217O85232k30784o37625m99660m84393n41740j78725
34893F2600K96672J76741k86719k43348K13578J71776m67523p53246k31545M08164
34883f52850N01670K48319P0500k0325q4304j06J30107m3719m37914m21736K67705
34872d42653R98235J016409L84659k22565l99782l10251k11084n3473K83944N52541
34862A595980K85606m59593q61372k73321P96603J235401P80323K23668J18937
$$ plain form
34932 112801 -132192 -266359 155217 700205 567907 -109223 -477980 -436720 -872267 -2225940
34922 -2225940 -3664629 -4039547 -3173166 -1963120 -1509638 -2154704 -3119062 -3231677 -2260383
34913 -2260383 -1171988 -770420 -676677 -235558 249636 114280 -354535 -317971 197288 452164
34903 452164 432307 904078 1950295 2635527 2404743 1767118 1267458 783065 241325 62600
34893 62600 359272 536013 249294 5946 219524 391300 -76223 -829469 -1061014 -652850
34883 -652850 -151180 97139 167639 147314 63010 62904 193011 149292 -288622 -710358 -442653
34872 -442653 555582 1571991 1956650 1734085 1334303 1024052 812968 759495 1043439 1595980
34862 1595980 1881586 1421993 560621 287300 1083903 2319304 3099627 3323295 3442232
34853C442232J14650j68200m48348m23807l36753l82657k72864O8976J18500l18211
34843A393518n45743p9972M39289K70391k08338k34771M1129K9946j26319J7923
34833I97053J27915l47224r19126o56057J97554M79853r4965o15116m43707J12377
34823a161443O19998R34342Q02339J12496m90503l08778J93160M0677n37975m33713
34813b29400L65610P01844K98801J73327N86959L92584p96974j525353p18992
34804g51594M96944N72971j08928j77270L86573M95539m1236l77894k36664k00208
34794E8233m47313m75917j79950r4876l84152n04784r6847N34611R63529J012371
34784C84905N46413l84741j131650r09632J42404R95270R85131M52655L9k46322
$$ plain form
34853 3442232 3556882 3388682 2940334 2516527 2179774 1797117 1524253 1593229 1711729 1393518
34843 1393518 847775 767803 1207092 1477483 1269145 1034374 1075503 1105449 979130 997053
34833 997053 1124968 777744 -141382 -797439 -599885 -120032 -214997 -830113 -1273820 -1161443
34823 -1161443 -541445 392897 1195236 1307732 817229 508451 701611 742288 204313 -229400
34813 -229400 136210 838054 1136855 1310182 1897141 2289725 1492751 -32602 -751594
34804 -751594 -254650 318321 209393 32123 418696 914235 872999 495105 258441 58233
34794 58233 -389080 -864997 -1044947 -1139823 -1523975 -2028759 -2125606 -1590995 -627466 384905
34784 384905 931318 546577 -585073 -1494705 -1352301 -357031 628100 1080755 1080794 834472
34774H34472l90496l68075j30247J66715L79453M41267J66370m75159q34099j16928
34764c26727J241014J605914K30222j428478j460986r4271P12763J33595n12507
34755A00539n1166O53837K04044r10598r40592L74924J306779P01066l87764m35383
34745F15686K80443L14469o39098j346289q67590K72127R74124Q44095K53655
34736G01622l10978n82137n08537k23780Q2763L22497M32927K86772p2366k76313
34726a47530o9246K58997K84704J25650K03427M63439M20417n3323n77974r07383
34716A178j097759r93473k53553Q90921J549713J187380K59896m34392o03518
34707E06393m23971j19999J08520J07340N38J06511M31612N72361K96340j05747
$$ plain form
34774 834472 443976 75901 -54346 112369 491822 933089 1099459 624300 -209799 -326727
34764 -326727 914287 2520201 2750423 1321945 -139041 -233312 479451 613046 100539
34755 100539 49373 703210 907254 -3344 -943936 -569012 737767 1438833 1051069 615686
34745 615686 896129 1210598 571500 -774789 -1642379 -1370252 -396128 447967 701622
34736 701622 390644 -191493 -700030 -923810 -841047 -518550 -85623 201149 128783 -147530
34726 -147530 -216776 42221 326925 452575 656002 1119441 1539858 1486535 908561 1178
34716 1178 -1096581 -2090054 -2343607 -1452686 97027 1284407 1544303 1109911 506393
34707 506393 82422 -37577 70943 178283 178821 285332 716944 1289305 1585645 1479898
34697A479898k25200l0999J46386o2273o75282j068454m21299J053276J800445
34688A996498P29215j034948j402770j88492P24624K66344m13965r1642N70661
34679A155525L67543l89321n68635j24219J30193O6520J55440K27044k70312r37697
34669a87919p14039M15524J178508P24215l54879r51015o51763J41345O87046
34660B87023M35389l83702q04054k88063M53361M86619O1599K7679K49178j23113
34650D01916r50685j096622k77824M49631M28990L03407O19663P94105K70941
34641I43522l48116k60392K58461M24253J35177k21281n26672o97061l10762O78724
34631G5853J423539J240543O34890L71563J64122n82218j287314q81552K74560
$$ plain form
34697 1479898 1254698 1223699 1370085 1307812 632530 -435924 -857223 196053 1996498
34688 1996498 2725713 1690765 287995 99503 824127 1090471 676506 584864 1155525
34679 1155525 1523068 1133747 565112 440893 571086 637606 793046 1020090 749778 -187919
34669 -187919 -901958 -486434 692074 1416289 1061410 110395 -541368 -400023 287023
34660 287023 722412 338710 -465344 -753407 -300046 186573 248172 275851 525029 401916
34650 401916 -548769 -1645391 -1923215 -1473584 -1044594 -741187 -121524 672581 943522
34641 943522 595406 335014 593475 1017728 1152905 931624 404952 -292109 -602871 75853
34631 75853 1499392 2739935 3374825 3746388 3910510 3328292 2040978 1159426 1433986
34622A433986O80526j4956n26115r7853L25111j69556q64592o14991K96152O99390
34612A147102L40973l9097q4067j21282k08273K5765M89568N40138L280n30723
34602A563384o67443o82881p57124n43340O5510M94018L75550K23656N50898R16988
34592A539216O58398P2053r1370O219m47976j321764j400855k28738R48150P85591
34582E18924l08159p82322n8319Q36043P76813k9497m89338j22831L80351J77825
34572H99490n27759p34216m5229P15777O17568j16545n32462l29139p2079j08653
34562b33247r7961K02663M40226L02316L3878o5022j06916j79653J961M95987
34552G94232O86182Q4939p45717p78633P7486P87999M88365m76870j000069m90819
$$ plain form
34622 1433986 2114512 2099556 1573441 1475588 1800699 1631143 766551 151560 447712 1147102
34612 1147102 1488075 1448978 1364911 1243629 1035356 1061121 1550689 2090827 2094107 1563384
34602 1563384 895941 213060 -544064 -1087404 -1021894 -527876 -152326 71330 622228 1539216
34592 1539216 2197614 2269667 2178297 2184516 1736540 414776 -986079 -1214817 -266667 518924
34582 518924 210765 -571557 -629876 206167 982980 953483 464145 341314 721665 899490
34572 899490 371731 -362485 -407714 308063 925631 809086 276624 -52515 -124594 -233247
34562 -233247 -331208 -128545 311681 613997 647875 582853 475937 296284 298245 794232
34552 794232 1480414 1565353 819636 41003 118489 906488 1394853 917983 -82086 -572905
34542e72905M64623P78230J75559m26096j40143N98114O17149k35403q34800m87152
34532f2824Q1155l289l77758j87224M12604N10373p8846n40445k69543L84551
34522a31246O92576L68735k42858m87233J1230Q15928R74500J58118q26080j048804
34512B84866o02326k37345k36028k73636j57978o0492q3490q6285Q9373M85195
34502h78146R29651R40737J93603p10949o51583M28266J156031N98083l40229
34493A665464k76221O17990J022110L80554o76190j420978j520084q40716K11384
34484h36687N89040j29266q62173m99150L77832N39873J86620L51480P94974M19760
34474I32303m74958m29137O20984J093065L94637k13307O4014L23347j80192p28951
$$ plain form
34542 -572905 -108282 669948 845507 419411 279268 877382 1494531 1259128 424328 -62824
34532 -62824 18331 15042 -362716 -549940 -137336 373037 294191 -246254 -515797 -131246
34522 -131246 561330 930065 687207 199974 211204 1027132 2001632 2159750 1333670 284866
34512 284866 -317460 -554805 -790833 -1064469 -1222447 -1282939 -1366429 -1452714 -1363341 -878146
34502 -878146 51505 992242 1185845 474896 -176687 251579 1407610 2005693 1665464
34493 1665464 1389243 2007233 3029343 3409897 2733707 1312729 -207355 -1048071 -836687
34484 -836687 -247647 -376913 -1239086 -1738236 -1360404 -820531 -633911 -282431 512543 932303
34474 932303 457345 28208 649192 1742257 2136894 1923587 1987601 2310948 2130756 1401805
34464A401805n83279j51747J01099L95745N63487j14640j224667j186545J61463
34455f37279Q73365m8246r34787k89717O89477L54405m76034j53888P34436M94965
34445F06697n56741p22018M7369L26948k0282J60501P64411M64470o01023p23483
34435b53151L84422R13748l9223j045374q28525j16597R9895K75493R30902J180802
34425A502392K04004j007739r58789R0929O39019J83599l85621l52442M7818L53220
34415C16390M44623L24441j1758l88741n34421l59293M1414M90580O83593L56800
34405A363628k90076o67502m89015m9958L21093O26917Q17659N82546j05241o74716
34395A435335o23882k01426k2864k28424m07989k50318P5624K24453J58296J63371
$$ plain form
34464 1401805 818526 666779 767878 1163623 1727110 1612470 387803 -798742 -637279
34455 -637279 236086 187840 -746947 -1036664 -347187 7218 -468816 -622704 111732 606697
34445 606697 49956 -672062 -624693 -297745 -318027 -157526 606885 1071355 470332 -253151
34435 -253151 131271 1045019 1005796 -39578 -868103 -984700 -884805 -609312 321590 1502392
34425 1502392 1706396 698657 -260132 -169203 469816 653415 267794 -84648 -36830 316390
34415 316390 761013 1085454 1073696 684955 150534 -208759 -167345 323235 1006828 1363628
34405 1363628 1073552 406050 -82965 -132923 188170 815087 1632746 2215292 2110051 1435335
34395 1435335 811453 610027 587163 358739 -49250 -299568 -223944 509 158805 322176
34385C22176L40578K84135l54879j038126p32716N93852J606731J288110K64019
34376B573880l17634m51292p00634o88130K67118J361453R95831o23107j422491
34367I94994n14762M93710J27853p24879n19512M16665P03121K91281K43709O30991
34357B143171M35818m80304r32994k92089M87394K88048o34009j168211q19691
34348i72867q6571L18691J93789q7003j9329M47919P72454M34579l57354q39387
34338a95079n69356J14164N22052K89136l75890r06540q48081k94501J67513J21226
34328a975356j47266j9455N91642J064493Q64690K41723j28063n5092k0925l55585
34318F0806o16089j82490P17649J145961O84221m1661l10618k08557j69529j58759
$$ plain form
34385 322176 662754 946889 592010 -446116 -1178832 -584980 1021751 2309861 2573880
34376 2573880 2256246 1804954 1104320 416190 683308 2044761 3040592 2417485 994994
34367 994994 480232 973942 1101795 376916 -142596 274069 977190 1268471 1512180 2143171
34357 2143171 2578989 2098685 1165691 873602 1360996 1649044 1015035 -153176 -972867
34348 -972867 -1059438 -740747 -546958 -633961 -653290 -205371 567083 1001662 644308 -195079
34338 -195079 -764435 -650271 -128219 160917 -214973 -1121513 -1969594 -2264095 -2096582 -1975356
34328 -1975356 -2122622 -2142077 -1550435 -485942 378748 620471 492408 437316 416391 60806
34318 60806 -555283 -737773 -20124 1125837 1810058 1768397 1457779 1249222 1079693 920934
34308I20934Q3516L89519M25664L01369K53454N0499n33467r87431p19920j75155
34298H982k15928n54762q8892J094027J450077K31522j232492j289063n2009J088006
34288D39468J300733Q21461J65180l49901n78798o05949o00053l91622L12984
34279E13503J125423J134281J98332p23478r28355p66389o21029j61307O50578
34270D21559Q74582m1489j068044r21961P6426O50751N12940M06176N83135N15675
34260B009750l790n61993q66634q94013m70242M15150J118796J068092O71498
34251B486614N54722L23151o93644j813298j618669j93400P82769M50089j61949
34242A16385J7134N29845M51656n8266k12520R5460L10389J39551j98728l70514
$$ plain form
34308 920934 1004450 1393969 1819633 2121002 2374456 2424955 1891488 904057 184137 8982
34298 8982 -206946 -761708 -850600 243427 1693504 1925026 692534 -596529 -648538 439468
34288 439468 1740201 2561662 2726842 2376941 1798143 1192194 592141 200519 513503
34279 513503 1638926 2773207 2971539 2248061 1319706 553317 -67712 -229019 421559
34270 421559 1296141 1254652 186608 -735353 -658927 -8176 504764 910940 1494075 2009750
34260 2009750 2005960 1443967 577333 -316680 -786922 -371772 747024 1815116 2486614
34251 2486614 3041336 3364487 2670843 857545 -761124 -954524 -171755 278334 116385
34242 116385 133519 663364 1115020 1056754 844234 939694 1250083 1389634 1190906 820392
34232H20392j46660M44890Q86272N30780m64028j029465m40715O85745J097384
34223B384595L85045o27926q83442k16734N29330M68543k95592q23337n99395
34214C21087j78360k25182m67120k75525J68549K02828q8831M024N41645P95660
34204G98775M49506l4246l33410n51061m80445K76682J203857J097501j23024
34195B304135j002577n85695K51534L03184j88843k76301M5226J06087j00321
34186H56429l8824K34264J59910k40390l45559J2186L11298K25525M5853R3045
34176A313737K46165J98372j53791o15441p91970m27660J79124M06720J67300
34167E22556O0956L41980L56959l73635j097954p44591M46188J172839Q57646
$$ plain form
34232 820392 673732 1118622 2004894 2535674 2071646 1042181 601466 1287211 2384595
34223 2384595 2769640 2141714 1258272 1041538 1570868 2039411 1743819 920482 321087
34214 321087 142727 -82455 -549575 -825100 -656551 -453723 -542554 -538530 3115 798775
34204 798775 1248281 1214035 880625 329564 -150881 125801 1329658 2427159 2304135
34195 2304135 1301558 715863 967397 1270581 1081738 805437 850663 956750 856429
34186 856429 817605 1051869 1211779 971389 625830 638016 949314 1174839 1220692 1313737
34176 1313737 1559902 1758274 1604483 989042 197072 -230588 -51464 355256 522556
34167 522556 583512 925492 1282451 908816 -189138 -933729 -487541 685298 1542944
34158A542944K39296Q7162K13719Q8941k70356m90767m84141m55370m83758m28544
34148d40874j80502J75215M39947N05048M71001M85629M68314K15802j57904k32242
34138A749434P2464K40549j13622o24151p13776m45088l04060l59016k26984K14122
34128e10128O39502P91911O99417M06020k8382k72284J8223O20102Q80028N04141
34118C748550j89770q05734j171912j098768m39554M25585P37839L06443j59635
34109A353044k2424M03809L95453o7956k86167J45771P87418R17178L39283m92966
34099C472443r64378q09295k86462N3354j21003n50175o30295j49407L52943K14979
34089E82704m10387o51151j19919M25969J03261p27285q42284R8715J009184R12357
$$ plain form
34158 1542944 1782240 1869402 2083121 2172062 1901706 1410939 926798 471428 -12330 -440874
34148 -440874 -621376 -446161 -6214 498834 969835 1455464 1923778 2139580 1981676 1749434
34138 1749434 1821898 2062447 1948825 1324674 610898 165810 -138250 -497266 -724250 -510128
34128 -510128 129374 921285 1620702 2026722 1998340 1726056 1744279 2364381 3244409 3748550
34118 3748550 3558780 2753046 1581134 482366 42812 468397 1206236 1512679 1353044
34109 1353044 1330620 1734429 2129882 2061926 1775759 1921530 2708948 3626126 3965409 3472443
34099 3472443 2508065 1698770 1412308 1465662 1344659 794484 164189 14782 367725 582704
34089 582704 172317 -478834 -598753 -172784 -69523 -796808 -1639092 -1540377 -531193 381164
34079C81164K77339J80831O65241P91116J45537n71523o13669j42668K05808K09983
34069A529159J10433Q0288O9316N1141N9123j5884l39667p39229o78375Q4879
34059B11184R46122R69664O4032p61875o26443R3127L56305o3538l94873j36299
34049F57406K74029K99852R7927L6633K2930j47062k30660P4528N09255N70369
34039B165207K00431l05309p71525j035797p47218J03132P64700N51591j24924
34030H00288k72527K85411P90037P39769L86152k839n35206j122865j256228p18620
34020i06628O518L81134M55150N85766Q57674J029768Q40164K66215l39384m81877
34010B694500j76563r4175n67963q23244j3179J229098J381450K33596p08012
$$ plain form
34079 381164 658503 839334 1504575 2295691 2441228 1869705 1256036 1113368 1319176 1529159
34069 1529159 1639592 1719880 1789196 1840337 1899460 1883576 1543909 804680 126305 211184
34059 211184 1157306 2126970 2191002 1429127 802684 895811 1252116 1188578 793705 657406
34049 657406 931435 1231287 1329214 1365847 1388777 1241715 1011055 1085583 1594838 2165207
34039 2165207 2365638 2060329 1288804 253007 -494211 -391079 373621 925212 800288
34030 800288 527761 813172 1603209 2342978 2729130 2726291 2191085 1068220 -188008 -906628
34020 -906628 -900110 -518976 -63826 521940 1379614 2409382 3249546 3515761 3176377 2694500
34010 2694500 2517937 2423762 1855799 1032555 1019376 2248474 3629924 3863520 3155508
34001C155508l96854L47851K99324l45148n43803p4005M29644O26995O50673M27175
33991D577360k09154q52246q56808l19808L1771o7718j67124M1399L31537N11161
33981C020370O80928P47735L55168m03794p87217l15365N23934Q55978M24246
33972E101983k80989o49202m36951J56636O50479O69705L45419J68577L50224
33963F075881N84949N83611N11001O37141Q44560Q32589O27492N37292P14734
33954A1949250J091909J640457K328148K868985K928880K665426K737473L638803
33946C1849331N219848O927888Q349459R556826J1142485J3805300J7659128K2283618
33938A26793883K7880006L5448244M3982023M7521842L7945477J3387058j6923031
$$ plain form
34001 3155508 2758654 3106505 3405829 3060681 2516878 2442873 2872517 3499512 4150185 4577360
33991 4577360 4368206 3515960 2659152 2339344 2371115 2303397 2136273 2177672 2509209 3020370
33981 3020370 3701298 4449033 4804201 4400407 3613190 3297825 3821759 4677737 5101983
33972 5101983 4820994 4171792 3734841 3891477 4541956 5211661 5557080 5725657 6075881
33963 6075881 6660830 7244441 7755442 8392583 9237143 10069732 10697224 11234516 11949250
33954 11949250 13041159 14681616 17009764 19878749 22807629 25473055 28210528 31849331
33946 31849331 37069179 43997067 52346526 61903352 73045837 86851137 104510265 126793883
33938 126793883 154673889 190122133 234104156 281625998 319571475 332958533 316035502
33931C16035502l8897768m5345147m0320472l2350001k6041093k1112437j6560064
33924I5408520j2732208j0100443q470324p597339p175435o388047m804277l420447
33916C4720000l371410l924217l406165j921955j219904j748681j956582j064137
33908A6106949l96375r26294j480607q58534l8778m72706j501187j486396n96980
33899H349092l49390r02627r47889j53297L37642L1706j97634P1590O2912n05542
33889E796563o62893J2385L54680n08231j511888j193907Q8335Q40925O26794
33880C842763J84339j54854o94847j187042q51030K23034Q98443N75558n5496
33871B780868k58665k89675n76744o84762J5979J075382J285890K80863q87632
$$ plain form
33931 316035502 277137734 231792587 191472115 159122114 133081021 111968584 95408520
33924 95408520 82676312 72575869 64105545 56508206 49332771 42944724 38140447 34720000
33916 34720000 31348590 27424373 24018208 22096253 20876349 19127668 17171086 16106949
33908 16106949 15710574 14784280 13303673 12445139 12406361 11933655 10432468 8946072 8349092
33899 8349092 7999702 7097075 6149186 5995889 6333531 6365237 6167603 6239193 6302105 5796563
33889 5796563 5133670 5146055 5500735 4992504 3480616 2286709 2375044 3215969 3842763
33880 3842763 4027102 3872248 3177401 1990359 1139329 1362363 2260806 2836364 2780868
33871 2780868 2522203 2232528 1655784 971022 987001 2062383 3348273 3629136 2741504
33862B741504j004339j13884O24060L61992m62013p44384j75307L42510k0706
33853A549433p59785p28375J04351N60376J19265k19120L66804R74570L35291
33844B302810r59719j158242q8717N25913j61725p70341p362J178496J142010
33835B003123J28379l30169Q1633L24611O1463K2802K45477k23992j376776j694945
33825g58394m22131J051710J154100K87734j97067j65388l70028o65934j98332
33816b83730Q40934J190158M13270m67829n59671k14008j15542k03975r5193J33197
33806F37611J98300J63821J84905Q1505l14578o74212n47324o8518J76418n2253
33796b14325l65884l07932Q9030M18630M04719J52054n8887j03422p4828p6698
$$ plain form
33862 2741504 1737165 1623281 2247341 2609333 2147320 1402936 1227629 1570139 1549433
33853 1549433 789648 61273 165624 726000 845265 626145 992949 1967519 2302810
33844 2302810 1343091 184849 96132 622045 460320 -310021 -317383 861113 2003123
33835 2003123 2131502 1801333 1882966 2207577 2269040 2291842 2537319 2313327 936551 -758394
33825 -758394 -1180525 -128815 1025285 1313019 1115952 950564 580536 -85398 -283730
33816 -283730 557204 1747362 2160632 1692803 1133132 919124 803582 599607 504414 637611
33806 637611 835911 999732 1184637 1266142 951564 277352 -269972 -338490 -162072 -214325
33796 -214325 -580209 -888141 -799111 -380481 24238 176292 117405 13983 -60845 -137543
33786a37543q6575n3230J587M7609R6409J21965O7462M01P9882K59645K35329
33775F32941j24195m70659l49875J92177N88099L54247l52049p84947l12770P85516
33765A58485J384004P12553o06205j202499o22594K46698N01532K59034R1392
33756I22400J34007K23810L37165L95496J62879k15146j72817L07524M19760j78010
33746B337068o40442l09206Q1152l31753q98827m90170M68905O36729O8261P7288
33736I99005Q21156R35252m6081p58130k56420M53768J93754m67903l53334K99079
33726A820146L39954l77344q96266o98791k58576j05729j58723n8243L23895P37789
33716F68112P35581J88587l54537k86454R1162n0257o47203p04959K2140M63567
$$ plain form
33786 -137543 -224118 -277348 -275761 -228152 -131743 -9778 57684 58085 137967 397612 632941
33775 632941 508746 38087 -311788 -119611 468488 822735 470686 -314261 -627031 158485
33765 158485 1542489 2255042 1648837 446338 -176256 70442 571974 831008 922400
33756 922400 1056407 1280217 1617382 2012878 2175757 1960611 1787794 2095318 2515078 2337068
33746 2337068 1696626 1387420 1468572 1136819 237992 -252178 216727 853456 921717 999005
33736 999005 1820161 2755413 2709332 1951202 1694782 2148550 2342304 1874401 1521067 1820146
33726 1820146 2160100 1782756 886490 187699 -70877 -176606 -335329 -393572 -69677 668112
33716 668112 1403693 1592280 1237743 951289 1042451 992194 344991 -359968 -337828 125739
33706A25739l4961n52825r0325P65871Q11461J07516l33401k32503j85961m00640
33696b0029m26348p3959L12035M63727L93829J41071j42457j71178p0435l68029
33686C8227r02369o12602P37955J640620Q93848l63871l07120O15344L74146j257992
33676H56186k175254j104062O38480J234272O31311p8004k61477O5562O24004
33667D31018P85861L2389j031538j128793j69058N10523K07994j75730J32085
33658d05249M94981K27960j10044Q3805J89176l93903q21044j22336R23650Q64541
33648I31537q4158m49230J11392N24178K93743J04346K59023R7690n86286r36898
33638B65337m67493O5230o0135l75246j73506K15061P8945l15284j11806N96703
$$ plain form
33706 125739 90778 -462047 -552372 213499 1024960 1132476 799075 566572 380611 -20029
33696 -20029 -446377 -520336 -208301 255426 649255 790326 647869 476691 406256 38227
33686 38227 -864142 -1476744 -738789 901831 1795679 1431808 1124688 1740032 2114178 856186
33676 856186 -1319068 -2423130 -1784650 -550378 80933 2929 -258548 -192986 431018
33667 431018 1216879 1249268 217730 -911063 -1080121 -569598 -361604 -537334 -405249
33658 -405249 89732 317692 207648 291453 480629 86726 -734318 -856654 66996 931537
33648 931537 847379 398149 509541 1033719 1327462 1431808 1690831 1788521 1202235 265337
33638 265337 -202156 -136926 -197061 -572307 -745813 -530752 -451807 -767091 -878897 -282194
33628b82194P18553j41175q72853l60127Q15823J070369P8278o90921j16842Q45561
33618A064472N66723p31186j243685l19947O15070L73695k40479r453N89375K81766
33608I46351p59226j152312m97301J58081N2083l79543m67524p4642P16985J612489
33598A55441J740467M88259j142982j350308n1798Q07933R3452q26805k64224
33589c50565J148700J434928J52933j199651j398663p76375k37036q0028p9617
33580a385374P585L03442P34290R75771P84448L27490j07083n01576q42500q12150
33570e15657k89907J67837K9396k87698J7985P91859J035793M02954k98980l23878
33560G29704P6076K62548Q8552k26745n38260o87310m47992O1433L43826K31221
$$ plain form
33628 -282194 436359 295184 -577669 -937796 -121973 948396 1026674 335753 218911 1064472
33618 1064472 1631195 900009 -343676 -663623 -48553 325142 84663 75210 664585 946351
33608 946351 187125 -965187 -1462488 -1304407 -1252324 -1631867 -2099391 -2174033 -1457048 155441
33598 155441 1895908 2384167 1241185 -109123 -160921 647012 740464 -86341 -350565
33589 -350565 798135 2233063 2385996 1186345 -212318 -988693 -1225729 -1305757 -1385374
33580 -1385374 -1377789 -1074347 -340057 635714 1420162 1747652 1640569 1138993 296493 -515657
33570 -515657 -805564 -637727 -608331 -896029 -878044 -86185 949608 1352562 1053582 729704
33560 729704 805780 1068328 1156880 930135 391875 -295435 -743427 -681994 -338168 -106947
33550a06947J55115L60130M12032M368k97066J45044Q63416P78617k31394j095879
33540I87436j007891l77048m9777k00368m15091m34244l24759j53402P1666K31652
33530a671826K14031J51887K69472N20354O28572M82461K62177J59577J66951
33521A183656J68654P1416j68745m74955o04662l84310j875J82857J55789K54896
33511C82721N42544N68161N6833n19928n23967o5352K21407J93206L15959O91527
33501A863111O94233o4969r95276j247154p74199j77240J63205K48323N0094m13151
33491f53023p33873m80719J37078N30134N71013N67345N09676J36610k36871J08515
33481D55885J036610J405295O56300l14404n22344l04396m89866q65597o07016
$$ plain form
33550 -106947 48168 408298 820330 824698 527632 672676 1536092 2314709 2083315 987436
33540 987436 -20455 -397503 -447280 -647648 -1062739 -1496983 -1821742 -1975144 -1903478 -1671826
33530 -1671826 -1457795 -1305908 -1036436 -516082 112490 594951 857128 1016705 1183656
33521 1183656 1352310 1423726 1254981 780026 175364 -208946 -210821 -27964 127825 382721
33511 382721 925265 1493426 1550259 1030331 506364 441012 662419 855625 1171584 1863111
33501 1863111 2557344 2492375 1497099 249945 -524254 -701494 -538289 -289966 -239872 -653023
33491 -653023 -1386896 -1867615 -1730537 -1200403 -629390 -62045 447631 584241 347370 455885
33481 455885 1492495 2897790 3554090 3239686 2717342 2412946 1923080 1057483 450467
33472D50467J45902L77702j67337n68141j52336O22545J031863R93092P15443
33463C449200J73287n75652j100762j112121q61519o67128m49578p4936K73147
33454i46062M18908M83439N22079L22840q7850k49843j1006P6241l43793o63970
33444d79017j87563O33682P09600j08867q28372p19605j33713K64321L82594M79254
33434A2314N36659K83702l10628q16433o66127K20089J119659J127059K62776
33425A769070m53605l55403j2484k03547n91581l36309L64856M89117j41033n65370
33415c6289k29228K77020L34470J27640l9321k75823m89289k06510M64251O81439
33405F08360K64064J48021P07960Q34139k38318j345767j074630n6281J24948
$$ plain form
33472 450467 596369 974071 806734 238593 86257 708802 1740665 2733757 3449200
33463 3449200 3622487 3046835 1946073 833952 -27567 -694695 -1144273 -1219209 -946062
33454 -946062 -527154 -43715 478364 801204 713354 463511 452505 528746 184953 -479017
33444 -479017 -666580 -32898 676702 567835 -260537 -980142 -1113855 -849534 -466940 12314
33434 12314 548973 832675 522047 -294386 -960513 -740424 379235 1506294 1769070
33425 1769070 1315465 960062 947578 744031 152450 -183859 180997 670114 529081 -36289
33415 -36289 -265517 11503 345973 473613 434292 158469 -330820 -537330 -73079 608360
33405 608360 872424 1020445 1728405 2562544 2324226 978459 -96171 -152452 -27504
33396b7504m04467k17958O94027Q05766j91231o94486J07613Q33441K30596q27679
33386C08118r54192m00039j26310N5349P41180J258621N76941o36898p45189K55068
33376C32649O81979j42890r22619n70864K38849M71207K96447K76376J09016o35424
33366A34726j302817r23907K11066Q69683N87061P3700k1407J61460K91599L73860
33356D55024M49609L75803J39369m9610j28138k47643l95070l67718j84104o8114
33346b0592K4129L34962O69228M43803l83078j029993r06618l75364o5177N4514
33336a254186L37036O21451M53935m9497k58944O5888M96287N88539L42443j0397
33326A332555k46830j96200M1879Q871n03580q94540m53694M44193O61780m3654
$$ plain form
33396 -27504 -431971 -649929 44098 849864 658633 -35853 71760 905201 1135797 308118
33386 308118 -646074 -1046113 -1172423 -1117074 -375894 882727 1459668 822770 77581 332649
33376 332649 1014628 871738 -50881 -621745 -382896 88311 384758 661134 770150 134726
33366 134726 -1168091 -2091998 -1880932 -1011249 -424188 -350488 -371895 -210435 81164 455024
33356 455024 904633 1280436 1419805 1370195 1242057 994414 599344 231626 47522 -20592
33346 -20592 3537 338499 1007727 1451530 1068452 38459 -868159 -1243523 -1308700 -1254186
33336 -1254186 -917150 -295699 158236 108739 -150205 -84317 411970 1000509 1342952 1332555
33326 1332555 1085725 889525 931404 940275 436695 -457845 -911539 -467346 194434 150780
33316A50780n65788m7421Q81874J092105N38592Q8521J50170K67894k9369n96387
33306A930971r04244n59442K93062Q69901M17583p02959j124415j83180J049056
33297A086333J175336L49905k53591l84482p90266j469153j368810k21420P02756
33288a173392M25567k76872j75790N46856Q28154M74815J92894K16630J04824
33279A163686j65429m0099M92278O32156J5707o05222m82067j7704r7693o85980
33269B09633r00239m02759R6396o227k30528K01104R91751J033891P3483p77037
33259B89468o10449j3013k3664m44347k85052M34609O48930Q0433k56627J79321
33249c91N09825J2958n60092k99396K56959J23235l31089p1490O42357O20261
$$ plain form
33316 150780 -415008 -462429 419445 1511550 2050142 2138663 2288833 2556727 2527358 1930971
33306 1930971 1026727 467285 760347 1630248 2047831 1344872 220457 37277 1086333
33297 1086333 2261669 2611574 2357983 1973501 1183235 -285918 -1654728 -1876148 -1173392
33288 -1173392 -747825 -1024697 -1200487 -653631 174523 649338 842232 1058862 1163686
33279 1163686 998257 958158 1450436 2082592 2098299 1493077 1011010 993306 895613 209633
33269 209633 -690606 -1093365 -996969 -1003196 -1233724 -1032620 -40869 993022 1066505 289468
33259 289468 -320981 -333994 -357658 -802005 -1087057 -652448 -3518 76915 -179712 -391
33249 -391 509434 522392 -37700 -337096 -80137 43098 -287991 -359481 282876 903137
33239I03137j53341m49017J02762M93100K40159J60989O28744O60482l03052j133707
33229A150256p74644q1437m15135j269124j019311L72723J189242N87654k21527
33220d81303L3876Q30867Q47559n6530q42642q53793m44071j02408K50691P91424
33210b6330J147635P82784r0750n55113j65375L93428K86014k29716k68921J76909
33200A450565J83601n25757j007470n92639L3665Q712l17916j51141K96669K75736
33190c45975q4570r0185J24864j13713n07988p2380R68532J155769J02477p34893
33180D01938l43874K60013j62659r65256p62533K00607M72917k20650o35195n5565
33170a810257P37015Q54438M93165K68473K51645J91430N5309j04570l46230n66093
$$ plain form
33239 903137 749796 300779 403541 896641 1136800 1297789 1926533 2587015 2283963 1150256
33229 1150256 375612 294175 -120960 -1390084 -2409395 -2036672 -847430 -259776 -481303
33220 -481303 -447427 383440 1230999 1174469 331827 -521966 -966037 -1068445 -817754 -26330
33210 -26330 1121305 1904089 1813339 1258226 1092851 1486279 1772293 1542577 1273656 1450565
33200 1450565 1634166 1108409 100939 -491700 -458035 -449323 -767239 -918380 -621711 -345975
33190 -345975 -430545 -520730 -395866 -509579 -1017567 -1089947 -121415 1034354 1136831 401938
33180 401938 58064 318077 155418 -809838 -1572371 -1371764 -898847 -1119497 -1754692 -1810257
33170 -1810257 -1073242 -218804 274361 542834 794479 985909 1041218 936648 590418 24325
33160B4325m72488q4596J91223J91337J97585K94683J19585m00930o56218k04654
33150h00148M49025N09347j2093m33115l80160m6971L29481O29842N91917L5520
33140H72645o33154p57795l67481j68062m33635n63112q4276N26977N80848K43494
33130g83551J78929M19789L82052p2909l96728l00343j69364k37134r3709M66975
33120f05993P79605K38700n73030n98080Q3404L58771j60502n28186K5758R03584
33110g5969J094981O13630K00392R0347n7482k80286k58169q0600k21846o45771
33100C79227p04786j62178L72805L55773M5743o4709j2931o2925q0109K06105
33090B72015N94089O45460L70854J39333Q329k92510p17451q22380m67911j06521
$$ plain form
33160 24325 -448163 -532759 -341536 -150199 47386 342069 461654 60724 -595494 -800148
33150 -800148 -351123 158224 146131 -286984 -667144 -714115 -384634 245208 837125 872645
33140 872645 239491 -518304 -885785 -1053847 -1487482 -2050594 -2134870 -1607893 -1027045 -783551
33130 -783551 -604622 -184833 197219 124310 -272418 -572761 -742125 -979259 -1072968 -605993
33120 -605993 173612 412312 -160718 -758798 -675394 -316623 -477125 -1005311 -979553 -75969
33110 -75969 1019012 1632642 1833034 1923381 1865899 1585613 1327444 1246844 1024998 379227
33100 379227 -325559 -487737 -114932 240841 286584 221875 208944 146019 65910 272015
33090 272015 866104 1511564 1882418 2021751 2030080 1737570 1020119 197739 -270172 -376693
33080c76693j27394l08382k06976K02320N85076P20478O12072K84378k06719o16164
33070E61996o44749k66303K36147N50134N39579K58159q0285k19730j18931j0871
33060H05146m7019l9377J83842L39450K1938n89250q49245n42235j43201j9497
33050h79448O8097L43437M65603J38038j99097J3123M50345L34117k61501m25852
33040D6862J47944O15144K40921n22308p48211k95872K14523L25715J00574k13909
33030h8617m09049l45320j04069N2408R1264K62627N03697K85110n02756j023712
33020a278417n26628M73475Q28406L42567j19933l5751J66246L5210j90008j40767
33010d45600M2459K6307j92998l92769m05561j09273M80970R55838P88554P2362
$$ plain form
33080 -376693 -504087 -812469 -1019445 -817125 -232049 488429 1100501 1384879 1178160 561996
33070 561996 -82753 -349056 -112909 437225 976804 1234963 1154678 934948 816017 805146
33060 805146 758127 718750 902592 1242042 1263980 674730 -174515 -716750 -859951 -879448
33050 -879448 -811351 -467914 -2311 135727 -63370 -50247 400098 734215 472714 46862
33040 46862 194806 809950 1050871 528563 -219648 -515520 -300997 24718 125292 -88617
33030 -88617 -497666 -842986 -947055 -894647 -803383 -540756 -37059 248051 -254705 -1278417
33020 -1278417 -1805045 -1331570 -503164 -160597 -280530 -316281 -150035 -114825 -304833 -445600
33010 -445600 -403141 -376834 -569832 -962601 -1368162 -1477435 -996465 -40627 747927 820289
33000H20289m50317l24269P2477J69892k4672j22198J2442J65515J31802o2645
32990C88316j81999J4180M01821M40125j48716p98551p46764j54065J32934q6195
32980g38914j45182K30727M25219Q2200j85894J70873P14868P85348M68548J48818
32970A956611j83755m81904k70496M58626P52443L2066q36817q58999m90169o06911
32960e29305o82884L10204J658211J534374j06427j213478o30020M34503O21480
32951A396658L67190N57640P46306J35571p21161p21316q0427N8811m52517o32427
32941F54328j18088K26527k37996q66240o71789K61378R15544O96991J52116J52645
32931A165416O28081N80219m74722j601491j575170n65209J77254J81489K18181
$$ plain form
33000 820289 369972 45703 118180 288072 263400 141202 153644 319159 450961 388316
32990 388316 206317 220497 622318 1062443 913727 115176 -631588 -785653 -652719 -738914
32980 -738914 -884096 -653369 -228150 -145950 -331844 -160971 553897 1339245 1807793 1956611
32970 1956611 1772856 1290952 1020456 1479082 2231525 2263591 1426774 567775 77606 -529305
32960 -529305 -1212189 -901985 756226 2290600 2184173 970695 340675 775178 1396658
32951 1396658 1763848 2321488 3067794 3203365 2482204 1760888 1680461 1739272 1286755 654328
32941 654328 536240 762767 524771 -341469 -1013258 -751880 163664 860655 1012771 1165416
32931 1165416 1793497 2373716 1898994 297503 -1277667 -1842876 -1665622 -1484133 -1265952
32922a265952P29421J011415N40025O711J60208N07026J91733n21045p53387m85905
32912A20250l70899m37603j79366K56439J77708l44828m31742J66783O30810L64310
32902d8138j77845l08463J0200M29658O81150N15144j47788p78456o74346n6192
32892e55076R5435l99544m84081M55527J408358J094084j91491j055740q80077
32883e12605k27444L27873P31378Q56638M09510l37880n60492j0525N27122L45718
32873A549293j86717k96286k3128m0916m24510m13807L61708J090088P61056l98344
32863A978437j139407q12300j01908R8908p6009P1500N12738M86124k13552p47176
32853E7355m05900L15577M00955k42767o75737k49739N39216P66531K69072k50184
$$ plain form
32922 -1265952 -536531 474884 1014909 1021620 1181828 1688854 1880587 1359542 606155 120250
32912 120250 -250649 -688252 -867618 -611179 -433471 -778299 -1210041 -1043258 -412448 -48138
32902 -48138 -225983 -534446 -524246 -94588 586562 1101706 953918 175462 -498884 -555076
32892 -555076 -459641 -859185 -1343266 -887739 520619 1614703 1423212 367472 -512605
32883 -512605 -740049 -412176 319202 1175840 1585350 1247470 686978 676453 1203575 1549293
32873 1549293 1362576 1066290 1043162 1002246 577736 163929 525637 1615725 2376781 1978437
32863 1978437 839030 26730 -75178 23730 -52279 19221 531959 1018083 804531 57355
32853 57355 -348545 -32968 367987 125220 -550517 -800256 -261040 505491 774563 524379
32843E24379j74231L27175O15780L53656k21195o57631p11864m29119k7451K25712
32833a74789J93422L9339R3615M44860P86969P75544M06418n8961l73867l92542
32823A740008j11565J69138j7695o89863j150908p61908J52664O50731L83468
32814C64070p4183j82413j40810l37524n88273m20251J24666M70185K68870j82808
32804f98471l54742n6457M69581Q27558P50443K68495k62619m01377o5184K88324
32794G65551J32500m18200o34845j34000M57293K65532n08451p00019J81232J103824
32784E10417Q39971l58980j138416q35387j10415J82123j8893l07297m62479m45389
32774b144745k16406R7133J80477l6899j95785J5857M39346O89937O06934L13995
$$ plain form
32843 524379 350148 677323 1293103 1646759 1425564 767933 56069 -373050 -400501 -174789
32833 -174789 18633 57972 151587 596447 1383416 2158960 2565378 2506417 2132550 1740008
32823 1740008 1628443 1797581 1779886 1090023 -60885 -822793 -670129 -19398 364070
32814 364070 289887 107474 -33336 -370860 -959133 -1379384 -1254718 -784533 -515663 -698471
32804 -698471 -1053213 -1109670 -640089 187469 937912 1206407 943788 542411 477227 765551
32794 765551 898051 479851 -154994 -288994 168299 433831 -74620 -774639 -593407 510417
32784 510417 1350388 991408 -147008 -982395 -1092810 -910687 -929580 -1236877 -1699356 -2144745
32774 -2144745 -2361151 -2264018 -2083541 -2120440 -2316225 -2300368 -1861022 -1171085 -564151 -250156
32764b50156M5033J1876K27168M15188L36747J45306O8012j34883p99228j471324
32754a406261j194514N6634J024407P51443j65873n45375k43875m808j08414j25542
32744a962178J22932K91170K86544M92598R47769J019311L41461m44583m46572
32735F48452K53244O87735K84063m38452o27004j93088K14663K00263J07471L49344
32725A486691O68413M98642j35776n96002m90362q9222J77072J70415r7975n59594
32715A032302q64595n76380J55701N96974L74246p5385k93824m37574o73430n66622
32705a328587K29293J111416J142275L03693n62799q99303q34362n75377j32824
32696a546575L11534L95375Q2197k43050k43369J05559O02292Q46164M39763l97541
$$ plain form
32764 -250156 -205123 -193247 33921 449109 785856 931162 999174 864291 65063 -1406261
32754 -1406261 -2600775 -2544141 -1519734 -768291 -934164 -1479539 -1723414 -1728222 -1836636 -1962178
32744 -1962178 -1839246 -1548076 -1261532 -768934 178835 1198146 1539607 1095024 648452
32735 648452 901696 1589431 1873494 1435042 808038 614950 829613 1029876 1137347 1486691
32725 1486691 2155104 2653746 2517970 1921968 1431606 1342384 1519456 1689871 1591896 1032302
32715 1032302 167707 -408673 -252972 344002 718248 642863 349039 -88535 -761965 -1328587
32705 -1328587 -1099294 12122 1154397 1458090 895291 -4012 -838374 -1413751 -1546575
32696 -1546575 -1235041 -839666 -757469 -1000519 -1243888 -1138329 -536037 310127 749890 352349
32686C52349p57224j60321O17622N71337n2309k41534Q0061R418o86035j117285
32676a383921p55326k08851o8495l6481K24172L65336J48111M0254K84058K83384
32666a107759k14087k60684Q14655J858059J258678n55358j518030p73616L54595
32657a43547N03019j2622k04303K3880J60709J30138J64515J55118o6257j76049
32647E34601J47187M72873J57563n31785o63943l1323N13938L15115k28579m21556
32637B64091k66276j86654k31714j66050n7497j36572k26755L8417M71671M70498
32627b6841q592k73606O4825M78556L06869l33075q14786p64583j86540P11072
32617h46701J372256J076967j28304j099475q76952N4633N28127L45597K24033
$$ plain form
32686 352349 -404875 -565196 52426 623763 571454 329920 409981 419399 -266636 -1383921
32676 -1383921 -2139247 -2348098 -2416593 -2453074 -2228902 -1863566 -1715455 -1675201 -1391143 -1107759
32666 -1107759 -1321846 -1582530 -767875 1090184 2348862 1793504 275474 -498142 -143547
32657 -143547 359472 346850 142547 166427 327136 457274 621789 776907 710650 534601
32647 534601 681788 1154661 1312224 780439 116496 85173 599111 914226 685647 264091
32637 264091 -2185 -188839 -420553 -586603 -644100 -780672 -1007427 -969010 -497339 -26841
32627 -26841 -35433 -309039 -244214 234342 541211 208136 -606650 -1371233 -1557773 -846701
32617 -846701 525555 1602522 1474218 374743 -502209 -447576 80551 426148 650181
32608F50181L40929J10339n09156o83981q7435M43650K27556j97239o3167L33305
32598E64982K19127k99582m15759Q7810N68430M85995k9847n59147p93414n76868
32588g48273k0809M34992M58575K48264J67330J32976j73779o34750p69102m58697
32578a363273j05560k5406j09996j37213k6359K53032O48020Q63317O19538J20805
32568G36905j19582J8630J44681L9137r227K16112L68134K2035o02946q55756
32558d1877n19135n3880Q7152J8566Q0937K34565J81965k5994k942K63446K62231
32547D85034j49796k60040M53079J191862O97354q37998j761168j137959N5073
32538a264559M67390J90026J90671O28169Q01544M56275Q5749k8388j51764l71511
$$ plain form
32608 650181 991110 1101449 592293 -91688 -179123 264527 492083 294844 231677 564982
32598 564982 784109 484527 68768 156578 725008 1211003 1181156 622009 -171405 -748273
32588 -748273 -769082 -334090 124485 372749 540079 673055 499276 -135474 -904576 -1363273
32578 -1363273 -1468833 -1494239 -1604235 -1741448 -1767807 -1514775 -866755 -3438 616100 736905
32568 736905 617323 635953 780634 819771 810544 1026656 1394790 1416825 813879 -41877
32558 -41877 -561012 -614892 -527740 -509174 -428237 -193672 -11707 -37701 -40643 222803 485034
32547 485034 335238 75198 528277 1720139 2417493 1579495 -181673 -1319632 -1264559
32538 -1264559 -797169 -607143 -416472 211697 1013241 1469516 1555265 1526877 1375113 1003602
32528A003602l52281l3073J29140j00559l27900j81364J09941J48399J2053Q1205
32518D89163M21007O63406M54543j46901o88567p00183j34934N44577P96462N03409
32508B201982P427k65980j62776R0258R3837k35020m35865j15156K83614n4605
32498A407716r59905j204495k27878Q91543R27894K46672O0078M72839M69770
32489B084234l25781j053423r02022q2018O42402O79448j32740j269417j617232
32480a976549o41391O73561R42921K53608j53021J16429K68828P540L0323N12402
32470C4651O09153M4500k62546J09340K14219m98900r73188l06287N47604K91795
32460a89659n39568n45141J85722M19121Q433j0639N59422O84764k7309n59515
$$ plain form
32528 1003602 651321 618248 747388 646829 318929 137565 247506 395905 407958 489163
32518 489163 910170 1573576 2028119 1881218 1192651 492468 357534 902111 1698573 2201982
32508 2201982 2209409 1943429 1780653 1870911 1964748 1729728 1293863 1178707 1462321 1407716
32498 1407716 447811 -756684 -984562 -93019 834875 1081547 1141625 1614464 2084234
32489 2084234 1758453 705030 -196992 -279010 363392 1042840 910100 -359317 -1976549
32480 -1976549 -2617940 -1944379 -1001458 -747850 -900871 -784442 -515614 -508074 -477751 34651
32470 34651 643804 688304 425758 535098 749317 250417 -722771 -1029058 -481454 -189659
32460 -189659 -729227 -1274368 -1088646 -669525 -661092 -671731 -112309 572455 545146 -14369
32450a4369j03106P07564P92802O3713o89595q29023l84935J48640L37158K77469
32440C06318M25067P75333O67881j64019r13239p47146n415M62027O01403P90335
32430B198545O89080k60481j458189j629241o61589L04521O37592P55608Q17781
32421A393627L20245o24961r61763k38986O24294P09138K41989j59411l96054
32412I08118m87001k19800K11122J26543n05840p71931k13965M04883L40638q4390
32402b91623l03649l66907k95092L31255J312449J484963M32847n58194l94161
32393A351888J06368k38143q08149l40725N75267K60234j111499j492253j32220
32384a829232J191924Q09144n62344j103078l46624O34534Q25543K31472m21565
$$ plain form
32450 -14369 -117475 590089 1382891 1446604 757009 -72014 -456949 -308309 28849 306318
32440 306318 731385 1506718 2174599 2010580 1097341 350195 344780 806807 1408210 2198545
32430 2198545 2887625 2627144 1168955 -460286 -1121875 -817354 -179762 575846 1393627
32421 1393627 1713872 1088911 127148 -111838 512456 1221594 1463583 1304172 908118
32412 908118 421117 201317 412439 538982 33142 -738789 -952754 -547871 -207233 -291623
32402 -291623 -595272 -962179 -1257271 -926016 386433 1871396 2304243 1746049 1351888
32393 1351888 1458256 1220113 411964 71239 646506 906740 -204759 -1697012 -1829232
32384 -1829232 -637308 171836 -390508 -1493586 -1840210 -1205676 -380133 -148661 -570226
32375e70226m43142J63521O48784M07868j71640k65951J37814K88857p9965l87078
32365b71158j90813K39582M99998M93451J93409l21014n51214q5766N70437N72004
32355A148916J30796K27697Q08080N97830q08438j987335j608701k22933P85808
32346i28280J077574J149848J050737M90765k29203n07614m05776m15557n23788
32337G58706l69651r1544j41977m17189m13319j56944j66106m95283n86454j64863
32327b244624L63821N51742M47144L73959N17301P52770O79869K5208p60992p48390
32317d2192K05111R53124M89760o13769j058762o85306m04420m87195k01066O82507
32307a162208J241705P73415j39144n35545l30067n4092M7970M0828j12243l69079
$$ plain form
32375 -570226 -1013368 -849847 -201063 206805 35165 -230786 -92972 195885 115920 -271158
32365 -271158 -461971 -222389 277609 771060 964469 643455 92241 6475 576912 1148916
32355 1148916 1279712 1507409 2315489 2913319 2104881 117546 -1491155 -1714088 -928280
32346 -928280 149294 1299142 2349879 2840644 2611441 2103827 1698051 1282494 758706
32337 758706 389055 297511 155534 -261655 -674974 -831918 -998024 -1493307 -2079761 -2244624
32327 -2244624 -1880803 -1329061 -881917 -507958 9343 762113 1441982 1467190 706198 -42192
32317 -42192 162919 1116043 1605803 992034 -66728 -752034 -1156454 -1643649 -1844715 -1162208
32307 -1162208 79497 852912 713768 178223 -151844 -205936 -157966 -117138 -229381 -598460
32297e98460l71929L9889L74136J07558m57472n38132L1170O05194O56588L96638
32287B45180L07788M46908M94091K83524l3064l16302o22211r21465q98475l43787
32277a357813L84184P02063N95001N79667P83475O76639K7417n30913m31461p4460
32267A353799o6831j07018L91456R45706M99429p67225j402640p54642J14852
32258B06886J33252k46824l3950O26779P92014K70587j73089m4524K72885K17099
32248B021115k19117o05870o01234k62856J7905p7578l94984m78346j92440R4971
32238f98434M4739k45207m69492m32303n8555N29730Q82859O28409Q1688q4772
32228A78662J44388J25805k70623l27561K90410Q14572N00328k18600m25218k8916
$$ plain form
32297 -598460 -970389 -930500 -556364 -448806 -906278 -1444410 -1413240 -808046 -151458 245180
32287 245180 552968 999876 1493967 1777491 1744427 1428125 805914 -115551 -1014026 -1357813
32277 -1357813 -973629 -271566 323435 903102 1686577 2363216 2390633 1859720 1428259 1353799
32267 1353799 1286968 1179950 1571406 2517112 3016541 2249316 846676 92034 206886
32258 206886 340138 93314 59364 686143 1478157 1748744 1575655 1531131 1804016 2021115
32248 2021115 1801998 1196128 594894 332038 349943 272365 -122619 -600965 -793405 -698434
32238 -698434 -653695 -898902 -1368394 -1800697 -1859252 -1329522 -446663 181746 263434 178662
32228 178662 323050 448855 178232 -149329 141081 955653 1455981 1237381 812163 783247
32218G83247L41335L26364N0315k85481m38637j49602L58606M06010j08022l53210
32208I30925J20545N15290Q9314m92584k59986L19272R7451p19364q48639p7443
32198c25219M31949Q7710l62620l15897j90012l36273k98857K28095P09079O39568
32188B67523K73956k0613l18983n76093l54188L47179P59389M01258k21488m80114
32178G7826m83176n37639m48297J0896M83107N03924J82837o2799p2455R5295
32168b50481L32045L70382J8816l33532r7829M90093N46631n5540m30996j63772
32158D25817L1437l44334o63491l24812K04884L23345L00319M59235L18212m12191
32148C18421q73973k86791O35900P34714J98784J4930K19476J09860k41718j65268
$$ plain form
32218 783247 1124582 1450946 1501261 1215780 777143 627541 986147 1392157 1284135 930925
32208 930925 1051470 1566760 1656074 1163490 903504 1222776 1320227 600863 -247776 -325219
32198 -325219 106730 194440 -168180 -484077 -674089 -1010362 -1309219 -1081124 -372045 267523
32188 267523 541479 520866 201883 -374210 -728398 -381219 378170 779428 557940 77826
32178 77826 -405350 -942989 -1391286 -1380390 -897283 -393359 -210522 -273321 -345776 -250481
32168 -250481 81564 451946 470762 137230 39401 529494 1076125 1020585 589589 425817
32158 425817 457254 112920 -550571 -875383 -670499 -347154 -46835 412400 730612 318421
32148 318421 -555552 -842343 -206443 528271 727055 741985 961461 1071321 829603 664335
32138F64335J71501k1503n96289n67001J58582N32758Q1253m11902k81163R9202
32128a70227K12055K42882N26130Q77236R03562M76297k76783r55996r37179r7938
32118H00039O33445K68871p97285j234399o00811K46168N46459M00484P1701l90206
32108e5534o49729k48257N04500P65836M44127K34918K73642n9912p77911j011253
32098e79573m85919j3820m7307k2213L19636L12300k16688k90401N18009J034184
32088E28208K78514q32820q75263n2049M21289K92802K18832L12106J59044r0103
32078C60560K6480K08197j77490p93446o96196Q7969N33798J99257k41444j66491
32068f58806K43141N85525P55903P15169M04686K063k53750m30789o17007n35103
$$ plain form
32138 664335 835836 814333 218044 -348957 -190375 342383 423636 11734 -269429 -170227
32128 -170227 41828 284710 810840 1688076 2591638 3067935 2791152 1835156 897977 800039
32118 800039 1433484 1702355 905070 -329329 -930140 -683972 -137513 262971 334672 -55534
32108 -55534 -705263 -953520 -449020 316816 760943 995861 1269503 1209591 431680 -579573
32098 -579573 -1065492 -1079312 -1126619 -1148832 -829196 -516896 -733584 -1023985 -505976 528208
32088 528208 806722 -26098 -901361 -953410 -532121 -239319 -20487 291619 450663 360560
32078 360560 387040 595237 417747 -375699 -1071895 -983926 -450128 -250871 -492315 -658806
32068 -658806 -415665 169860 925763 1640932 2045618 2047681 1793931 1363142 746135 211032
32058B11032m8011L19902J23307j43237J59229N57168J42359p54732q87676q4878
32048d05537M40598K2400n19822l52218J28958J89876n0894o6161J54773L10581
32038a47446L64398L44393Q6978l15528l57200O5713K41960l31592j014431q43110
32028a905865N3431O40619M37935K7709K9238K46544J65587j59931k26374M6280
32018f44827R7231l98667q66381n69210J95246L94759j36187k74702P14543J888303
32008D00108J837553O21611m66811o83465l65624M0137L78236L37447k58049p24106
31998A117037k46736O25192N17079n56848r83993o2548P80290J87444j017558
31989C59359j139951q1194Q28103Q52808M26157L3210l16467o14927p68519q92196
$$ plain form
32058 211032 163021 482923 606230 462993 622222 1179390 1321749 567017 -320659 -405537
32048 -405537 35061 57461 -462361 -814579 -685621 -495745 -546639 -612800 -458027 -147446
32038 -147446 216952 561345 648323 332795 -24405 41308 283268 -48324 -1062755 -1905865
32028 -1905865 -1852434 -1211815 -773880 -746171 -716933 -470389 -304802 -464733 -691107 -644827
32018 -644827 -547596 -946263 -1812644 -2381854 -2186608 -1791849 -1928036 -2202738 -1488195 400108
32008 400108 2237661 2859272 2392461 1708996 1343372 1383509 1761745 2099192 1841143 1117037
31998 1117037 870301 1495493 2012572 1455724 471731 409183 1189473 1376917 359359
31989 359359 -780592 -861786 -33683 819125 1245282 1278492 962025 347098 -421421 -1313617
31979a313617r93652o33805L60423J199498J025856K17711j55419L3043n7883
31970c17845o61965r33900l28778M98079O38544J11096l76065l90215r8161J03112
31960a756098K758k37711k41782J07995M69412N33824M81875N93065O91772M85752
31950A130862J81616J31300Q3924m63558j274381j524162r60435j52937M46470
31941b401301Q90210J101415P45933j5344m80082m17028l25393l89906j04241
31932a395737O06250Q74527K25017m58906k02636N45837O96892K48780Q3885L74537
31922A598446L94841j46984o87765p85874n43068p895Q08898J239916M86748q50171
31912A507092j072304J47770R11322k27855j884700j683977K37011J422550O89819
$$ plain form
31979 -1313617 -2307269 -2941074 -2580651 -1381153 -355297 -137586 -293005 -259962 -317845
31970 -317845 -979810 -1913710 -2242488 -1744409 -1105865 -994769 -1370834 -1761049 -1859210 -1756098
31960 -1756098 -1753340 -1991051 -2232833 -2124838 -1655426 -1121602 -639727 -46662 645110 1130862
31950 1130862 1312478 1443778 1527702 1064144 -210237 -1734399 -2694834 -2847771 -2401301
31941 -2401301 -1511091 -409676 336257 320913 -159169 -576197 -901590 -1291496 -1395737
31932 -1395737 -789487 85040 310057 -148849 -351485 194352 891244 1140024 1223909 1598446
31922 1598446 1993287 1846303 1158538 372664 -170404 -178299 630599 1870515 2357263 1507092
31912 1507092 434788 582558 1493880 1266025 -618675 -2302652 -2065641 -643091 46728
31903D6728l96722j98287N85386L75701o29482q58952P3600Q15364M03046l92785
31893a76403m01059K36831M83047M665m79025l30166K20372N69286N43494M09163
31883A080205L43836K67596J51805J30193J66341n1647n60586p47718r1967Q09740
31873A497798P16629n14178j438997q50901N59010J165530N46760l24386p09070
31864F48195p43061m94290K98860J206952J108160j02345r16692k68569P56980
31855A494190M64970q72832j412710m72446N97545N22251j80839k28566N30645
31846D42208J043094N41637m99604r13604j33218J081675J329616J83579j127289
31837A948094j134722l3780N80561p4032r14295o06557N20516R86614K29553p28946
$$ plain form
31903 46728 -349994 -548281 37105 412806 -216676 -1075628 -1002028 -186664 216382 -176403
31893 -176403 -577462 -340631 142416 147081 -331944 -662110 -441738 127548 671042 1080205
31883 1080205 1424041 1691637 1843442 1973635 2139976 2088329 1527743 780025 688058 1497798
31873 1497798 2214427 1700249 261252 -589649 -30639 1134891 1681651 1357265 648195
31864 648195 -94866 -589156 -290296 916656 2024816 1922471 1005779 737210 1494190
31855 1494190 1959160 1086328 -326382 -798828 -201283 320968 140129 -88437 442208
31846 442208 1485302 2026939 1527335 613731 480513 1562188 2891804 3075383 1948094
31837 1948094 813372 779592 1360153 1286121 371826 -234731 285785 1272399 1501952 773006
31827G73006p65900n8430M17574L34877L05461P29882J007744L68777q39599j387045
31817H86347p36117K71395N89121K32725r5492j28771j27660j90350j84785j81328
31807C35085k76536j55640M39821R54031N81457m25660r31260n21745J1197N1857
31797F2607J1546L06901M72429O8230l19756M5988P02829N58174m08542j021508
31787D78898n54762L36685O00758J01945m14452l44281J27957L38071o3255o86679
31777g9115q24998k51634N73141J069575J038247N83537q1880o41214q52723q50332
31767c17396q93731p95745j80977O01416O48067p6457m06193L04710J039993O56256
31757E79943k32020j97089O58560Q32767j28915q60061l05814O76679O55198l50015
$$ plain form
31827 773006 7106 -51324 366250 701127 1006588 1736470 2744214 3112991 2273392 886347
31817 886347 150230 421625 1010746 1243471 1147979 1019208 891548 701198 516413 335085
31807 335085 58549 -97091 342730 1296761 1878218 1452558 521298 -447 10750 62607
31797 62607 74153 381054 853483 921713 601957 647945 1350774 1908948 1500406 478898
31787 478898 -75864 260821 861579 963524 549072 204791 332748 670819 607564 -79115
31777 -79115 -904113 -1155747 -582606 486969 1525216 2108753 2026873 1385659 532936 -317396
31767 -317396 -1211127 -2006872 -2187849 -1586433 -938366 -1014823 -1421016 -1116306 -76313 579943
31757 579943 347923 150834 809394 1642161 1513246 653185 347371 1024050 1679248 1329233
31747A329233j103285r08450k59420Q1431l4121k34407j96664K6654J64966J56370
31737i77693K52192N23749N35148m2740o94618n97400J30656M68719m7414o48710
31727a098111m59008L58189J020270J132262P77392Q1844p42316j231955j068326
31718a229759m69740J21306M82048N13166J38327l54984l47674K84751Q12697
31709d9862O08080J8550k56653j88469j39187j3844M53915Q65601N60173k37827
31699A620477n90628k02541K64047L16702J91184R6990j84684o06970o20767j03424
31689A80386K48401k389k92196l5641L53215K23968j14206P4298O17555O94271
31679A947662K46863M1286K80417K64830k84181o20014k16898K95024J55641l13937
$$ plain form
31747 1329233 225948 -682502 -941922 -860491 -894612 -1129019 -1325683 -1299029 -1134063 -977693
31737 -977693 -725501 -201752 333396 290656 -403962 -1001362 -870706 -401987 -449401 -1098111
31727 -1098111 -1557119 -1198930 -178660 953602 1730994 1812838 1070522 -161433 -1229759
31718 -1229759 -1699499 -1578193 -1096145 -582979 -444652 -799636 -1147310 -862559 -49862
31709 -49862 558218 576768 320115 131646 -7541 -21385 432530 1298131 1858304 1620477
31699 1620477 1029849 827308 1091355 1408057 1599241 1696231 1511547 904577 283810 180386
31689 180386 428787 426398 134202 98561 451776 675744 561538 635836 1253391 1947662
31679 1947662 2194525 2235811 2516228 2781058 2496877 1876863 1659965 1954989 2110630 1796693
31669A796693l83718k06901m18016p99431n06175L99608P83650J18104o59599
31660A24215m95144L56695Q98596P79845L97007K7883l75012p34427q59596q05779
31650f85717o96804l61586L06439Q40718P02385J40761j37014l8733o6236k97024
31640b92811k75266J5684K7234k87394k59628K71344N23845J14080j59243L60549
31630C8394R80934P46467j2823l27556k03012l56524p26441n81493o590O5975
31620c82669n23423p59413p0870P25900O79354N4417k19758J35842O06387O91904
31610I37671L73240l1630k06572j79337l30949p93176j019503m86542L55439N77264
31600h04095J44846p3155K74323N51345K97208j07748k70884l52155m24516k11012
$$ plain form
31669 1796693 1412975 1206074 788058 -11373 -517548 -117940 665710 783814 124215
31660 124215 -370929 -14234 884362 1664207 2061214 2089097 1714085 979658 120062 -685717
31650 -685717 -1382521 -1744107 -1437668 -596950 105435 246196 109182 70449 4213 -292811
31640 -292811 -568077 -552393 -525159 -812553 -1072181 -800837 -276992 -162912 -322155 38394
31630 38394 1019328 1765795 1752972 1425416 1222404 865880 139439 -442054 -448644 -382669
31620 -382669 -906092 -1665505 -1736375 -1010475 -331121 -276704 -496462 -360620 245767 937671
31610 937671 1310911 1279281 1072709 893372 562423 -230753 -1250256 -1736798 -1381359 -804095
31600 -804095 -659249 -732404 -458081 93264 390472 282724 11840 -340315 -764831 -975843
31590i75843J35334L738m58242k47627P45300J152694K07025q51540o62069J07272
31580h43958O618p24080o93539J97672O90665L38186o084J06381J55420l0287
31570h03006P3666M30048K85523l57286n06745J24632N42161J37240l54513k11729
31560f40009J69941K58989L23130N71473M34351l83851j064697q37104j77189
31551a344966O9526N250J72308M29193L40495J22963K16956L75642J07246l76266
31541A18347n05843k60341N2479M58590R58919J011764K62414o50925q92698n82214
31531b9508l02381l1200M39006O25487J08726l58646J26530Q88364N23505p10270
31521A279613j077107q0007P42707K52318o55090o76061l0444K66370O6226o4490
$$ plain form
31590 -975843 -840509 -836771 -1295013 -1542640 -797340 355354 562379 -289161 -951230 -843958
31580 -843958 -837340 -1561420 -2254959 -2057287 -1366622 -1028436 -1034520 -928139 -772719 -803006
31570 -803006 -729340 -299292 -13769 -371055 -877800 -753168 -211007 -73767 -428280 -640009
31560 -640009 -470068 -211079 112051 683524 1117875 734024 -330673 -1167777 -1344966
31551 -1344966 -1275440 -1270190 -1097882 -668689 -328194 -205231 11725 387367 494613 118347
31541 118347 -387496 -647837 -595358 -136768 822151 1833915 2096329 1445404 552706 -29508
31531 -29508 -331889 -363089 75917 701404 810130 451484 578014 1466378 1989883 1279613
31521 1279613 202506 122499 865206 1117524 462434 -213627 -244071 22299 88525 24035
31511B4035J760m1286j74334j24102N9948J19739N0025q980o0079p0200J34381
31500h9093M49267L88227k26235q83481j058359q23338m38939J22327P63168R21715
31490h74741L04033m30243m23142J68065M08201n4512n41283l59948K84243O68675
31480h50652N26084K97469M38473P32341N43921k47675r24032q01713j32442L10321
31470a07905L15985L14787M68849L79378j79879q28154j055359o85019J68987
31461a208330J084919J327699N51831m97169p66886l73947l32360p53716n65505
31452a533464N92506J512790J204605L45267q318q0135n64187j051772o75519
31443b58227K25988N03113k331l45066p4983K44961J74066l102L0595J72206K76075
$$ plain form
31511 24035 25795 -15491 -189825 -313927 -253979 -134240 -84215 -93195 -153274 -223474 -89093
31500 -89093 360174 748401 522166 -361315 -1419674 -2243012 -2681951 -2559624 -1796456 -874741
31490 -874741 -570708 -1000951 -1424093 -1256028 -847827 -902339 -1443622 -1803570 -1519327 -850652
31480 -850652 -324568 -27099 411374 1143715 1687636 1439961 515929 -285784 -418226 -107905
31470 -107905 208080 522867 991716 1371094 1191215 363061 -692298 -1377317 -1208330
31461 -1208330 -123411 1204288 1756119 1258950 492064 118117 -214243 -967959 -1533464
31452 -1533464 -940958 571832 1776437 2121704 2113386 2033251 1469064 417292 -258227
31443 -258227 -32239 470874 468543 123477 48494 293455 467521 464419 495014 667220 943295
31432I43295L09013J14363l58065o93093n19282j73559j59792k31692J51919P41084
31422A24191Q26173M45910K38702K40125p3282o15203p25529l99882k99537m43757
31412f82089j49592N12558N36848l14765r09251m63712K78176L23964j18330k69750
31402a255943j9788K57805M37560M85620J95507l25105n46519l84849l99964o40340
31392b196016k74474R25324J763908J240271P4475m51012l42486l76570m71962
31383a08542m231P09918P08801m162m79916l95083l42736n34204m63016l1987
31373i45158J58134o6939r4653L65030P44590N50761N505n30360r42496r33416
31363a689002j57373Q66005R71583l575p54985l43762M39388L92818k46889l74662
$$ plain form
31432 943295 1252308 1366671 1008606 315513 -203769 -377328 -537120 -768812 -616893 124191
31422 124191 950364 1396274 1634976 1875101 1801819 1186616 461087 61205 -238332 -682089
31412 -682089 -831681 -319123 217725 -97040 -1006291 -1470003 -1191827 -867863 -986193 -1255943
31402 -1255943 -1275731 -1017926 -580366 -94746 100761 -224344 -770863 -1155712 -1555676 -2196016
31392 -2196016 -2470490 -1545166 218742 1459013 1533488 1082476 739990 363420 -108542
31383 -108542 -112773 597145 1305946 1301784 821868 426785 84049 -450155 -913171 -945158
31373 -945158 -787024 -853963 -948616 -583586 161004 711765 717270 186910 -755586 -1689002
31363 -1689002 -1846375 -980370 -8787 -12362 -767347 -1111109 -671721 -278903 -525792 -900454
31353i00454J18189K96677j52194l92794J85590R80637J012477J98522o44182
31344G02468p90083k70120L35731N54381M33331L03163K05498j59096p81328j030777
31334d96832m22940N32133Q07891J67274n52202n77652j06646K05182K27052L58002
31324A41262P34211R22813N11573k85363q09478o71144j46283J65874J0045l00523
31314B72987l45785j37801k6162j35910j72354J19718N36231O61767M17777J41030
31304A331498J42114L65919N05962L30316j11167n08123n48607k61649l8732j75709
31294A031822m81760n48316l21823j14906p0864J6966K54493L72965J14883l63177
31284a09717o72589n71387m7092O74049J063374O55039k57611p34606l71799J10177
$$ plain form
31353 -900454 -782265 -485588 -637782 -1030576 -844986 135651 1148128 1346650 702468
31344 702468 -87615 -357735 -22004 532377 965708 1268871 1474369 1315273 533945 -496832
31334 -496832 -919772 -387639 420252 587526 35324 -542328 -648974 -443792 -216740 141262
31324 141262 875473 1798286 2309859 2024496 1215018 543874 397591 563465 573510 272987
31314 272987 -72798 -210599 -236761 -372671 -545025 -425307 110924 772691 1190468 1331498
31304 1331498 1473612 1839531 2345493 2675809 2564642 2056519 1507912 1246263 1207531 1031822
31294 1031822 550062 1746 -320077 -434983 -505847 -488881 -234388 138577 253460 -109717
31284 -109717 -782306 -1353693 -1400785 -726736 336638 991677 734066 -540 -372339 -262162
31274b62162j6199k97905J46294J027706J101658J8905j048963r63626J0491Q06505
31264E22704Q57464L53701k40755m84686k31648N0783k68400r43004r47472j7842
31254a349155P27661L81714l47525k92919K77457J87354n68503p06633K70049
31245a420500J226064J102828L50356n6306j22581m30787q28633n90683K66509
31236e03733P98859M54405j48962j43580L80833N97562J58215l53723k77808K33417
31226A195485M78373J33570m61627q73533r96634q19825k26252O57426J233836
31217C20819J007702K82798j27748Q5161L63834Q1746n63621p45739q0757P57110
31207A381305P40391k32118j116487r87489j60102L83131L59479K65958K37594
$$ plain form
31274 -262162 -278361 -576266 -429972 597734 1699392 1718297 669334 -294292 -283801 522704
31264 522704 1380168 1733869 1493114 1008428 776780 827563 559163 -383841 -1331313 -1349155
31254 -1349155 -621494 -239780 -587305 -880224 -602767 -415413 -983916 -1690549 -1420500
31245 -1420500 -194436 908392 1258748 1202442 1079861 649074 -179559 -770242 -503733
31236 -503733 295126 749531 600569 456989 837822 1435384 1593599 1239876 962068 1195485
31226 1195485 1673858 1807428 1345801 472268 -524366 -1344191 -1570443 -913017 320819
31217 320819 1328521 1611319 1483571 1568732 1932566 2014312 1450691 704952 624195 1381305
31207 1381305 2121696 1889578 773091 -214398 -374500 8631 368110 634068 871662
31198H71662j99982r95722j184221k55275Q66529J008275L38015r8916O064M1409
31188C97838l07984o14341m93317p3099L71006O41381N27604P7342j88050M0803
31178C79183K10529k71486q42890m58667O54211J116993M24458l65929l48566
31169D97836L534n9928k89110q8701L30170L27280j43767o13692p82122n54763
31159a373263J18984Q88006J007846L06018l86169l72147o9327j45056l15102
31150c40210N8978O71967O61703L4059l73627k53331j05522j48132j2761K81295
31140D74419R7822o47552j000644k81675P73590R03845k2259r14290q72945j24611
31130a614300M82251M90408J76684Q1599L79315P34117P18561K66707l39929q15875
$$ plain form
31198 871662 671680 -324042 -1508263 -1763538 -897009 111266 449281 350365 356429 397838
31188 397838 89854 -524487 -1017804 -1090903 -719897 -78516 449088 526430 338380 379183
31178 379183 589712 318226 -524664 -983331 -329120 787873 1212331 846402 497836
31169 497836 501370 441442 152332 63631 393801 721081 577314 -36378 -818500 -1373263
31159 -1373263 -1254279 -366273 641573 947591 561422 189275 119948 -25108 -340210
31150 -340210 -281232 390735 1052438 1086497 712870 459539 354017 205885 193124 474419
31140 474419 572241 -75311 -1075955 -1357630 -584040 319805 297546 -616744 -1489689 -1614300
31130 -1614300 -1132049 -641641 -464957 -383358 -4043 730074 1448635 1715342 1375413 559538
31120E59538j055718j045041p67352k34951M38502R79512J026310M72044k25487
31111A47357l67131J96103Q42239R04165L45292m21314r96217j062368m77958
31102h89832L34815N84622J54244q6516L98614Q03034J77811r03589j080169l06563
31092h13529J67455r7012j76130L38608N27345l9771k27179P28594J552222P84020
31082B744623p17646j010184j64809J2087p95758q15340O41045J655705O22401
31073B172124j127079j327685j40702M41549j90218p02642k99472K10636J54064
31064h09425R0284M95266P19344J28233p14835q65133k69799M75658R69357R80715
31054A199665L13819o27280q56562j28724M71029O5163o50111n66241L8869J05082
$$ plain form
31120 559538 -496180 -1541221 -2308573 -2543524 -2105022 -1125510 -99200 372844 147357
31111 147357 -219774 -23671 818568 1722733 2068025 1646711 650494 -411874 -889832
31102 -889832 -555017 29605 183849 97333 495947 1298981 1476792 573203 -506966 -813529
31092 -813529 -646074 -743086 -919216 -580608 -53263 -93034 -320213 408381 1960603 2744623
31082 2744623 2026977 1016793 851984 864071 68313 -747027 -105982 1549723 2172124
31073 2172124 1045045 -282640 -423342 18207 -172011 -874653 -1174125 -963489 -809425
31064 -809425 -719141 -223875 495469 623702 -91133 -956266 -1226065 -750407 218950 1199665
31054 1199665 1513484 886204 29642 -99082 371947 437110 -213001 -779242 -740373 -635291
31044f35291l33821k87470M00049Q02546M94829R4778L6113k8551l14738m36863
$$ plain form
31044 -635291 -969112 -1256582 -856533 -53987 440842 535620 571733 543182 228444 -208419
$$ [...]
##END NTUPLES=NMR SPECTRUM
##END=
