##TITLE=31Pdec_LY-TMF-9.40.3
 D2O, 24 sc
 2.3.2020
##JCAMPDX= 6.0         $$ Bruker NMR JCAMP-DX V2.0
##DATA TYPE= NMR SPECTRUM
##DATA CLASS= NTUPLES
##ORIGIN= UXNMR, Bruker Analytische Messtechnik GmbH
##OWNER= root
$$ XWIN-NMR		Version 3.5
$$ Mon Mar  2 16:17:24 2020 Russian Standard Time (UT+4h)  she@DPX200
##.OBSERVE FREQUENCY= 81.013821
##.OBSERVE NUCLEUS= ^31P
##.ACQUISITION MODE= SIMULTANEOUS
##.ACQUISITION SCHEME= undefined
##.AVERAGES= 24
##.DIGITISER RES= 17
##SPECTROMETER/DATA SYSTEM= spect
##.PULSE SEQUENCE= zgpg30
##.SOLVENT NAME= D2O
##.SHIFT REFERENCE= (INTERNAL, D2O, 0, 182.463)
##AUDIT TRAIL= $$ (NUMBER, WHEN, WHO, WHERE, WHAT)
$$ ##TITLE= Audit trail, XWIN-NMR		Version 3.5
$$ ##JCAMPDX= 5.01
$$ ##ORIGIN= Bruker BioSpin GmbH
$$ ##OWNER= she
$$ F:/spectra/data/she/nmr/P31/1/pdata/1/auditp.txt
$$ ##AUDIT TRAIL=  $$ (NUMBER, WHEN, WHO, WHERE, WHAT)
(   1,<2020-03-02 16:16:30.34 +0400>,<she>,<DPX200>,
      <created by zg, POWCHK disabled, PULCHK disabled
       configuration hash MD5:
       00 E9 B6 7A A2 85 ED C7 34 08 36 98 17 FE 4E 26
       data hash MD5: 32K
       50 18 8B D9 89 32 51 E1 B5 12 FD 1F 1B 0E CC 61>)
(   2,<2020-03-02 16:16:32.90 +0400>,<she>,<DPX200>,
      <Start of raw data processing
       efp BC_mod = 2 LB = 1 FT_mod = 6 PKNL = 1 PHC0 = -1463.562 PHC1 = 359.6017 SI = 64K 
       data hash MD5: 64K
       8D 0B 9D F4 2A 41 4F 02 5D 2C 51 60 ED 7F EA 08>)
(   3,<2020-03-02 16:16:46.09 +0400>,<she>,<DPX200>,
      <pk PHC0 = 1.58522 PHC1 = 0 
       data hash MD5: 64K
       5C 03 BA 4B 10 28 59 30 8E 4E 04 A7 7E 78 86 D6>)
(   4,<2020-03-02 16:16:58.43 +0400>,<she>,<DPX200>,
      <abs ABSG = 5 
       data hash MD5: 64K
       E6 DC 20 CC A4 0B B6 AD CF 0C 6D 36 7A 4C 11 51>)
$$ ##END=
$$ 
$$ hash MD5
$$ 86 B2 57 B1 AC 7F 0C BE DE FC 46 E0 56 EF C7 43
##$RELAX= 
##$RELAX= 
##$RELAX= 
##$RELAX= 
##$RELAX= 
##$RELAX= 
##$RELAX= 
##$RELAX= 
$$ Bruker specific parameters
$$ --------------------------
##$DU= <F:/spectra>
##$EXPNO= 1
##$NAME= <P31>
##$PROCNO= 1
##$TYPE= <nmr>
##$USER= <she>
##$AMP= (0..31)
100 100 100 100 100 100 100 100 100 100 100 100 100 100 100 100 100 100 
100 100 100 100 100 100 100 100 100 100 100 100 100 100 
##$AQSEQ= 0
##$AQ_mod= 1
##$AUNM= <au_zg>
##$AUTOPOS= <>
##$BF1= 81.014009
##$BF2= 200.13
##$BF3= 200.13
##$BF4= 200.13
##$BF5= 200.13
##$BF6= 200.13
##$BF7= 200.13
##$BF8= 200.13
##$BYTORDA= 1
##$CFDGTYP= 0
##$CFRGTYP= 5
##$CHEMSTR= <none>
##$CNST= (0..31)
1 1 145 1 1 1 1 1 1 1 1 1 1 1 1 1 1 1 1 1 1 1 1 1 1 1 1 1 1 1 1 1 
##$CPDPRG= <waltz16>
##$CPDPRG1= <>
##$CPDPRG2= <waltz16>
##$CPDPRG3= <>
##$CPDPRG4= <mlev>
##$CPDPRG5= <mlev>
##$CPDPRG6= <mlev>
##$CPDPRG7= <mlev>
##$CPDPRG8= <mlev>
##$CPDPRGB= <>
##$CPDPRGT= <>
##$D= (0..31)
0 1 0 0 0 0 0 0 0 0 0 0.03 2e-05 3e-06 0 0 0 0 0 0 0 0 0 0 0 0 0 0 0 0 
0 0 
##$DATE= 1583151389
##$DBL= (0..7)
120 120 120 11 120 120 24 19 
##$DBP= (0..7)
150 150 150 150 150 150 150 150 
##$DBP07= 0
##$DBPNAM0= <>
##$DBPNAM1= <>
##$DBPNAM2= <>
$$ [...]
##$SUBNAM3= <"">
##$SUBNAM4= <"">
##$SUBNAM5= <"">
##$SUBNAM6= <"">
##$SUBNAM7= <"">
##$SUBNAM8= <"">
##$SUBNAM9= <"">
##$SW= 369.568048894756
##$SWIBOX= (0..15)
0 1 3 0 0 0 0 0 0 0 0 0 0 0 0 0 
##$SW_h= 29940.119760479
##$TD= 32768
##$TD0= 1
##$TE= 0
##$TE2= 300
##$TE3= 300
##$TEG= 300
##$TL= (0..7)
0 120 53 12 22 120 120 120 
##$TP= (0..7)
150 150 150 150 150 150 150 150 
##$TP07= 0
##$TPNAME0= <>
##$TPNAME1= <>
##$TPNAME2= <>
##$TPNAME3= <>
##$TPNAME4= <>
##$TPNAME5= <>
##$TPNAME6= <>
##$TPNAME7= <>
##$TPOAL= (0..7)
0.5 0.5 0.5 0.5 0.5 0.5 0.5 0.5 
##$TPOFFS= (0..7)
0 0 0 0 0 0 0 0 
##$TUNHIN= 0
##$TUNHOUT= 0
##$TUNXOUT= 0
##$USERA1= <user>
##$USERA2= <user>
##$USERA3= <user>
##$USERA4= <user>
##$USERA5= <user>
##$V9= 5
##$VALIST= <valist>
##$VCLIST= <CCCCCCCCCCCCCCC>
##$VD= 0
##$VDLIST= <DDDDDDDDDDDDDDD>
##$VPLIST= <PPPPPPPPPPPPPPP>
##$VTLIST= <TTTTTTTTTTTTTTT>
##$WBST= 1024
##$WBSW= 4
##$XGAIN= (0..3)
0 0 0 0 
##$XL= 0
##$YL= 0
##$YMAX_a= 9429
##$YMIN_a= -7932
##$ZGOPTNS= <>
##$ZL1= 120
##$ZL2= 120
##$ZL3= 120
##$ZL4= 120
##$ABSF1= 182.463
##$ABSF2= -187.1042
##$ABSG= 5
##$ABSL= 3
##$ALPHA= 0
##$AQORDER= 0
##$ASSFAC= 0
##$ASSFACI= 0
##$ASSFACX= 0
##$ASSWID= 0
##$AUNMP= <proc_1d>
##$AZFE= 0.1
##$AZFW= 0.5
##$BCFW= 0
##$BC_mod= 2
##$BYTORDP= 0
##$COROFFS= 0
##$CY= -3
##$DATMOD= 1
##$DC= 0
##$DFILT= <>
##$DTYPP= 0
##$F1P= 0
##$F2P= 0
##$FCOR= 1
##$FTSIZE= 65536
##$FT_mod= 6
##$GAMMA= 0
##$GB= 0
##$INTBC= 1
##$INTSCL= 5.30512e-09
##$ISEN= 30
##$LB= 1
##$LEV0= 0
##$LPBIN= 0
##$MAXI= 10000
##$MC2= 0
##$MEAN= 0
##$ME_mod= 0
##$MI= 50
##$NCOEF= 0
##$NC_proc= -5
##$NLEV= 6
##$NOISF1= 182.463
##$NOISF2= 159.3651
##$NSP= 0
##$NTH_PI= 0
##$NZP= 0
##$OFFSET= 182.463
##$PC= 4
##$PHC0= -1461.977
##$PHC1= 359.6017
##$PH_mod= 1
##$PKNL= yes
##$PPARMOD= 0
##$PSCAL= 0
##$PSIGN= 0
##$REVERSE= no
##$SF= 81.0140089999434
##$SI= 65536
##$SIGF1= 159.3651
##$SIGF2= -187.1042
##$SINO= 113.3802
##$SIOLD= 16384
##$SREGLST= <1H.CDCl3>
##$SSB= 0
##$STSI= 65536
##$STSR= 0
##$SW_p= 29940.119760479
##$SYMM= 0
##$S_DEV= 0
##$TDeff= 32768
##$TDoff= 0
##$TI= <>
##$TILT= no
##$TM1= 0
##$TM2= 0
##$TOPLEV= 0
##$USERP1= <user>
##$USERP2= <user>
##$USERP3= <user>
##$USERP4= <user>
##$USERP5= <user>
##$WDW= 1
##$XDIM= 65536
##$YMAX_p= 272919851
##$YMIN_p= -13079764
$$ End of Bruker specific parameters
$$ ---------------------------------
##NTUPLES= NMR SPECTRUM
##VAR_NAME=  FREQUENCY,     SPECTRUM/REAL,   SPECTRUM/IMAG
##SYMBOL=    X,             R,               I
##VAR_TYPE=  INDEPENDENT,   DEPENDENT,       DEPENDENT
##VAR_FORM=  AFFN,          ASDF,            ASDF
##VAR_DIM=   65536,         65536,           65536
##UNITS=     HZ,            ARBITRARY UNITS, ARBITRARY UNITS
##FACTOR=    0.456856943014862, 1,           1
##FIRST=     14782.0589164792, 0,            0
##LAST=      -15158.0608439998, 0,           0
##MIN=       -15158.0608439998, -13079764,   0
##MAX=       14782.0589164792, 272919851,    0
$$ Real data points
##PAGE= N=1
##DATA TABLE= (X++(R..R)), XYDATA
$$ [...]
36803E83831k22279m52132Q7587L41996k64795p91578m63857k7820l02502n41032
36793b052581L30357J614897J592795R0076j208113j108694k50849K62821M07935
36784c21356P13587J002022N81635n27373j330152j014757K2277O25572K58439
36775I894m11885m60913Q5750M25666J97913r6389J0162K72767K54178k4661l33177
36764g0695o35842q34094o02221L2566M36704K60645R2577N38606J101438Q28232
36754A147916j97645r08087o96592R203N75902P51744M17925l97294j105689r43468
36744a346085j4172P10522O48703K27191L1672K6418l8212m8898J99656N61638
36734I58433P16392N03671n9632p32545r91438n42270P7768O7017m18284m45322
$$ plain form
36803 583831 361552 -90580 -2993 339003 74208 -717370 -1181227 -1209047 -1511549 -2052581
36793 -2052581 -1722224 -107327 1485468 1575544 367431 -741263 -992112 -729291 -321356
36784 -321356 392231 1394253 1975888 1448515 118363 -896394 -874117 -248545 9894
36775 9894 -401991 -862904 -777154 -351488 -153575 -249964 -239802 32965 287143 262482 -70695
36764 -70695 -706537 -1540631 -2142852 -2110286 -1673582 -1412937 -1320360 -781754 319684 1147916
36754 1147916 950271 42184 -654408 -645205 -69303 682441 1100366 703072 -402617 -1346085
36744 -1346085 -1360257 -649735 -1032 226159 257831 284249 246037 197139 396795 958433
36734 958433 1674825 2178496 2118864 1386319 394881 -147389 -69621 -2604 -420888 -866210
36724h66210J22949K83333m08103q99619k64360O97264O46701j67518l40671M36068
36714g60166R88426O18420J04695K77468O94872M73977k97150p80922o22450k39611
36704D57559n1118j9420K7411O8833K3071l7133L9564K27771K30959k28944r29713
36693a91160j122001k93948J056955J780829J324923L03121l58637m95311n79824
36684A424947p86259p10712j06795N35837M92340k45466q67160p06821o1168K31724
36674g99533p2930l31193k359M79644K77950n85945j111079n80522N03821J036373
36664a185773N95322j90788m47194M0028P27766R74876P12791M00822L18023J61806
36654B107679l65423q30324n39875K72655N05917k49379r80342p00490O1048J52571
$$ plain form
36724 -866210 -743261 -459928 -868031 -1767650 -2032010 -1334746 -688045 -855563 -1196234 -760166
36714 -760166 228260 846680 951375 1228843 1923715 2397692 2100542 1319620 697170 457559
36704 457559 406441 387021 414432 483265 506336 469203 508767 736538 967497 738553 -191160
36693 -191160 -1313161 -1607109 -550154 1230675 2555598 2858719 2500082 2004771 1424947
36684 1424947 638688 -72024 -178819 357018 849358 603892 -263268 -970089 -1031257 -799533
36674 -799533 -872463 -1203656 -1206015 -726371 -448421 -1034366 -2145445 -2725967 -2222146 -1185773
36664 -1185773 -590451 -781239 -1228433 -1188405 -460639 514237 1227028 1627850 1945873 2107679
36654 2107679 1742256 911932 372057 644712 1150629 901250 -79092 -779582 -718534 -565963
36644e65963l03043j40233Q07853J262591M92636m82639m60237J55152J52459
36635I18576n63322j004740p24511k71215q8438K1891K41574M19315N34631O73087
36625A56848M77959m42523j425537j179228K94107J325599Q21127j81012j68222
36616c20882N50788N29981l85328q34025j27136P31319O14524j95208o37118l31820
36606d04905J92549L45735Q1016j78027j2072M63892O13097J06341m72172l78380
36596C57074J31346J56900l91482o34609j87265K29598O9847j25512K06716N25869
36586C38482O8724p26619p38454J51242Q80740P13487Q6512j79807J25185N82979
36576A302471O69282J77128n62444q96157n75777j11365l7694j07727K25868P76466
$$ plain form
36644 -565963 -869006 -1009239 -201386 1061205 1553841 1071202 610965 766117 918576
36635 918576 355254 -649486 -1373997 -1645212 -1733650 -1711759 -1470185 -1050870 -516239 156848
36625 156848 634807 192284 -1233253 -2412481 -2118374 -792775 28352 -152660 -320882
36616 -320882 229906 759887 374559 -459466 -586602 144717 759241 564033 -73085 -404905
36606 -404905 -212356 133379 214395 36368 24296 488188 1101285 1207626 735454 357074
36596 357074 488420 645320 253838 -380771 -568036 -338438 -268591 -394103 -187387 338482
36586 338482 407206 -319413 -1057867 -906625 -25885 687602 774114 594307 719492 1302471
36576 1302471 1971753 2148881 1586437 690280 114503 3138 -34556 -142283 83585 860051
36566H60051Q18900K41323k98387m37728n14234o97034n55920P0616N16658K16215
36556B20460l45268k94909L39411O81537K12817o47567j137035q78922m7930P92346
36546a105060J023909N02305k28492n09771k87550K2718K22305M16127M99533
36537E56024J80215l42725l58963L07448P84134K93359n81246o04394K40389N86405
36527A060646k76627j162827o25559Q13796J268760J85763q61459m81799O03797
36518E24491Q23908Q4411l92402j42499J6323l62834n16396J21865P31605K62697
36508A151169q56264j216835m01462N39444O49362K22004O1914K80780L77461
36499H07573J23939k20928m52968o48564p96413o48238j41868L39603M09504J80695
$$ plain form
36566 860051 1678951 1920274 1621887 1184159 669925 -27109 -583029 -512413 4245 220460
36556 220460 -124808 -419717 -80306 601231 814048 166481 -970554 -1849476 -1897406 -1105060
36546 -1105060 -81151 421154 192662 -317109 -604659 -581941 -359636 56491 556024
36537 556024 736239 393514 34551 341999 1126133 1419492 838246 233852 474241 1060646
36527 1060646 784019 -378808 -1004367 -190571 1078189 1263952 402493 -79306 524491
36518 524491 1348399 1432810 1040408 897909 914232 551398 35002 156867 888472 1151169
36508 1151169 294905 -921930 -1323392 -783948 -134586 87418 149332 430112 807573
36499 807573 931512 710584 257616 -390948 -1187361 -1835599 -1977467 -1637864 -1228360 -1047665
36489a047665K7490L20j25670k73636m9493N26839P66653J78801p44453j083600
36479a824414o39871l5581K25191K63712L68140N28502N81835M66700K17110k4630
36469A26694n279K88532L81507q7734o16081l85487M20110P13290J46640l05564
36459F76628Q6301O17479L29927m33836o86977l92828k37982k41470J15730N76293
36449D09265L04643n38679p99904j87389K53920R272J422P85214J196950J07268
36439A541982j480617j646765l17984P73996O82693J92307N7121r7465n64262
36430h58994o70843k9841M36985j15421q26450k44874J286949J813476M93110
36421A284097j145798j260585k6659R23815P44236M8691l79894m99261m94164
$$ plain form
36489 -1047665 -1020175 -1019855 -1145525 -1419161 -1468654 -941815 -175162 3639 -740814 -1824414
36479 -1824414 -2464285 -2499866 -2274675 -2010963 -1642823 -1114321 -532486 -65786 151324 126694
36469 126694 121415 409947 791454 703720 87639 -297848 122262 835552 982192 676628
36459 676628 762929 1380408 1710335 1276499 589522 196694 -41288 -282758 -167028 409265
36449 409265 713908 175229 -624675 -812064 -558144 -548872 -547450 237764 1434714 1541982
36439 1541982 61365 -1585400 -1903384 -1129388 -446695 -254388 -197267 -294732 -858994
36430 -858994 -1529837 -1559678 -1122693 -1238114 -2064564 -2309438 -1022489 790987 1284097
36421 1284097 138299 -1122286 -1148945 -225130 519106 567797 187903 -311358 -805522
36412h05522k73287R8615J62005j98868l28605K38991Q46784N64863k98475n27753
36402e21252J46068N90652L4464p21319n71688J87416M00963j27395m36684J1902
36392a006873N39503L14211n10935j127610j068226m82595K63951Q80558J163410
36383a034606J015325N16157n9053l26240p7100L85220M34867p5955m69112j25357
36373A84146N24533N14371k48517q24809o05013q8273J4904j96572j71087J86668
36363g09649M84305M49675J59581j42602j83213J38765M73889K92597l41364p02635
36353h0651m04617L4238L8072j41958K6648L88779M08973J42106J04104L09546
36343H25240K25757k85087o86038n67387j49858J72359K94211K39938j8830l79076
$$ plain form
36412 -805522 -1078809 -980194 -818189 -1017057 -1345662 -1106671 -259887 304976 6501 -521252
36402 -521252 -375184 215468 249932 -471387 -1043075 -855659 -454696 -582091 -1018775 -1006873
36392 -1006873 -467370 -153159 -664094 -1791704 -2859930 -3342525 -3078574 -2198016 -1034606
36383 -1034606 -19281 496876 437823 111583 34483 419703 854570 778615 309503 184146
36373 184146 708679 1223050 974533 149724 -455289 -543562 -528658 -725230 -896317 -709649
36363 -709649 -225344 224331 383912 241310 58097 196862 670751 963348 621984 -80651
36353 -80651 -485268 -451030 -412958 -554916 -528268 -139489 269484 411590 515694 825240
36343 825240 1050997 765910 79872 -487515 -637373 -465014 -170803 69135 50305 -328771
36333c28771n49406l41308J50019O44060P89227L60846l76307p53756n24575k92925
36323a222896o13491j016458o48947L71678J110693J203710J143144J146771P58649
36314B232853j53380r26541j034014p30238m09108o2468K70605K96531J10404
36305d05356K54506P05789O69153q6028o13538k42275K60024q2245q20394p93682
36295a154046N2934P16587O97152M09897J85172j16663m86457o26428m74022j93072
36285i88946K55493Q56102J070032M48423m40861n85015M1043M94108K81971j54598
36275A277752m13427o22158p87068n69182n42L66705L14817K42671L48908K83174
36265D41650r0082l15077j03204J78755J54563j375r44P9160O2874n3369l03477
$$ plain form
36333 -328771 -878177 -1219485 -1069466 -425406 363821 724667 348360 -405396 -929971 -1222896
36323 -1222896 -1836387 -2852845 -3501792 -3130114 -2019421 -815711 327433 1474204 2232853
36314 2232853 2079473 1152932 118918 -611320 -1020428 -1082896 -812291 -515760 -405356
36305 -405356 -150850 554939 1224092 1138064 524526 282251 542275 460030 -360364 -1154046
36295 -1154046 -1101112 -384525 312627 722524 907696 791033 304576 -321852 -795874 -988946
36285 -988946 -733453 122649 1192681 1641104 1200243 615228 656271 1150379 1432350 1277752
36275 1277752 864325 242167 -544901 -1114083 -1114625 -747920 -433103 -190432 158476 441650
36265 441650 351568 36491 -66713 112042 266605 265230 264286 343446 406320 352951 49474
36254D9474p13769r19288m36910M92004R84571O63521P3430k40489l41514l61196
36244g50166j51529J92062K39174J4372R5368N64638P23305K79552r6609N8708
36234A168875K22602p9486l97829k77270j30139l28146l42372K02165N14892j00543
36224D52749p64503k38632R20946J015375j80397j022050m08401P52147R41274
36215A468508o8156j198062j356318m27210O74297R00255K68611j52048K10909
36206C20786N71526J37781m86165l38534J78880M6140m13275j1454J036382J153619
36196B195686n9268j092787q71177k00460j16991k86993o3720J24542l43323r09274
36186a623765n69713N48763J365416J250542M85446l33721p18262m76969n554
$$ plain form
36254 49474 -664295 -1583583 -2020493 -1528489 -543918 119603 193033 -47456 -388970 -750166
36244 -750166 -901695 -709633 -470459 -456087 -360719 203919 927224 1206776 1110167 1168875
36234 1168875 1391477 1311991 914162 636892 506753 178607 -163765 38400 553292 452749
36224 452749 -311754 -550386 370560 1385935 1205538 183488 -224913 527234 1468508
36215 1468508 1400352 202290 -1154028 -1581238 -906941 -6686 261925 109877 320786
36206 320786 892312 1030093 543928 205394 384274 430414 17139 5685 1042067 2195686
36196 2195686 2136418 1043631 172454 -28006 -144997 -431990 -495710 -371168 -714491 -1623765
36186 -1623765 -2193478 -1644715 -279299 971243 1456689 1122968 404706 -72263 -77817
36177g7817K0487l62349l14472M49421R56637L37753p48891r34688j2035Q51118
36167A65164O45828l49222r70852m06846Q73678J417170M13992j055163j161813
36158d28064K45357J393964J047402J8545l73668j64673j41489l85877m95318
36149G16179m98632n40368l33414J63037K96517j26069j82392N79789R81048M8665
36139A104360j050199p10624L51993J91433j045211j264186J41337J390637J241977
36130C51517N69370L16221j234p33824r57581j60014N39271J98739l25550K0786
36120a82299N74790K29948m64168k34638O52222Q67638K98080N6631L86350K91121
36110B475675n78033j223000q96300j22547L60616N82622P20986M88975j83026
$$ plain form
36177 -77817 -57330 -419679 -734151 -284730 671907 1009660 260769 -673919 -685954 165164
36167 165164 810992 461770 -509082 -915928 -42250 1374920 1788912 733749 -428064
36158 -428064 -182707 1211257 2258659 2277204 1903536 1738863 1597374 1211497 716179
36149 716179 217547 -322821 -656235 -493198 -196681 -322750 -505142 74647 1055695 1104360
36139 1104360 54161 -656463 -304470 -113037 -1158248 -2422434 -2281097 -890460 351517
36130 351517 920887 1237108 1235874 502050 -455531 -615545 -76274 122465 -203085 -182299
36120 -182299 392491 622439 158271 -76367 575855 1443493 1741573 1798204 2184554 2475675
36110 2475675 1897642 674642 -221658 -344205 16411 599033 1320019 1808994 1625968
36101A625968o30015l48685J45396O7033m42636n94293j90334J41330m4569l91355
36091f62160l29464J45694N73636O63006N29255M00033L48488L12735J72195j95297
36081A958121p10362r50473n40348K12952M67853j01411p69453o76015L1611M88212
36071e89313L22853k4913j16070k0112K9381m9309k65306m76918k81031M64789
36061a005949J095671Q09074j45664p23079n30875j22043K13570Q17183J515112
36052A923000J345942R4359j014491j004065n30740n93848q16144k64142P38387
36043a21742J035920M86376Q801j6193p1908k82781j64612K65896L16373j97355
36033A258775o40751o84025p14137q38897n35866K65349P37995L68650k32050
$$ plain form
36101 1625968 995953 647268 792664 859697 417061 -177232 -367566 -226236 -270805 -662160
36091 -662160 -991624 -845930 -272294 390712 919967 1320000 1668488 1981223 2153418 1958121
36081 1958121 1247759 297286 -243062 -30110 437743 336332 -433121 -1109136 -1077525 -589313
36071 -589313 -266460 -291373 -407443 -427555 -398174 -447483 -712789 -1189707 -1470738 -1005949
36061 -1005949 89722 898796 753132 30053 -500822 -622865 -409295 407888 1923000
36052 1923000 3268942 3363301 2348810 1344745 814005 220157 -595987 -860129 -121742
36043 -121742 914178 1400554 1409355 1393162 1321254 1038473 873861 1139757 1456130 1258775
36033 1258775 618024 -66001 -780138 -1619035 -2154901 -1889552 -1151557 -782907 -1014957
36024a014957l36003j42841j44192j42089K88757Q50926Q74023L57467o0092l9833
36014D91166J53567K06345Q8568j30529l47009l13153J26611O57062P15690J99433
36004A847751l36326l45093L4747J91259j31616m92572m02277p4135j02172m35314
35994b45748k95625N83315J256398P40623n20890j164010o92090O7665K79663
35985I301K9117k24146l33352k93240k1168L48523M57709K64377R6991K1066k29267
35974A25911n23960l16438L33719N56459j706m67832o0024O31476N83601j4743
35964H46463j22439M51456Q09520M27090j47008k76815j15620j36264l73397n22411
35954H40575m14505r2842K88979M20135l265p89421j179258o19808M78056J086190
$$ plain form
36024 -1014957 -1350960 -1493801 -1637993 -1780082 -1491325 -640399 233624 591091 530999 491166
36014 491166 644733 851078 939646 809117 462108 148955 275566 932628 1648318 1847751
36004 1847751 1511425 1166332 1201079 1392338 1260722 768150 365873 291738 189566 -245748
35994 -245748 -541373 41942 1298340 2038963 1518073 354063 -338027 -270362 9301
35985 9301 38418 -185728 -519080 -812320 -833488 -484965 -27256 237121 334112 355178 125911
35974 125911 -398049 -714487 -380768 175691 173985 -293847 -353871 277605 861206 846463
35964 846463 724024 1175480 1985000 2412090 2265082 1988267 1872647 1736383 1362986 840575
35954 840575 426070 333228 622207 1042342 1039077 249656 -929602 -1549410 -1071354 14836
35944A4836P16426l9217k91849M4410K74092l9181n38306p31479o56277m94699
35934a741244m5267P55395J182432N10440o84261j008424j35694P85225Q37885
35925D56487M07632J20433k00948p96185j122054o77900R479J58486o7873n0917
35915a763360J24073L323j63254K20950Q92070R29234J18693p73280j056134o82477
35905b150162R9773Q77628J036557M19489j76389o803M15087J29643n79006n83058
35895e17241J41728M23863j11567m47787J4967M79935K28133k16786k09593j36980
35885c51328n12837q60715m97468K90043P66922Q04538N76831q3683j064801j372043
35875b304541k89564J264629J666764O62525m85368p63831l32096K65697Q04139
$$ plain form
35944 14836 731262 692045 400196 444606 718698 679517 141211 -590268 -1246545 -1741244
35934 -1741244 -1786511 -1031116 151316 661756 -22505 -1030929 -1166623 -381398 456487
35925 456487 864119 984552 783604 -12581 -1134635 -1812535 -1803056 -1644570 -1712443 -1763360
35915 -1763360 -1639287 -1635964 -1799218 -1578268 -686198 243036 361729 -411551 -1467685 -2150162
35905 -2150162 -2050389 -1172761 -136204 283285 106896 100093 515180 644823 65817 -517241
35895 -517241 -375513 48350 -63217 -511004 -496037 -16102 212031 -4755 -214348 -351328
35885 -351328 -864165 -1724880 -2222348 -1932305 -1165383 -360845 215986 132303 -932498 -2304541
35875 -2304541 -2594105 -1329476 337288 999813 514445 -249386 -581482 -315785 488354
35866D88354J102758Q60297J07838o33560q65345n36912K330K28142j72649q26431
35856b45178q93889j46228N95540N80031J57791J9400j4159m60183q91732m44753
35846a743360N36543P19124j53300p17389j6251J072286J174595L05404m43509
35837G34143m95077k07649l9105l5597l2336J23680M28077N28522J879r02024
35827A04513j269620o92664P7843J98922m3768J79356Q25867J062081O16800J19755
35817A179085O579l3782k58532l24611J3176L08058Q6007l56749m08523q1177
35807A29531J00074k8743q5584J88384N53805O24207K48753m52273j102701j172188
35797i96735m71048M46226P83456M40229J6945j28897k51805m89432m35923J32109
$$ plain form
35866 488354 1591112 2451409 2559247 1925687 1060342 523430 525760 753902 581253 -245178
35856 -245178 -1139067 -1285295 -689755 -109724 48067 67467 53308 -406875 -1298607 -1743360
35846 -1743360 -1206817 -487693 -640993 -1358382 -1374633 -302347 872248 1177652 734143
35837 734143 239066 31417 -7688 -43285 -75621 48059 476136 1004658 1006537 104513
35827 104513 -1165107 -1857771 -1779928 -1581006 -1624774 -1445418 -619551 442530 1059330 1179085
35817 1179085 1185664 1151882 893350 568739 581915 889973 975980 619231 210708 129531
35807 129531 229605 200862 115278 303662 857467 1481674 1730427 1278154 175453 -996735
35797 -996735 -1467783 -1021557 -238101 202128 219073 90176 -161629 -651061 -1086984 -954875
35787i54875O55028M98899r8477l91438j87780N8150N2861m4298p9807j03688
35777e95425j15359q2377j53962l82661l66641K37470R48556R19113J73970l57939
35767B24745j75040J88410J18520k36157m04028k39434J80009O96422Q53404K40874
35757A447725o41266o88629J96966P02098l0909j012290q06367L74494J070026
35748F11848O30322k33635p36721p92269n26603J8819N57035O60370L41453J846
35738E32465j88055l48596m41160l10280n5425J48917L83406O13873L87440l90447
35728C32138q24488j40414R06483Q72490k70725j085695p59286r429L12756L13007
35718c53163L40911K89399J31024K07207M58303K36501n99809j247962j127580
$$ plain form
35787 -954875 -299847 199052 100575 -290863 -478643 -420493 -367632 -411930 -491737 -595425
35777 -595425 -710784 -793161 -947123 -1329784 -1696425 -1458955 -510399 408714 582684 224745
35767 224745 49705 238115 356635 120478 -283550 -522984 -342975 353447 1206851 1447725
35757 1447725 806459 117830 314796 1016894 985985 -26305 -832672 -458178 611848
35748 611848 1242170 1008535 271814 -520455 -1047058 -1028239 -471204 189166 530619 532465
35738 532465 344410 -4186 -445346 -755626 -811051 -662134 -278728 335145 722585 332138
35728 332138 -492350 -632764 273719 1146209 875484 -210211 -969497 -978926 -666170 -353163
35718 -353163 -12252 277147 408171 615378 1073681 1310182 710373 -537589 -1665169
35709a665169o44339k80223J62738P83713R78873M23475j40487K3076M64797L52238
35699D58692j41244k18378K08361N07551L56786m3622n01119q17860n71510L04421
35689d57922J023380Q31702J17299j75591M7906J16877j32523j80809R3119J45060
35679A428498k36491n26935l64046j40111l06132o00563m02757L86515J120771
35670C58749J038169Q6067q88587r78262k95619J84623O129j80538J88439N51210
35660G0380J42385o46233q21049l28038K5181k3332K5670K93198L08019N5960
35650h97859J32764N78631O23827J317m90800k73844Q2967j15088n25879m10795
35640a294759J51785M88606L62318N8180k36985m57178l28990K70632P84983N06087
$$ plain form
35709 -1665169 -2309508 -2589731 -2426993 -1643280 -664407 -240932 -381419 -358343 106454 458692
35699 458692 317448 99070 307431 814982 1171768 1128146 627027 -190833 -762343 -457922
35689 -457922 565458 1397160 1514459 1338868 1386774 1503651 1371128 1190319 1283438 1428498
35679 1428498 1192007 665072 301026 160915 -145217 -745780 -1148537 -762022 358749
35670 358749 1396918 1482985 594398 -383864 -679483 -494860 -488731 -669269 -480830 70380
35660 70380 212765 -433468 -1254517 -1582555 -1557374 -1580706 -1555036 -1261838 -953819 -897859
35650 -897859 -765095 -186464 437363 438680 -52120 -325964 -242997 -358085 -883964 -1294759
35640 -1294759 -1142974 -654368 -292050 -233870 -470855 -928033 -1257023 -986391 -201408 304679
35630C04679l85026r36732o61796q2015J35593N8932J57414M50988M80700N6205
35620d21058m15300n02142l19638k24483j57268K39336Q56580J025966M48056
35611E30049k46478k87526K04977M67925J59316l39162n81426n19218l08654q0040
35601a000237N1274M7347K2282N2620N0861J8981J27713K76601L1161n63589o62950
35590a547936J91760J093360R09561N618k99199K15809M42353j65513p61030n26252
35580d41469J93281O44372O08038J59137n86172j062036n61121N67533J012647
35571E34210L28714l60849j24043M07503K68880k68776l98835j91125j87950k78305
35561b70576p4834J77677J20493J10155M79840O40192Q3994m29440q0779L12307
$$ plain form
35630 304679 -80347 -1017079 -1678875 -1760890 -1625297 -1566365 -1408951 -957963 -477263 -421058
35620 -421058 -836358 -1338500 -1658138 -1882621 -2039889 -1800553 -943973 81993 530049
35611 530049 283571 -3955 201022 668947 828263 489101 -92325 -611543 -920197 -1000237
35601 -1000237 -948963 -901616 -879334 -826714 -775853 -756872 -629159 -352558 -321397 -884986 -1547936
35590 -1547936 -1356176 -262816 646745 652363 353164 568973 1011326 845813 84783 -441469
35580 -441469 -248188 396184 1004222 1163359 577187 -484849 -1045970 -478437 534210
35571 534210 862924 502075 378032 785535 1054415 785639 386804 195679 7729 -270576
35561 -270576 -345410 -167733 -47240 62915 542755 1182947 1266941 837501 756722 1069029
35551A069029m82645j675245j277471O47587J703228O50085q11816p26435L55826
35542e47857O44118j18140o83032l98305J61406L84101K73935j1132l70262n12028
35532a177196j99123K55978K93679j17173m52688l18675J98579P25603Q27411
35523C6395K93964m27939m27070N37010J415456J053633k20206r74609o02634
35514F84000j039j03055n85358n85423p3783K50722J24041k5680M1486p706l55187
35503f36982n47927j60511M92456P94490O68444M44481J40074m39339r59095p24344
35493i28253J92046P36685K37110o16240p13175L655O50982O80550L55111R3356
35483F91827o57M3943J59126J07008k79946p13460p50061m63408l35490m73534
$$ plain form
35551 1069029 586384 -1088861 -2366332 -1718745 -15517 634568 -177248 -903683 -547857
35542 -547857 96261 -21879 -704911 -1103216 -941810 -557709 -283774 -294906 -665168 -1177196
35532 -1177196 -1376319 -1120341 -826662 -943835 -1396523 -1715198 -1516619 -791016 36395
35523 36395 330359 -97580 -524650 12360 1427816 2481449 2261243 1286634 684000
35514 684000 682961 579906 -5452 -590875 -664658 -413936 -289895 -315575 -274089 -281795 -636982
35503 -636982 -1184909 -1345420 -852964 -58474 609970 1054451 1194525 755186 -203909 -928253
35493 -928253 -736207 478 237588 -378652 -1091827 -1088172 -437190 243360 598471 691827
35483 691827 691170 735113 894239 1001247 721301 7841 -742220 -1205628 -1541118 -2014652
35473b014652m64195q5665L62666N90434O80168P21793N51755J33195j84906j00603
35463A89990K06515L28562J22496k27916m53072l68441J947L75674M77159L91572
35453A044486M16995N57457M84167N7716m51198p55229q26216o75122k35432L45054
35443c7322O37573M19970N595j43098L1173J90118L7922l86687p82029q86448
35433i13233p34544n33788k64616K99348R83602J068894K44828o64207o23434
35424a137150J96758P37716O36365N04716N84294K76620n72860j020131l97328
35415a91000N06609N31986j93388o23486m11576j81046l48162n86441n17289k06563
35405b220356J54624M92784O52440M42313K1420j59976N5363L18803K60318o0718
$$ plain form
35473 -2014652 -2478847 -2564512 -2201846 -1611412 -931244 -209451 342304 475499 290593 189990
35463 189990 396505 725067 847563 619647 166575 -201866 -199919 175755 652914 1044486
35453 1044486 1461481 2018938 2503105 2560821 2109623 1354394 528178 -146944 -382376 -37322
35443 -37322 600251 1020221 1025816 882718 913891 1104009 1141931 755244 -26785 -913233
35433 -913233 -1647777 -2181565 -2446181 -2146833 -1163231 -94337 150491 -513716 -1137150
35424 -1137150 -940392 -202676 433689 938405 1522699 1799319 1226459 206328 -191000
35415 -191000 315609 847595 654207 30721 -380855 -561901 -910063 -1496504 -2013793 -2220356
35405 -2220356 -2065732 -1572948 -920508 -478195 -456775 -616751 -561388 -242585 17733 -42985
35395d2985k75309j09116L35655N71194J24084q28760j385265q42143L65771J057675
35385a029199P01515J2172n9745M13350N32640o1936n89798k31813N64739N74471
35375H26396m23680j165739o18114N51374R65878M72519R1271K96114M82338K11917
35365A690274j14709j40155j26031k34557j30301K19486J98772m37702r70851
35356d5774p41769p6069L62762M22704J57533m68877r79020m75553Q72461J481847
35346E10245N07571o92688n01750N24649P03770j03436o55644o27644p80270j039056
35336b154253m46118P93914J185714L30986l70283m7799L51904l7661m70789q7611
35326i51996M77253L01782j53367J8333M62413K42814m21677n50166j18898J8748
$$ plain form
35395 -42985 -318294 -427410 -91755 479439 603523 -225237 -1610502 -2452645 -2086874 -1029199
35385 -1029199 -327684 -315512 -375257 38093 570733 508797 -81001 -312814 251925 826396
35375 826396 402716 -763023 -1381137 -829763 136115 608634 699905 996019 1478357 1690274
35365 1690274 1575565 1435410 1309379 1074822 944521 1164007 1362779 925077 -45774
35356 -45774 -787543 -863612 -500850 -78146 79387 -389490 -1368510 -1844063 -971602 510245
35346 510245 1017816 325128 -176622 348027 1051797 948361 292717 -334927 -1115197 -2154253
35336 -2154253 -2600371 -1806457 -620743 -289757 -660040 -707839 -355935 -393596 -864385 -951996
35326 -951996 -474743 -172961 -326328 -307995 154418 397232 -24445 -574611 -693509 -674761
35316f74761k64132j99311L92620O80189J75351m73233m58067J21304N80280N45299
35306D25539J73824j87536k75626l3398L49500N94288N69409L19581m8270m03649
35296A483662o29000p06969o48385l51908J83311N30358K03325n18577o98466
35287a152649K3258Q40962Q60040K70634r5797J7121J53390r411k98877m58958
35277A49713m29674k46009k3462K4495j51752k87818j72193M0233J36803J90456
35267g69208K91341K51958n0751l36602l09881r6361P3606K77036N91339P49779
35257F72256N51326K29924l0368m53788r96374r14707J75964J314767J254612
35248A803612J89502n94189n54308k82852j97650n9075J34567j0436k96243K6205
$$ plain form
35316 -674761 -938893 -1138204 -745584 -65395 109956 -363277 -821344 -700040 -119760 425539
35306 425539 599363 411827 136201 102803 452303 1046591 1616000 1935581 1887311 1483662
35296 1483662 854662 147693 -500692 -852600 -669289 -138931 64394 -454183 -1152649
35287 -1152649 -1129391 -288429 571611 842245 746448 763569 916959 907548 608671 149713
35277 149713 -279961 -525970 -549432 -524937 -676689 -964507 -1136700 -1096467 -959664 -769208
35267 -769208 -477867 -225909 -276660 -613262 -923143 -1019504 -945898 -668862 -77523 672256
35257 672256 1223582 1453506 1423138 969350 -27024 -941731 -765767 549000 1803612
35248 1803612 1993114 1398925 844617 561765 364115 305040 439607 429171 132928 159133
35238A59133Q50201J028794J51983o39065l76357K46169Q5650o09809p34585j39093
35228B3021K88099R9438k36382k87072j57946P651K46816M09678K31624j54617
35218D70310l42961k84928k31779j23700K89443P49715O74666J19942k14071r4617
35208A012020o7835m01591n73176k39429J13314O8538M0265M05725O26967J67264
35198A152062l70561j71296K29242k86332j299580j140323M53897J603835R59596
35189A130540l39894m94257L44935P03522K14704j91086j50855k89446p33197
35180A94966p03328M3247O27937M21607l8435n3569K25975L67231L91879L46265
35170A823775o1470p22939q00973O2599Q79308N60209m78597r09051l48207L33852
$$ plain form
35238 159133 1009334 2038128 2190111 1551046 1174689 1420858 1506508 896699 162114 23021
35228 23021 311120 410558 174176 -112896 -270842 -263191 -16375 393303 624927 470310
35218 470310 127349 -157579 -389358 -513058 -223615 526100 1200766 1320708 1106637 1012020
35208 1012020 944185 542594 -30582 -270011 -156697 -88159 -47894 357831 984798 1152062
35198 1152062 781501 610205 839447 553115 -746465 -1886788 -1432891 170944 1130540
35189 1130540 790646 296389 641324 1344846 1559550 1368464 1217609 928163 194966
35180 194966 -508362 -465115 162822 584429 545994 492425 718400 1085631 1477510 1823775
35170 1823775 1762305 1039366 238393 300992 1180300 1740509 1261912 352861 4654 338506
35160C38506M00389M6679k00477j59804P361j6784m69776j054954r91398m8585
35150b148843Q24337O42163j31051j63198P62856J356825O41332p08730j312221
35141b36530p83292L7281K77354R532k8114M64214P94015J88724q59497r49764
35131a086077K28420J191376P05643l51431l40702N93457Q29869j34946j013090
35122F22519q19927j50005J08833O0665J79584M23251N71045O13563L67094m28850
35112A547772j272521j173028j90544L93369k8728n01032j86249L07128K00916
35103i02917l3894L10167P58197N32833K1872K9346K58160p6035o98268p71666
35093e72205m64070n30719p06205j07129R41516J127399K47414n03748n27065
$$ plain form
35160 338506 738895 785574 585097 425293 432654 415870 -53906 -1108860 -2100258 -2148843
35150 -2148843 -1324506 -682343 -813394 -976592 -213736 1143089 1784421 1075691 -236530
35141 -236530 -1019822 -982541 -705187 -695655 -723769 -259555 534460 723184 -136313 -1086077
35131 -1086077 -857657 333719 1039362 687931 347229 940686 1770555 1635609 622519
35122 622519 -197408 -347413 -238580 -177915 1669 424920 995965 1609528 1976622 1547772
35112 1547772 275251 -897777 -1088321 -694952 -723680 -1224712 -1410961 -1103833 -902917
35103 -902917 -936811 -626644 131553 664386 686258 715604 973764 897729 199461 -572205
35093 -572205 -1036275 -1566994 -2273199 -2380328 -1438812 -311413 -63999 -567747 -1094812
35084a094812n10786p69767n16023N28293J244077P73406j01529k40326J47560
35075e39907J38735k93328m08708m454M05661M95721M16667L09318J42665o2852
35065E99518k80837n69655q03129o30648l7365M50208M78892L40113L39474K42950
35055A29521j31393l41694j6606L84140K70053q2569j09634r1689o00993j102509
35045a693373m75509R66415J424155J52604j242689j010450K66680O91278p2101
35036i92990m85155L22794J214462Q44764l22293p54383o825Q55871Q06390l2524
35026A450111q68608j127004o73588K59364J062236J080438K97566n60797q40939
35017G8779o29044l91507k42918Q0594O49636J064469Q12667j47264j140817j257701
$$ plain form
35084 -1094812 -1605598 -2375365 -2891388 -2363095 -1119018 -345612 -447141 -687467 -539907
35075 -539907 -401172 -694500 -1103208 -1107662 -702001 -206280 210387 519705 662370 599518
35065 599518 318681 -250974 -1054103 -1684751 -1722116 -1271908 -793016 -452903 -113429 129521
35055 129521 -1872 -343566 -360172 23968 294021 211452 101818 10129 -590864 -1693373
35045 -1693373 -2168882 -1202467 221688 374292 -868397 -1878847 -1612167 -920889 -992990
35036 -992990 -1478145 -1155351 59111 903875 581582 -172801 -179626 676245 1482635 1450111
35026 1450111 581503 -545501 -1219089 -959725 102511 1182949 1480515 919718 78779
35017 78779 -550265 -941772 -1184690 -1104096 -454460 610009 1422676 1275412 134595 -1123106
35007a123106l36013O67784P23636L7791l06455J1193J63878l06392o25323j09057
34997a202064N79608M73906j15509k10752J64596K10764p7824K8763M51961L05447
34987F08896l63346l40505P16499J418331O73404n88916p86973Q2365P23755M86708
34977B630218j10850n17270p46225q46651o21723o8463M13035M24440l2481n50193
34967b6163o22447j60706K49003k1686p05440q86217l07514K74128K99164J49123
34957a758755K50290L10316Q8880Q0415O01114R57029M85381k35008k72396J33611
34947F40877R8914l22355l51793K6164J10042j42216j10343J60328m015m53136
34937c47533k24178O93025J016286J45641q06005o85392J03019N01756L62374
$$ plain form
35007 -1123106 -1459119 -791335 -67699 -29908 -336363 -325170 -161292 -467684 -1093007 -1202064
34997 -1202064 -622456 -148550 -264059 -474811 -310215 -99451 -177275 -148512 303449 608896
34987 608896 245550 -94955 621544 2039875 2713279 2124363 1337390 1419755 2143510 2630218
34977 2630218 2519368 2002098 1255873 409222 -212501 -280964 132071 556511 524030 -26163
34967 -26163 -648610 -809316 -560313 -581999 -1287439 -2173656 -2481170 -2207042 -1907878 -1758755
34957 -1758755 -1508465 -1198149 -1109269 -1028854 -427740 529289 1014670 779662 507266 640877
34947 640877 739791 417436 65643 91807 201849 59633 -50710 109618 105603 -347533
34937 -347533 -571711 121314 1137600 1283241 477236 -208156 -105137 396619 758993
34928G58993J81902J4193l86608p96115p47037k65322K33035N13002N32720K48241
34918B87004j60569k62552J8075J89119l6335k39051J9126M97495O91873M73721
34908A477906m3095p04404j036613m95832N30733P95998q4658q37626l20213P08028
34898i776P17828l01118r55685n34042K66278O05625L97262p3641m67976l31566
34888f86811L99208Q93502L40736p19326r81258k43786M02966L27736J15741K96929
34878A45637M57330J23139l94399n76821l90730J264M86734O34557o0095j135192
34868g08576j270843l7213J277232J279654K27280n58275m39283J43898N81464
34859D95338O40704L56082m1742k52401k76624l58334m17502j31542K45530Q400
$$ plain form
34928 758993 940895 955088 568480 -227635 -974672 -1239994 -1006959 -493957 38763 287004
34918 287004 126435 -136117 -118042 71077 34742 -204309 -185183 312312 1004185 1477906
34908 1477906 1434811 730407 -306206 -802038 -271305 524693 440035 -397591 -717804 -9776
34898 -9776 708052 406934 -548751 -1082793 -816515 -210890 186372 112731 -355245 -686811
34888 -686811 -287603 605899 946635 227309 -753949 -997735 -594769 -267033 -151292 145637
34878 145637 602967 726106 331707 -245114 -635844 -634580 -147846 486711 426616 -708576
34868 -708576 -1979419 -2016632 -739400 540254 767534 209259 -230024 -86126 495338
34859 495338 1136042 1492124 1450382 1197981 921357 563023 145521 13979 259509 267909
34849B67909o87112o73031M05129J182026M82211q09413j031994j72987L98903
34840f38359J49527j52828M001K63374L62281M41329L23970l17256r84488p46475
34830a294924K35489P60713L74861r9766q5124l4187k77604l37154J4395J52135
34820e91166k59471n57893k19692K68847L87287M45050P07299O61002L4654m18297
34810D57620j36091J86551j67674n66019j51184M98253K91301m43504n32401j6150
34800e79298L4825m46924l90192M49521J014251P04845J40939j71471m93918p69161
34790e06583l46108O24008R29731J83213l75651J54152Q43615M99321m13207o82630
34780I09861k85140n4007j02297M7007K42553k4956m63094l95171p7760k63145
$$ plain form
34849 267909 -419203 -1092234 -687105 494921 977132 167719 -864275 -1037262 -638359
34840 -638359 -488832 -641660 -637659 -374285 -12004 429325 753295 436039 -548449 -1294924
34830 -1294924 -1059435 -298722 76139 -23627 -108751 -142938 -420542 -757696 -743301 -591166
34820 -591166 -850637 -1408530 -1628222 -1359375 -972088 -527038 180261 841263 875917 457620
34810 457620 321529 508080 340406 -225613 -376797 121456 412757 -30747 -563148 -579298
34800 -579298 -544473 -991397 -1381589 -932068 82183 787028 927967 756496 262578 -506583
34790 -506583 -852691 -228683 701048 884261 508610 662762 1506377 2005698 1592491 909861
34780 909861 624721 570714 468417 515424 757977 733021 269927 -125244 -203004 -466149
34770d66149o27964j14006J099517J492249M72002o47716o00214R9223K29933
34761I36875k63887m84296p9092M24954N18885K14614j89153l34908O189N91571
34751A341752Q19239M86770M2804k14154n88521j160322j212373k90300P34444
34742d0661O90731j41922m43517J11529M62108k7799n94433m06752J93483M90254
34732B93021N45058O92938O04491j18764q54709n66213O22338J435335J093194
34723C746689J05523o94977j077219j114654p45730r3604L14988J24878l73865
34714A92029o53856n23003r9909L74470N10684N3344n68817n50607J10507M20753
34704g34405j32520o63587k36146N52523M53858l72214n24252M02730J115338
$$ plain form
34770 -466149 -1094113 -1208119 -108602 1383647 1855649 1207933 607719 706942 936875
34761 936875 672988 188692 109600 534554 1053439 1268053 1078900 743992 750181 1341752
34751 1341752 2160991 2647761 2690565 2476411 1887890 727568 -484805 -775105 -40661
34742 -40661 650070 508148 64631 176160 638268 610469 16036 -390716 -197233 293021
34732 293021 838079 1531017 2135508 2016744 1162035 595822 1218160 2653495 3746689
34723 3746689 3852212 3157235 2080016 965362 219632 126028 441016 565894 192029
34714 192029 -461827 -984830 -1084739 -710269 -199585 -146241 -715058 -1265665 -1155158 -734405
34704 -734405 -866925 -1530512 -1766658 -1214135 -760277 -1132491 -1656743 -1254013 -138675
34695a38675O07612l36139m15479K68600N49302j4744o58837o27287p1968L97420
34685d40195M96626L50685J16154j92749n42236p18538n00408m1115J61254o4635
34675a375157j63552L91162J102513R23116j96967j032111o98316J81583M58696
34666d09033k1427n35465o19295l54481J13134N83065N96345j6437n87782l93555
34656a644931J88059J64286m93476p32653m4563P43909P06360N8765l60183k45557
34646a659984J04690M31370O54505O61450M59279L45631N07533O24384K75420
34637B404278l85230p59838n73145j62814K5495m7226j17239o8291q0403k73532
34627c7945l59582L7775O43802N63609n24616j562869j210440L38655J436905
$$ plain form
34695 -138675 468937 132798 -282681 -14081 535221 520477 -138360 -765647 -837615 -440195
34685 -440195 56431 407116 523270 330521 -211715 -930253 -1430661 -1471776 -1310522 -1375157
34675 -1375157 -1538709 -1147547 -45034 878082 681115 -350996 -1049312 -867729 -409033
34666 -409033 -430460 -965925 -1585220 -1939701 -1826567 -1243502 -647157 -663594 -1251376 -1644931
34656 -1644931 -1456872 -1292586 -1786062 -2518715 -2563278 -1819369 -1113009 -1054244 -1414427 -1659984
34646 -1659984 -1555294 -1123924 -469419 192031 651310 996941 1504474 2128858 2404278
34637 2404278 2019048 1259210 686065 523251 548746 501520 384281 315990 235587 -37945
34627 -37945 -397527 -359752 284050 847659 323043 -1239826 -2450266 -2111611 -674706
34618f74706J043760r3650o86256n40319l03775k03509P2266M98336N95490K15496
34608g6867k38005m67189n74558n74359j89615N89038J197483J114710N14098
34599A294736j8803k15596k48114k55104j28103J66646L48142J18433l98597p23092
34589e9452n54594j02233J88706J27247j05907k33120j33939J14573L12595K91807
34579a54317R7772o5392j61449l92421p49925p71412j38389O76999Q85819M40711
34569c32004O2175J81919M62814N00456L67677K06470r5451m48379l76048K18896
34559G48525O19303K09738n69610q05657l56348J10851J25102j45570l50740l23469
34549g37875m4246L37229N22190M19710K81023J98252j21475o59340p03986J44994
$$ plain form
34618 -674706 369054 275404 -410852 -951171 -1254946 -1458455 -1386189 -887853 -292363 -76867
34608 -76867 -314872 -782061 -1356619 -1930978 -2120593 -1531555 -334072 780638 1294736
34599 1294736 1275933 1060337 812223 557119 429016 595662 943804 1062237 663640 -59452
34589 -59452 -614046 -716279 -527573 -400326 -506233 -739353 -873292 -758719 -446124 -154317
34579 -154317 -56545 -121937 -283386 -675807 -1425732 -2197144 -2335533 -1658534 -772715 -332004
34569 -332004 -269829 -87910 374904 875360 1243037 1449507 1354056 905677 529629 748525
34559 748525 1367828 1577566 1007956 202299 -154049 -43198 81904 -63666 -414406 -737875
34549 -737875 -782121 -444892 77298 497008 778031 976283 854808 195468 -508518 -363524
34539c63524J071344J014180J92832l09001k00676j11277k21563n3986K93970
34530A312299O3899o78495q13108R385O00000Q1712o94224n93926J2312J35492
34520e64654n9037J98791O03171K39709n69498n31105M64541J033417M84101j59598
34510A139838N5110N16951K53176m08611m82884L5440K95852J3728k57595j64886
34500I96119J7679L0675l5030j30675l41184m80156k05532K95531L42583k33060
34490B56950o68628k83301N01700O90297N5784n79737m25119L35556Q22917M57945
34480A164364m57214j063807q08343j5960M65529K47637j64187r9985L47592N12154
34470A27780J53902k34806k01969Q6108K67794L29012L61271J63406m12510r42267
$$ plain form
34539 -363524 707820 1722000 1914832 1605831 1405155 1293878 1072315 1018329 1312299
34530 1312299 1376198 697703 -115405 -106020 493980 575692 -118532 -712458 -700146 -564654
34520 -564654 -623691 -424900 178271 417980 -151518 -682623 -218082 815335 1299436 1139838
34510 1139838 1194948 1711899 1965075 1556464 1073580 1109020 1404872 1418600 1161005 996119
34500 996119 1013798 1044473 1009443 878768 537584 57428 -148104 147427 490010 256950
34490 256950 -411678 -694979 -193279 497018 552802 -26935 -452054 -116498 706419 1164364
34480 1164364 707150 -356657 -1165000 -1180960 -715431 -467794 -631981 -731966 -384374 127780
34470 127780 281682 46876 -155093 -68985 198809 527821 889092 1052498 639988 -302279
34460c02279q11389p8131N25125M98322P6545k27192j78155J83494P03122J076265
34450A465727R66890L78550k98217p26615q68066p20986k07261M61738O97951
34441A149711K11142m57806n00998J46191P32201O16154o1509o85040q45563n78027
34431b73544j23604L18833O17152O46544L44373j56141n54690o48876n20525l65301
34421g15779k20955j0322K34232L88391M10565K95405l1157m91018o74735k94641
34411a110014K78510M34849K24247K05729L84274J25654o10343q68258j12195
34402a047547P72655P14310L1369k09580R4967J84173m1904Q5854N48802M24375
34392A557474m80916j020804m19503M50965M14639j99282j98526N01376P51974
$$ plain form
34460 -302279 -1113668 -1191799 -666674 -168352 -91807 -318999 -497154 -313660 389462 1465727
34450 1465727 2432617 2811167 2512950 1786335 918269 197283 -9978 451760 1149711
34441 1149711 1360853 903047 402049 548240 1280441 1896595 1835086 1150046 304483 -273544
34431 -273544 -397148 -78315 538837 1185381 1529754 1373613 818923 170047 -350478 -715779
34421 -715779 -936734 -947056 -712824 -324433 86132 381537 350380 -140638 -815373 -1110014
34411 -1110014 -831504 -396655 -172408 33321 417595 543249 -67094 -935352 -1047547
34402 -1047547 -274892 439418 470787 261207 356174 540347 498443 584297 1133099 1557474
34392 1557474 1076558 55754 -363749 87216 501855 302573 104047 605423 1357397
34383A357397l0432r93773j052014k21380O05014P40639K38059l52107m92739
34374b01336j09744L36342L72738R6550k0174J30105J52096j53973m08526k58017
34364f3939m590j93425p40359r44749m15979L92927P48997M94738J27175J40125
34354d59079M92201P25592M86144j09555n78541n34230n6097M26739N95691M75678
34344A464543K08477j77609o03425p55333m05467J38319K78303r5987m24571k33045
34334f05795K62492N57461N53683M82143L59015l623m95803o85121l98124K3125
34324D9453J78420M9216j31774j83576k5220L08462N40918L15663k98219p09954
34314I3389m97686Q765J82826j2742n3880K32861L29991j28103o32443m51346
$$ plain form
34383 1357397 1326965 333192 -718822 -940202 -335188 405451 643510 291403 -201336
34374 -201336 -311080 25262 398000 494550 474376 604481 756577 602604 194078 -63939
34364 -63939 -68529 -261954 -1002313 -1947062 -2363041 -1970114 -1221117 -726379 -599204 -459079
34354 -459079 33122 758714 1244858 1135303 556762 22532 -33565 393174 988865 1464543
34344 1464543 1673020 1495411 891986 136653 -268814 -130495 147808 51821 -372750 -605795
34334 -605795 -343303 214158 767841 1249984 1608999 1605376 1109573 424452 26328 49453
34324 49453 227873 277089 145315 -38261 -63481 244981 785899 1101562 803343 93389
34314 93389 -404297 -395532 -212706 -225448 -279328 -46467 283524 155421 -477022 -928368
34304i28368K14546L99963k17083p53780l66359M96496P37879J95001k13230J24438
34294c10497P69948J045388Q35043K84266n59897j343346j335109m02084N03624
34285e12664N24054N7015k0878K30202J40759k37766k92624j35025m38421r54048
34275a639396n59523Q49948J828570J367072K55977l16581m49962q13483j175223
34266f52601r01681l26011k91120o16042l20280O36795J079301L68123n90964
34257a614480n94695L12261J086826J049278M84606N5941P847L4086j69439m01579
34247B50652k50723J63080K29148j92507m34711n8973L61156J23021m46037n14059
34237g69953o6136J87189Q260j61338q4295N4440K33162N19058N09589j68176
$$ plain form
34304 -928368 -713822 -313859 -530942 -1284722 -1651081 -1154585 -416706 -221705 -434935 -310497
34294 -310497 459451 1504839 2339882 2624148 2064251 720905 -614204 -1016288 -512664
34285 -512664 11390 68405 47527 277729 418488 180722 -111902 -246927 -685348 -1639396
34275 -1639396 -2198919 -1348971 479599 1846671 2102648 1786067 1336105 522622 -652601
34266 -652601 -1554282 -1880293 -2171413 -2787455 -3107735 -2470940 -1391639 -1023516 -1614480
34257 -1614480 -2209175 -1896914 -810088 239190 723796 779737 787584 821670 652231 250652
34247 250652 -71 163009 392157 199650 -235061 -294034 67122 190143 -255894 -769953
34237 -769953 -836089 -648900 -640640 -801978 -886273 -831833 -598671 -79613 429976 261800
34227B61800q64810n53251M58360P13099k14201j024661o89444J55188N39279
34218a218641O40401R36170R70482K13950o36725n39767K24720N23811J39302
34209A253703j62525q5140r7903l48570m23246k43829j97262l18801k88913k33715
34199a146201n19302p56914j67549R27227J221632L79163l68711j29095L54830
34190b04920J16702m06354k33061M60446O78994K00321k70970l01755j02295J60297
34180I7405N04167O33328J57924o22150r07082m69537J25547M26126N12983M28508
34170H87219j8423o07483o26863J03845P36971M72909l13576o11009j38539M28175
34160C13226M73616J28476j01032K9917L55195N22747K83855k63203o79558n84260
$$ plain form
34227 261800 -603010 -1156261 -697901 15198 -199003 -1223664 -1913108 -1757920 -1218641
34218 -1218641 -578240 357930 1328412 1542362 905637 365870 590590 1114401 1253703
34209 1253703 1091178 1006038 908135 559565 136319 -107510 -304772 -623573 -912486 -1146201
34199 -1146201 -1665503 -2422417 -2589966 -1662739 -441107 -61944 -430655 -559750 -204920
34190 -204920 -88218 -494572 -727633 -267187 411807 612128 341158 39403 -62892 97405
34180 97405 601572 1234900 1392824 770674 -136408 -605945 -480398 -54272 458711 887219
34170 887219 868796 261313 -365550 -261705 475266 948175 634599 23590 -114949 313226
34160 313226 786842 915318 814286 844203 1199398 1722145 2006000 1742797 1063239 478979
34150D78979o3235M32522N65564L68836R2310l9071M4169J90394J09849l03309
34140A877008p38338p42765k65115K43829L43309Q7283j01982J9526K05585R853
34130I38193o10988j090806q32616O696N79203L35893l19536o21536m13398j20203
34120b149098L9051K41593M94955N11727L03437K86888N10872L89734l31747r16626
34110f19214n98710K21423N45496K79954K41694P00236R21790M37004j74892k88170
34100A666611k18305m97599p94534m41919L33131O52990L28560L8732J41114K16750
34090A425531J7001l0873K93063M02487j67900q41561p62903o4617M21735M29073
34080A121036L62795L03682j17963p58599q55125k32621K55166q00m39421l22701
$$ plain form
34150 478979 415744 848266 1413830 1782666 1874976 1835905 1880074 2070468 2180317 1877008
34140 1877008 1138670 395905 130790 374619 717928 805211 703229 722755 928340 938193
34130 938193 327205 -763601 -1596217 -1589521 -1010318 -674425 -993961 -1615497 -2028895 -2149098
34120 -2149098 -2110047 -1868454 -1373499 -861772 -558335 -271447 239425 629159 297412 -619214
34110 -619214 -1217924 -996501 -451005 -171051 70643 770879 1692669 2129673 1954781 1666611
34100 1666611 1448306 950707 156173 -285746 47385 700375 1028935 1067667 1208781 1425531
34090 1425531 1442532 1411659 1704722 2107209 1939309 1097748 334845 270228 691963 1121036
34080 1121036 1483831 1787513 1669550 910951 55826 -176795 78371 77571 -361850 -684551
34070f84551P3869J03401k5097K91633P39942M27670n37213r88000m10214L70493
34060f38067N47207L51811K41658N9301l29902m34961K5877M14280J49090k48888
34050A37406j7182N12014M75429n3381k62009K1594K55032K86058L97315L82841
34040B135117k02009q78277o18664M50701J010621N13937r9659r0480N861l52437
34030A874711o42100l58266o1717l34991o38087k74078L25318L86225J31533J83775
34020E92323L03755l0491l70478Q219N88180K63273o90671q17220K60105J202560
34010A309555R14928p6185o51088m94714J2304M70491N73047K03547k27017j18095
34000A916773M33149O83451L13082k24013n29422o94595p50701m70593K9254K17334
$$ plain form
34070 -684551 -610682 -507281 -532378 -240745 499197 926867 389654 -598346 -1008560 -638067
34060 -638067 -90860 260951 502609 561910 232008 -202953 -177076 237204 386294 137406
34050 137406 120224 632238 1107667 1054286 792277 813871 1068903 1354961 1752276 2135117
34040 2135117 1933108 1054831 436167 886868 1897489 2411426 2311767 2221287 2227148 1874711
34030 1874711 1232611 874345 812628 477637 -160450 -434528 -109210 277015 408548 592323
34020 592323 896078 865587 495109 503328 1091508 1354781 664110 -153110 106995 1309555
34010 1309555 2224483 2148298 1497210 1002496 1014800 1485291 2058338 2261885 2034868 1916773
34000 1916773 2349922 3033373 3346455 3122442 2593020 1898425 1147724 677131 706385 923719
33990I23719m2598k55017q6328K37696M83590O83303P25956M01412k2790k8494
33980C020449K48203J67912k70810l81228p967K37423J47836J93698L54286o0109
33970C649693r55010j123481o5471J054151J066639L40704j44499j94557Q303
33961C636472O41353J557665J806920Q92493k69146n61315m7392O52439J394207
33952I703696K065809K179152J840149K006454K852314L202403K647742K693841
33944B9191560M515367P202576R653876J2326051J5593428J8951720K3886826
33937A21321404L3605758M5356667M6518730K6117292r348046l8603006m6718137
33930A78250662l8325237k7533299k1068255j6413664j1473968q229965p621966
$$ plain form
33990 923719 881121 626104 539776 777472 1261062 1944365 2670321 3071733 3048943 3020449
33980 3020449 3268652 3436564 3165754 2784526 2776559 3013982 3161818 3355516 3709802 3649693
33970 3649693 2694683 1571202 1505731 2559882 3626521 3967225 3822726 3628169 3636472
33961 3636472 4277825 5835490 7642410 8534903 8265757 7704442 7657050 8309489 9703696
33952 9703696 11769505 13948657 15788806 17795260 20647574 23849977 26497719 29191560
33944 29191560 33706927 40909503 50563379 62889430 78482858 97434578 121321404
33937 121321404 154927162 200283829 246802559 272919851 263571805 224968799 178250662
33930 178250662 139925425 112392126 91323871 74910207 63436239 55206274 47584308
33923D7584308p231804n398847l526543l007042k991585k451758j937564k077799
33915A8961366k303912k102578j922782k012123j798529j118030o99831q17462
33907F186119p58571k11548J01699k21192n19072l38662k73545p72152j154227
33898B038849o75301K34047O02539J89124n17765j005003r08874r1239R08444
33889G74821J070725J32205q46914p18846L19175J050302P20578k60876r32168
33880A309002p45111j1563M38371J18969n86972q90421m38537M96184J354826
33871A044748J486832M82244j086567j744546p87387N48574O33056k41600m51497
33862a16143K74685M90605l91130r89862k45479P99567P15285r6013l06938J52513
$$ plain form
33923 47584308 40352504 34953657 31427114 28420072 25428487 22976729 21039165 18961366
33915 18961366 16657454 14554876 12632094 10619971 8821442 7703412 7003581 6186119
33907 6186119 5427548 5216000 5317699 5096507 4577435 4238773 3965228 3193076 2038849
33898 2038849 1363548 1597595 2200134 2389258 1871493 866490 -42384 -133623 774821
33889 774821 1845546 1977751 1130837 411991 731166 1781468 2502046 2241170 1309002
33880 1309002 563891 552328 990699 1109668 522696 -367725 -806262 -310078 1044748
33871 1044748 2531580 3013824 1927257 182711 -604676 -56102 576954 335354 -116143
33862 -116143 158542 649147 258017 -731845 -977324 -177757 537528 441515 134577 287090
33852B87090L36401R3348J04420M07170L28769j50575k76940J06958K36845k78661
33842A194825q62208r79105q19063o01808q8675P07836J100838O53965m4832j90907
33832G0866J00238J51460j14685j53926J77022L69460J63675n949K07016M18312
33822A383489J50895l03591k99331Q9237J19392m42145q80898n68606J13038L28144
33812c10376q8955n38910m99265n4330L24679K46959k41303n90265k61226N25276
33802a487716R08135M81134j79571l94830k29789k545L98565R88809J089163K17396
33792A788751q53440r89574l50893k1711k15346j41843L61926M76803n9924m02242
33782d07493o0246K93609P7861k36469r5894J84451J55438M3460J18311P4672
$$ plain form
33852 287090 623491 716839 821259 1228429 1557198 1406623 1129683 1236641 1473486 1194825
33842 1194825 332617 -646488 -1465551 -2067359 -2156034 -1448198 -347360 306605 261773 70866
33832 70866 171104 322564 207879 53953 230975 600435 764110 758161 965177 1383489
33822 1383489 1534384 1230793 931462 1020699 1140091 697946 -182952 -751558 -638520 -310376
33812 -310376 -399331 -938241 -1437506 -1491836 -1167157 -920198 -1161501 -1751766 -2012992 -1487716
33802 -1487716 -579581 -98447 -278018 -672848 -902637 -905182 -506617 482192 1571355 1788751
33792 1788751 935311 -54263 -405156 -426867 -642213 -784056 -422130 54673 -5251 -407493
33782 -407493 -467739 -174130 -96269 -332738 -428632 -244181 -88743 -45283 73028 147700
33772A47700k51520l45662Q9701M67956K62114j45134k68575l78255p71490r83120
33762b176285n75474J6740K64506M00104O46702M68523l89462r74144m27947N31788
33752b214949P05244K92445L05706P00181O08847M8203j51656Q6051N8223k87713
33742A50582l03584M0074J45227L9429K65215N77652K18895m86881l75322N42194
33732H13481Q99686J77666m88897k57386J65600l7431m44989l94306k18946n09174
33722b94696r59998q71083k31153L98512O40655M92037K03398J88490N25209N76409
33712F67780j18324p55140k41456Q33901P47392o30862j405401n59841M90304
33703i71647K62289n27416m27457L79325P35108N14748L85838L15046j38891n81246
$$ plain form
33772 147700 -103820 -449482 -359781 108175 370289 225155 -43420 -421675 -1193165 -2176285
33762 -2176285 -2751759 -2735019 -2470513 -2070409 -1423707 -955184 -1344646 -2318790 -2746737 -2214949
33752 -2214949 -1509705 -1217260 -911554 -211373 397474 445677 294021 380072 438295 150582
33742 150582 -153002 -112928 32299 71728 336943 914595 1133490 646609 271287 813481
33732 813481 1713167 1890833 1401936 1144550 1310150 1272719 827730 433424 214478 -294696
33722 -294696 -1254694 -2125777 -2356930 -1958418 -1317763 -825726 -622328 -433838 91371 667780
33712 667780 549456 -205684 -447140 386761 1134153 503291 -902110 -1461951 -971647
33703 -971647 -709358 -1236774 -1664231 -1284906 -549798 -35050 350788 665834 526943 -54303
33693e4303k98267L54296M15636j20303m30601k63725m0235J66913N74091Q38343
33683A141845M42230k27815l20133Q8318J59755k24179l04735J76325N36513K81129
33673A749253k54837n96147o67227m84550k5011M59398N96988M10523J59056j80098
33663A167348o51432p92013j67529P08869Q41277J00530o57696p75718l61300
33654e87664K29947P09154P37521K61936j25220R9548M98168K98197l33484n88658
33644A199445l67146k59433l34012j20320K38623P0401m93647n47836P530K13550
33634c92845k69371n46696q3689L56232R1078k99695m4238N16508O15250K96347
33624B38881P1192m1478k71627m16654k24726k5938k11512m62506k44942K42993
$$ plain form
33693 -54303 -352570 1726 417362 297059 -133542 -397267 -437502 -270589 303502 1141845
33683 1141845 1584075 1356260 1036127 1124445 1284200 1060021 755286 931611 1468124 1749253
33673 1749253 1494416 898269 231042 -253508 -278519 180879 777867 1188390 1347446 1167348
33663 1167348 515916 -276097 -443626 265243 1106520 1207050 549354 -226364 -587664
33654 -587664 -357717 351437 1088958 1350894 1225674 1325222 1823390 2121587 1788103 1199445
33644 1199445 832299 572866 238854 118534 357157 427558 -66089 -613925 -606395 -392845
33634 -392845 -662216 -1208912 -1292601 -936369 -845291 -1144986 -1189224 -672716 -57466 238881
33624 238881 310073 268595 -3032 -419686 -644412 -670350 -881862 -1344368 -1589310 -1346317
33614a346317L65530Q8619J5509M21624Q17000N64407l58711j261506j335347
33605b029192m60656O12843J106681J051574Q82280N31073k79644j060383r78535
33596f23959l11502k30263q40737q20366L69746J329505Q07128l07488m27360
33587a055296K70005M05141k03211l98910K40612P92168N97858J28886p3809j66850
33577E36594l13559k16399J89684L82566O1858l47956m28635m00980n81542p30003
33567a848372m39779J71598O15232O57946M47772J71297j18807l88895n11991
33558a243999l01859K75035Q41692P82201j9631p83906o37646K29811P32109K89525
33548A63332m67261o26968j36973L71637N22337M49714L07345P7559r3900J07102
$$ plain form
33614 -1346317 -980787 -892168 -876659 -455035 361965 926372 567661 -693845 -2029192
33605 -2029192 -2489848 -1877005 -770324 281250 1163530 1694603 1414959 354576 -623959
33596 -623959 -935461 -1165724 -2006461 -2826827 -2457081 -1127576 -320448 -627936 -1055296
33587 -1055296 -785291 -380150 -583361 -982271 -741659 50509 648367 777253 703444 536594
33577 536594 223035 6636 196320 578886 640744 292788 -135847 -536827 -1118369 -1848372
33567 -1848372 -2288151 -2116553 -1501321 -843375 -395603 -224306 -343113 -732008 -1243999
33558 -1243999 -1545858 -1270823 -429131 353070 333439 -450467 -1088113 -858302 -126193 163332
33548 163332 -303929 -930897 -1067870 -696233 -173896 275818 583163 660722 566822 673924
33538F73924N91032O93999o676r39842j120822m34145K34740K63306M2345J10530
33528A08391K01376j67056o36861m51026K56421N66774J84179k09436j70091j02947
33518d20276l07466l32508J58759O45735N25814M2885j88862q4096Q1430K40831
33508C62246L31133J5271p10799j073343m38902O31475R92753L91456l45348m72487
33498c16545p0089L17749K96014j01054m35122l04897O5529L9574m36595o17606
33488a563042q1922N77950O77517L85565J63699k7163k45266l5195P20854J095809
33478A668806L22715q33452j038674k99800K51575J46663o3323l3685j4360q4090
33468B2375n7181o5586k88701l63282n3855m0725p90931j206258n7169J629778
$$ plain form
33538 673924 1264956 1958955 1952279 1012437 -108385 -542530 -307790 -44484 -2139 108391
33528 108391 309767 142711 -494150 -945176 -688755 -121981 62198 -147238 -317329 -420276
33518 -420276 -727742 -1060250 -901491 -255756 270058 312943 124081 39985 121415 362246
33508 362246 693379 708650 -2149 -1075492 -1514394 -882919 109834 501290 155942 -316545
33498 -316545 -386634 -68885 227129 126075 -309047 -613944 -548415 -508841 -945436 -1563042
33488 -1563042 -1644964 -1067014 -389497 -3932 159767 132604 -112662 -147857 572997 1668806
33478 1668806 1991521 1158069 119395 -180405 71170 217833 154510 120825 106465 22375
33468 22375 -34806 -100392 -389093 -752375 -806230 -846955 -1637886 -2844144 -2901313 -1271535
33458a271535J636384k9371r99201k21550N47986j39990j058100n65717N84108
33449a516986O27150k67768m96742K00865M64455k87240r18398m29588N02654
33440b121598N14530n29737j262439m73619J247853J985433Q64574o35695n75390
33431i86088P19372J192066K02678o10556o4841P93031O47087O308o3230O1765
33421A897592m78147j073661n25438P05349R80677J8021p61433m70408J78941
33412D71493L06151P4218O1881L59571O37241M88394l38913j447841j736760o33449
33402a758014Q47741J208055M20552k38657j41851J03805L9336M2378L02676K48459
33392A074480m46169j126734j013719k23174N08951O87674L56806p6546j47868
$$ plain form
33458 -1271535 364849 335478 -663723 -885273 -337287 -477277 -1535377 -2101094 -1516986
33449 -1516986 -889836 -1157604 -1654346 -1453481 -989026 -1276266 -2194664 -2624252 -2121598
33440 -2121598 -1607068 -2136805 -3399244 -3872863 -2625010 -639577 224997 -410698 -986088
33431 -986088 -266716 925350 1128028 517472 452631 1245662 1892749 1899057 1835827 1897592
33421 1897592 1419445 345784 -179654 525695 1506372 1524393 762960 292552 471493
33412 471493 777644 851862 913743 1273314 1910555 2398949 2060036 612195 -1124565 -1758014
33402 -1758014 -910273 297782 718334 479677 337826 441631 480967 523345 826021 1074480
33392 1074480 628311 -498423 -1512142 -1735316 -1226365 -538691 -181885 -258431 -406299
33383d06299J89674L97072M4661m86780n38149j81495J0492L170K39132O22126
33373a06396N16625j47074o59098n75394j68599K63244O88384Q53724M33177j93777
33363I04816k67187J04652P7208l71282k66924N79489R86645L18365l29058J12705
33353A849429Q75885N98046m89560j048563p53556m52489m92081l68520m8620
33344c30029j85017p12759n86088M78118J168970L99299r15657j026326J67609
33335a541880J011165M49685o38665q47624q3617O57681P59820M35414J5620l80499
33325a62900n23319j88542L15070M25101K36465L78913Q18236O87350k79426j068873
33315F38075q00730L488L56933K57580K60316K73887j02908n42529m51238r5274
$$ plain form
33383 -406299 -216625 180447 225108 -261672 -799821 -981316 -970824 -967654 -728522 -106396
33373 -106396 410229 263155 -395943 -971337 -1139936 -876692 -188308 665416 1098593 904816
33363 904816 637629 742281 819489 448207 181283 760772 1747417 2065782 1736724 1849429
33353 1849429 2725314 3323360 2833800 1785237 1031681 579192 87111 -281409 -330029
33344 -330029 -515046 -1227805 -1813893 -1335775 -166805 232494 -683163 -1709489 -1541880
33335 -1541880 -530715 -81030 -719695 -1567319 -1650936 -993255 -233435 201979 217599 -162900
33325 -162900 -686219 -874761 -559691 -134590 101875 480788 1299024 1986374 1706948 638075
33315 638075 -162655 -159167 197766 455346 715662 989549 886641 344112 -107126 -202400
33305b02400r9945j93472K64222Q19458M65886n00161p60467j65368L9000n41350
33295h74597p21076J39429R48914P07333L7605j31352r3288m27566o92085l04940
33285a411623K22322J89413K2563M22811R25144O22423k37157o68098n15586l49927
33275g77715j72812M70827J280765J337444M57424n72966j087965j029179n14589
33266f08766J99015N01007O0500m94750l81918J01669P7455m26558n31889N9128
33256a445107P04911Q67718O00792Q0732m37927l70416M84655J156496N67470
33247B209324p29162j140242l54447L11106O4005l30506j31845J57256j19246
33238f3757o27110p89284o99366n26657M0220R34408J223585M42420m00782k15144
$$ plain form
33305 -202400 -302345 -495817 -231595 587863 1053749 553588 -206879 -372247 -333247 -874597
33295 -874597 -1595673 -1456244 -507330 200003 237608 106256 12968 -414598 -1106683 -1411623
33285 -1411623 -1189301 -999888 -977325 -554514 370630 993053 755896 87798 -427788 -777715
33275 -777715 -950527 -479700 801065 2138509 2595933 2022967 935002 -94177 -608766
33266 -608766 -409751 91256 151756 -342994 -724912 -623243 -545788 -972346 -1504235 -1445107
33256 -1445107 -740196 127522 728314 809046 371119 703 485358 1641854 2209324
33247 2209324 1480162 339920 -14527 296579 360584 30078 -101767 55489 -63757
33238 -63757 -690867 -1480151 -2179517 -2706174 -2665954 -1731546 -507961 -65541 -466323 -681467
33228f81467M71439M06720l07515m13224L78221Q58933K24449o66587n78676L17901
33218A0194P41064O4475r22055j088869l29894M35572M35625j39999n80310n83945
33208a958142m28686l62111k43499J35114O77361J055777R93228M78453j15244
33199B32251k41698J92525N55332K41972m47212p09151l98038r8724n8383J15221
33189f15905M95914M88108j11172n42116k37321J83378q9284o55302n26083K21229
33179a388554N50885J52938j44158J37029L41405p6249m96276j57429M47088K30887
33169d02434p35630j203031n21080N12997Q77099N85748K71359J79406J77812
33160b57754K62910M11399L14558j02198k79978J47617N52183K25987l02029l7503
$$ plain form
33228 -681467 -210028 196692 -110823 -524047 -145826 713107 937556 270969 -307707 10194
33218 10194 751258 815733 -106322 -1195191 -1525085 -1089513 -653888 -793887 -1374197 -1958142
33208 -1958142 -2386828 -2748939 -2992438 -2857324 -2179963 -1124186 -130958 347495 232251
33199 232251 -9447 183078 738410 980382 533170 -175981 -574019 -672743 -731126 -615905
33189 -615905 -119991 368117 256945 -285171 -522492 -339114 -428398 -1083700 -1609783 -1388554
33179 -1388554 -837669 -684731 -828889 -691860 -350455 -426704 -922980 -1080409 -633321 -402434
33169 -402434 -1138064 -2341095 -2862175 -2349178 -1472079 -886331 -614972 -435566 -257754
33160 -257754 5156 416555 731113 628915 348937 496554 1048737 1274724 972695 935192
33150I35192O27125K85905j134943j969834j257585q2328L09717K72087N70502
33141a444162P99268L50426j70188k283K64904j54614n08056K57518J307827J047466
33131A748106j10668l66880L55623L81357n70762q25457J24769N39692m93285
33122G82495j321123m90743Q65554J080150N41684L92811K54638o83673j586315
33113a64522j164738l2720K67385j22296R6422P64713N05092n59341o65477O46341
33103d29141J566747P60499o65269r48161j31781L66296j57124j031097j275305
33094a944336o54477K13925N53542L27440K92112Q48795J255908O77296l65391
33085A204814n84642J79964P58721M18914k44296m48298k67081j34080j32409
$$ plain form
33150 935192 1562317 1848222 713279 -1256555 -2514140 -2596468 -2286751 -2014664 -1444162
33141 -1444162 -644894 -294468 -464656 -466939 -202035 -356649 -864705 -607187 700640 1748106
33131 1748106 1637438 1270558 1626181 2007538 1436776 611319 736088 1275780 782495
33122 782495 -538628 -1029371 -163817 916333 1458017 1850828 2105466 1421793 -164522
33113 -164522 -1329260 -1361980 -1094595 -1216891 -1120469 -355756 149336 -410005 -1075482 -429141
33103 -429141 1137606 1898105 1232836 284675 152894 519190 362066 -669031 -1944336
33094 -1944336 -2598813 -2384888 -1831346 -1503906 -1211794 -362999 892909 1570205 1204814
33085 1204814 620172 800136 1558857 1977771 1733475 1285177 1018096 884016 751607
33076G51607k19598m72247p10690n01958J04267M39006J57903k59749l04355j43338
33066a159152j26245j31937Q0729K83800R7808l18438l97047N0449N37181M97399
33056e85453l254l43888j63124J41347K0389l28277k64480J42655J37941l13064
33046a559208k05245P89141J382561N12300q09826q74799J53178O31109M5382
33037F4593m68443j88057K74077L57457L41844L72973J00831k99857j20980M40282
33027H74720K89048n81574o90560N20633J445847O58926q53777j224595m07638
33018C1030J97522P8834l0320K58653N22430N39831N15077K99829m73952j387891
33008E51043j394625k57385R43467J065810J63340p35308p54797N1869Q36941
$$ plain form
33076 751607 532009 59762 -650928 -1152886 -1048619 -609613 -451710 -711459 -1015814 -1159152
33066 -1159152 -1285397 -1417334 -1336605 -1052805 -954997 -1273435 -1670482 -1620033 -1082852 -585453
33056 -585453 -588707 -932595 -1095719 -954372 -933983 -1262260 -1526740 -1384085 -1246144 -1559208
33046 -1559208 -1764453 -975312 407249 919549 109723 -765076 -611898 19211 64593
33037 64593 -403850 -591907 -317830 39627 381471 754444 855275 555418 434438 874720
33027 874720 1163768 582194 -108366 412267 1858114 2517040 1663263 438668 31030
33018 31030 228552 307386 277066 535719 1058149 1597980 2113057 2412886 1938934 551043
33008 551043 -843582 -1100967 -157500 908310 1071650 336342 -418455 -366586 470355
32999D70355Q36958J98596k40109l8406L52455L22315j35578o19388p98554m88831
32989a40187J94107N61695m3668j100220j255894k62456M81293L1889n65733L3656
32979b065518J197401J213829m4084r41718n14424L58081M81590r8824n19979
32970i33646k81468L93437Q66160N68245l82564j052993o74928L30224Q72013
32961b95520O09520J75963N6985J3449k52276n23837m26917M9189N42651N93477
32951E42684M222q05019j035700m56249K31798M16103M78678R86812J456327R34304
32941B753960l65491j099268o13969K01722K21312m82929r34736n43342K84568
32932e78173O66326K22733m64100n33134R448L03915l4561l23677j2868L32126
$$ plain form
32999 470355 1307313 1505909 1265800 1227394 1579849 1902164 1766586 1147198 348644 -140187
32989 -140187 53920 615615 571947 -528273 -1784167 -2046623 -1565330 -1533441 -2099174 -2065518
32979 -2065518 -868117 345712 301628 -640090 -1154514 -796433 -314843 -413667 -933646
32970 -933646 -1215114 -821677 44483 612728 230164 -822829 -1497757 -1167533 -295520
32961 -295520 314000 489963 546948 560397 308121 -215716 -642633 -593444 -50793 542684
32951 542684 546906 -258113 -1293813 -1750062 -1518264 -1102161 -623483 363329 1819656 2753960
32941 2753960 2388469 1289201 675232 876954 1098266 615337 -319399 -862741 -578173
32932 -578173 88153 310886 -153214 -686348 -676900 -372985 -407546 -731223 -744091 -411965
32922d11965K4966m78021l09027L66048P04596N53175L73994K17172j06122k41433
32912F93383J05711K29999n35243j278356o36446Q25193J204873J99082n28070
32903B80126j53454J85939l06222o66113m5928P13002N66844p6719l56854l78921
32893b38300n04068l62142K76985O59110J74801n75808q06129o62344m43321J40909
32883b340307R44022R04435k07641q69554m0526R82465O08969l73731j70301R55655
32873C93486J226871L68674k35510j62437m18436j190302j327689m85543J89727
32864a641159P2076m6187L05609L76017j84885m32106J89076P30979L92415m3328
32854b81493L51255Q97057L92582q54420j492183j117537m71513M0016O86252
$$ plain form
32922 -411965 -386999 -865020 -1174047 -807999 -103403 449772 823766 1040938 934816 693383
32912 693383 799094 1029093 493850 -784506 -1420952 -595759 609114 808196 280126
32903 280126 126672 312611 6389 -659724 -705652 7350 574194 497475 140621 -238300
32893 -238300 -742368 -1104510 -827525 -168415 6386 -569422 -1375551 -2037895 -2481216 -2340307
32883 -2340307 -1396285 -491850 -699491 -1569045 -1609571 -627106 -18137 -391868 -562169 393486
32873 393486 1620357 1989031 1753521 1591084 1172648 -17654 -1345343 -1830886 -1641159
32864 -1641159 -1569083 -1615270 -1309661 -933644 -1118529 -1550635 -1361559 -630580 -238165 -281493
32854 -281493 69762 966819 1359401 504981 -987202 -2104739 -2576252 -2536236 -1849984
32845a849984J311173J173956K18966n03418k35374L66902J78724p23012j106637
32836a168704l15494P55320Q33156k9182o13259k86836K23850Q1888m22542m95138
32826a436941j24542N7314j02297j16133K57479O68450P39682M57014L9041j62075
32816B76992J61117P37393P28072j34309q85621o00805J79656L31578j6241J20214
32806H98046O13929K92675q83169j386872m39294P32602P63709J720m52714m46531
32796c05899m32944l15934J98659O91331N51541K6261j64747O3977K24680R8556
32786F35481j85659n60757q49419n95515K36165Q08589M11935m50751p37648k94706
32776a582285J76433K88869K76427K89051J71948q1502k78811l80038m09946j98054
$$ plain form
32845 -1849984 -538811 635145 854111 350693 115319 482221 660945 -62067 -1168704
32836 -1168704 -1484198 -728878 104278 75096 -538163 -824999 -601149 -519261 -941803 -1436941
32826 -1436941 -1561483 -1504169 -1606466 -1722599 -1465120 -796670 -56988 400026 439067 276992
32816 276992 438109 1175502 1903574 1769265 883644 282839 462495 794073 777832 898046
32806 898046 1511975 1804650 921481 -465391 -904685 -172083 591626 593346 140632 -305899
32796 -305899 -738843 -1054777 -856118 -164787 386754 413015 248268 312245 536925 635481
32786 635481 449822 -110935 -960354 -1555869 -1319704 -511115 -99180 -549931 -1287579 -1582285
32776 -1582285 -1405852 -1116983 -840556 -551505 -379557 -461059 -739870 -1119908 -1529854 -1727908
32766a727908K90746O14490L95035n4296k00932r6492j02307j37781R1244L77236
32756e50965K73356j06064k60123j20385r057N1805K82469N40024M66069J21228
32746F88357j55878l30227m89317l94166O4051L29233m6919m91337k59380K14288
32736h71295J7296n37492l60754M18524N52218j00240j85798Q21279J600922J070411
32726B425071m1412o47388r03267j243783j157597k65231N18522L63356P9712
32717h72017P10014J437386P50890q62335j408772m41697L66983m5472p06522
32708a071542n05507J32611L34763K11251K36545K49500K1871n1696K51889L05129
32698A14814l04878p86992k87684O12676P29237J30240j24232J60713J17616m72296
$$ plain form
32766 -1727908 -1437162 -822672 -427637 -481933 -682865 -779357 -881664 -1019445 -928201 -550965
32756 -550965 -277609 -383673 -643796 -764181 -773238 -721433 -438964 101060 567129 688357
32746 688357 532479 202252 -287065 -681231 -617180 -287947 -334866 -826203 -1085583 -871295
32736 -871295 -853999 -1391491 -1752245 -1333721 -781503 -881743 -1067541 -246262 1354660 2425071
32726 2425071 2383659 1736271 833004 -410779 -1568376 -1833607 -1315085 -951729 -872017
32717 -872017 -162003 1275383 2026273 1163938 -244834 -686531 -319548 -365020 -1071542
32708 -1071542 -1577049 -1444438 -1109675 -898424 -661879 -412379 -390508 -442204 -190315 114814
32698 114814 -190064 -977056 -1264740 -652064 77173 207413 83181 243894 361510 -110786
32688a10786o78887n4253M83695J08686n75559n54193j9473P0179l69412m30531
32678b130534L20872J198267J390516Q87218J69533m21897p04221n36135p0029
32669A03590K04018M162l89030n72508n27424m02726j20293L76353P14633M70863
32659a38362r6257k26280L01629P63178M00983n51587j100380o53629L21307Q48195
32649a31203M94054k29577m93334p8918M37345M35372k130k66653m1751L09828
32639D33033K26784l53569q85807p75389l4175O44640N96070R96k59045K52503
32629a53959Q37298N34139n22386j211056r12956k49560p7435l31993l52952M6747
32619b394113M39325N32137M77966M41636L57040K08462J38675J41819J0829k45739
$$ plain form
32688 -110786 -789673 -843926 -360231 -251545 -827104 -1381297 -1400770 -1330591 -1700003 -2130534
32678 -2130534 -1809662 -611395 779121 1666339 1835872 1413975 709754 173619 103590
32669 103590 307608 311770 -77260 -649768 -1177192 -1579918 -1700211 -1323858 -609225 -138362
32659 -138362 -234619 -460899 -159270 603908 1004891 453304 -647076 -1300705 -979398 -131203
32649 -131203 362851 133274 -360060 -438978 -1633 433739 431609 164956 123205 433033
32639 433033 659817 306248 -579559 -1354948 -1389123 -744483 -148413 -147417 -406462 -153959
32629 -153959 683339 1217478 695092 -515964 -1428920 -1678480 -1755915 -2087908 -2440860 -2394113
32619 -2394113 -1954788 -1422651 -944685 -503049 -146009 62453 201128 342947 353776 108037
32609A08037k79592P3562M44976M07804P9244r6333j7264K0992j01357j43520
32599D96549j1913l5826m31673p74779m32250N39089J311550J180346K66023p44693
32589A362423j270022j119878m32487L87525Q43698P54430M12671J48029r0657
32580I95732m22063n24020K1813Q79109J077127K72807o28694o08959O8115K49598
32570A380565m40774j074156p56331J61385O86648N46565K94167K64147J75548
32561A237764j23167k30474J04012M05937J51327l71975n13339l03547k95719
32552F0819m72550k01805N64370R69521N65057P3507J51074J81841o55074j644864
32542d08104j211086O69545K043250J445190k45880j125341o54371J43690L82737
$$ plain form
32609 108037 -171555 -97993 346983 754787 834031 737698 720434 741426 640069 496549
32599 496549 484636 448810 17137 -757642 -1189892 -650803 660747 1841093 2107116 1362423
32589 1362423 92401 -1027477 -1459964 -1072439 -228741 525689 938360 1086389 995732
32580 995732 573669 49649 71462 950571 2027698 2300505 1671811 1062852 1130967 1380565
32570 1380565 939791 -134365 -890696 -729311 -42663 503902 798069 1062216 1237764
32561 1237764 1114597 884123 988135 1394072 1545399 1173424 660085 356538 60819
32552 60819 -411731 -613536 -49166 920355 1485412 1558919 1709993 1891834 1236760 -408104
32542 -408104 -1619190 -949645 1093605 2538795 2292915 1167574 513203 656893 1039630
32533A039630K00771K8810j17158l36192m37075k33054O2371Q4016j67624l19589
32523a95094r7706L84557P93719Q50136M15488m40486j267262j345905l89892
32514a292445Q59772J203564L56231o63792q21655k95533O4395N9796J54692L97937
32504B2962K94224j48523j81569M93666J084173P92303o8838o32022o43120m40928
32494E72328j84968J84645M56120L14189o9982j96686K1803J50284j37369o91141
32484D19223j112725j046761l88964M57427P40514J93770m90720m82104J20160
32475a590180N73518O05477N45976M99408K19332j44763m8405M41036M59474l77965
32465A182908j214445j073465k24545K74470Q5759j12753K07418O62617O09159
$$ plain form
32533 1039630 1240401 1269211 1152053 815861 378786 145732 208103 292119 124495 -195094
32523 -195094 -292800 91757 885476 1735612 2151100 1710614 443352 -902553 -1292445
32514 -1292445 -432673 770891 1127122 463330 -358325 -653858 -589463 -529667 -374975 22962
32504 22962 317186 168663 -12906 480760 1564933 2357236 2288398 1656376 1013256 572328
32494 572328 387360 572005 1028125 1342314 1272332 1075646 1097449 1247733 1110364 419223
32484 419223 -693502 -1740263 -2129227 -1671800 -931286 -737516 -1228236 -1710340 -1590180
32475 -1590180 -1016662 -411185 134791 634199 853531 708768 660363 1101399 1560873 1182908
32465 1182908 -31537 -1105002 -1329547 -1055077 -969318 -1082071 -874653 -212036 397123
32456C97123J14900j22263K64704P63057N85166k77795r25379o47865J22859L67190
32446F41697j48454o08691l67777J48691J42561l75914o56853l00869K69519M88551
32436g67539L35685J21310p8019l91209o78864n33494Q3906N57858L41493k10764
32426a219637k26047M57818J004419P49655J10899j21979N5976N6968k30603l17513
32416C19956j8010K36587J26595j09656j63457r8766r4847j56376k52674l69170
32406e79818l19180O8523N04207M99083J73394J81748O31158P72678J56465n69158
32396A519100n63897K3301L88376J94221k42155n75920o69258m43706k8279J66178
32386b32039j1605j21451J82820N16786M14256J99154M11819O90365K20364p95138
$$ plain form
32456 397123 512023 389760 654464 1417521 2002687 1724892 799513 151648 274507 641697
32446 641697 493243 -115448 -483225 -334534 -191973 -567887 -1224740 -1525609 -1256090 -767539
32436 -767539 -431854 -310544 -388563 -779772 -1458636 -1992130 -1908224 -1350366 -1008873 -1219637
32426 -1219637 -1445684 -987866 16553 766208 877107 755128 811104 868072 637469 319956
32416 319956 301946 538533 665128 555472 392015 293249 198402 42026 -210648 -579818
32406 -579818 -898998 -830475 -326268 172815 346209 527957 1159115 1931793 2088258 1519100
32396 1519100 955203 978504 1366880 1561101 1318946 743026 73768 -369938 -398217 -232039
32386 -232039 -243644 -365095 -182275 334511 748767 947921 1359740 2050105 2270469 1475331
32376A475331j191847n49993J75340J27746k63075j60418L68386O64290N59795
32367A205555L43820J138o42726j153601p78322L24832R50466L81807n38500n05544
32357d11075M33311R48544L07945o27915o86931k3168K44978k72302p62585m97638
32347a346836J99480O08453N89107M20082J61207k30381m71879k48990K35416
32338h4341N23428N39054M61705J97769l81183q34475n57541J85332M20928j42043
32328C28633o31962k88360M50506O65115K58165j01992o6775L1815r9944j93747
32318C51454J52104P94831J076594N46654m69872j152041j045288m81509m4251
32309b71324J36587K77217L55638J19392l52300n97511m04865p0059J33706L13281
$$ plain form
32376 1475331 283484 -266509 -91169 36577 -226498 -386916 -18530 645760 1205555
32367 1205555 1549375 1550513 907787 -245814 -1024136 -699304 251162 632969 94469 -411075
32357 -411075 22236 970780 1278725 650810 -36121 -59289 185689 -86613 -849198 -1346836
32347 -1346836 -1147356 -538903 50204 470286 631493 401112 -70767 -319757 -84341
32338 -84341 439087 978141 1439846 1637615 1256432 421957 -135584 49748 470676 328633
32328 328633 -303329 -591689 -141183 523932 782097 680105 613330 645145 545201 351454
32318 351454 503558 1298389 2374983 2921637 2451765 1299724 254436 -227073 -271324
32309 -271324 -134737 142480 498118 617510 265210 -332301 -737166 -807225 -673519 -360238
32299c60238N58496O04404K36817k59380m34826k86701j88036k89742l11323K5424
32289g05105N45633P29399K92700l91434o27828k43265J62380N3518k61999j52341
32279e98342K96565M33452J49727L7461L12383M08999m155l82813k02467J76323
32269F27133J84087K7913K45493O67903O40851Q9272l97438m81918m03311l77928
32259H22057l03039j58035j60786l49468m15770j47217K24359K64214j83816p61244
32249a168745q17010q2347P92849P80200j97996r60885n27992O03035J248353
32240c30538J130193Q35270N41755j13658r26683j037058k86581L09707j5906
32231A06501o64249o02465J62877P27928N41686j11407o54495p01538j50570P04623
$$ plain form
32299 -360238 198258 802662 1039479 780099 345273 58572 -129464 -419206 -730529 -705105
32289 -705105 -159472 569927 862627 471193 -156635 -399900 -237520 -184002 -446001 -598342
32279 -598342 -301777 131675 281402 318863 631246 1040245 1036090 653277 450810 627133
32269 627133 811220 839133 1084626 1752529 2393380 2482652 2085214 1603296 1199985 822057
32259 822057 519018 360983 200197 -149271 -565041 -712258 -487899 -223685 -407501 -1168745
32249 -1168745 -1985755 -2068102 -1275253 -495053 -693049 -1653934 -2181926 -1578891 -330538
32240 -330538 799655 1634925 2176680 2063022 1136339 99281 -187300 122407 106501
32231 106501 -557748 -1160213 -997336 -269408 272278 160871 -493624 -1195162 -1345732 -641109
32221f41109J209518R10494R8934m87316m80809j56375N7750M6343n6127j42695
32211C58608j98087j99277j21268n3671j53823l61340l14553J66575O10208L69962
32201A03334l69690o69750j86303K60402J6630k40882L89501J315217J108557
32192A727016k63901j215596p63802K61410O73123M49824J68025p8735l91159
32183E66205m72387j34645K01456J95970J52238K51359r959q06988j198513m01907
32173a657171P71175R43548K03316j53878L13259O79328K52116m76962p43954
32164A30777m86023j35581q0431m33806q22414n53964M12277J034364N48712k07211
32154e93300L7349R12985R48953j8086o37189l31960k9319k29935j71716M10286
$$ plain form
32221 -641109 568409 1478903 1577837 1090521 609712 453337 511087 557430 501303 358608
32211 358608 160521 -38756 -160024 -213695 -367518 -728858 -1043411 -876836 -266628 103334
32201 103334 -266356 -936106 -1122409 -862007 -845377 -1086259 -696758 618459 1727016
32192 1727016 1463115 247519 -516283 -254873 418250 868074 1036099 957364 566205
32183 566205 93818 -40827 160629 356599 508837 760196 750237 -56751 -1255264 -1657171
32173 -1657171 -885996 57552 260868 106990 420249 1099577 1351693 874731 130777
32164 130777 -355246 -490827 -571258 -1005064 -1827478 -2381442 -1969165 -934801 -386089 -593300
32154 -593300 -555951 357034 1305987 1287901 650712 318752 289433 59498 -112218 298068
32144B98068N04392k40974n71589J58453N76464l32533j111641j29874J396329
32135E47095J141311m85932r76763J43789O94634l35560j138469k60266J003026
32126C32865Q82471r3310l51811Q7424P0898m94351o89838l48690j67836k66903
32116a039081m7898N21296P08760K38314k81092l07085N0591M86536Q10985P50014
32106A891340J46521n67480p53726m61038k97088m28609m35419j79092j4379j8575
32096a117545J61172M82538L86612j62908l73972J52162O91796N11310j8428j71026
32086E41711q3142l05614o17372l49481L36005N87374K86002K41656P33555R07240
32076B277934J47893q18556r30698k95055J14955j03614m45297m34550j59672
$$ plain form
32144 298068 802460 561486 -10103 148350 724814 392281 -719360 -849234 547095
32135 547095 1688406 1202474 225711 369500 1064134 728574 -409895 -670161 332865
32126 332865 1215336 1122026 770215 857639 928537 434186 -255652 -604342 -772178 -1039081
32116 -1039081 -1086979 -565683 143077 381391 100299 -206786 -156195 330341 1141326 1891340
32106 1891340 2037861 1470381 716655 255617 -41471 -470080 -905499 -1084591 -1098970 -1117545
32096 -1117545 -956373 -473835 -87223 -250131 -624103 -471941 219855 731165 712737 541711
32086 541711 458569 152955 -464417 -813898 -477893 109481 395483 637139 1370694 2277934
32076 2277934 2425827 1607271 676573 381518 496473 392859 -52438 -486988 -646660
32067f46660J37012L70515M28916K18254R03J84165O34427P13024K05103k91826
32057A953833k21565J37799J45737k83012o92139p73244n77786k12914J91496
32048c31795L02556j30506p77449r43729l94813L58573O90760N06617J90959J51959
32038c76868M51172O89908L31018o03958j298217j006980o3632M88969K39140
32029a149448k18330k92830p7558J86421N61138R08506O62732k71698r92179p17638
32019a400884K0665J36548l99088o34964j82078L00698K67288L9481J12635M25840
32009a313859O74532P76631O93153K91194k79031n21399k45419J01412M7319l15413
31999i0880n95723n64489j36465O25253J211965R30863j24954r02953p05538j66005
$$ plain form
32067 -646660 -509648 -139133 289783 508037 508940 693105 1327532 2040556 2245659 1953833
32057 1953833 1732268 1870067 2015804 1732792 1040653 267409 -310377 -523291 -331795
32048 -331795 -29239 -159745 -937194 -1880923 -2275736 -1917163 -1226403 -719786 -528827 -376868
32038 -376868 74304 764212 1095230 491272 -806945 -1813925 -1877557 -1388588 -1149448
32029 -1149448 -1367778 -1660608 -1738166 -1551745 -990607 -82101 580631 308933 -683246 -1400884
32019 -1400884 -1380219 -1243671 -1642759 -2277723 -2459801 -2159103 -1891815 -1852334 -1739699 -1313859
32009 -1313859 -639327 137304 830457 1121651 842620 321221 75802 177214 224533 -90880
31999 -90880 -686603 -1251092 -1387557 -762304 449661 1380524 1255570 352617 -352921 -518926
31989e18926k59024p93140p40471J64789J074324J281081R68416N31267l5031
31980A673285o86383r50495n56200j6603j3858m42318n95913j83398L69641O40697
31970g61545P17149P93058O89725J61100n40265q49699o38704l70130l76052l62839
31960a538202P9852P72965J148065R85836N40207M4055m30041o64718m16360O4393
31950E86052J78947j63811l66119o1524L27261K94532p500j63932j48792r4201
31940C80913J15303M42745L60157l71712r69446n35089N12076Q45021P2712p42340
31930A10340o23976P7775L96326R3800k14630J1750N92479Q57734L98032m10187
31920A289443p61906m04298P0068J49825R9828K20243M0836q29784j538636r24030
$$ plain form
31989 -518926 -777950 -1571090 -2311561 -2146772 -1072448 208633 1177049 1708316 1673285
31980 1673285 986902 36407 -519793 -536396 -550254 -992572 -1588485 -1771883 -1402242 -761545
31970 -761545 -44396 748662 1438387 1599487 1059222 209523 -429181 -799311 -1175363 -1538202
31960 -1538202 -1458350 -685385 462680 1448516 1988723 2032778 1602737 938019 521659 586052
31950 586052 764999 601188 235069 173545 500806 795338 787838 623906 475114 380913
31940 380913 496216 938961 1299118 927406 -42040 -577129 -65053 779968 852680 110340
31930 110340 -513636 -435861 -39535 54265 -160365 -148615 443864 1301598 1699630 1289443
31920 1289443 527537 123239 193307 343132 442960 663203 704039 -125745 -1664381 -2588411
31910b588411N40091J109140K30193p44595o98564j91473o4644K6022O14905J087522
31900f79814O65346l6311J44828R36567R14559l03971j426863j281281k45994
31891a312934M90128M07851k0214j11189K47277N31328K66497k80730m22995r3866
31881b98847K3566l54303n73381j40955L92438L50847L0125K4377J08919j88405
31871f25619m63389n8385N90705M93163k26001m63444J19527P16107P54962M75344
31861A312970O9966n42023r71584o02023K53359O24811M44978N25466Q37866L87816
31851B341602p90176j200969k16333P65548N03649k36467k58075L1275l01533
31842F38521p39842k06273Q12952Q74756m4106n37027q6315K40342l40036j147181
$$ plain form
31910 -2588411 -2048320 -939180 -708987 -1453582 -2152146 -2343619 -2408263 -2382241 -1767336 -679814
31900 -679814 -14468 -50779 94049 1030616 1945175 1641204 214341 -1066940 -1312934
31891 -1312934 -822806 -414955 -435169 -546358 -299081 232247 498744 218014 -204981 -298847
31881 -298847 -275281 -629584 -1202965 -1343920 -951482 -600635 -570510 -546133 -437214 -625619
31871 -625619 -1089008 -1147393 -556688 -63525 -289526 -752970 -633443 82664 837626 1312970
31861 1312970 1382936 840913 -130671 -732694 -479335 145476 590454 1115920 1953786 2341602
31851 2341602 1551426 350457 134124 899672 1403321 1166854 908779 940054 638521
31842 638521 -101321 -307594 505358 1380114 1336008 798981 712666 953008 612972 -534209
31832e34209j182938m22656M71199R46641P55957J6759o66654o74216q9561M90755
31822h88923P67001Q02959M98655k34627q77517p21344Q1528O58762O47494M94172
31812A228160M61591K05397m03621q03248m87319K70124P43087M85462l37915
31803A361718j018071q16276J39074P06405R9809q89887q88293Q5419P10644L89898
31793a19560m5791R3032L03521j7937m48485k55355M53182R75388R28204M16846
31783B283045k44199o14455m28140p0423j72835n77987n04571N3954J27254o05559
31773g53916j104666n75826K90984N82842O28454J065954J361075O65130m59708
31764A700323o87365M513M00474Q1586j08652K11649K57454m10772r63306o41049
$$ plain form
31832 -534209 -1717147 -2139803 -1668604 -721963 33994 50753 -615901 -1290117 -1379678 -888923
31822 -888923 -121922 681037 1179692 945065 67548 -653796 -572268 86494 733988 1228160
31812 1228160 1689751 1895148 1491527 688279 200960 471084 1214171 1699633 1361718
31803 1361718 343647 -472629 -333555 372850 472659 -417228 -1305521 -1220102 -509458 -119560
31793 -119560 -165351 -72319 231202 213265 -235220 -490575 -37393 937995 1866199 2283045
31783 2283045 2038846 1424391 996251 925828 752993 175006 -329565 -275611 -148357 -753916
31773 -753916 -1858582 -2434408 -2143424 -1560582 -932128 133826 1494901 2160031 1700323
31764 1700323 1012958 1017471 1417945 1499531 1390879 1602528 1859982 1449210 485904 -155145
31754a55145j2461j4059m65128m89880J2765K82698j7326k74045J05226P68911
31744b58444Q68660K00761n03369m95786O3319L68441M0366m50929n13412j69358
31734h49751J98596M70690P30747Q12130M27455k47676n64389j50406N48979O67805
31724B044180j25847j125445j223449k31926O96950M46144m87692o03189M04612
31715b05662J132995N86136l38983l48514K53176K86902k71704m09155J15627
31706H00818N18135M72716M57389N18654P8444p44774r89891n00352l85110j141191
31696i15162j579828o08509R45066J465536P98522J55512K02444M50073M19855
31687A333509L10872L37988K50687j69331o59183q09421n48303j22252K05224
$$ plain form
31754 -155145 -167606 -181665 -646793 -1136673 -1123908 -841210 -858536 -1132581 -1027355 -258444
31744 -258444 610216 810977 307608 -188178 -124859 243582 283948 -166981 -680393 -849751
31734 -849751 -651155 -180465 550282 1362412 1789867 1542191 977802 827396 1376375 2044180
31724 2044180 1918333 792888 -430561 -662487 34463 480607 -7085 -610274 -205662
31715 -205662 927333 1513469 1174486 825972 1079148 1366050 1094346 685191 800818
31706 800818 1318953 1791669 2249058 2767712 2846156 2101382 1111491 611139 226029 -915162
31696 -915162 -2494990 -3103499 -2158433 -692897 105625 261137 463581 913654 1333509
31687 1333509 1644381 1982369 2233056 2063725 1404542 595121 46818 -75434 129790
31678A29790L15955K00465j31099n88090q07072l34062O31568J006251N7798j290931
31668h09427j377628j12578P89486L02271m66226j64738O79013P22461O8136j41175
31658e10405J65212M4615m61501k55776O40091P21779m58331j151942m3439J447748
31648A38051J171515m32929j017732L6333P84701j20034j392794j272073j79134
31639b284096K76718l7308J10262R17264J128723K60278m65684j10941N25279
31630C20495M56331J92062N00861O13711n06104j802018j221571R03149J850496
31621A307412M28025j264626j063648K13086N18666j98379m95855j28811r2618
31612g76748m51912k24975N80987P46795l7461n52552j01646L45398j60773r76529
$$ plain form
31678 129790 445745 646210 515111 -72979 -880051 -1214113 -582545 423706 481504 -809427
31668 -809427 -2187055 -2299633 -1510147 -1207876 -1674102 -1838840 -1159827 -437366 -369230 -510405
31658 -510405 -345193 -300578 -762079 -1017855 -377764 344015 -114316 -1266258 -1309697 138051
31648 138051 1309566 876637 -141095 -104762 679939 559905 -832889 -2104962 -2284096
31639 -2284096 -2007378 -2044686 -1934424 -1017160 111563 371841 -93843 -204784 320495
31630 320495 776826 968888 1469749 2083460 1577356 -224662 -1446233 -543084 1307412
31621 1307412 1735437 470811 -592837 -379751 138915 -59464 -555319 -684130 -776748
31612 -776748 -1228660 -1453635 -872648 -125853 -163314 -715866 -817512 -472114 -632887 -1609416
31602a609416r26801m2592O91320P35783L62074K6605p293K67603M97612K46088
31592B40983l51019o11029k06993M16443P15131O16956K69190j83266m01008r8898
31582D06490L21704J14424o45201j049255p29791k94005j02069K56633P73615
31573i47455N74158n11645j146867l86269O78271N25977l95656m40225O27038
31564a422673J425741J136774L28950l52332q46634r28828k32213P08757P57951
31555E75493j25081p15738m20818p0302l04265m63502J35123R33210J058440O25476
31545A228036K00566k30780p88862q94159l1168J127768J398204O22260l34890
31536B296975q40372q92135n62015J5693K81492j73163p54090n26236L13244O28501
$$ plain form
31602 -1609416 -2536217 -2578809 -1887489 -1151706 -789632 -763027 -770320 -502717 -5105 240983
31592 240983 -110036 -721065 -928058 -511615 203516 820472 1089662 906396 505388 406490
31582 406490 728194 842618 197417 -851838 -1581629 -1875634 -1977703 -1721070 -947455
31573 -947455 -373297 -884942 -2031809 -2418078 -1739807 -1213830 -1609486 -2049711 -1422673
31564 -1422673 3068 1139842 1468792 1116460 269826 -659002 -891215 -182458 575493
31555 575493 450412 -265326 -686144 -756446 -1060711 -1524213 -1389090 -455880 602560 1228036
31545 1228036 1428602 1197822 408960 -485199 -516367 611401 2009605 2631865 2296975
31536 2296975 1456603 564468 2453 18146 299638 126475 -627615 -1153851 -840607 -212106
31526b12106R5031l18675O7247O19849N16138J3868j42292O9087J56950J03249
31516I68346K75577N53712L58330m21768j170603j302712p85793J08485J018894
31507c97532J388089P92433l18882p73132l4989R75849R80364n351p66243n80904
31497A259702q1421j45215n57320l94874N12525J204121Q16281l05627j063522
31488A244650r08524k81996J68381L54754N26285O25791L29201k96152o38585
31479A123805l05197K61508L04956k55288p80400q32880o57229n95049n01120
31470b236894j01181M04861N64949L53483J86209K89617M41610L63610L7384l94384
31460i0736p15048o01798J00396R60131J205524O04179k16391n54863m29460k89496
$$ plain form
31526 -212106 -117075 -435750 -368503 251346 767484 781352 639060 708147 865097 968346
31516 968346 1243923 1797635 2155965 1734197 563594 -739118 -1524911 -1416426 -397532
31507 -397532 990557 1782990 1464108 690976 655987 1631836 2612200 2606849 1840606 1259702
31497 1259702 1178281 1033066 475746 80872 593397 1797518 2613799 2308172 1244650
31488 1244650 336126 54130 222511 577265 1103550 1729341 2058542 1762390 1123805
31479 1123805 818608 1080116 1385072 1129784 349384 -483496 -1140725 -1735774 -2236894
31470 -2236894 -2338075 -1933214 -1368265 -1014782 -828573 -538956 -97346 266264 303648 -90736
31460 -90736 -805784 -1407582 -1307186 -347055 858469 1462648 1246257 691394 261934 -27562
31450b7562k36739J0455M89680P99066O13710P4135m56085p63065p74929m24914
31440f96248K14844P46321O81696l913o93939p08005p9388M27132K05309m28756
31430c34947o08345j1565P27557Q14304K07960m90747q20854p60386l78984K90145
31420a365862Q97370Q03873r8601q86586n38735O23184J083656N1423j335459
31411g65737j352267Q4406J346476J237072L12902k53528k69709k86965m00978
31402c48328k41115J03590J13062j94841k00105K46904M99446J55349l16730l84382
31392e67150k06201j06958N6804M09775N04632j7276o29709n65833J9640L19023
31382g83253J15031o7478K3585O8608j7847J59229O33675P49080J06477p39176
$$ plain form
31450 -27562 -264301 -253846 235834 1034900 1648610 1722745 1266660 503595 -271334 -696248
31440 -696248 -481404 264917 946613 942700 248761 -459244 -538632 -111500 93809 -334947
31430 -334947 -943292 -954857 -227300 587004 794964 304217 -516637 -1277023 -1656007 -1365862
31420 -1365862 -468492 335381 236780 -649806 -1188541 -565357 518299 569722 -765737
31411 -765737 -2118004 -2033598 -687122 549950 862852 609324 339615 52650 -348328
31402 -348328 -589443 -485853 -372791 -567632 -767737 -520833 -21387 133962 -182768 -567150
31392 -567150 -773351 -880309 -823505 -413730 90902 73626 -556083 -1121916 -1102276 -783253
31382 -783253 -668222 -735700 -712115 -643507 -661354 -502125 131550 880630 987107 247931
31372B47931j002708o56778k52904j09035j11039o1265J53180N19316P39975M22078
31362a11249k65100n09385J08765Q55454P18040j94286q11039n75707k2150K19159
31352e87498K40286L43833L49005l8156n42162n99951j75092K19988K64185J20851
31342d04711l0137k71108n83585o23558j86238L55552M47078Q2451k10972j08804
31332a534032J40995J87718Q7341J02025K25799K50780K09914L71498P31978Q66094
31322A640110M76963j62511n60773n94826m57063k02854K29146O05683N12022
31313A485897J4633k57356K1659L35401P4056m99651n96034p0282L66818J77149
31303A052290l10324m31888o038N78118P63976K25877p37381j172873m33084P04305
$$ plain form
31372 247931 -754777 -1411555 -1664459 -1773494 -1884533 -1945798 -1792618 -1273302 -533327 -111249
31362 -111249 -376349 -885734 -776969 78485 796525 602239 -208800 -784507 -806657 -587498
31352 -587498 -347212 -3379 345626 307470 -234692 -834643 -1009735 -789747 -525562 -404711
31342 -404711 -434848 -705956 -1289541 -1913099 -2099337 -1743785 -1296707 -1214256 -1425228 -1534032
31332 -1534032 -1393037 -1205319 -1117978 -1015953 -790154 -539374 -329460 42038 774016 1640110
31322 1640110 2117073 1954562 1393789 798963 341900 139046 368192 973875 1485897
31313 1485897 1500530 1243174 1264833 1600234 1674290 1174639 578605 508323 875141 1052290
31303 1052290 741966 310078 304040 882158 1646134 1872011 1134630 -38243 -471327 232978
31293B32978O73520p39771j799511j091442M72495J030944M67859K35025P67133
31284B49230Q28158k29552j196989q42657K51656P40072M62025K17555K57010
31275G36508J41408k59734o26405q05709p77232l28036M63666Q37968L19465l55428
31265f53529k57305K27761P2938n64176n70213J99637O96672M81016K62228L54145
31255B49174J23208n00503n09133L77307Q59050R7470p13792j76113J004369J121752
31245A932789J28199n20776k91982j31237n95964r99493p40416k12466N3064J48649
31235a229633K70856K73203J16735O6061J66867J97315K79598P41965J224079
31226B107046Q82948j88198p63242k39965L81237K2518q31025r77347l38852J47318
$$ plain form
31293 232978 906498 166727 -1632784 -2724226 -2251731 -1220787 -752928 -517903 249230
31284 249230 1077388 847836 -349153 -1191810 -940154 -200082 261943 479498 736508
31275 736508 877916 618182 -8223 -813932 -1591164 -1919200 -1455534 -617566 -298101 -653529
31265 -653529 -910834 -683073 -610135 -1174311 -1744524 -1544887 -848215 -367199 -104971 249174
31255 249174 372382 -128121 -637254 -259947 599103 696573 -17219 -193332 811037 1932789
31245 1932789 2060988 1540212 1248230 1116993 521029 -478464 -1218880 -1431346 -1378282 -1229633
31235 -1229633 -958777 -685574 -568839 -502778 -335911 -138596 141002 882967 2107046
31226 2107046 2989994 2801796 2038554 1798589 2179826 2202344 1371319 393972 55120 202438
31216B02438J26026J62765N06086N57448j28708j060688j403043q91862J00370
31207a829168J001077J298146P66489k23626q63433o82008m2263L52429K95743
31198G3386J57712K16073K51501o0726n78555p77960m13288J22504K46532j00765
31188h63586l89888j74624L60096O70476N64947L93115M56326M90826N1848o74716
31178H84820r16339l67520K67408K40489j26165q792M81148M16582l31239p44898
31168b04506l47613m6595m97156p90108O831R91102P32927k34102j62259R36838
31158C85359J209333O8564q22857m02198J08994m25421r66447k31416R22913R98198
31148H45022M33921N37085Q60137P0127j192055r60727O39110J270964Q1717j019768
$$ plain form
31216 202438 328464 491229 997315 1554763 1426055 365367 -1037676 -1929538 -1829168
31207 -1829168 -828091 470055 1236544 1012918 149485 -532523 -574786 -222357 73386
31198 73386 231098 447171 698672 637946 59391 -718569 -1131857 -1009353 -762821 -863586
31188 -863586 -1253474 -1428098 -1068002 -397526 167421 560536 1016862 1507688 1559536 884820
31178 884820 -31519 -399039 -131631 108858 -17307 -26099 455049 871631 540392 -204506
31168 -204506 -552119 -598714 -1095870 -1885978 -1879147 -888045 -155118 -389220 -551479 385359
31158 385359 1594692 1663256 840399 438201 547195 121774 -844673 -1076089 -153176 845022
31148 845022 1278943 1816028 2676165 2746292 1554237 593510 1232620 2503584 2585301 1565533
31138A565533o03811J46393j99477r26441p63572j52672j25278k54203L81626
31129i31902J201909J019834K08963P2010N44792M36385l27378o29967k89769
31120A304877l36308r35197r14680J07938Q62356M61416k38194k45300j4756k92335
31110b40183n78472q5726O49070N34601k40041n19221l2134L76521K68111J18354
31100B50880J98004R3320l39867n15786o4186N25964O80050N19147L80513J37541
31090A865580l97612q26165o16392K667K83080N9707n3466K81269N16516Q7666
31080A202850n89302o44405r1706J28070m03822q51210l49832O20446Q77310K38294
31070A36693l46526l24767j90175l34442k82514K87647O36943K4059q96437q19481
$$ plain form
31138 1565533 961722 1108115 908638 -17803 -781375 -934047 -1059325 -1313528 -931902
31129 -931902 270007 1289841 1498804 1570814 2115606 2551991 2224613 1594646 1304877
31120 1304877 968569 33372 -881308 -773370 88986 550402 312208 66908 52152 -240183
31110 -240183 -818655 -904381 -255311 279290 39249 -479972 -512106 -135585 132526 250880
31100 250880 448884 542204 202337 -313449 -377635 148329 828379 1347526 1728039 1865580
31090 1865580 1467968 641803 25411 28078 311158 370865 317399 598668 1115184 1202850
31080 1202850 613548 -30857 -122563 5507 -398315 -1249525 -1599357 -978911 -101601 136693
31070 136693 -209833 -534600 -724775 -1059217 -1341731 -1054084 -417141 -393082 -1289519 -2109000
$$ [...]
##END NTUPLES=NMR SPECTRUM
##END=
