##TITLE=31Pdec_LY-TMF-9.24.R.t
 D2O, 24 sc
 2.3.2020
##JCAMPDX= 6.0         $$ Bruker NMR JCAMP-DX V2.0
##DATA TYPE= NMR SPECTRUM
##DATA CLASS= NTUPLES
##ORIGIN= UXNMR, Bruker Analytische Messtechnik GmbH
##OWNER= root
$$ XWIN-NMR		Version 3.5
$$ Mon Mar  2 15:31:31 2020 Russian Standard Time (UT+4h)  she@DPX200
##.OBSERVE FREQUENCY= 81.013821
##.OBSERVE NUCLEUS= ^31P
##.ACQUISITION MODE= SIMULTANEOUS
##.ACQUISITION SCHEME= undefined
##.AVERAGES= 24
##.DIGITISER RES= 17
##SPECTROMETER/DATA SYSTEM= spect
##.PULSE SEQUENCE= zgpg30
##.SOLVENT NAME= D2O
##.SHIFT REFERENCE= (INTERNAL, D2O, 0, 182.463)
##AUDIT TRAIL= $$ (NUMBER, WHEN, WHO, WHERE, WHAT)
$$ ##TITLE= Audit trail, XWIN-NMR		Version 3.5
$$ ##JCAMPDX= 5.01
$$ ##ORIGIN= Bruker BioSpin GmbH
$$ ##OWNER= she
$$ F:/spectra/data/she/nmr/P31/1/pdata/1/auditp.txt
$$ ##AUDIT TRAIL=  $$ (NUMBER, WHEN, WHO, WHERE, WHAT)
(   1,<2020-03-02 15:30:02.85 +0400>,<she>,<DPX200>,
      <created by zg, POWCHK disabled, PULCHK disabled
       configuration hash MD5:
       00 E9 B6 7A A2 85 ED C7 34 08 36 98 17 FE 4E 26
       data hash MD5: 32K
       3F 56 1F 31 AD 4C 7D FD 3A 4F BA F5 36 2F 6C D5>)
(   2,<2020-03-02 15:30:06.12 +0400>,<she>,<DPX200>,
      <Start of raw data processing
       efp BC_mod = 2 LB = 1 FT_mod = 6 PKNL = 1 PHC0 = -1290.551 PHC1 = 7.60157 SI = 64K 
       data hash MD5: 64K
       1D EB 79 7F 82 63 CC 53 AE 42 B0 69 88 70 0F C0>)
(   3,<2020-03-02 15:30:37.95 +0400>,<she>,<DPX200>,
      <pk PHC0 = 56.43787 PHC1 = -119.2 
       data hash MD5: 64K
       9B D2 A5 DB 4F C9 8C A7 7A 76 B5 80 C8 5E E4 D1>)
(   4,<2020-03-02 15:30:41.90 +0400>,<she>,<DPX200>,
      <abs ABSG = 5 
       data hash MD5: 64K
       2B B0 66 26 40 6F CD 94 AF A5 09 8B 57 0F 2B 59>)
(   5,<2020-03-02 15:30:56.14 +0400>,<she>,<DPX200>,
      <pk PHC0 = -3.999641 PHC1 = 0 
       data hash MD5: 64K
       B3 0C 71 0E E4 88 7B C4 6D 15 1E 84 C6 56 E5 0A>)
$$ ##END=
$$ 
$$ hash MD5
$$ B4 0D 39 61 07 48 29 3D 5B FC 61 E5 C3 F0 DE 2C
##$RELAX= 
##$RELAX= 
##$RELAX= 
##$RELAX= 
##$RELAX= 
##$RELAX= 
##$RELAX= 
##$RELAX= 
$$ Bruker specific parameters
$$ --------------------------
##$DU= <F:/spectra>
##$EXPNO= 1
##$NAME= <P31>
##$PROCNO= 1
##$TYPE= <nmr>
##$USER= <she>
##$AMP= (0..31)
100 100 100 100 100 100 100 100 100 100 100 100 100 100 100 100 100 100 
100 100 100 100 100 100 100 100 100 100 100 100 100 100 
##$AQSEQ= 0
##$AQ_mod= 1
##$AUNM= <au_zg>
##$AUTOPOS= <>
##$BF1= 81.014009
##$BF2= 200.13
##$BF3= 200.13
##$BF4= 200.13
##$BF5= 200.13
##$BF6= 200.13
##$BF7= 200.13
##$BF8= 200.13
##$BYTORDA= 1
##$CFDGTYP= 0
##$CFRGTYP= 5
##$CHEMSTR= <none>
##$CNST= (0..31)
1 1 145 1 1 1 1 1 1 1 1 1 1 1 1 1 1 1 1 1 1 1 1 1 1 1 1 1 1 1 1 1 
##$CPDPRG= <waltz16>
##$CPDPRG1= <>
##$CPDPRG2= <waltz16>
##$CPDPRG3= <>
##$CPDPRG4= <mlev>
##$CPDPRG5= <mlev>
##$CPDPRG6= <mlev>
##$CPDPRG7= <mlev>
##$CPDPRG8= <mlev>
##$CPDPRGB= <>
##$CPDPRGT= <>
##$D= (0..31)
0 1 0 0 0 0 0 0 0 0 0 0.03 2e-05 3e-06 0 0 0 0 0 0 0 0 0 0 0 0 0 0 0 0 
0 0 
$$ [...]
##$SUBNAM3= <"">
##$SUBNAM4= <"">
##$SUBNAM5= <"">
##$SUBNAM6= <"">
##$SUBNAM7= <"">
##$SUBNAM8= <"">
##$SUBNAM9= <"">
##$SW= 369.568048894756
##$SWIBOX= (0..15)
0 1 3 0 0 0 0 0 0 0 0 0 0 0 0 0 
##$SW_h= 29940.119760479
##$TD= 32768
##$TD0= 1
##$TE= 0
##$TE2= 300
##$TE3= 300
##$TEG= 300
##$TL= (0..7)
0 120 53 12 22 120 120 120 
##$TP= (0..7)
150 150 150 150 150 150 150 150 
##$TP07= 0
##$TPNAME0= <>
##$TPNAME1= <>
##$TPNAME2= <>
##$TPNAME3= <>
##$TPNAME4= <>
##$TPNAME5= <>
##$TPNAME6= <>
##$TPNAME7= <>
##$TPOAL= (0..7)
0.5 0.5 0.5 0.5 0.5 0.5 0.5 0.5 
##$TPOFFS= (0..7)
0 0 0 0 0 0 0 0 
##$TUNHIN= 0
##$TUNHOUT= 0
##$TUNXOUT= 0
##$USERA1= <user>
##$USERA2= <user>
##$USERA3= <user>
##$USERA4= <user>
##$USERA5= <user>
##$V9= 5
##$VALIST= <valist>
##$VCLIST= <CCCCCCCCCCCCCCC>
##$VD= 0
##$VDLIST= <DDDDDDDDDDDDDDD>
##$VPLIST= <PPPPPPPPPPPPPPP>
##$VTLIST= <TTTTTTTTTTTTTTT>
##$WBST= 1024
##$WBSW= 4
##$XGAIN= (0..3)
0 0 0 0 
##$XL= 0
##$YL= 0
##$YMAX_a= 9149
##$YMIN_a= -9706
##$ZGOPTNS= <>
##$ZL1= 120
##$ZL2= 120
##$ZL3= 120
##$ZL4= 120
##$ABSF1= 182.463
##$ABSF2= -187.1042
##$ABSG= 5
##$ABSL= 3
##$ALPHA= 0
##$AQORDER= 0
##$ASSFAC= 0
##$ASSFACI= 0
##$ASSFACX= 0
##$ASSWID= 0
##$AUNMP= <proc_1d>
##$AZFE= 0.1
##$AZFW= 0.5
##$BCFW= 0
##$BC_mod= 2
##$BYTORDP= 0
##$COROFFS= 0
##$CY= -3
##$DATMOD= 1
##$DC= 0
##$DFILT= <>
##$DTYPP= 0
##$F1P= 0
##$F2P= 0
##$FCOR= 1
##$FTSIZE= 65536
##$FT_mod= 6
##$GAMMA= 0
##$GB= 0
##$INTBC= 1
##$INTSCL= 5.30512e-09
##$ISEN= 30
##$LB= 1
##$LEV0= 0
##$LPBIN= 0
##$MAXI= 10000
##$MC2= 0
##$MEAN= 0
##$ME_mod= 0
##$MI= 50
##$NCOEF= 0
##$NC_proc= -5
##$NLEV= 6
##$NOISF1= 182.463
##$NOISF2= 159.3651
##$NSP= 0
##$NTH_PI= 0
##$NZP= 0
##$OFFSET= 182.463
##$PC= 4
##$PHC0= -1238.113
##$PHC1= -111.5984
##$PH_mod= 1
##$PKNL= yes
##$PPARMOD= 0
##$PSCAL= 0
##$PSIGN= 0
##$REVERSE= no
##$SF= 81.0140089999434
##$SI= 65536
##$SIGF1= 159.3651
##$SIGF2= -187.1042
##$SINO= 113.3802
##$SIOLD= 16384
##$SREGLST= <1H.CDCl3>
##$SSB= 0
##$STSI= 65536
##$STSR= 0
##$SW_p= 29940.119760479
##$SYMM= 0
##$S_DEV= 0
##$TDeff= 32768
##$TDoff= 0
##$TI= <>
##$TILT= no
##$TM1= 0
##$TM2= 0
##$TOPLEV= 0
##$USERP1= <user>
##$USERP2= <user>
##$USERP3= <user>
##$USERP4= <user>
##$USERP5= <user>
##$WDW= 1
##$XDIM= 65536
##$YMAX_p= 294574891
##$YMIN_p= -13349684
$$ End of Bruker specific parameters
$$ ---------------------------------
##NTUPLES= NMR SPECTRUM
##VAR_NAME=  FREQUENCY,     SPECTRUM/REAL,   SPECTRUM/IMAG
##SYMBOL=    X,             R,               I
##VAR_TYPE=  INDEPENDENT,   DEPENDENT,       DEPENDENT
##VAR_FORM=  AFFN,          ASDF,            ASDF
##VAR_DIM=   65536,         65536,           65536
##UNITS=     HZ,            ARBITRARY UNITS, ARBITRARY UNITS
##FACTOR=    0.456856943014862, 1,           1
##FIRST=     14782.0589164792, 0,            0
##LAST=      -15158.0608439998, 0,           0
##MIN=       -15158.0608439998, -13349684,   0
##MAX=       14782.0589164792, 294574891,    0
$$ Real data points
##PAGE= N=1
##DATA TABLE= (X++(R..R)), XYDATA
$$ [...]
36799E63140m25635k67266J9319J43961L27532O95050Q17399K75002o64236j261250
36789B23016j033831j42561P46509R42286L52296l07188k14978N57209J057334
36780B180092O00489l93797r39907o49031o2993R7850k76030p22428p98358m27045
36770a391158J93017P00437O35238j42515r40398o88915O68338J759242J411784
36761B205070K40366k90212j7017o3513p43296r68144j89268N06555J07401p07503
36751H0439p49540j59438J51780J31431L23426N31748J42317n30839n71971J2772
36741f37875L61456K45520K29996L89654J83783k92320k48267L67556O16203O9614
36731A285320n92793p98610p39093n25774N1694N75609J93524p36945o86448O35203
$$ y = [563140, 137505, -129761, -110442, 33519, 361051, 1056101, 1873500, 2148502, 1484266, 223016, -810815, -953376, -206867, 735419, 1087715, 780527, 565549, 1122758, 2180092, 2780581, 2386784, 1446877, 797846, 734853, 832703, 556673, -165755, -964113, -1391158, -1198141, -497704, 137534, -4981, -945379, -1634294, -965956, 793286, 2205070, 2445436, 2155224, 2138207, 2074694, 1331398, 363254, 173986, 680541, 787942, 80439, -669101, -828539, -676759, -545328, -221902, 309846, 452163, -78676, -650647, -637875, -276419, -30899, 199097, 588751, 772534, 480214, 231947, 599503, 1215706, 1285320, 692527, -106083, -845176, -1370950, -1319256, -743647, -550123, -1287068, -1973516, -1338313]
36721a338313J459299N89460o52990n00074N56855Q02492L4959n58992n84178
36712a91482o12702n81111Q8334Q87907O16101m94050q31901N2717O91329O3037
36702c11821q89761r22670k33671M15759J026806J656104J499858Q1875j390121
36693I32358j310834N0957R01311L93586m95381o34081j45902J77999J1163l88059
36683e06883o26891m24805J80406O95365O39235K28021J12852L70522L73038j27966
36673I12894m71181j04055M36904K47204n50222q94211k74639N48691N75454j66989
36663B59850p71647o08186P7480O39386P16834L53607k45855q22016j061230p83190
36653b244967j72239L54409N60509N31879L91092J12976k40787l54467k6121M14714
$$ y = [-1338313, 120986, 710446, 57456, -442618, 114237, 916729, 951688, 392696, -191482, -804184, -1385295, -1296961, -409054, 207047, -287003, -1118904, -1066187, -374858, -311821, -1201582, -2124252, -2357923, -1942164, -915358, 740746, 2240604, 2322479, 932358, -378476, -327519, 573792, 967378, 471997, -162084, -307986, -129987, -118824, -506883, -1133774, -1558579, -1378173, -682808, -43573, 184448, 297300, 667822, 1040860, 912894, 441713, 337658, 774562, 1021766, 471544, -422667, -697306, -148615, 426839, 259850, -511797, -1119983, -1042503, -403117, 313717, 667324, 421469, -400547, -1461777, -2244967, -2417206, -2062797, -1502288, -970409, -579317, -466341, -707128, -1061595, -1087716, -673002]
36643f73002M08059j00349n48651m76456m2958L29081N04883N48501L53997j95859
36633A07246p90422q72310l48468K48110M49209L66849L25976L27185J94300j0658
36623b983j22424k42476n11474o19255j22170O80753Q35351K9902p62200n00474
36613a337450M61271Q66436L37364j87911O2966O30744P07737L79780K36450J89161
36603B346548l67333j274628j462140m32633Q32350J023602J36530o38017m44819
36594b80540L70688Q98965P03053J03585k94166k27293r094j13696n09585o38479
36584C438j96523L86697N39536K85615k9619m08733r76153j306141p69837M12371
36574b059349J217505J091634N01701L9591k71522m67903k43920L99222P67833
$$ y = [-673002, -264943, -365292, -913943, -1390399, -1433357, -1104276, -599393, -50892, 303105, 107246, -683176, -1555486, -1903954, -1655844, -1206635, -839786, -513810, -186625, 7675, -2983, -125407, -367883, -879357, -1498612, -1620782, -940029, -104678, -74776, -836976, -1337450, -876179, -9743, 327621, 139710, 202676, 833420, 1541157, 1920937, 2157387, 2346548, 1979215, 704587, -757553, -1190186, -357836, 665766, 802296, 164279, -280540, 90148, 989113, 1692166, 1795751, 1501585, 1274292, 1265198, 1151502, 641917, 3438, -193085, 193612, 733148, 1018763, 989144, 580411, -395742, -1701883, -2471720, -2059349, -841844, 249790, 751491, 791082, 519560, 51657, -192263, 206959, 974792]
36565I74792L79391k69879m69248l19282l03895l31104l6531L18508J71349l02864
36555a88763l68945J08630N05218M28689J03523k30584n29712n52861p4208M58083
36545c40930L17032l38476n53073O578O02068O12365K70742n6321l72707m93224
36535c45946j3055O86644M98741o68920j315624m23786R15210J092883L07692
36526G33839p3998J98352K05059k27302k10635M87271Q88872L65074m57292q07964
36516A101276p56334n98306k21466L41533N53262J87114j79160o1526J86148J05945
36506F58486m9901P2015J18197l33450p98433n01045K92164N41397k54m60044
36496d60868k66895K9666j87322n16945k34408M18519N21588n7367l73547J50484
$$ y = [974792, 1354183, 1084304, 615056, 295774, -8121, -339225, -375756, -57248, 114101, -188763, -557708, -449078, 56140, 484829, 588352, 357768, -171944, -724805, -799013, -340930, -23898, -362374, -915447, -908869, -306801, 305564, 576306, 519985, 147278, -345946, -359001, 327643, 826384, 157464, -1158160, -1581946, -666736, 426147, 733839, 659841, 858193, 1063252, 835950, 625315, 1112586, 2001458, 2366532, 1909240, 1101276, 344942, -253364, -474830, -133297, 419965, 607079, 427919, 366393, 552541, 658486, 608585, 680600, 798797, 465347, -333086, -834131, -541967, -570, -824, -460868, -727763, -698097, -885419, -1402364, -1636772, -1218253, -696665, -754032, -1127579, -977095]
36486i77095P50830M11970n38700p87884O4110Q63726N40439l72629n93874k5321
36476f64428J58820o01116j243263n23376J128802J991063J192163k41196p53400
36467D44069j81128K42149l25187j189004j112073l4368Q35293O27133j23329
36458h16445l13771K79900Q68271P57158J42312k16528J37800Q48149J037147
36449B723993K41944r30743j391116q79842k35511j52952k80860j7335L94700
36440e27722L05886k14408n38012n22150n09376m25505J39372R06535R86925K48768
36430a49687l41031j54661K01510o711m41038l58659J06733K05271j85429m10122
36420a533824q3443L99450N19370L00186J06646P3640q22k33222l20972J43340
$$ y = [-977095, -226265, 185705, -352995, -1140879, -1076769, -213043, 327396, -45233, -639107, -664428, -505608, -1106724, -2349987, -2873363, -1744561, 246502, 1438665, 1197469, 444069, 262941, 505090, 179903, -1009101, -2121174, -2155542, -1320249, -693116, -816445, -1130216, -850316, 17955, 775113, 917425, 700897, 838697, 1686846, 2723993, 2965937, 2035194, 644078, -235764, -471275, -624227, -905087, -922422, -527722, -221836, -436244, -974256, -1496406, -2005782, -2431287, -2291915, -1385380, -398455, -149687, -490718, -645379, -443869, -450580, -891618, -1250277, -1143544, -938273, -1123702, -1533824, -1617267, -1217817, -698447, -398261, -291615, -217975, -218797, -452019, -772991, -629651]
36410f29651R71669J321863O76104l73922q20830n44513k81030l79282m04884
36401d64476j10955P0083j25120k41281P5921L83794J68747k87201l94772j49349
36391a074609Q9173K93926O03504Q00001O01149K21363O4217R0965K0487j03694
36381A606482p5496r760j56396m41430n93706m60765O7333R35920J423809N72904
36371B868895j281461k301839j373449K94978Q98706N22715M62343P86048M39515
36362A316451n12365p83519j75441J4536n88423n89944O68822J602300P61315
36353A713732p54566r35044J25699O46684M436o50809n12751j98354l79672o32406
36343a573051k51231N94712J104368Q28591M1956o28191p49948m04508l827K32808
$$ y = [-629651, 342018, 1663881, 2339985, 1966063, 1145233, 600720, 319690, -59592, -464476, -575431, -505348, -630468, -871749, -795828, -412034, -243287, -530488, -925260, -1074609, -985436, -691510, -88006, 711995, 1313144, 1534507, 1598724, 1689689, 1710176, 1606482, 1530986, 1521226, 1364830, 923400, 329694, -131071, -63738, 872182, 2295991, 2868895, 1587434, -714405, -2087854, -1792876, -894170, -371455, 90888, 876936, 1316451, 804086, 20567, -154874, -140338, -728761, -1318705, -649883, 952417, 1713732, 959166, 24122, 149821, 796505, 800941, 150132, -362619, -560973, -940645, -1573051, -1824282, -1229570, -125202, 703389, 745345, 117154, -632794, -1037302, -1041129, -808321]
36333h08321M07309M84277J72751m37715o51161r3366N87323N83542J08457l1828
36323C21268K50821L07812o6360l33540j92939m3817k00031l26384n2759L36216
36313B87K78406k20672m87793L9404J036263J422263M99608j045926j739452j106297
36303a323909k71114l29362q01856n23317M61909R91080N70688n1562j57086J32598
36293a301931M82351Q10613Q94322M38279j82033j67672M11083N37409j66904
36284A755517q12601o91041k71378j01043J77963Q35369J122613M36586m59446
36275A992539n67200k30782l01720m77159L426N87335J13025r75277j021207J27064
36265g49956P19161q6479q64863k74057Q55282R98593K44259k57997k60160m04883
$$ y = [-808321, -401012, 83265, 256016, -181699, -832860, -926226, -338903, 244639, 353096, 321268, 572089, 879901, 813541, 480001, 287062, 243245, 43214, -283170, -335929, 287, 278693, 58021, -429772, -390368, 645895, 2068158, 2567766, 1521840, -217612, -1323909, -1595023, -1924385, -2726241, -3249558, -2787649, -1796569, -1225881, -1277443, -1434529, -1301931, -819580, -8967, 885355, 1323634, 1141601, 973929, 1385012, 1922421, 1755517, 942916, 251875, -19503, -120546, 57417, 892786, 2015399, 2451985, 1992539, 1425339, 1194557, 892837, 415678, 419104, 1006439, 1119464, 144187, -877020, -749956, -30795, -117274, -982137, -1256194, -400912, 597681, 841940, 583943, 323783, -81100]
36255h1100p81673q16484l72137J11714M14633N89349M64614k0948k53585L12750
36245d32867J023665O86976o14799j409256p76302M69901R29015K94518n40169
36236c69318o45996L1254P48048P95884K94215j4261J47577J92398k70952o09193
36226B99656j41384N93933N62988j14967m04216p8835N6424k82198m17509r6647
36216b2755R034l38964l82155J87638M65553j30104p18880l88926K72655K76615
36206g70289m8457J86086O55815L59463m66074n75552J90703N76941p0663q21503
36196g83530o88784j9912K86306J20664K2613K11023L72208K01358k06220m25987
36186i10261j17863M91468P16224K82888k23426k33136q6590l56438p03491l95472
$$ y = [-81100, -862773, -1679257, -2051394, -1939680, -1525047, -935698, -471084, -492032, -745617, -432867, 590798, 1277774, 662975, -746281, -1522583, -1052682, -123667, 170851, -369318, -1015314, -984060, -236012, 559872, 854087, 839826, 987403, 1179801, 908849, 299656, 158272, 752205, 1315193, 1200226, 796010, 717175, 773599, 491401, 73892, -22755, -13721, -352685, -734840, -547202, -81649, -211753, -930633, -1319559, -1046904, -770289, -818746, -632660, 23155, 382618, -83456, -659008, -468305, 108636, 37973, -783530, -1472314, -1492226, -1205920, -1085256, -1062643, -851620, -479412, -278054, -484274, -910261, -1028124, -536656, 179568, 462456, 239030, 5894, -80696, -437134, -1140625, -1536097]
36176a536097K88911L45590k79922n30694M0101N99268M85044J72433K27638L63702
36166A75974K15545Q4503J58037r0124q54486j208717l88206Q20200J084798M41144
36156D38668N4108L52561N53746N3093o87798q51513k33540O31852R25127K26823
36146A463127q74742j148058j61767J008769J091857K07559n60557p23069o06091
36137c02972l82179L9735L24967L7851l58342L0885R48727J070715k011j010151
36127C97225q55274q8361J64272j47946l32936k47181k37558k16628J82594O93755
36117f88038O07510o4443m25172O4386P88183P74634p4802r09885r33726k22307
36107a083660M39110L93938k59410q32800p54737o4706P05382J012250P22909
$$ y = [-1536097, -1247186, -901596, -1181518, -1712212, -1672111, -1072843, -587799, -415366, -187728, 175974, 391519, 476022, 634059, 543935, -310551, -1519268, -1907474, -1087274, -2476, 438668, 492776, 845337, 1399083, 1452176, 764378, -87135, -320675, 311177, 1236304, 1463127, 588385, -559673, -721440, 287329, 1379186, 1586745, 1026188, 303119, -302972, -685151, -645416, -320449, -282598, -640940, -610055, 338672, 1409387, 1407376, 397225, -458049, -546410, -382138, -530084, -863020, -1110201, -1347759, -1564387, -1381793, -688038, -80528, -144971, -570143, -505757, 282426, 1057060, 982258, 72373, -861353, -1083660, -644550, -250612, -510022, -1342822, -2097559, -2162265, -1456883, -444633, 278276]
36098B78276K11914j2278Q5538q479n76207j044115o42974L97022R55373M68486
36088A12556l52665n42815m5491N46023Q71223Q84024M96854j95241o21148l49636
36078H03684J77199K19299q3998P3328P42016R39188J51636p37717o99028j03084
36068A482523j21126q77542j213561m14433P30707J044195M72368j38690l34449
36059F29992l60778l74889j89540Q1161p8506o61495q11510l5802Q02335N53628
36049d45404m48468p19748K03804J011504N40461m97904o42274Q0615K86834m79988
36039a110568r29590m0905J182075J023597m40920j415709r21355L266Q6869l20007
36029b883247j06218O72046R70559N41318K14759L34693K25730l67630n67602
$$ y = [278276, 490190, 477912, 563450, 554971, -21236, -1065351, -1708325, -1311303, -355930, 112556, -240109, -782924, -828415, -282392, 588831, 1472855, 1969709, 1774468, 1153320, 803684, 980883, 1200182, 1116184, 1189512, 1931528, 2870716, 3022352, 2284635, 1585607, 1482523, 1361397, 483855, -729706, -1144139, -413432, 630763, 1103131, 964441, 629992, 269214, -105675, -295215, -214054, -292560, -954055, -1765565, -1801367, -999032, -445404, -893872, -1613620, -1409816, -398312, 142149, -355755, -998029, -917414, -630580, -1110568, -2040158, -2081063, -898988, 124609, -316311, -1732020, -2653375, -2650109, -2563240, -2883247, -2989465, -2317419, -1346860, -805542, -590783, -256090, -30360, -397990, -965592]
36020i65592J53814Q64063N64665j80254k24727K40271J79289l14253j73566N77918
36010G21628O39223l38940r87369l95430M37506L31437k04515j12214K67551q1578
36000B77299q70059q75034P101O40385N32836L50308M11111J59797m46238m47637
35990b60131N07041J276255Q55281r7867l80945o9552n3294l49764k02968L85368
35980A609424N44956L2287l67102k25578j51473n61680p80458j68260O00505M00708
35970I33329n94630j083250m96690K98384L94373O2468O4147L85498L73788j58336
35960A79081o74971p41276n13692k81540k0147L43205O01407N49635L45295K22884
35950I881L9920m41975r08196p02316J44228O64382J86529o05204n02820N14537
$$ y = [-965592, -811778, 52285, 616950, 436696, 211969, 452240, 631529, 317276, 143710, 721628, 1360851, 1021911, 34542, -360888, 76618, 408055, 203540, 91326, 358877, 277299, -592760, -1467794, -1460693, -820308, -287472, 62836, 473947, 633744, 187506, -260131, 246910, 1523165, 2378446, 2280579, 1899634, 1830082, 1776788, 1427024, 1224056, 1609424, 2154380, 2186667, 1819565, 1593987, 1442514, 880834, 100376, -67884, 532621, 933329, 338699, -744551, -1241241, -942857, -548484, -486016, -421869, -36371, 337417, 179081, -495890, -1237166, -1750858, -2032398, -2052545, -1709340, -1107933, -558298, -213003, 9881, 49801, -392174, -1300370, -2002686, -1858458, -1194076, -1007547, -1612751, -2115571, -1601034]
35940a601034J186000O96507k85709o77789l78630J5809L05082O47385P90290
35931F97911L17213m23721o04122k10581r2236n10133o72416j37335L70862K25960
35921a038598p261L23839O32039Q7322o63761k31199J231526J922093Q36407q75836
35911B216571j493612p56604K46718N70971K21624j79740j42943J52908O0547
35902H96440n76032r61593m04632M95137N76448j45810n20281o2118M19284K55317
35892b7840j19122q5620K31975M43121M43954J09025o59774j236397p07312N60012
35882a047978J018648K13568m15107J46930Q25987L60767n02776l42256M92053
35873G49836O06895J417j65607J95196P3996n78542o75561k908L83319P1261n9022
$$ y = [-1601034, -415034, 281473, -4236, -682025, -1060655, -1044846, -739764, -92379, 697911, 1015124, 591403, -12719, -223300, -315536, -825669, -1498085, -1635420, -1264558, -1038598, -1045859, -722020, -89981, -2659, -666420, -897619, 333907, 2256000, 3092407, 2216571, 722959, -33645, 213073, 784044, 1005668, 825928, 682985, 835893, 896440, 320408, -641185, -1045817, -550680, 25768, -120042, -640323, -702441, -283157, -27840, -146962, -232582, -607, 442514, 886468, 995493, 335719, -900678, -1607990, -1047978, -29330, 184238, -230869, -83939, 742048, 1102815, 600039, 257783, 749836, 1356731, 1358148, 1192541, 1387737, 1461733, 883191, 207630, 204722, 588041, 659302, 600280]
35862F00280M48841P96999L94522j97568l79792l67726l80497j41589K59061J50384
35852A182915m93910p27798j27048M80117L78868l8169k62720m92446p47810l83305
35842a231306O24626J061868K00249q96632r12642j69428K26135K23841M42459
35833d30830O64738K37100m49258l66067M18350P59108K04220m30240l74481J84416
35823D17056O51578O95388K79021l41907o72162n42977m01362n24411m28112K18423
35813f49465O82473J84185o82744p55557j52260N2267k07944J04253J137084J622990
35803A335282Q34574k70422n40029j76133m4854l05294m85003l10654J37928O00678
35793G76073N85761k37942j271883j360886l34263O29791O56493L13992M55686
$$ y = [600280, 1049121, 1846120, 2240642, 2043074, 1663282, 1295556, 915059, 773470, 1032531, 1182915, 689005, -38793, -165841, 314276, 693144, 654975, 392255, -100191, -848001, -1231306, -606680, 455188, 655437, -241195, -1153837, -1323265, -1097130, -873289, -430830, 233908, 471008, 21750, -344317, 74033, 833141, 1037361, 607121, 232640, 417056, 1068634, 1764022, 2043043, 1701136, 1028974, 485997, 84635, -439776, -867888, -649465, 33008, 217193, -465551, -1221108, -1373368, -1321101, -1529045, -1424792, -287708, 1335282, 2169856, 1899434, 1359405, 1183272, 1138418, 833124, 348121, 37467, 175395, 776073, 1361834, 1123892, -147991, -1508877, -1843140, -1213349, -556856, -242864, 212822]
35784B12822Q08050O16685O395l34561l51018m44792m28639K06723J060660J017020
35774B369345p4217r14612m86360M81055M95031o48362j591597j205089K4331
35765a550475P49150M92172L0810R4711L44041N0088o45362q19074o3428R02415
35755d14952J102974L98625m93784q15388m37771J29282L30031K03364K61450
35746B63831O14953O36292r3120r32701r56816k70962K55446L40521M06273M63406
35736G27123L4646o84562p97276j79099K03963p7839k08953K96278O02663R1910
35726H854l41889K01698Q78593L77922q20046j137515l84955J73427M4040L8058
35716i61813M82966O16734J65046n5682K75755K36010o88684j456385r84954J66496
$$ y = [212822, 1020872, 1637557, 1643952, 1309391, 958373, 513581, 84942, 291665, 1352325, 2369345, 2295128, 1380516, 894156, 1375211, 1870242, 1221880, -369717, -1574806, -1550475, -801325, -309153, -278343, -183632, 160409, 210497, -434865, -1253939, -1317367, -414952, 688022, 1086647, 592863, -222525, -660296, -531014, -200983, 2381, 263831, 878784, 1515076, 1421956, 489255, -467561, -738523, -483077, -142556, 263717, 727123, 761769, 77207, -720069, -899168, -695205, -773044, -981997, -685719, -83056, 8854, -333035, -131337, 747256, 1125178, 305132, -832383, -1217338, -1043911, -999871, -961813, -478847, 137887, 302933, 247251, 523006, 759016, 70332, -1386053, -2371007, -2204511]
35706b204511O90630L61404p0036k16206k30533o2331M07390P12719K90704m44070
35696g64840m54701L96534J041644O81013j67529n12459k32376j0923j99884l81473
35686f04994j68602P3371k43658q81143q91649K0734Q83498P37396K8791j10240
35676a156496L45051L60417k84653m62257M42803J312157Q57740m57143j147971
35667a90352p67320q6924L74690P70326J017519P15907R0918r1909K01632J23580
35657B158067o02962j103362p28441o7629Q6075k9320K33610O94192O46503N1708
35647A338441m23232l92071o5623K82877N18648M34467j7024l70381j72863K06179
35637A339418k067p15067r43477k04800P12509P92956P8070n43593m90353j5326
$$ y = [-2204511, -1513881, -1152477, -1222513, -1438719, -1669252, -1731583, -1324193, -611474, -320770, -764840, -1219541, -823007, 218637, 899650, 732121, 219662, -12714, -23637, -223521, -604994, -773596, -700225, -943883, -1825026, -2716675, -2695941, -1812443, -1075047, -1046256, -1156496, -811445, -451028, -735681, -1197938, -755135, 557022, 1414762, 957619, -190352, -957672, -1044596, -669906, 100420, 1117939, 1833846, 1924764, 1832855, 2034487, 2158067, 1555105, 451743, -276698, -344327, -258252, -287572, -53962, 640230, 1286733, 1338441, 915209, 523138, 457515, 740392, 1259040, 1693507, 1676483, 1306102, 1133239, 1339418, 1337351, 622284, -321193, -525993, 186516, 979472, 1057542, 513949, 23596, 8270]
35627H270K40951n3052n62600n62983J85078Q87522N55084n46601j004442j61761
35617a014534Q44652O22057n25897j119419o14663R2398K41970J70759L57001
35608i45676M68983Q399p20408r68672n25402K03035Q00021J029043P27457Q1809
35598A58589k23999K42673R02900P99150p0053p47571p01371m29461m20495l23833
35588h13471K49546P38425L21634o66670r39603J5210J186922J350467N31446
35579A973906k87961m86282k56831K0176K30487L18364J52324j93495l68918j92869
35569I08901O3126N7633j35728j67811O8145L00511K49453m2629k83616k50422
35559G67563k2904R1213p4443k74203j24026L21307N24651J56449m27921o60402
$$ y = [8270, 249221, 196169, -366431, -929414, -744336, 143186, 698270, 151669, -852773, -1014534, -169882, 452175, -73722, -1193141, -1807804, -1715406, -1473436, -1302677, -945676, -476693, -468294, -1188702, -2157374, -2682776, -2479741, -1679720, -650677, 76780, 158589, -65410, 177263, 1080163, 1879313, 1809260, 1061689, 360318, -69143, -489638, -813471, -563925, 174500, 496134, -170536, -1110139, -1094929, 91993, 1442460, 1973906, 1685945, 1199663, 942832, 963008, 1193495, 1511859, 1664183, 1470688, 1101770, 908901, 972027, 1029660, 893932, 726121, 794266, 1094777, 1344230, 1301601, 1017985, 767563, 744659, 835872, 761429, 487226, 363200, 684507, 1209158, 1365607, 937686, 277284]
35549B77284m93852l14096k65324j07859K32932M05076J10471m10031n85559j30658
35539a281616O28255J008782O15586j93828o36915m26429r2163j37784k76431
35530g92543k1026L43590J92643k23522k2138P59687R85417K07181n02690k58853
35520F67746J50316m00861j354941j203855J32186J135180R15558K21241o7410
35511A95160j46840m09529m75182M8499O28167N45535O8497j976L57946M08993
35501A219270j11587n57949l48182K01518L20393k11053p85391p05352o3412L32486
35491g09259N0621k51582K88290J298175J424724K27919j044692j130698m32369
35482b78871j88281n49488n81152M3913N27015K78388k53841m73716m93610n64226
$$ y = [277284, -216568, -530664, -795988, -903847, -670915, -265839, -155368, -565399, -1150958, -1281616, -653361, 355421, 971007, 777179, 140264, -286165, -378328, -516112, -792543, -813569, -469979, -277336, -500858, -522996, 236691, 1222108, 1429289, 926599, 667746, 818062, 417201, -937740, -2141595, -2009409, -874229, 41329, 262570, 195160, 48320, -361209, -836391, -787892, -159725, 385810, 454307, 452331, 810277, 1219270, 1107683, 549734, 201552, 403070, 723463, 512410, -272981, -978333, -1041745, -709259, -658638, -910220, -621930, 676245, 2100969, 2328888, 1284196, 153498, -278871, -467152, -1016640, -1597792, -1553879, -1026864, -748476, -1002317, -1476033, -1969643, -2533869]
35472b533869l73334L66314J102956J020233K42771k63241r295M39871L92659
35463C85065o273j05461K83692O87895O61591K84126j17935m25071o68752p30719
35453B48158m64485j09907j99177q39373j354082r64184K55211J365867J504169
35444e57803O47401m82804j041549o38092L91854J209522J196148N42497l8590
35435A228584j71554j19940k02699k91058j13323K35329M21392L55954K17552
35426A560237O8513k08015n65206p15147n24992k34446r2991R057K87660N89205
35416A73875N31142J27987j23344K3438J23261k67083p25497m25065N30659R50708
35406I20081J11280j113969j312316l74992M88833M81934J07006J08987L45827
$$ y = [-2533869, -2907203, -2540889, -1437933, -417700, -174929, -438170, -447465, -7594, 385065, 378792, 273331, 557023, 1244918, 1906509, 2190635, 2072700, 1647629, 978877, 248158, -216327, -326234, -525411, -1364784, -2718866, -3683050, -3427839, -2061972, -557803, 89598, -393206, -1434755, -2072847, -1680993, -471471, 724677, 1267174, 1228584, 1057030, 937090, 734391, 443333, 330010, 565339, 986731, 1342685, 1560237, 1628750, 1420735, 855529, 140382, -384610, -619056, -712047, -702990, -415330, 173875, 705017, 833004, 709660, 733098, 856359, 589276, -136221, -561286, -30627, 920081, 1031361, -82608, -1394924, -1769916, -1281083, -799149, -692143, -583156, -237329]
35397b37329K77730J4362J07380N17578N47510j19824r14709j124604p03216r8808
35387a733930L45870N17390L62286j0323k08734P0563N80983P60190M44213M9405
35377A177913j8572J45475J63603j58169p17351j251689j434155j049369k79598
35368c421912L58513N59056N29643N63579N81324M06219K06625J95610J20518
35359I9175l28927p24102k95511P55623J192024L97339o56006p22829M3900N34618
35349B95304L50291O5808J856k32961p96123j100969o71319J25708O48672Q02296
35339e11437Q43007P67512M12700o3699k91221k00746o4991o6664j23439j21846
35329E79176p1469j3020M3217P6006P0102M6066j7393k01213m56438n05788j45863
$$ y = [-237329, 40401, 54763, 162143, 679721, 1227231, 1107407, 192698, -931906, -1635122, -1733930, -1388060, -870670, -508384, -518707, -727441, -656878, -75895, 684295, 1128508, 1177913, 1159341, 1304816, 1468419, 1310250, 592899, -658790, -2092945, -3142314, -3421912, -3063399, -2504343, -1974700, -1411121, -829797, -423578, -216953, -21343, 99175, -229752, -953854, -1249365, -493742, 698282, 1095621, 439615, -283214, -239314, 295304, 645595, 711403, 713259, 480298, -315825, -1416794, -2088113, -1962405, -1313733, -511437, 331570, 1099082, 1511782, 1448083, 1156862, 956116, 891125, 824461, 701022, 579176, 507707, 494687, 537904, 613910, 684012, 730078, 712685, 511472, 55034, -450754, -596617]
35318e96617L81284N47606J51173l93442n13858j35366L00768M40838L77650K95546
35308H55582P4047l94199p00560l06367N39445Q90618L47297l86944n52951l22857
35298D3111k16332j67625O7827J39959k79227n26426K23159J367380J442447L10510
35288B404783o18695o10101n35415j001618j117986j96024O79854K36857p95915
35279a554260p15562M95268J209583O83433n0778M704M94771O36797L88473J65181
35269A757610J30407J84206J36675k91129j112403j686185j307416k00720P19447
35260a669508J017416R30775N50412k04261q04683m55183N51248R31418K27899
35251A075533n61155o07718l59263l90855l10704K87443P74124M63088j32702
$$ y = [-596617, -215333, 332273, 483446, 90004, -423854, -559220, -258452, 182386, 560036, 855582, 929629, 535430, -165130, -471497, 67948, 958566, 1305863, 918919, 365968, 43111, -173221, -340846, -273019, -133060, -412287, -938713, -715554, 651826, 2094273, 2404783, 1786088, 1175987, 640572, -361046, -1479032, -1675056, -995202, -758345, -1554260, -2269822, -1774554, -564971, 118462, 67684, 72388, 567159, 1203956, 1592429, 1757610, 1888017, 2072223, 2208898, 1917769, 805366, -880819, -2188235, -2388955, -1669508, -652092, 278683, 829095, 624834, -179849, -635032, -83784, 847634, 1075533, 514378, -93340, -452603, -843458, -1154162, -866719, -92595, 370493, 237791]
35242B37791j48344J61152j990m09871j47704O66611Q39609o0070r76068q84396
35232g23280j59776J14133l59759q24496m80832N70963J389348J157759J17891
35223H01951o45015m68340J62487M08498J76494m3470p5029j48759k71579j59074
35213b61836J86216L57712J07470l20196m81260j70231L71631N99150K52832j62992
35203D78496K1911M97773K33449q03358j223206k41861R14877P52632k51565n88946
35193b09798j99340k71133q99933q45540K57885J227845J236906P77288L09374
35184A383554m05380j073823p03357N26570R27678j18524r18434j20264J014477
35175E12497O94505m53337n86546K17196L32688m20525n28033M55025J093621
$$ y = [237791, 89447, 250599, 248609, -161262, -308966, 357645, 1197254, 1137184, 161116, -723280, -883056, -768923, -1128682, -1953178, -2434010, -1863047, -473699, 684060, 801951, 156936, -311404, -148917, 259581, 436075, 392605, 317576, 168817, -102762, -261836, -75620, 282092, 389562, 69366, -411894, -582125, -210494, 388656, 641488, 478496, 500407, 998180, 1231629, 428271, -794935, -1036796, -121919, 630713, 379148, -209798, -409138, -680271, -1580204, -2425744, -2167859, -940014, 296892, 1074180, 1383554, 978174, -95649, -799006, -272436, 655242, 536718, -381716, -501980, 512497, 1207002, 753665, 167119, 384315, 717003, 296478, -231555, 223470, 1317091]
35166A317091M78620m37301n75873k21157j0425J98934O02338P04547J68430m58905
35156A766299o07521n04370n07157m03121K8L37232L52203L58638M60443J47050
35146A399724o57360j021296l39255N58994O02823P5758n7527K06062J61305j60139
35136G69089j21433J69652j2416n50343m77782L67650R33105N66106r2769l19767
35126A231092l48789n72030o60641k78048R8478o2594l51910o9976N61502P35882
35116B82966L37394K2101J53302M22737M74795K33494l24055j059797j413214
35107h70277r37459o0456L82009L14796L37407N20086K89742l16453m07207K71593
35097d76219O82673R8874o05698l00250N28125N20437l66610q05636j69376O74901
$$ y = [1317091, 1795711, 1358410, 782537, 561380, 550955, 749889, 1352227, 2056774, 2225204, 1766299, 1158778, 654408, 147251, -255870, -255842, 81390, 433593, 792231, 1252674, 1399724, 742364, -278932, -618187, -59193, 543630, 619388, 561861, 767923, 929228, 769089, 647656, 817308, 804892, 254549, -223233, 144417, 1077522, 1643628, 1550859, 1231092, 882303, 310273, -350368, -628416, -529938, -592532, -944442, -1014418, -452916, 282966, 620360, 642461, 795763, 1218500, 1693295, 1926789, 1602734, 542937, -870277, -1807736, -1868192, -1486183, -1171387, -833980, -313894, -24152, -340605, -747812, -476219, 206454, 305328, -300370, -600620, -72495, 447942, 81332, -724304, -893680, -218779]
35087b18779Q67235O28764L82744q6530q89709j322984p70596K35667O74909L85805
35077a13474K0820m9076k8412n1054L6594K36070L14436K07625O0434j17667l95363
35066A20933n57152k80456K98190O40160M80550N4753l44482n84755m74628J04239
35056e42648P19025O43981j11895o01690k15053L43028J5439r53782j179207o0019
35046a942821J243562J259369J16772p08742l90700L22957L80121j49470m88215
35037c57167m26963l56961l03606J03841O76935O84952J06726j23791L73613O63727
35027A041306K8210o72982k96680O43717P29697p1747m34064N0325K65224l72404
35017I10602q33380k52932N55097M41351k57215m57967j31325n9446l07565k69758
$$ y = [-218779, 648456, 1277220, 1659964, 1573434, 683725, -639259, -1409855, -1174188, -499279, -113474, -92654, -141730, -170142, -221196, -184602, 51468, 365904, 573529, 633963, 516296, 120933, -436219, -716675, -418485, 221675, 702225, 756978, 412496, -172259, -646887, -542648, 176377, 820358, 708463, 106773, -108280, 234748, 250187, -703595, -1882802, -1942821, -699259, 560110, 676882, -31860, -422560, -99603, 280518, 131048, -357167, -784130, -1141091, -1444697, -1340856, -663921, 21031, 127757, 3966, 377579, 1041306, 1069516, 396534, 99854, 743571, 1473268, 1401521, 967457, 1017782, 1283006, 910602, 77222, -175710, 379387, 820738, 563523, 105556, -25769, -85215, -392780, -662538]
35007f62538L7221N3688n8894L89880J070449P55309n65121j171344j14836J080029
34997H13843N64806r31987j104954L95849J391593M90389q87403q54981P5880
34988d6965J08240p92251r64638L8740O79119N7206n77106k094Q56871M98000
34978a44878n86330o96363L32359J021951O94312K12478J45983n3165n88894o59509
34968c22056J9520M44757n8480o79238n05016O5735K82646L41212O25520O57394
34958H71994K4216n40607l11642L0492m11993r54206l87524P53308Q55427j16725
34948a87260n77886K7299M75557K6381m30012j56942J64559j42948m75656j08481
34938a385389N08403O24008M10744L67114L46922R2881n5765J20437P1233n42081
$$ y = [-662538, -625317, -571629, -630523, -240643, 829806, 1585115, 1019994, -151350, -266186, 813843, 1378649, 446662, -658292, -262443, 1129150, 1619539, 732136, -122845, -46965, 61275, -730976, -1695614, -1656874, -977755, -920549, -1497655, -1499749, -642878, -144878, -731208, -1427571, -1095212, -73261, 621051, 833529, 979512, 926347, 337453, -322056, -302536, 142221, 83741, -595497, -1100513, -1034778, -752132, -410920, 214600, 871994, 896210, 355603, 43961, 74453, -337540, -1291746, -1679270, -925962, -70535, -187260, -765146, -737847, -262290, -235909, -665921, -822863, -658304, -801252, -1276908, -1385389, -876986, -252978, 157766, 524880, 871802, 964683, 908918, 1029355, 1100588, 558507]
34928E58507r67637m54499M43415O77427K34991j66235l65214o47847q12776m79685
34918a979553J4937J26870J68968P11944J246378P80764l54159p34967k2958N02502
34908D60726J45o59445l66878N58269J041501Q24242M51839J79973k22873p59484
34898A508015r98220o40493P3156N58022L75083l30787q38892n78741J12985L59102
34888d00770n4428l64908M4747P54881R53595N30337K736l40773o18495p85166
34878b78244n11139J93644O87994M00730l38883n70868Q0447P96106N57420m04343
34868F12864p88464m1965P29138K88731q54489j087737k0976R54547O81008k23128
34858B49529m33936K28870Q12657O60469L4637n43402q87580r90828p49914q6888
$$ y = [558507, -409130, -863629, -420214, 257213, 492204, 325969, -39245, -687092, -1499868, -1979553, -1964616, -1837746, -1668778, -956834, 289544, 1070308, 716149, -18818, -41776, 460726, 460871, -198574, -565452, -7183, 1034318, 1858560, 2310399, 2490372, 2267499, 1508015, 509795, -130698, -57542, 500480, 875563, 544776, -294116, -872857, -759872, -400770, -455198, -820106, -775359, -20478, 933117, 1463454, 1466190, 1125417, 506922, -278244, -789383, -595739, 92255, 492985, 154102, -416766, -336319, 459787, 1017207, 612864, -175600, -217565, 511573, 800304, -54185, -1141922, -1162898, -208351, 472657, 249529, -184407, 44463, 857120, 1517589, 1552226, 1008824, 121244, -869584, -1619498, -1706386]
34848a706386P78225J298346R66964j03335j054995j086041l79664J73254J76091
34839i37541O8791J66832J32494j92260j90627N85046J429081J285391K29706
34830B576913o52836o90289j74824L54738N95544L24471m26479j021010q40715
34821D5513k92705l25451q53661p26953L89564J255242Q85470Q3719P7420M79768
34811A017926M5310j001922j093857J01250R08056J61261r42798o74054O10869
34802h67959J158477N25258o3825N9723J34802l12036n04063J7087K95575l83386
34792E9653r47484j80487R90443P25003o66617r96198L55511J410774P15329m98360
34782I67567m96960K60172K56301m37706n26927J37261M05262j24275n56927l15800
$$ y = [-1706386, -928161, 370185, 1337149, 1233814, 178819, -907222, -1286886, -1113632, -937541, -868750, -701918, -569424, -761684, -952311, -367265, 1061816, 2347207, 2576913, 1924077, 1233788, 1058964, 1413702, 2009246, 2333717, 1907238, 886228, 45513, -247192, -572643, -1426304, -2153257, -1763693, -508451, 377019, 460738, 538158, 1017926, 1063236, 61314, -1032543, -931293, -23237, 138024, -804774, -1478828, -867959, 290518, 815776, 751951, 811674, 946476, 634440, 130377, 147464, 443039, 59653, -887831, -1068318, -77875, 647128, -19489, -1015687, -660176, 750598, 1465927, 967567, 470607, 730779, 987080, 549374, 22447, 159708, 564970, 440695, -116232, -432032]
34772d32032R4331J72722R3210L3033j47965l44286k35422K3923N2479J08146
34762e81861O10023R34623J15184j216541j265779J86704J253201Q03370P929
34753H46853J1897p211r00883j421950j60082J634805J576854j72267j186429
34744B21587n25080K37871k9526l99617K2675M57305M7967m96903j59861O31043
34734G461P44117M7879o80566r41789p57444k78884J70408K33236J92596P34884
34724e28102J578048J410946p3311j272563q67630J98878K82662m06859m51513
34715a29444K86827O61694L68404J97331K39038k61801j059627q33591N06193
34706b4976J261287N06435m94165m84098j94282p06487j263355n46411Q10147
$$ y = [-432032, -337701, -164979, -71769, -38736, -186701, -530987, -766409, -742486, -690007, -581861, 28162, 962785, 1077969, -138572, -1404351, -1217647, 35554, 838924, 846853, 858750, 851539, -49344, -1471294, -1631376, 3429, 1580283, 1408016, 221587, -303493, -65622, -95148, -494765, -472090, -14785, 33182, -463721, -623582, 7461, 751578, 799457, 118891, -822898, -1580342, -1859226, -1688818, -1455582, -1262986, -528102, 1049946, 2460892, 2387581, 1115018, 247388, 446266, 728928, 322069, -129444, 157383, 819077, 1187481, 1384812, 1623850, 1362049, 302422, -531169, -24976, 1236311, 1742746, 1248581, 764483, 570201, -136286, -1399641, -1946052, -1135905]
34697a135905J007373m2757o29090l5002M98789L9321n46922k14014N36033O50256
34687A28082K70435K69804O33317N26066k10554p25458m61451M6299J2745m98306
34677i021p29699k56973M77263O83475J50563m90393n28309n2995K52129J48690
34667c55270J30707M74404O37163J44832m40016k50543M42087M71720m69069j243496
34657d57481q04312M28361J227285J034928K38883n66674r80674p72306r5342
34648g47332M12286K62919k52043m90400l19035o0957J87947N63599Q76358P33761
34638A167103K42590m4343M7118J39970J9760j14618j91670l58027m14829K6463
34628E19517O13333M21584n18869q78166O5469J108412P44691n98204j173037
$$ y = [-1135905, -128532, -171289, -800379, -835381, -336592, -297271, -844193, -1058207, -522174, 128082, 398517, 668321, 1301638, 1827704, 1617150, 891692, 430241, 476540, 489285, -9021, -738720, -995693, -518430, 165045, 315608, -174785, -703094, -756089, -503960, -355270, -224563, 249841, 887004, 1031836, 591820, 341277, 783364, 1255084, 786015, -457481, -1261793, -833432, 393853, 1428781, 1667664, 1100990, 120316, -651990, -747332, -335046, -72127, -324170, -814570, -1133605, -1194562, -1006615, -443016, 433342, 1167103, 1409693, 1365350, 1412468, 1552438, 1572198, 1457580, 1265910, 907883, 493054, 519517, 1132850, 1554434, 1035565, 157399, 222868, 1331280, 2075971, 1477767, 304730]
34619C04730l67894P16200J016113O15663K1406n26910p52255l46851L53997N50344
34609A584543J53885n5079K28498K80244l52770r38490p08430j50139k23676q00140
34599i81554q63018m5793Q99374J142288O20504j57340o24852m82819O0199M12091
34589b0920K83674P3096K14695M37615J83718m67316q74421p08857k03467L52101
34579g30082P97998Q79189M36099j89726m78372m25135l88531l68276r0641K78057
34569b79420K90785J02895L14872P94622O42862l05430r57950n66377Q8166j2333
34559A12692m43273j04816Q27402J048650J58714p11968n93701O5498L20937N4152
34549G34287k38368l33276k92738n0804L61746N27824K11713r1461J42410M86182
$$ y = [304730, -63164, 653036, 1669149, 2284812, 2306218, 1779308, 1027053, 680202, 1034199, 1584543, 1738428, 1683349, 1911847, 2192091, 1839321, 900831, 192401, 42262, -181414, -981554, -1844572, -1890365, -990991, 151297, 771801, 614461, -10391, -493210, -433011, -20920, 262754, 335850, 550545, 988160, 1171878, 704562, -169859, -878716, -1082183, -730082, 67916, 947105, 1383204, 1193478, 715106, 289971, -98560, -466836, -557477, -279420, 11365, 114260, 429132, 1223754, 1866616, 1561186, 603236, 36859, 125025, 112692, -330581, -435397, 392005, 1440655, 1599369, 887401, 293700, 359198, 680135, 734287, 495919, 162643, -130095, -180899, 180847, 708671, 920384, 828923, 971333, 1457515]
34539A457515J22304p22344q82901r57P99800M93837m05382p33420l91529k26426
34529d89503n08834n79756p5651M35878L85745M9578J033K30464L12641J28032
34519a10373o4741j09204j10944j89465l41628m94171n15622k70340J95567O12879
34509a398042P10923L84252k99945j011320j173434n18314L77305O58274L65075
34500a905226L55185Q45962R04905m8163j053514q37995L07223R27566M46105
34491e7952k49656k78973J53485M02067L16017J48056M9614k926q6963k92916
34481I9853n46544n12711l6455M42203M00292L6703k3981K55864L02606o5822
34471C52008l39169j47877K66887N62291O44837M13504j61393o04318l46722K94075
$$ y = [1457515, 1579819, 857475, -25426, -26383, 773417, 1267254, 861872, 128452, -263077, -489503, -998337, -1578093, -1653744, -1217866, -832121, -782543, -781510, -551046, -238405, -110373, -175114, -284318, -395262, -584727, -926355, -1420526, -1936148, -2206488, -2010921, -1398042, -687119, -302867, -602812, -1614132, -2787566, -3305880, -2928575, -2270301, -1905226, -1550041, -704079, 200826, 152663, -900851, -1738846, -1431623, -504057, -57952, -307608, -586581, -433096, -31029, 284988, 433044, 482658, 479732, 392769, 99853, -446691, -959402, -995857, -553654, -153362, -116659, -140640, 115224, 417830, 352008, 12839, -135038, 131849, 694140, 1338977, 1752481, 1591088, 986770, 640048, 934123]
34461I34123M03539q3739k33503K54898M10364l60572j090436o97943K53085M08063
34451A97879l46774r16564p32440k68231P0239M47922Q66956Q83673L40690l08722
34441B34628o49266p34724p23847o08159m39092l36538j47792M10131J113731
34432a880928J240488M95563m43365o53667m7313N93327O18765K70923K58717
34423D52510O93694Q35226J28914q66898j134469n82337o1364k1194r179L01573
34413b63524N15128L60027K31517L32533J79748l50556m55403K09347N69819k21303
34403A107333j076004m67964R84635J252415n199r74469n28250L03211L03374
34394H99082j22192m2004L68308L63587o9537m27707n88707o83610n87633k19052
$$ y = [934123, 1337662, 1253923, 1020420, 1275318, 1685682, 1325110, 234674, -463269, -210184, 197879, -148895, -1065459, -1797899, -2066130, -1995891, -1547969, -681013, 202660, 543350, 234628, -414638, -1149362, -1873209, -2481368, -2920460, -3256998, -3404790, -2994659, -1880928, -640440, -144877, -588242, -1241909, -1289222, -695895, -77130, 193793, 452510, 1146204, 1981430, 2110344, 1243446, 108977, -473360, -534724, -555918, -565097, -263524, 251604, 611631, 843148, 1175681, 1355429, 1004873, 549470, 758817, 1328636, 1107333, 31329, -436635, 548000, 1800415, 1795216, 820747, 292497, 595708, 899082, 776890, 734886, 1103194, 1466781, 1397244, 969537, 380830, -302780, -890413, -1109465]
34384a109465J17225K26979L58806N77939M42637j52995m85577k6548O27703N91097
34374A167801j9697l83365k06793P2831Q6468j03878k89838k83263K0425L90864
34364D51555L73537k4567j85822K03072N96768M33038j388j34677m0009j27160
34354A544347l39560l87623m19695p03016r31704o26979j813L36413L55269M94156
34344f80205P49183O89805L37845J91309K93636P8834o36771j195665r64497j81007
34334a317533L76297K69485k47615n59223k81271L50496P47421P03655N84074
34325F25786O19859N15864J46581M4541N10838P78453J7155j175856j414992n52392
34315A15837J36257n5579l14262J77917Q79660Q21333J12037l54583k30501M6379
$$ y = [-1109465, -992240, -765261, -406455, 171484, 614121, 461126, -24451, -50999, 576704, 1167801, 1148104, 764739, 557946, 630777, 717245, 613367, 323529, 40266, 60691, 451555, 825092, 800525, 614703, 817775, 1414543, 1847581, 1846193, 1711516, 1671507, 1544347, 1204787, 817164, 397469, -305547, -1237251, -1864230, -1866043, -1529630, -1174361, -680205, 68978, 758783, 1096628, 1287937, 1581573, 1660407, 1023636, -172029, -1136526, -1317533, -941236, -671751, -919366, -1478589, -1759860, -1409364, -661943, 41712, 625786, 1245645, 1761509, 1908090, 1952631, 2463469, 3241922, 3259077, 2083221, 668229, 115837, 252094, 196515, -117747, 60170, 939830, 1761163, 1873200, 1518617, 1288116, 1334495]
34305A334495P4013j25691l90089n50107m02845J7172K97282J79867K2280K52149
34295G08526N76079L49890l20492n51302M2901O77354M49187l79025p60491l43920
34285D48707J17063n5885n23470n52184r2594L22094M52416M86611M45356J42352
34275A190466k68809m09559m01088p00089j056827n64125Q35666J827123J398843
34266A851601K50956l10546j89395k07934n51749o70588m62855m16088o10782
34257a317380n73267j37788L88361Q46586J189115J030564K11744m35323o9663
34248A132949O01344J76707j042359j208441J47733J147054L88716q92399p96458
34239c45154M04445R74106M16297j84482j54170j4464k35835m60707k75058R7235
$$ y = [1334495, 1408508, 1282817, 892728, 342621, -60224, -43052, 254230, 434097, 456377, 708526, 1284605, 1634495, 1314003, 762701, 805602, 1482956, 1932143, 1553118, 792627, 448707, 565770, 509885, -13585, -565769, -658363, -336269, 116147, 602758, 1048114, 1190466, 921657, 512098, 111010, -589079, -1645906, -2210031, -1374365, 452758, 1851601, 2102557, 1792011, 1602616, 1394682, 842933, 172345, -290510, -706598, -1317380, -1890647, -2028435, -1640074, -793488, 395627, 1426191, 1637935, 1202612, 1132949, 1734293, 1911000, 868641, -339800, -192067, 954987, 1343703, 451304, -345154, 59291, 1033397, 1449694, 1265212, 1111042, 1096578, 860743, 400036, 124978, 222213]
34229B22213K10055J8990j21434J20272O04450O72049o9787q82567n77468O76296
34219H73069J233382K78369q48101o46504K51998K35048o12778p61840J21467
34210A24110O65562J41128m27133j14170M11317J42488o09230p97878j78069N91940
34200d9935Q88636N14131l68679j114648r16123J53155Q93632M26437n55141p21703
34190h50238L3951N40842R9465n60860l71053O07494J285676R21953m7890o54502
34180A004838n57681k23935l9018K17112P33759J018392N09485m00043o91451
34171A571458r2399N60489M82890j45477o51525o97222l71535O2136K54943M4691
34161A018449j82745R8784O50246O25250j28310o95704m58642m3353k48183p21629
$$ y = [222213, 432268, 451258, 329824, 450096, 1054546, 1726595, 1656808, 774241, 196773, 873069, 2106451, 2384820, 1536719, 890215, 1142213, 1377261, 764483, 2643, 124110, 789672, 930800, 503667, 389497, 800814, 943302, 334072, -463806, -641875, -49935, 838701, 1352832, 984153, -130495, -1046618, -893463, 169, 426606, -128535, -850238, -816287, -275445, -175980, -736840, -1107893, -500399, 785277, 1707230, 1659340, 1004838, 447157, 223222, 184204, 401316, 1135075, 2153467, 2662952, 2262909, 1571458, 1479059, 2039548, 2522438, 2376961, 1725436, 1028214, 656679, 718815, 973758, 1018449, 835704, 934488, 1584734, 2209984, 2081674, 1385970, 927328, 883975, 635792, -85837]
34151h5837n76137J58570O37939N17326K80855L30096N05516N26348L02608j53157
34141B444127o12219o04953p6375K15188l25462j058647r35091j62004J01198
34132a014238l20291l25629M97001J002965L39417n40651k99196P17819J075446
34123A132643L99212l30160m19621k06186j16013n1479M6193q4550m13128m55140
34113d98229p0838K23996J20411P3467N20200J062281J010054L88693j94554m60523
34103B174958o17272o99596m11444K11273N40622J40353n25400o36537j42589
34094C4368J78176j12423m25966m6530O87268Q02255J84766j99228J67919M67847
34084A738452j71116j180587j279870l48641M61384M40546J30530K06041M65982
$$ y = [-85837, -661974, -503404, 134535, 651861, 932716, 1262812, 1768328, 2294676, 2597284, 2444127, 1831908, 1226955, 1150580, 1365768, 1040306, -18341, -953432, -1115436, -1014238, -1334529, -1660158, -1163157, -160192, 179225, -361426, -660622, 57197, 1132643, 1531855, 1201695, 782074, 575888, 459875, 408396, 454589, 370039, -43089, -498229, -569067, -345071, -224660, -151193, 369007, 1431288, 2441342, 2830035, 2635481, 2174958, 1557686, 858090, 446646, 657919, 1198541, 1338894, 813494, 176957, 34368, 212544, 100121, -325845, -372375, 314893, 1117148, 1301914, 1102686, 1270605, 1738452, 1567336, 386749, -893121, -1241762, -780378, -339832, -209302, -3261, 462721]
34075D62721L87130P605k36319j17945K76443O67741O31548Q439o30572n58503
34065H98288k3512K0329n16461o14023J21524O71241K91421j97513J29611O32194
34055A413099K46765n67858n94496M2295K14201j56960j37335K99616K24072l16511
34045F66888j97216O33798Q07288p2267n71977J26548P34684M9526r56879p70665
34035D49728K14193N50906Q9420k37854k72415n27892o94088j7375R92464R63726
34025A510813j10329o56628R0754R42283O30227l57843o71215j5258P08758P66340
34015B837902L23880p8916k35142l05252l85816k98111O4253L44642Q2378n14564
34005A835254o87387k06230K77044K91570K73557O80034J048732P12260n8688
$$ y = [462721, 849851, 857456, 621137, 503192, 779635, 1447376, 2078924, 2087363, 1456791, 898288, 874776, 895105, 378644, -235379, -113855, 557386, 848807, 651294, 780905, 1413099, 1659864, 1092006, 497510, 539805, 754006, 597046, 459711, 759327, 983399, 666888, 469672, 1103470, 1910758, 1838491, 1266514, 1393062, 2127746, 2177272, 1220393, 449728, 663921, 1214827, 1304247, 1066393, 793978, 266086, -428002, -445377, 547087, 1510813, 1400484, 743856, 834610, 1776893, 2407120, 2049277, 1378062, 1362804, 2071562, 2837902, 3161782, 3082866, 2847724, 2542472, 2156656, 1858545, 1922798, 2267440, 2349818, 1835254, 1147867, 941637, 1218681, 1510251, 1783808, 2463842, 3512574, 4224834, 4166146]
33996D166146m60804l34218j27835j8119J32358K20524Q4969l0084Q8811R2912
33986C814660k67340m29941J12598P18874M60406l10518m55029J48654N45500
33977D337864L25535O6467J54386L16572L81470M68231M34994J10058r3958J90343
33967F691962L91011p8161m82831J40704J033343P08676l86841l56907R74431
33958H635387J685352R38871K11925O19852J262663J237067J200089J755647K208132
33949A9754985K154147K500538L666132M571046M673717N200465P072096R463616
33941E9056742J1672129J4440865J8344983K3283401L0363751M0172732M6807949
33934B44142552L8770093J1662246k2381372m4157613m6058108l6554769k7102481
$$ y = [4166146, 3705342, 3371124, 3243289, 3225170, 3357528, 3578052, 3663021, 3632937, 3721748, 3814660, 3547320, 3117379, 3229977, 3948851, 4409257, 4098739, 3643710, 3792364, 4337864, 4663399, 4729866, 4884252, 5200824, 5582294, 6050525, 6485519, 6595577, 6501619, 6691962, 7082973, 7004812, 6521981, 6662685, 7696028, 8404704, 8017863, 7660956, 8635387, 10320739, 11259610, 11471535, 12091387, 13354050, 14591117, 15791206, 17546853, 19754985, 21909132, 24409670, 28075802, 32646848, 37320565, 42521030, 49593126, 59056742, 70728871, 85169736, 103514719, 126798120, 157161871, 197334603, 244142552, 282912645, 294574891, 272193519, 228035906, 181977798, 145423029, 118320548]
33927A18320548k1020390j6306027j2518674j0545896r396636p509136n463234
33920C5560555m525126m130761l191602k290665k350737k613594k052315j363679
33912A3042076j503944j661355q10006P1329l99096j369405j107351l9416M5265
33903F268097q32435r90750r3208M44900N2373k90696j70854m24741j246106j538109
33893A178471p95140J7053J25961L0726K52336L75137P1932j42825M7424Q4572
33883A245647l09553l65871M25358J167292P71835l58607r46565o75516l29259
33874F24761l40476k82561J33793N00189M40329J83992K3384k22430o81579q20843
33864d41441r7882R41330J073591J10281o36503j44137Q00890P61188k00551p24278
$$ y = [118320548, 97300158, 80994131, 68475457, 57929561, 48532925, 41023789, 35560555, 31035429, 26904668, 23713066, 21422401, 19071664, 16458070, 14405755, 13042076, 11538132, 9876777, 9066771, 9138100, 8739004, 7369599, 6262248, 6222832, 6268097, 5435662, 4444912, 4351704, 4796604, 4848977, 4558281, 4387427, 3962686, 2716580, 1178471, 383331, 400384, 526345, 557071, 809407, 1184544, 1256476, 1113651, 1161075, 1245647, 936094, 570223, 995581, 2162873, 2934708, 2576101, 1629536, 954020, 624761, 284285, 1724, 135517, 635706, 1076035, 1260027, 1283411, 1060981, 379402, -441441, -539323, 402007, 1475598, 1585879, 949376, 805239, 1606129, 2367317, 2166766, 1442488]
33854A442488l23547K7002k88782n25931m6036M82205L18138R843L08513N88857
33844A992750j77477j394821j412383n2501R72755M92797n90643p95011o4825
33835a029359M77553J85099m37445n08560K03392R97012R40563N319p08292k93280
33825a67998O43390O60021n61848j704662j460714m2600J250633J461723O54588
33816G32533m08693r16527n88420J13765M52685J54804m40445q64265q89155n34619
33806c188337l2119L02902M36680O51084R21116O72133k98724j097609p51881
33797b384755L23545Q33712M54330J07248L15036M36303p0341o64514o37523k18980
33787a505939q1091k94278m06633j65897L33938Q63908J037716N06634m41758
$$ y = [1442488, 1118941, 1145943, 857161, 331230, 285194, 767399, 1085537, 1095380, 1403893, 1992750, 1815273, 420452, -991931, -1044432, -71677, 421120, -169523, -964534, -1029359, -551806, -366707, -804152, -1312712, -1109320, -112308, 828255, 833574, 125282, -167998, 475392, 1135413, 573565, -1131097, -2591811, -2634411, -1383778, 77945, 732533, 323840, -592687, -1181107, -1067342, -614657, -459853, -900298, -1764563, -2653718, -3188337, -3220456, -2917554, -2480874, -1829790, -908674, -236541, -535265, -1632874, -2384755, -2061210, -1227498, -773168, -665920, -350884, 85419, 15078, -649436, -1286959, -1505939, -1587030, -1881308, -2287941, -2453838, -2119900, -1255992, -218276, 288358, -153400]
33778a53400r25445n06967K36575N52355M44019L46280L56282L00736J76513K7803
33768H54751k72906o69282p09206j57717N16178P18064M53571N5362l85245p96265
33758c92695p75489j20334O04233O87287K25893j60762l02453m63163n85685l69331
33748a652499k6432j09348m88932l43923N39603J204260P51404l80813r45707
33739a452387m37103M25375P09728L17326j32734j74324N4741K03971K33880L13568
33729F2041L80152J90947j80084l11137m1764K58659K35338R200j40616j82100
33719B80636j22420K09429P64932J013933N83147r6298l09581n5222J5602m29908
33709A854250j004903j162335p34631O1321P80064R64561N75478J23464L1493
$$ y = [-153400, -1078845, -1585812, -1349237, -796882, -352863, -6583, 349699, 650435, 826948, 854751, 581845, -87437, -796643, -954360, -438182, 279882, 733453, 788815, 403570, -392695, -1168184, -1288518, -684285, 3002, 228895, 68133, -234320, -697483, -1283168, -1652499, -1678931, -1788279, -2277211, -2621134, -2081531, -877271, -125867, -506680, -1452387, -1889490, -1464115, -754387, -437061, -569795, -744119, -689378, -485407, -251527, 62041, 442193, 633140, 453056, 141919, 100155, 358814, 594152, 603352, 462736, 280636, 158216, 367645, 1132577, 2146510, 2729657, 2633359, 2323778, 2268556, 2284158, 1854250, 849347, -312988, -1047619, -986298, -206234, 758327, 1333805, 1457269, 1488762]
33700A488762M9420k58630o75234n96928l4240L35878J48766k63807n43662o86682
33690a036357o04627l3212Q03297J109842N73162n0337N0875N70260N59711j72220
33680A770394q04714o31049J13748O86030O90598K86419k10630o38438r24545
33671C37813r45776o31524j52657K19950M98096R23834J358883J132668j3608
33662B727679j129360r68713K72179R55125Q1989j350056j675408p00938K82239
33653a505264L77170O7639J70880N68857N05999j98315q08829n95666K55520Q68813
33643b93196O89911L5676m04834l81469j81814o7472L1996K10870L13870J83131
33633A36669l5124p5397P0068J82611J64663J44264K24109K90044J42455k30958
$$ y = [1488762, 1538182, 1279552, 604318, 7390, -26850, 309028, 457794, 193987, -349675, -1036357, -1640984, -1674196, -870899, 238943, 812105, 761768, 812643, 1382903, 1942614, 1770394, 965680, 334631, 448379, 1134409, 1825007, 2111426, 1900796, 1262358, 337813, -607963, -1239487, -1392144, -1172194, -674098, 249736, 1608619, 2741287, 2727679, 1598319, 629606, 901785, 1856910, 1938899, 588843, -1086565, -1787503, -1505264, -1128094, -1060455, -889575, -320718, 185281, -13034, -821863, -1417529, -1162009, -293196, 396715, 432391, 27557, -353912, -535726, -603198, -571202, -360332, -46462, 136669, 101545, 26148, 96216, 278827, 443490, 587754, 811863, 1101907, 1244362, 1013404]
33623A013404n62865n34525j46700J91974P4991m16193p84317o81047k35457J99283
33613a881452M28084M74663M44692M29086M20735K92570O062j90126l8925K37847
33603F23236J08716m65109p91707l15390N76035R84550N66066j91415o29036n07453
33593d1507j1177M84040O28036L45707q7653l59846m29031l68001j14827L07671
33583C53412N11678J41652m97816p01587l24953n471k36073o56278n84175N6194
33573a943417O90983P93057L17620m03711q97180p89931j49894M43533M57580
33564a481360M7994j15729L01006Q90446J040415O36506N5406l58233n61242o23488
33554a68279n37106l09415q3507n666j9996N8247K59345M03201L88894L64036
$$ y = [1013404, 450539, -83986, -230686, -38712, 36279, -379914, -1164231, -1845278, -2080735, -1881452, -1453368, -978705, -534013, -104927, 315808, 608378, 614440, 424314, 385389, 623236, 731952, 266843, -524864, -840254, -264219, 720331, 1286397, 1094982, 465946, -41507, -52684, 431356, 1059392, 1405099, 1317446, 957600, 528569, 160568, 45741, 353412, 865090, 1006742, 508926, -192661, -517614, -523085, -759158, -1415436, -1999611, -1943417, -1252434, -459377, -141757, -545468, -1442648, -2232579, -2382473, -1938940, -1481360, -1433366, -1549095, -1248089, -357643, 682772, 1319278, 1374684, 1016451, 455209, -168279, -705385, -1014800, -1098307, -1103973, -1123969, -1065722, -806377, -403176, -14282, 349754]
33544C49754M33765L50703j89408r47019j205780o27295K56907O93195O13636
33535b71542N14639N79774M38741j22854o95380p54853l27545J39919L51071L28147
33525A80117K01509J17854K10795L89620L11093j43265n38798m19428k7721j1853
33515B69923m44484o69902k53901M09038O72667M12782n1117m45788o27726m68948
33505a197456k4585L68871M68997M34167M85507M70728J03853n04904r06274q35173
33495a136269m09649J04266M74088N50732L92310K48953K18479P7806l03531n91322
33485c74137l66139K56486P03872N58709j15599q61314j034713k90447Q02406
33476g20876J063498J29163q63253o91602K75894P05557K69185j26650R517J32409
$$ y = [349754, 783519, 1134222, 944814, -2205, -1207985, -1835280, -1578373, -885178, -271542, 243097, 822871, 1261612, 1138758, 443378, -311475, -639020, -499101, -148030, 180117, 381626, 499480, 710275, 1099895, 1410988, 1267723, 728925, 309497, 281776, 269923, -174561, -844463, -1098364, -689326, -16659, 396123, 345006, -100782, -728508, -1197456, -1222041, -853170, -384173, 49994, 535501, 1006229, 1110082, 605178, -301096, -1136269, -1545918, -1441652, -967564, -416832, -24522, 224431, 442910, 520716, 217185, -374137, -740276, -483790, 220082, 778791, 663192, -198122, -1232835, -1523282, -720876, 342622, 471785, -391468, -1083070, -807176, -101619, 167566, 40916, 50433, 182842]
33466A82842q1434j01116K98278L64587l67320j057496p33530J90021N34091N0989
33456g20088m40044l53639Q3454M49701N99933N19082K35700j06255l82208n41385
33446f55749l83397K54997Q68280N75490m81867r12190l4643Q37630K47206j036717
33436g20960j045460L91988J427371J008729J58418j5696O4196l30723p68884
33427A68979n39777k7317k8513l53793k28854L27915N76551K78597p9376j99941
33417a05529l08817n43884o56453m36392j5979L15252L79415K97747N16351J270232
33407G11943J852255J084511r73227k486661j884101O1195J226036R04891L41439
33398H38281M98405P10362J30167o72872n83868K66209O93111K17173l83807l72358
$$ y = [182842, 101408, 292, 298570, 663157, 295837, -761659, -1495189, -1305168, -771077, -720088, -1160132, -1513771, -1430317, -980616, -380683, 138399, 374099, 267844, -114364, -655749, -1039146, -784149, 84131, 659621, 177754, -734436, -769079, 68551, 315757, -720960, -1766420, -1374432, 52939, 1061668, 1220086, 1204390, 1268586, 937863, 168979, -370798, -398115, -426628, -780421, -1009275, -681360, -104809, 173788, 94412, -105529, -414346, -958230, -1614683, -2051075, -2067054, -1751802, -1372387, -1074640, -558289, 711943, 2564198, 3648709, 2675482, 188821, -1695280, -1634085, -408049, 496842, 838281, 1336686, 2047048, 2177215, 1504343, 920475, 1186684, 1879795, 2096968, 1713161, 1340803]
33388A340803l3196J3438j65421o7084K91676L22455k12216p64526p30378k39753
33378b44202J23908J45466Q8990J01186P728k18152k64954j486K03879K4719k45082
33367b78000o2589N59664J023755Q95983L47080j87302m84675n70684n03828l06106
33357D33298n4136P8939n6316l85450n89191m22825n3575J05122o3844k24614
33347a232592o8621K82940N13857N36122M75604M00755K79509R8986j36834m22760
33337G26966o43991n97089k48617J65569L93713L66376J15686k46464m36552k34606
33327f39009J17154J68465L325J74388P00703Q14161J21714o59607p30216l41958
33317b70880j54675n1890M28183R18173O39929j71629m60873k4898J95090k46014
$$ y = [1340803, 1307607, 1321045, 1155624, 1088540, 1380216, 1702671, 1490455, 725929, -4449, -244202, -120294, 25172, 114162, 215348, 223076, 4924, -260030, -261516, -57637, -32918, -278000, -340589, 219075, 1242830, 2138813, 2485893, 2298591, 1813916, 1243232, 739404, 433298, 379162, 458101, 401785, 16335, -572856, -995681, -1049256, -944134, -1007978, -1232592, -1301213, -1018273, -504416, 31706, 507310, 908065, 1187574, 1286560, 1149726, 726966, 82975, -514114, -762731, -597162, -203449, 162927, 278613, 32149, -404403, -639009, -521855, -353390, -350065, -175677, 525026, 1339187, 1460901, 801294, 71078, -270880, -425555, -477445, -49262, 868911, 1508840, 1337211, 876338, 851440, 1046530, 800516]
33307H00516n49368r1265M72343K97113k67969k96732K48653N92824M17554J92234
33297A815903K67560L69036J59041k10934l76513l15648l47554o10454p61284
33288a0847m07719K03400L13289l08132q66268n64303K42525O07415M30124M08589
33278D8073O35712L72650n07945r79058l62083N62761P07229J80991j79342j58782
33268C20206j40879k04067j60150j86110n46560q91652o39838Q0618O02530O87844
33258a078058O29677N57407L67190K02542K64547K65637j70362o81911n68604
33249b11935L7749K78579j01345m12406j74760K31907L34752K06778K2919l04513
33239i2275o77189o40930p3344M88665N72662L47360J82060J26014J05564J26596
$$ y = [800516, 251148, 159883, 632226, 929339, 661370, 364638, 613291, 1206115, 1623669, 1815903, 2083463, 2452499, 2611540, 2400606, 2024093, 1708445, 1360891, 750437, -10847, -418566, -215166, 98123, -210009, -1076277, -1640580, -1398055, -790640, -360516, 48073, 683785, 1056435, 548490, -430568, -792651, -229890, 477339, 658330, 478988, 320206, 179327, -24740, -184890, -371000, -917560, -1809212, -2449050, -2368432, -1765902, -1078058, -448381, 109026, 476216, 678758, 943305, 1208942, 1038580, 356669, -211935, -174186, 104393, 3048, -409358, -584118, -352211, -17459, 189319, 212238, -92275, -769464, -1410394, -1483738, -995073, -422411, -75051, 107009, 233023, 338587, 465183]
33229D65183J7162m68236j011864q52497P5219P97695O09003O4499K4625L19718
33219D0507K13393k32011k46690K95281N61781N209p94797q99885k07933M79553
33209g85592M20457k69012p64271m22339N05749J141188R47422K33567l52900
33200F54269n39364m75920l69129l32189m00126m46837k35565K57023P12913Q01807
33190c73118M74788j10727o80722q40468m03524J89488K89318R682J41261Q41288
33180d62734J191129N76983k64857l54295M7801M3400l14338k18951L12475L24995
33170H81608m56151j032296n84521L65141P72651M08813j30622k88867M447M09061
33160C49264M08346k09054r35350j002930l66095K67523M84226N96706Q12447
$$ y = [465183, 482345, 14109, -997755, -1850252, -1775033, -977338, -368335, -303836, -279211, 40507, 253900, 21889, -224801, 70480, 632261, 637470, -157327, -1057212, -1265145, -785592, -365135, -634147, -1398418, -1820757, -1315008, -173820, 773602, 1007169, 654269, 114905, -361015, -730144, -1062333, -1462459, -1909296, -2144861, -1887838, -1174925, -373118, 101670, -9057, -689779, -1530247, -1933771, -1744283, -1454965, -1445283, -1304022, -462734, 728395, 1305378, 1040521, 686226, 734027, 777427, 463089, 244138, 556613, 881608, 425457, -606839, -1191360, -826219, -53568, 355245, 224623, -64244, -59797, 349264, 757610, 548556, -386794, -1389724, -1755819, -1488296, -1004070, -407364, 405083]
33151D05083P24269J01365m67858l62949R9167J39382l50182p65594o71415j72150
33141a320882M19429P82680O27808K3575m60367l84932l1827Q3544J6923J25315
33131a18734K39132j27638p91745r35571k88831M46738O22348M32571L18713K06729
33121C712j19835l55518n6363N16108N90640l6595o50684n49568K8147K23403
33111d06553l16082r53629q44486r888O79253O13345J55159j4650J12787O2888
33101i21856j60673k9106N18442P75477L10565k98488k66975L07315O90174N18501
33091A443376M5323l55957m50987j79618J12700j53875q62857r47029J51838J281116
33081H4030R61109l52159q04044N3967O25494q2390q33684k39879R23667R54116
$$ y = [405083, 1129352, 1230717, 762859, 399910, 499077, 638459, 288277, -477317, -1148732, -1320882, -901453, -118773, 509035, 532610, 72243, -312689, -344516, -260972, -244049, -118734, 120398, -7240, -798985, -1734556, -2023387, -1576649, -954301, -521730, -203017, 3712, -116123, -471641, -528004, -11896, 578744, 542149, -108535, -658103, -629956, -406553, -722635, -1676264, -2520750, -2530638, -1851385, -1238040, -1082881, -1097531, -984744, -921856, -1082529, -1111635, -593193, 182284, 492849, 194361, -72614, 234701, 924875, 1443376, 1488699, 1132742, 681755, 502137, 614837, 460962, -401895, -1348924, -1197086, 84030, 1045139, 692980, -111064, -57097, 568397, 486007, -347677, -587556, 336111, 1290227]
33071A290227j37842q37461m94901R2376K97895L75226M61648K19478k63314l65568
33061F37764j5952J55470p394O6499M69094M94310n6362l91375j03191R9754k75037
33050A073580n42827q9580M22337J47405m74621m98118p3095n0193m29124m32516
33040i46752Q5501M39885K73280n7947k55016l86463m15061j57052K71430N55742
33030e92453O22350M72043q9237r18412j179409l50135P98403J117525N90302
33021D70977j174m15679q09020p52078J63197J042931O25518n94275q69642Q9343
33011a049902P27374K79880j34551K74386N78668M097n27809n9618O37558M13007
33001A143090l32810n44247l21125l38335l60109J13088M97332M3134n49332j10781
$$ y = [1290227, 1152385, 314924, -179977, -87601, 210294, 585520, 1047168, 1266646, 1003332, 637764, 621812, 777282, 769888, 836387, 1305481, 1799791, 1743429, 1352054, 1248863, 1348617, 1073580, 530753, 441173, 863510, 1010915, 536294, 38176, -34919, -85112, -514236, -946752, -861251, -421366, -148086, -206033, -461049, -847512, -1262573, -1419625, -1148195, -592453, 29897, 501940, 412703, -505709, -1685118, -2035253, -1236850, -119325, 470977, 469803, 54124, -754896, -1506974, -1343777, -300846, 324672, -269603, -1139245, -1049902, -322528, -42648, -177199, 97187, 675855, 679952, 152143, 92525, 730083, 1143090, 810280, 266033, -55092, -393427, -753536, -640448, -143116, -99982, -649314, -760095]
32991g60095R05600J043316K02843l92918l97953o50254j230118j090761l256
32982b373596Q44960P54256M71104O05958N83815m426l69176J32708P35354M58982
32972A839939k90558m29731J21950N10354K54879m04084j077293j360519q26685
32963a661748L02617Q98192K30271q04048p33529M11942J129988N69719m19372
32954g5968o53026j12675M34266O17842O02281M52970O7014l89163n57525m29175
32944d3159l37647l42060r2732M90010Q62372N63764n3032k75967j0903K24567
32934I85213J61255L0986k5661j54851l04061k16059n8478l05750p53222n32360
32924a172988M52538J052161N21562k83797k80745J28568j14679q66497j090247
$$ y = [-760095, 145505, 1188821, 1391664, 998746, 600793, -49461, -1279579, -2370340, -2373596, -1528636, -774380, -303276, 302682, 886497, 882071, 512895, 645603, 1380957, 1839939, 1549381, 1119650, 1241600, 1751954, 2006833, 1602749, 525456, -835063, -1661748, -1359131, -460939, -230668, -1034716, -1768245, -1356303, -226315, 343404, -75968, -728994, -841669, -407403, 210439, 812720, 1265690, 1332704, 943541, 386016, -43159, -380806, -722866, -815598, -325588, 536784, 1100548, 1047516, 771549, 760646, 985213, 1146468, 1177454, 1151793, 996942, 692881, 476822, 418344, 112594, -640628, -1172988, -720450, 331711, 853273, 569476, 288731, 417299, 302620, -563877, -1654124]
32915a654124n65157R5536P69260J665736K093050J085212o89451j386588o45996
32906G67478o3048n20577q65901r7959Q53722P55690M8760j79725m5578k44405
32896D08457n24160k83109L3317l52688r69262p22738K36909P21354L88738N7320
32886a005862J99219M15638M70386O39318Q60436O14673j03475o09622n43907
32877I36804k75791j60947j52210k34729m79806n88512j51600N54228P87932M35083
32867F70452J22929J87260L05850K40014J42813J3188l73127q50819r21812n22231
32857i85483k6045M69717J011749J064454O2652j250245j351442j35859P51955
32848c88547L35910k93259J49829J116008J220325L31299n88223j045324j171186
$$ y = [-1654124, -2219281, -2123745, -1354485, 311251, 2404301, 3489513, 2800062, 1413474, 767478, 704430, 183853, -682048, -780007, 73715, 829405, 878165, 698440, 652862, 408457, -115703, -398812, -365495, -718183, -1687445, -2410183, -2173274, -1451920, -1063182, -1005862, -806643, -391005, 79381, 718699, 1579135, 2193808, 2090333, 1480711, 936804, 661013, 500066, 347856, 113127, -366679, -955191, -1106791, -552563, 235369, 670452, 793381, 980641, 1286491, 1526505, 1669318, 1682506, 1309379, 458560, -463252, -985483, -1011528, -541811, 469938, 1534392, 1597044, 346799, -1004643, -1140502, -388547, -52637, -345896, -196067, 919941, 2140266, 2471565, 1883342, 838018, -333168]
32839c33168q42466L4952O78483J99650q52346r93333L1470Q11093L40273o02574
32829a527966p56836j48427K64134J30275j6438J80382L94400K93446R4694J26291
32819i66045K37778P4497k54712k77043O4696K55917N8232k1353M03928P33513
32809C09408J74032q25216r45247N3065Q11085L28823n15984l05109P28334J022194
32799H35385K4821r60878o03168O42826J165619K65211j015734j175039j4078
32790h35035J173053J183287L35317r5365K86791M67481l86022j556787j725053
32781a152333q15349K3046J31050N7965L91031P78349O26247J29959m4594K32558
32771C57929M93393M69209L64386L18442J38812k30378m12257j28327K48271J21425
$$ y = [-333168, -1175634, -1140682, -462199, -262549, -1114895, -2108228, -2076758, -1265665, -925392, -1527966, -2284802, -2433229, -2169095, -2038820, -2055258, -1874876, -1480476, -1187030, -1092336, -966045, -728267, -653770, -908482, -1185525, -1120829, -864912, -806680, -828033, -424105, 309408, 483440, -341776, -1287023, -1233958, -422873, -94050, -610034, -915143, -186809, 835385, 860206, -100672, -703840, -61014, 1104605, 1369816, 354082, -820957, -835035, 338018, 1521305, 1856622, 1761257, 2048048, 2515529, 2129507, 572720, -1152333, -1967682, -1944636, -1813586, -1755621, -1364590, -586241, 40006, 169965, 125371, 357929, 851322, 1320531, 1684917, 2003359, 2142171, 1911793, 1499536, 1371209, 1619480, 1740905]
32761A740905m46242p74140n38023j61518p252K18985P45595R73470K80607p27911
32751A304476q29014k2792L97066j12820m93932M2699N30965j84804j330537j189816
32741a888509K40324J224702R07841L37161M88117P83830L75848l29871m82350
32732A657093k53811l64655p04864n77830l2822J44738k69932o24120m66851q7571
32722a580625K10518N64472R53071Q84736J97477l87751j48880N24192N63657
32713A780867l09912j170179j080430k28274M55327N27988M38873O88758J016846
32704B119864P75156l9700o07342l25848L30072L98182k85719q90801p43705j85737
32694E44422J7756k32761l33081Q2800O22837O82544K08986k97307m20213k65729
$$ y = [1740905, 1294663, 520523, -17500, -179018, -186270, 32715, 778310, 1751780, 2032387, 1304476, 475462, 452670, 849736, 736916, 242984, 285683, 816648, 631844, -698693, -1888509, -1648185, -423483, 484358, 821519, 1309636, 2093466, 2469314, 2139443, 1657093, 1403282, 1038627, 333763, -244067, -276889, -132151, -402083, -1026203, -1493054, -1580625, -1370107, -805635, 147436, 1032172, 1229649, 841898, 693018, 1217210, 1780867, 1470955, 300776, -779654, -1007928, -552601, -24613, 414260, 1103018, 2119864, 2895020, 2855320, 2247978, 1922130, 2252202, 2650384, 2364665, 1473864, 730159, 544422, 562178, 329417, -3664, 79136, 701973, 1384517, 1593503, 1296196, 875983, 610254]
32684F10254k35669m69831o35357l39126L29064Q49187Q88359O34808L98163J41473
32674B171325l23885q73435j148235j007805n86698j4089N41914O85072J91744
32665c64092m14471l34548L13134M69110l55605j229031j025638M5183Q39801
32656b056157Q23567M47209K08499J26861J02249R4866p1398m70234o57974j42288
32646a594800P42280J121601P78026L14454N0381l74081j031453j243176n94646
32637a831414L05462O60491N01536L05956J52508j05753k75716j03066J95033
32628a94963K68577K17561K83525K73317j03256n79411o39801l03454k1340M3062
32618g56183P0984Q6006l4309j59523n6797J59976K18820J80917K53829L15362
$$ y = [610254, 374585, -95246, -730603, -1069729, -740665, 108522, 996881, 1631689, 2029852, 2171325, 1847440, 974005, -174230, -1182035, -1768733, -1782822, -1240908, -555836, -364092, -778563, -1113111, -799977, -330867, -686472, -1915503, -2941141, -2895958, -2056157, -1232590, -785381, -576882, -450021, -347772, -252906, -324304, -794538, -1452512, -1594800, -852520, 269081, 1047107, 1361561, 1411942, 1037861, 6408, -1236768, -1831414, -1525952, -865461, -363925, -57969, 94539, -11214, -286930, -389996, -194963, 73614, 291175, 574700, 848017, 744761, 165350, -474451, -777905, -799245, -756183, -685199, -599193, -633502, -793025, -849822, -689846, -471026, -290109, -36280, 279082]
32608B79082J70920N9764K64741M15631p5097r66748j338674q03932J15037Q28206
32598a051070J176595J072166M44785k96223n07075k29063j49505m44466m53857
32589d37713J67266P81435P48127L65986K28594K12919j84301q64432j178449
32580a60568q27201j85021K21143J91758j15302l57795k79170K7566K36821K37697
32570a010072K41346L82680N16366M98617L50901O6199l87555q05636q95675p37557
32560a780386o27537m60459J02180P90170Q64260L44595K00567Q32586J260374
32551A526350N69916n92796r22609l16992J95043Q6957j46248m9596J63852J98926
32541G12803J35958P7802q4562l36827m18136k21194J8180O1109n5776j42303
$$ y = [279082, 450002, 509766, 774507, 1190138, 1115041, 148293, -1190381, -1994313, -1879276, -1051070, 125525, 1197691, 1642476, 1346253, 839178, 610115, 460610, 16144, -437713, -270447, 510988, 1259115, 1625101, 1853695, 2066614, 1882313, 1017881, -160568, -987769, -1172790, -951647, -759889, -875191, -1232986, -1512156, -1484590, -1247769, -1010072, -768726, -386046, 130320, 628937, 979838, 1046037, 658482, -147154, -1042829, -1780386, -2407923, -2868382, -2766202, -1976032, -1111772, -767177, -566610, 265976, 1526350, 2096266, 1503470, 580861, 263869, 458912, 545869, 399621, 350025, 513877, 712803, 848761, 926563, 842001, 505174, 87038, -134156, -115976, -54867, -110643, -252946]
32531b52946p3721R1763J12421j49210l63070m0600O14558P23357j8197p32689
32521h8334o00832o5251L3992q3498L16703Q87822N44987o13729j144878l50213
32511a163231P46488J035775P52650N58229K89386l88032r13964n69515K10834
32502E58620L63720k24905o83912n80101l86513m62577m79602j26317L35064N44801
32492a141722N20513L61917j915m35909m48756J50123Q02057Q66075M67556K01415
32482A341354J99100O8901k91259m61039k53413j31337m91993r48222q14289q2144
32472a864341N83954P30353N18956K69583O4598j12265k38784l52239m59218l51156
32462a210559Q1511L98947N8943o39211p62122p8239N90994O68895N83862P03578
$$ y = [-252946, -326667, -234904, -122483, -271693, -634763, -675363, -60805, 662552, 644355, -88334, -689166, -754417, -720425, -803923, -487220, 400602, 945589, 331860, -813018, -1163231, -416743, 619032, 1371682, 1929911, 2219297, 1831265, 917301, 347786, 558620, 922340, 697435, 13523, -566578, -953091, -1415668, -1895270, -2021587, -1686523, -1141722, -621209, -259292, -261207, -697116, -1145872, -995749, -193692, 672383, 1139939, 1341354, 1540454, 1609355, 1318096, 857057, 603644, 472307, -19686, -967908, -1782197, -1864341, -1280387, -550034, -31078, 238505, 303103, 190838, -47946, -400185, -859403, -1210559, -1129048, -730101, -671158, -1310369, -2072491, -2150730, -1559736, -890841, -306979, 396599]
32452C96599M90440l82338r45960k13420J032079J140653K6436p75427m90290
32443B78772l3418k32019n69983l76615m6096j85274m53721j76276N21996J002330
32433b70304J024830O99176N2973o82892q82701l17201L29826L92200J66610K35574
32423G48091L91146P6871n26512p50251m73618q3900K96796P00746P46163J20138
32413A245670o04447o11391j16184K7867j67344R0968P89453R27321K11887l54637
32403A439163j27617J38443l09549q18362l76432O32019Q76520n42r32637r05687
32393c84681j20067M72046K95971l46649o79373k93427L88023O55082M59313L53458
32383G99696M42439J21579p87573j411145j000534j12524K36486J23605M06120
$$ y = [396599, 887039, 504701, -441259, -654679, 377400, 1518053, 1544489, 769062, 278772, 245354, 13335, -556648, -933263, -979359, -1164633, -1618354, -1794630, -1272634, -270304, 754526, 1453702, 1506675, 823783, -58918, -376119, -46293, 345907, 512517, 748091, 1139237, 1216108, 689596, -60655, -534273, -618173, -321377, 379369, 1125532, 1245670, 641223, 29832, -86352, -58485, -225829, -134861, 654592, 1581913, 1793800, 1439163, 1311546, 1449989, 1140440, 322078, -54354, 577665, 1454185, 1453643, 521006, -384681, -504748, -32702, 263269, -83380, -762753, -1056180, -668157, -13075, 446238, 799696, 1242135, 1363714, 576141, -835004, -1835538, -1948062, -1711576, -1587971, -1181851]
32374a181851J098352J214260L67022n14475m87352J76214N78253M22938Q4553
32365A757914j58709l68986n79073o56159n55465m26577l97997l69646q7601N09885
32355a332414J011119Q27963j8453o83116m75482J74632L02468j87463m63416
32346h44162j56793Q2135k26665m90379K7314R83204J401304R65868J98897l47228
32336A593495m43832m4981N33729N82533j39084p93486n28752J46757P8076o25490
32326C58965o71184K65627Q39892P9752j073642j164814k27924O27537Q97240
32317f8551Q19556L88288n00638j176018p53618L95636R08164L37885l04447k28949
32307a82692M2464j61991m24415k7718P09586Q57089K73173k96753l61728j56437
$$ y = [-1181851, -83499, 1130761, 1497783, 983308, 495956, 672170, 1250423, 1673361, 1757914, 1599205, 1230219, 651146, -5013, -560478, -987055, -1385052, -1754698, -1842299, -1332414, -321295, 506668, 488215, -194901, -670383, -495751, -193283, -380746, -844162, -1000955, -918820, -1145485, -1635864, -1608550, -625346, 775958, 1741826, 1940723, 1593495, 1149663, 1104682, 1638411, 2220944, 2081860, 1288374, 759622, 906379, 984455, 358965, -312219, -46592, 793300, 873052, -200590, -1365404, -1593328, -965791, -68551, 751005, 1139293, 638655, -537363, -1290981, -895345, 12819, 350704, 46257, -182692, -140228, -302219, -726634, -754352, -44766, 812323, 1085496, 788743, 427015, 270578]
32297B70578k1093J258r4961l40613n04117k73762J65288K62395l1946p6999M89299
32286a54673J090709R69359K54352k51411j75388P3619L8816k16000m02761m38339
32276G88283l51263j15904J35062M2540m67861q53466n87758L3085K53965j8992
32266a142309r3065L85660Q49941P14292K61594P5128N5806k81528q06731q66691
32256h47903l39210J57583K26460J74219L04941L68896Q8228k76283l24516j17371
32246e84956M8001J63926L62295M55551J24723m77890p47777l61637K72406M56136
32236b89222Q246m86781l04113N48729J236996J021115J20420n96524o45474k98527
32226C14865k4984q814k14059m70789m70196j32116N6181l52126q62495n38839
$$ y = [270578, 249485, 250743, 155782, -184831, -688948, -962710, -797422, -535027, -566973, -643972, -154673, 936036, 1905395, 2159747, 1908336, 1732948, 1806567, 1845383, 1629383, 1226622, 788283, 437020, 321116, 456178, 498718, 30857, -822609, -1410367, -1377282, -1123317, -1142309, -1235374, -849714, 227, 714519, 976113, 1051241, 1107047, 825519, 18788, -847903, -1187113, -1029530, -803070, -628851, -323910, 44986, 133214, -143069, -467585, -584956, -536955, -373029, -10734, 444817, 569540, 91650, -656127, -1017764, -745358, -289222, -280976, -767757, -1071870, -523141, 713855, 1734970, 1855390, 1258866, 613392, 314865, 289881, 281067, 67008, -403781, -873977, -1006093, -949912, -1302038, -2164533, -2703372]
32216b703372N02079J050288N68405m5669k2128N3699n15875j072447o28267L53865
32206b459422O35253K32083K58431Q86105J032189K83906l43967p0269M99272
32197I53581N24011J71536j994k0141j01916o8229J49450Q7223m50861q08120
32187D34540m38529J28586Q8519l71459m52114j8368L41605K83992j8798l60620
32177c82646n70958l50114K76540O25934K30221k63311N3348Q47968R47620J57858
32167A572460m67229l34345j24207m59295q28777n40559R7404L69842L04254L60859
32157d9593M30907Q1635m44467m37069Q3279K87308j32063l80748K37300J183633
32147H60122J369514O04170k95454o89637p60092r04565j065551r31964m33318
$$ y = [-2703372, -2201293, -1151005, -582600, -628269, -650397, -596698, -1112573, -2185020, -2813287, -2459422, -1824169, -1592086, -1333655, -447550, 584639, 868545, 524578, 454309, 953581, 1477592, 1649128, 1647134, 1626993, 1525077, 1456848, 1606298, 1693521, 1242660, 434540, -3989, 124597, 213116, -158343, -610457, -628825, -287220, -3228, -22026, -382646, -953604, -1303718, -1027178, -401244, -171023, -434334, -380986, 466982, 1414602, 1572460, 1105231, 770886, 646679, 187384, -641393, -1181952, -1084548, -714706, -410452, -49593, 381314, 462949, 18482, -418587, -335308, -48000, -180063, -560811, -323511, 860122, 2229636, 2833806, 2538352, 1848715, 1088623, 184058, -881493, -1813457, -2246775]
32138b246775K43574Q51574J075269O75083m7118l07228J68043N61762L1106r25025
32128H0265j044983j93357L84162l4388n88214l17482L05995L30710L3877L93163
32118f50252J251648J412828N69590k02735j86300k2883m09471q66213o30818
32109B65394L838J86244j30452k24057K13501O91593O59157P2849o94489j089016
32099d5438p14954J17798M59792j20891p45243l02813Q70477J276597K89336r69979
32089A14682j126002k04876O85505Q01157L29194j68003l25349j13233J73961
32080A67036J11167l77742q04310o53999o3580L38623K44165K930P7219M34311
32070e24180O73103N92972L70580J69261j40416o46688r62549n50039M34768J066464
$$ y = [-2246775, -2003201, -1151627, -76358, 598725, 551607, 244379, 412422, 974184, 1005290, 80265, -964718, -1158075, -773913, -808301, -1396515, -1713997, -1408002, -1077292, -1043415, -650252, 601396, 2014224, 2583814, 2381079, 2194779, 2171896, 1762425, 896212, 265394, 269232, 455476, 325024, 100967, 314468, 1006061, 1665218, 1738067, 1043578, -45438, -760392, -642594, -182802, -303693, -1048936, -1351749, -481272, 795325, 1084661, 114682, -1011320, -1216196, -530691, 270466, 599660, 431657, 106308, -6925, 167036, 278203, -99539, -903849, -1557848, -1621428, -1282805, -1038640, -1035710, -958491, -524180, 148923, 741895, 1112475, 1281736, 1141320, 494632, -467917, -1017956, -583188, 483276]
32060D83276P55204P3951l4332L58941K97194n15534j109798o07378M49779P86971
32050I38274Q3634p26536p69391j99771K83713L75069K89271K28985R4239k53115
32040C44372o33140o26583p5030N97784P74467L82350K652J21752N15538N89041
32030A993203J44082m29679o17796k61098L03430M77244q353o49898o76067j28721
32020A46347R5173m01486p84767k42787O57223Q06716L04537J84044N73515M91598
32010A830113l30987q20470l35426J79871k80591j112732j063819j61769N03881
32001a591929N02565L70861L73802J12304n18731r36055p07477j08313L85062
31992b117911O17109O15812M23124J99871J05745K9377j95400l68358j55352L26274
$$ y = [483276, 1238480, 1312431, 1278099, 1637040, 1934234, 1418700, 308902, -298476, 151303, 938274, 1021908, 295372, -474019, -673790, -390077, -15008, 274263, 503248, 597487, 344372, -288768, -915351, -990381, -392597, 381870, 764220, 766872, 888624, 1404162, 1993203, 2137285, 1707606, 1089810, 828712, 1132142, 1609386, 1601033, 951135, 275068, 146347, 241520, -159966, -944733, -1187520, -530297, 276419, 580956, 765000, 1338515, 1830113, 1499126, 678656, 343230, 523101, 242510, -870222, -1934041, -2095810, -1591929, -1089364, -718503, -344701, -232397, -751128, -1687183, -2394660, -2502973, -2117911, -1500802, -884990, -461866, -261995, -156250, -126873, -322273, -690631, -845983, -519709]
31982e19709N99889M25127r1163p42632j109749o08154O12450J240631L12724
31973A19414j127246j161749K48947J141565M86895l59870M0038R43984P85911
31964A117889k60982o82379q0238L64368j05948p26817n10610L20084P49617L10003
31954D94987m51250o74596j51420M27403K85235m06002p10931k69786J79670K0452
31944a256238k04741K91052J143502J321672P05100J49895N9285q4619o09445
31935A515463j004394p41042n3350M71306N76140L38048o0692l43038l26783k44221
31925A27437m45931p17157m43029L88993R50859O38977j30798n50218m22144j55155
31915g58166q5314k05073l72352m48193l24438n0889J34170O2717j17797o4224
$$ y = [-519709, 80180, 505307, 414144, -328488, -1438237, -2046391, -1433941, -193310, 119414, -1007832, -2169581, -1920634, -779069, -292174, -652044, -612006, 331978, 1117889, 856907, 174528, 94290, 458658, 352710, -374107, -884717, -564633, 184984, 494987, 43737, -630859, -782279, -354876, -69641, -475643, -1186574, -1456360, -1276690, -1256238, -1460979, -1169927, -26425, 1295247, 2000347, 2150242, 2209527, 2124908, 1515463, 511069, -229973, -283323, 187983, 764123, 1102171, 1041479, 698441, 371658, 127437, -318494, -1035651, -1478680, -1089687, -138828, 500149, 369351, -180867, -603011, -758166, -843480, -1048553, -1420905, -1869098, -2193536, -2244425, -2110255, -2047538, -2165335, -2229559]
31905b229559L69398Q42247P23967j67611j050616q84792K25938R51408M79395
31896g40225l37838k87657M13486O63021L09154J57662L65471K52783k07956j78416
31886D09485M23249N19436l02538r00949l48356N75827O40873n2078n65775n98955
31876a99781m41766j52514K29500K71139j21813k07481M23696R07826L81123n37714
31866E52215p13907k45770M3267J73359N96023Q28069J77773o19697l36295M72789
31856I27826J69361j045011j176940K14891J074728J38518j046543p39999K90725
31847a192444M10342r2369J45329R50626R33139o7021p30337l61358L19374N58080
31837H73361M63585L78194L46950L08367J00607n36262j293192j151185J52220
$$ y = [-2229559, -1860161, -1017914, -293947, -461558, -1512174, -2396966, -2171028, -1219620, -740225, -1078063, -1365720, -952234, -289213, 19941, 177603, 543074, 795857, 587901, 409485, 832734, 1352170, 1049632, 148683, -199673, 376154, 1017027, 964949, 399174, -199781, -641547, -794061, -564561, -293422, -415235, -622716, -199020, 708806, 1089929, 552215, -161692, -407462, -364195, -190836, 405187, 1233256, 1411029, 791332, 455037, 927826, 1097187, 52176, -1124764, -909873, 164855, 303373, -743170, -1483169, -1192444, -782102, -874471, -729142, 221484, 1154623, 1087602, 357265, -4093, 315281, 873361, 1336946, 1715140, 2062090, 2370457, 2471064, 1934802, 641610, -509575, -357355]
31828c57355J154034M58445j028790j236418J7165R21114O23176K78948O72245
31819A502564P79366k62144j410172j295434l22888K06497J46259K48185N40588
31810A32821M22343j5736j34112j4172l13371r00851q36875J53390J211635J547498
31800A252570J236740O60410j769n06012n61324l59724l99975o13665m12193K21175
31790E16233N34996K06355j34455q876J46985q5878k53403R4646L82176j41156
31780A257623r99068j040124j98803L79321L2869n87686o44988k00695K42477
31771a759074N77442R17243J056447O95595j439n08411n00857p4518M36066O50674
31761A489168L64926j96033n34928m69708l16046l18291k73574j9758J26037r3399
$$ y = [-357355, 796679, 1255124, 226334, -1010084, -992919, -71805, 551371, 830319, 1502564, 2281930, 2019786, 609614, -685820, -1008708, -802211, -655952, -407767, 132821, 555164, 539428, 405316, 391144, 77773, -823078, -1659953, -1506563, -294928, 1252570, 2489310, 3149720, 3147951, 2641939, 2080615, 1720891, 1320916, 707251, 295058, 516233, 1051229, 1257584, 1123129, 1114253, 1261238, 1175360, 921957, 1016603, 1398779, 1257623, 258555, -781569, -980372, -601051, -568182, -1155868, -1800856, -2001551, -1759074, -1181632, -264389, 792058, 1487653, 1486214, 977803, 476946, 402428, 838494, 1489168, 1854094, 1658061, 1123133, 653425, 337379, 19088, -254486, -274244, -148207, -241606]
31751b41606k53143J75447Q26581P96918N711o11943m83087j67359l15882n97779
31741h66142l65254J34362R0122n33138q57930l65724M33468Q15678P10477M53291
31731c50790J86289j01391k95273l11412k95775l37812j95172L50948R98372J120036
31721G68020M67237m93348r52813m80659M75096Q69521J71314q40752q98803P4589
31711h40598Q12674N10788p2048L1535L85293m007p71772n44340Q25611J761551
31701B094687J093814m58593j492760j612654j225971n33354L76810J002739R03837
31692A48555L91881M5876j37264m40991o48117l47044K13555L64160Q239l23366
31682g24516l34866k13997q0047J41759L04106J54100r6753N2780N74883Q54877
$$ y = [-241606, -494749, -319302, 507279, 1304197, 1309908, 697965, 214878, 47519, -268363, -866142, -1231396, -1097034, -1006912, -1540050, -2397980, -2763704, -2330236, -1514558, -804081, -350790, -164501, -265892, -561165, -872577, -1168352, -1506164, -1701336, -1350388, -352016, 768020, 1235257, 741909, -210904, -691563, -216467, 653054, 824368, -16384, -915187, -840598, -27924, 482864, 410816, 442351, 827644, 823637, 51865, -492475, 333136, 2094687, 3188501, 2729908, 1237148, -375506, -1601477, -2134831, -1758021, -755282, 148555, 540436, 586312, 449048, 8057, -640060, -987104, -773549, -409389, -401150, -724516, -1059382, -1273379, -1353426, -1211667, -907561, -753461, -850214, -797434, -222551, 632326]
31672F32326N40242q8875o38327r23204p52597n0885O86978P21262N3638n11111
31662c30553m88484k69595k92688l21481J9854N17531O68207L72164o9869l81529
31652e76443m22450j39018L19380O36414O42599L96760k9892m91444n58755O5028
31642a57821Q88535J029388L75669l15830n79102o83706p46175l93705K69975
31633c12772L97816k55384p07175k72296K67689M8857k68829L54476J305267J075741
31623A633390k50279r92982m55746J60242j10119m86906N2374R58392R51290j6077
31613A443579p73248o33604j12213O8914o0337j580L90301O85118M27332k30786
31603A203476n78752j34305P17978J086614N50186m23612j012126q03089p9286
$$ y = [632326, 1172568, 1083693, 445366, -477838, -1230435, -1281320, -594342, 126920, 180558, -330553, -819037, -1088632, -1381320, -1702801, -1682947, -1165416, -497209, -125045, -194914, -576443, -998893, -1137911, -818531, -182117, 460482, 857242, 827350, 335906, -222849, -157821, 730714, 1760102, 2135771, 1819941, 1240839, 557133, -189042, -582747, -312772, 85044, -170340, -877515, -1149811, -882122, -833265, -1102094, -747618, 557649, 1633390, 1383111, 390129, -65617, 94625, -15494, -502400, -450026, 508366, 1459656, 1443579, 670331, 36727, -75486, -6572, -66909, -68489, 321812, 1006930, 1434262, 1203476, 624724, 490419, 1208397, 2295011, 2845197, 2421585, 1409459, 606370, 527084]
31594E27084M61986L33639k32409n24507k35516J61734J47155j13494j52680N6849
31584D29841K45518L79162M61735J63057o44470j288159j052385k94795O4468
31575a536028p3794j19757p9194m49770q71549l28207J019337J657819R26594
31566A45451o528j00145O5502k35052l15726N53396J357077O89529p91205j146474
31556B15825j28272N13759j58367r39225n32418N61171J077286Q07624M16764
31547A834147J90235o9696l19926k96052q5065m2318k03964k41022L2600M20521
31537A219460N79665L25723j80541m50529j07426N43562O75648q6080j096630
31528A422852j379731p09881K54170P54904N77706L9890l48323k49361K04844
$$ y = [527084, 989070, 1322709, 1090300, 565793, 330277, 492011, 639166, 525672, 372992, 429841, 675359, 1054521, 1516256, 1679313, 1034843, -253316, -1305701, -1600496, -1536028, -1609822, -1729579, -1808773, -2258543, -3130092, -3458299, -2438962, -781143, 145451, 138923, 38778, 104280, -130772, -446498, 106898, 1463975, 2153504, 1362299, 215825, 87553, 601312, 442945, -496280, -1028698, -467527, 609759, 1417383, 1834147, 2024382, 1954686, 1634760, 1338708, 1253643, 1211325, 1007361, 766339, 798939, 1219460, 1799125, 2124848, 1944307, 1493778, 1386352, 1929914, 2605562, 2519482, 1422852, 43121, -666760, -412590, 342314, 920020, 959910, 611587, 362226, 567070]
31519E67070M64351J15697n94977r71181o25594J25949O53877O30064J97510k89898
31509B72868n39348m30697o0919K86471L48181J38307n7725o083J99875K46968
31499C97898l5257m69732o85466m51365J22650O78947Q92554O69082J32833m44408
31489H07736o87301l48414K82000M39031k32719j006641q56083J03864O73863
31480h24664K64382k93542j21868L45489K12509l17853l33204J82458L36496j16020
31470f65817l78367J2735M76695M22310P4887j55898l09293m11998j51038M73353
31460f12431Q37007N45804J1083k57781l07424k87203o9097K05808j7243p21106
31450f72583r77311k90012M93320M35050n6349r162M94899N67259n445n70242
$$ y = [567070, 1031421, 1147118, 552141, -419040, -1044634, -918685, -264808, 365256, 562766, 272868, -266480, -697177, -758096, -471625, -123444, 14863, -42862, -48945, 150930, 397898, 362641, -107091, -792557, -1243922, -1121272, -442325, 450229, 1119311, 1252144, 807736, 120435, -227979, 54021, 493052, 260333, -746308, -1602391, -1498527, -824664, -560282, -853824, -975692, -630203, -417694, -735547, -1068751, -886293, -549797, -665817, -1044184, -1031449, -554754, -132444, -57557, -213455, -522748, -934746, -1085784, -612431, 224576, 770380, 781463, 523682, 216258, -70945, -140042, 65766, 48523, -672583, -1649894, -1939906, -1446586, -1011536, -1067885, -1077047, -582148, -14889, -20334, -590576]
31440e90576o89480m98870j36138L83160Q41123J020126J026922Q96804L19141
31431B572212o35252j117187o26544P6050Q6377k75075k53408r2467l80128o25628
31421a271050n1326O77472K70923q68312j006339J97532J189689J018429M86490
31412F43508L14727k5958q58197j302509p22827J55783N00185N40275O42259M48618
31402C35864j34541l00819K92966O64089P0376o58415n10497K6142n3963n28132
31392g96930n51819k58496l32728n34214n1317R90667J607221J329596N14120
31383A916100l97741j019573q79520q8925L66608l5063l85630J79508Q33705L31140
31373H20609p58513q48863J4448K39966n76778r72756j01450Q84863P13153j75818
$$ y = [-590576, -1280056, -1778926, -1915064, -1531904, -690781, 329345, 1356267, 2253071, 2572212, 1936960, 819773, 193229, 269279, 355656, 80581, -172827, -265294, -645422, -1271050, -1322376, -644904, -373981, -1242293, -2248632, -2051100, -861411, 157018, 643508, 958235, 932277, 74080, -1228429, -1951256, -1795473, -1295288, -755013, -112754, 335864, 201323, -99496, 193470, 857559, 927935, 269520, -240977, -214835, -268798, -796930, -1348749, -1607245, -1939973, -2474187, -2525504, -1534837, 72384, 1401980, 1916100, 1518359, 498786, -380734, -469659, -103051, -138114, -523744, -344236, 489469, 820609, 62096, -786767, -772319, -532353, -1109131, -2081887, -2183337, -1298474, -585321, -761139]
31363g61139n69467j81927M32281Q18046P55361J88270l88977k05089N93174Q14367
31353A494900r3907j035549p28354M72338J114150O12949k19996m83502k32048
31344I00981q5957l15081n81807m50039K4905L34577J86407r1314n6875J73845
31334C9642J73585p5531k24855j79794r6211J13495N76680Q36560K69247p69885
31324F62933j089202k60698O99133O78367j42389p22382m69546L30977R84632
31315F71825R04770L7350r10795j029675k54277N18654N60977J09234j84171q4646
31305C39246K28379N11141M80385o2964q22335j141466q23161l64254j46753L9203
31295a762579L54116M32332M3948l11416p6003M80418O32154J99005l36897n26533
$$ y = [-761139, -1330606, -1512533, -1080252, -262206, 493155, 681425, 292448, 87359, 680533, 1494900, 1400993, 365444, -362910, 109428, 1223578, 1836527, 1616531, 1133029, 900981, 815024, 499943, -81864, -531903, -506998, -172421, 13986, -77328, -134203, 39642, 213227, 137696, -87159, -266953, -363164, -249669, 327011, 1163571, 1432818, 662933, -426269, -686967, 12166, 690533, 548144, -174238, -643784, -312807, 671825, 1576595, 1613945, 703150, -326525, -580802, -62148, 498829, 608063, 423892, 339246, 567625, 1078766, 1559151, 1496187, 673852, -467614, -1290775, -1655029, -1801782, -1762579, -1408463, -976131, -932183, -1243599, -1319602, -839184, -207030, -8025, -344922, -871455]
31285h71455l32246L8677L27163L67306K57665K30930K77336K08730J23859L05071
31275I33036N56472L05186l86560o38990k4650O66725N24722j99750n85700l69930
31265G80561q2267j43210m50875o82539n42173P7447Q29313J111610Q00812L49819
31255B048498m5204o68577j347025j229770j54408P15431N12268K1272L06782
31246A59267Q49801M77549n01350p45617j34373J49838k61437m54804q2601M3891
31236d99836l37216l06471M49279P85329J028q00028m20353N42269Q23796N22522
31226G60319N37705P32702K70161o22125q46214l22486j42750o48214q19999p5330
31216a176231O36605L20675m91190o09888L9007N14017L62503N5801Q919L7469
$$ y = [-871455, -1203701, -1165024, -837861, -470555, -212890, 18040, 295376, 504106, 627965, 933036, 1489508, 1794694, 1408134, 769144, 744494, 1411219, 1935941, 1736191, 1150491, 780561, 698294, 555084, 104209, -578330, -1120503, -1043056, -213743, 897867, 1698679, 2048498, 2003294, 1334717, -12308, -1242078, -1396486, -681055, -168787, -147515, 159267, 1009068, 1486617, 985267, 239650, 105277, 255115, -6322, -461126, -543727, -499836, -837052, -1143523, -694244, 91085, 92113, -707915, -1128268, -585999, 237797, 760319, 1298024, 2030726, 2300887, 1678762, 832548, 510062, 367312, -280902, -1100901, -1176231, -539626, -218951, -710141, -1320029, -1281022, -767005, -404502, -348701, -339782, -302313]
31206c02313o0500q5691J05614K47896J22605k1554R8438K40016j0968m72994
31196a39451n09327r997L05477j07315p11225n34895L87141Q64614J24120r57067
31186a287925q11449P18584J956961J422966k74823j261215q19397m3245L4788
31177c64755j41837K21990O94018L39982m97581n63785K33953N84454p0019n85076
31167a48656m1902P00347M70863k56812k27807N07989Q49960N62193M08359N10793
31157C335327J12232q48016j347963q89399k48750j07508p5732K82929M99819
31148G12939O8593n73183p45277n34187l42644p3329M33278P20353L50142k07960
31138a91275j77209L58843O83071N56731L28363J77149J3088q0015m5979k61973
$$ y = [-302313, -362813, -448504, -342890, -94994, 27611, 6057, 104495, 344511, 333543, -139451, -648778, -658775, -353298, -460613, -1171838, -1706733, -1319592, -454978, -330858, -1287925, -2099374, -1380790, 576171, 1999137, 1724314, 463099, -356298, -399543, -364755, -506592, -284602, 409416, 749398, 251817, -311968, -78015, 506439, 436420, -148656, -190558, 509789, 980652, 723840, 496033, 1004022, 1853982, 2416175, 2824534, 3335327, 3447559, 2599543, 1251580, 362181, 113431, 5923, -69809, 213120, 712939, 781532, 208349, -536928, -1071115, -1413759, -1487088, -1053810, -333457, 16685, -191275, -368484, -9641, 673430, 1230161, 1558524, 1735673, 1748761, 1668746, 1622767, 1360794]
31128A360794r43685j392418p79840M41774R46880L96144j72644j9276L29877
31119A67606K44156Q5273L87367P23178L18157o32574j151098q17781j80319J44330
31109g11705J32481L3335q4361k53899l87785l29811k6905L82618N94952L76353
31099b74727j04341l64622k09410N740j8633J7187M58562Q57983M27758o45933
31089A49564j149404m52161N25668N51737k23377n92806p0133N39072M32969j15647
31079d04518l45771p8169K83060M37957L82692J46483j87622l24022n4715L35385
31069A90760L59663J2872k15029m2470K42201K20048j44821n45612o71726m20831
31059a014945N1805M35330N33102M02263J27453l42293q76685r50887k37249P21141
$$ y = [1360794, 417109, -975309, -1755149, -1313375, -366495, 29649, -142995, -162271, 167606, 411762, 497035, 884402, 1607580, 1925737, 1293163, 142065, -675716, -856035, -711705, -579224, -545889, -630250, -884149, -1271934, -1601745, -1628650, -1246032, -651080, -274727, -379068, -743690, -953100, -947360, -965993, -948806, -490244, 367739, 795497, 149564, -999840, -1452001, -926333, -374596, -597973, -1190779, -1260912, -721840, -288871, -404518, -750289, -828458, -545398, -107441, 275251, 421734, 234112, -89910, -144625, 190760, 550423, 563295, 348266, 305796, 547997, 768045, 623224, 77612, -594114, -1014945, -963140, -527810, 5292, 407555, 535008, 192715, -683970, -1634857, -1872106, -1150965]
$$ [...]
##END NTUPLES=NMR SPECTRUM
##END=
