##TITLE=31Pdec_LY-TMF-9.100
 D2O, 24 sc
 2.3.2020
##JCAMPDX= 6.0         $$ Bruker NMR JCAMP-DX V2.0
##DATA TYPE= NMR SPECTRUM
##DATA CLASS= NTUPLES
##ORIGIN= UXNMR, Bruker Analytische Messtechnik GmbH
##OWNER= root
$$ XWIN-NMR		Version 3.5
$$ Mon Mar  2 16:21:56 2020 Russian Standard Time (UT+4h)  she@DPX200
##.OBSERVE FREQUENCY= 81.013821
##.OBSERVE NUCLEUS= ^31P
##.ACQUISITION MODE= SIMULTANEOUS
##.ACQUISITION SCHEME= undefined
##.AVERAGES= 24
##.DIGITISER RES= 17
##SPECTROMETER/DATA SYSTEM= spect
##.PULSE SEQUENCE= zgpg30
##.SOLVENT NAME= D2O
##.SHIFT REFERENCE= (INTERNAL, D2O, 0, 182.463)
##AUDIT TRAIL= $$ (NUMBER, WHEN, WHO, WHERE, WHAT)
$$ ##TITLE= Audit trail, XWIN-NMR		Version 3.5
$$ ##JCAMPDX= 5.01
$$ ##ORIGIN= Bruker BioSpin GmbH
$$ ##OWNER= she
$$ F:/spectra/data/she/nmr/P31/1/pdata/1/auditp.txt
$$ ##AUDIT TRAIL=  $$ (NUMBER, WHEN, WHO, WHERE, WHAT)
(   1,<2020-03-02 16:21:04.59 +0400>,<she>,<DPX200>,
      <created by zg, POWCHK disabled, PULCHK disabled
       configuration hash MD5:
       00 E9 B6 7A A2 85 ED C7 34 08 36 98 17 FE 4E 26
       data hash MD5: 32K
       DC DC 56 AF E9 E2 A9 D7 58 D9 D6 C2 0E 6A D9 A4>)
(   2,<2020-03-02 16:21:12.60 +0400>,<she>,<DPX200>,
      <Start of raw data processing
       efp BC_mod = 2 LB = 1 FT_mod = 6 PKNL = 1 PHC0 = -1461.977 PHC1 = 359.6017 SI = 64K 
       data hash MD5: 64K
       7A A5 C1 A0 DF 7B 62 12 3D 2E F3 68 2A 12 EA B0>)
(   3,<2020-03-02 16:21:28.10 +0400>,<she>,<DPX200>,
      <pk PHC0 = -1.064505 PHC1 = 0 
       data hash MD5: 64K
       DF 47 2B 24 23 CC 60 DE DE 3B 30 A2 47 25 A6 5E>)
(   4,<2020-03-02 16:21:31.42 +0400>,<she>,<DPX200>,
      <abs ABSG = 5 
       data hash MD5: 64K
       F0 8A 73 7B 22 F5 DA 05 7E FA EA DF A3 F2 0C 5A>)
$$ ##END=
$$ 
$$ hash MD5
$$ 3C 87 D1 E5 73 2F A9 E6 87 62 82 68 3E 24 CB 73
##$RELAX= 
##$RELAX= 
##$RELAX= 
##$RELAX= 
##$RELAX= 
##$RELAX= 
##$RELAX= 
##$RELAX= 
$$ Bruker specific parameters
$$ --------------------------
##$DU= <F:/spectra>
##$EXPNO= 1
##$NAME= <P31>
##$PROCNO= 1
##$TYPE= <nmr>
##$USER= <she>
##$AMP= (0..31)
100 100 100 100 100 100 100 100 100 100 100 100 100 100 100 100 100 100 
100 100 100 100 100 100 100 100 100 100 100 100 100 100 
##$AQSEQ= 0
##$AQ_mod= 1
##$AUNM= <au_zg>
##$AUTOPOS= <>
##$BF1= 81.014009
##$BF2= 200.13
##$BF3= 200.13
##$BF4= 200.13
##$BF5= 200.13
##$BF6= 200.13
##$BF7= 200.13
##$BF8= 200.13
##$BYTORDA= 1
##$CFDGTYP= 0
##$CFRGTYP= 5
##$CHEMSTR= <none>
##$CNST= (0..31)
1 1 145 1 1 1 1 1 1 1 1 1 1 1 1 1 1 1 1 1 1 1 1 1 1 1 1 1 1 1 1 1 
##$CPDPRG= <waltz16>
##$CPDPRG1= <>
##$CPDPRG2= <waltz16>
##$CPDPRG3= <>
##$CPDPRG4= <mlev>
##$CPDPRG5= <mlev>
##$CPDPRG6= <mlev>
##$CPDPRG7= <mlev>
##$CPDPRG8= <mlev>
##$CPDPRGB= <>
##$CPDPRGT= <>
##$D= (0..31)
0 1 0 0 0 0 0 0 0 0 0 0.03 2e-05 3e-06 0 0 0 0 0 0 0 0 0 0 0 0 0 0 0 0 
0 0 
##$DATE= 1583151664
##$DBL= (0..7)
120 120 120 11 120 120 24 19 
##$DBP= (0..7)
150 150 150 150 150 150 150 150 
##$DBP07= 0
##$DBPNAM0= <>
##$DBPNAM1= <>
##$DBPNAM2= <>
$$ [...]
##$SUBNAM3= <"">
##$SUBNAM4= <"">
##$SUBNAM5= <"">
##$SUBNAM6= <"">
##$SUBNAM7= <"">
##$SUBNAM8= <"">
##$SUBNAM9= <"">
##$SW= 369.568048894756
##$SWIBOX= (0..15)
0 1 3 0 0 0 0 0 0 0 0 0 0 0 0 0 
##$SW_h= 29940.119760479
##$TD= 32768
##$TD0= 1
##$TE= 0
##$TE2= 300
##$TE3= 300
##$TEG= 300
##$TL= (0..7)
0 120 53 12 22 120 120 120 
##$TP= (0..7)
150 150 150 150 150 150 150 150 
##$TP07= 0
##$TPNAME0= <>
##$TPNAME1= <>
##$TPNAME2= <>
##$TPNAME3= <>
##$TPNAME4= <>
##$TPNAME5= <>
##$TPNAME6= <>
##$TPNAME7= <>
##$TPOAL= (0..7)
0.5 0.5 0.5 0.5 0.5 0.5 0.5 0.5 
##$TPOFFS= (0..7)
0 0 0 0 0 0 0 0 
##$TUNHIN= 0
##$TUNHOUT= 0
##$TUNXOUT= 0
##$USERA1= <user>
##$USERA2= <user>
##$USERA3= <user>
##$USERA4= <user>
##$USERA5= <user>
##$V9= 5
##$VALIST= <valist>
##$VCLIST= <CCCCCCCCCCCCCCC>
##$VD= 0
##$VDLIST= <DDDDDDDDDDDDDDD>
##$VPLIST= <PPPPPPPPPPPPPPP>
##$VTLIST= <TTTTTTTTTTTTTTT>
##$WBST= 1024
##$WBSW= 4
##$XGAIN= (0..3)
0 0 0 0 
##$XL= 0
##$YL= 0
##$YMAX_a= 11452
##$YMIN_a= -11909
##$ZGOPTNS= <>
##$ZL1= 120
##$ZL2= 120
##$ZL3= 120
##$ZL4= 120
##$ABSF1= 182.463
##$ABSF2= -187.1042
##$ABSG= 5
##$ABSL= 3
##$ALPHA= 0
##$AQORDER= 0
##$ASSFAC= 0
##$ASSFACI= 0
##$ASSFACX= 0
##$ASSWID= 0
##$AUNMP= <proc_1d>
##$AZFE= 0.1
##$AZFW= 0.5
##$BCFW= 0
##$BC_mod= 2
##$BYTORDP= 0
##$COROFFS= 0
##$CY= -3
##$DATMOD= 1
##$DC= 0
##$DFILT= <>
##$DTYPP= 0
##$F1P= 0
##$F2P= 0
##$FCOR= 1
##$FTSIZE= 65536
##$FT_mod= 6
##$GAMMA= 0
##$GB= 0
##$INTBC= 1
##$INTSCL= 5.30512e-09
##$ISEN= 30
##$LB= 1
##$LEV0= 0
##$LPBIN= 0
##$MAXI= 10000
##$MC2= 0
##$MEAN= 0
##$ME_mod= 0
##$MI= 50
##$NCOEF= 0
##$NC_proc= -4
##$NLEV= 6
##$NOISF1= 182.463
##$NOISF2= 159.3651
##$NSP= 0
##$NTH_PI= 0
##$NZP= 0
##$OFFSET= 182.463
##$PC= 4
##$PHC0= -1463.042
##$PHC1= 359.6017
##$PH_mod= 1
##$PKNL= yes
##$PPARMOD= 0
##$PSCAL= 0
##$PSIGN= 0
##$REVERSE= no
##$SF= 81.0140089999434
##$SI= 65536
##$SIGF1= 159.3651
##$SIGF2= -187.1042
##$SINO= 113.3802
##$SIOLD= 16384
##$SREGLST= <1H.CDCl3>
##$SSB= 0
##$STSI= 65536
##$STSR= 0
##$SW_p= 29940.119760479
##$SYMM= 0
##$S_DEV= 0
##$TDeff= 32768
##$TDoff= 0
##$TI= <>
##$TILT= no
##$TM1= 0
##$TM2= 0
##$TOPLEV= 0
##$USERP1= <user>
##$USERP2= <user>
##$USERP3= <user>
##$USERP4= <user>
##$USERP5= <user>
##$WDW= 1
##$XDIM= 65536
##$YMAX_p= 285039710
##$YMIN_p= -6550027
$$ End of Bruker specific parameters
$$ ---------------------------------
##NTUPLES= NMR SPECTRUM
##VAR_NAME=  FREQUENCY,     SPECTRUM/REAL,   SPECTRUM/IMAG
##SYMBOL=    X,             R,               I
##VAR_TYPE=  INDEPENDENT,   DEPENDENT,       DEPENDENT
##VAR_FORM=  AFFN,          ASDF,            ASDF
##VAR_DIM=   65536,         65536,           65536
##UNITS=     HZ,            ARBITRARY UNITS, ARBITRARY UNITS
##FACTOR=    0.456856943014862, 1,           1
##FIRST=     14782.0589164792, 0,            0
##LAST=      -15158.0608439998, 0,           0
##MIN=       -15158.0608439998, -6550027,    0
##MAX=       14782.0589164792, 285039710,    0
$$ Real data points
##PAGE= N=1
##DATA TABLE= (X++(R..R)), XYDATA
$$ [...]
$$ plain form
36939 -291107 -550255 -404024 -173292 -123499 -133706 -42645 73191 98949 36121 -153069
36929 -153069 -550070 -1020458 -1254002 -1186838 -1089592 -1107084 -1021084 -644590 -158695 158061
36919 158061 287893 342982 304055 125674 -84777 -221436 -348311 -502070 -503973 -212864
36909 -212864 180378 367987 328431 269475 256052 147644 -130070 -468884 -723554 -815026
36899 -815026 -724450 -523045 -351885 -255013 -134053 13544 -10105 -266873 -432147 -189225
36889 -189225 247420 360976 42976 -291897 -322646 -174394 -52717 99995 365321 551098
36879 551098 413455 27933 -292489 -361070 -228526 -22385 165125 294066 396475 503860
36869 503860 497165 200920 -263601 -448692 -122463 354984 477774 249650 49274 -19587
$$ packed form
36939b91107k59148J46231K30732M9793j0207R1061J15836K5758o2828j89190
36929a53069l97001m70388k33544O7164R7246j7492Q6000L76494M85895L16756
36919A58061J29832N5089l8927j78381k10451j36659j26875j53759j903K91109
36909b12864L93242J87609l9556n8956j3423j08408k77714l38814k54670r1472
36899h15026R0576K01405J71160R6872J20960J47597k3649k56768j65274K42922
36889a89225M36645J13556l18000l34873l0749J48252J21677J52712K65326J85777
36879E51098j37643l85522l20422o8581J32544K06141J87510J28941J02409J07385
36869E03860o695k96245m64521j85091L26229M77447J22790k28124k00376o8861
$$ plain form
36859 -19587 -183585 -425814 -386548 -821 257403 70995 -201855 -115624 101824 -85003
36849 -85003 -585243 -722939 -225860 385607 554793 369990 259373 384453 611376 788305
36839 788305 771181 425292 -112708 -403989 -251491 -70888 -359071 -945541 -1181971 -814236
36829 -814236 -244079 111589 313789 607348 967079 1174769 1161155 1047028 917876 714750
36819 714750 341412 -182599 -674560 -916669 -874344 -724350 -595323 -400972 -75231 174969
36809 174969 106957 -156346 -261989 -123407 46034 178382 426240 719188 696105 298689
36799 298689 19537 218876 519067 302292 -392316 -915330 -862098 -457780 -97700 84445
36789 84445 98149 -86313 -392263 -530624 -267624 263989 642453 534991 2046 -506583
$$ packed form
36859a9587j63998k42229L9266L85727K58224j86408k72850Q6231K17448j86827
36849h5003n00240j37696M97079O11467J69186j84803j10617J25080K26923J76929
36839G88305j7124l45889n38000k91281J52498J80603k88183n86470k36430L67735
36829h14236N70157L55668K02200K93559L59731K07690j3614j14127j29152k03126
36819G14750l73338n24011m91961k42109M2325J49994J29027J94351L25741K50200
36809A74969o8012k63303j05643J38582J69441J32348K47858K92948k3083l97416
36799B98689k79152J99339L00191k16775o94608n23014N3232M04318L60080J82145
36789H4445J3704j84462l05950j38361K63000N31613L78464j07462n32945n08629
$$ plain form
36779 -506583 -503519 52139 644523 726838 335192 757 83488 443733 791160 1036986
36769 1036986 1155976 1004143 544559 62501 -134694 -115971 -149942 -235594 -135797 160832
36759 160832 369144 343131 230621 91937 -248799 -742679 -873888 -279665 590908 884003
36749 884003 364418 -360267 -662330 -562541 -465946 -564326 -707459 -667019 -352854 105456
36739 105456 400159 320627 45971 -32750 164316 313071 200436 26398 29365 117547
36729 117547 105479 43174 50706 84067 132067 351881 687242 689173 168780 -274323 43069
36718 43069 853956 1270491 1056414 836981 973297 1007272 531693 -65706 -209088 -7418
36708 -7418 199 -331664 -669325 -753858 -623488 -395659 -171911 -82255 -148629 -179283 -20149
$$ packed form
36779e06583L064N55658N92384Q2315l91646l34435Q2731L60245L47427K45826
36769A036986J18990j51833m59584m82058j97195J8723l3971q5652R9797K96629
36759A60832K08312k6013j12510j38684l40736m93880j31209N94223Q70573K93095
36749H84003n19585p24685l02063R9789R6595r8380j43133M0440L14165M58310
36739A05456K94703p9532k74656p8721J97066J48755j12635j74038K967Q8182
36729A17547j2068o2305P532L3361M8000K19814L35361J931n20393m43103L17392
36718D3069Q10887M16535k14077k19433J36316L3975m75579n97399j43382K01670
36708g418P617l31863l37661q4533J30370K27829K23748Q9656o6374l0654J59134
$$ plain form
36697 -20149 189350 216116 75607 -26337 10732 122392 212134 202335 81799 13516 208172
36686 208172 568807 703788 463612 200621 271647 542950 651094 495782 164325 -376780
36676 -376780 -1116628 -1693033 -1668019 -1062129 -308564 238115 466815 344493 -32362 -311601
36666 -311601 -208046 67951 61308 -262016 -463800 -276204 59200 186000 72755 -61099
36656 -61099 -48023 96947 205234 78300 -293340 -645584 -691064 -403550 41805 476303
36646 476303 750661 733944 507470 369932 423472 384183 75303 -179072 -40684 234874
36636 234874 172953 -143818 -244891 -95160 -124472 -439933 -627492 -440179 -130358 40807
36626 40807 117121 130274 -30204 -261891 -243302 32647 176596 38455 -36004 210672
$$ packed form
36697b0149K09499K6766j40509j01944L7069J11660Q9742r799j20536o8283J94656
36686B08172L60635J34981k40176k62991P1026K71303J08144j55312l31457n41105
36676c76780p39848n76405K5014O05890P53565N46679K28700j22322l76855k79239
36666c11601J03555K75997o643l23324k01784J87596L35404J26800j13245j33854
36656f1099J3076J44970J08287j26934l71640l52244m5480K87514M45355M34498
36646D76303K74358j6717k26474j37538N3540l9289l08880k54375J38388K75558
36636B34874o1921l16771j01073J49731k9312l15461j87559J87313L09821J71165
36626D0807P6314J3153j60478k31687J8589K75949J43949j38141p4459K46676
$$ plain form
36616 210672 558579 725160 731943 643290 389709 79473 26775 225892 258265 -44574
36606 -44574 -349422 -460065 -601341 -760394 -454415 353385 813724 351087 -345228 -304753
36596 -304753 251439 368855 -54265 -210622 160858 320396 -269752 -1161636 -1663242 -1669286
36586 -1669286 -1409833 -964244 -417551 -50237 5693 -14946 93756 199199 140909 33388
36576 33388 21130 17066 -86149 -205396 -279850 -438274 -735532 -957292 -908077 -689006 -487584
36565 -487584 -295243 -42060 180243 259109 281146 399201 580427 653783 520844 205440
36555 205440 -189996 -482244 -505605 -307746 -99453 42423 196646 264017 -35721 -621757
36545 -621757 -865507 -334330 503935 773159 295577 -247384 -271416 57398 276498 312483
$$ packed form
36616B10672L47907J66581O783q8653k53581l10236n2698J99117L2373l02839
36606d4574l04848j10643j41276j59053L05979Q07800M60339m62637o96315M0475
36596c04753N56192J17416m23120j56357L71480J59538n90148q91884n01606o044
36586a669286K59453M45589N46693L67314N5930k0639J08702J05443n8290j07521
36576C3388j2258m064j03215j19247p4454j58424k97258k21760M9215K19071K01422
36565d87584J92341K53183K22303P8866K2037J18055J81226P3356j32939l15404
36555B05440l95436k92248k3361J97859K08293J41876J54223O7371k99738n86036
36545f21757k43750N31177Q38265K69224m77582n42961k4032L28814K19100L5985
$$ plain form
36535 312483 394983 541800 518672 271732 94905 284777 790479 1274921 1429131 1198159
36525 1198159 794407 527058 543919 711060 795329 731714 596262 360645 -93508 -645006
36515 -645006 -869629 -508124 163385 640247 721135 510611 90322 -441049 -719561 -388202
36505 -388202 336857 821479 844509 817265 1008591 1076785 713248 268041 228331 417537
36495 417537 289426 -188726 -538798 -556169 -499051 -496941 -360290 -96845 -74317 -441278
36485 -441278 -821873 -845235 -620292 -417986 -204385 183605 616745 767829 548533 203594
36475 203594 -10069 -79851 -173572 -393693 -606325 -564518 -262506 -29975 -85318 -150878
36465 -150878 155781 646919 733636 302064 -69466 67061 458801 666064 704879 797564
$$ packed form
36535C12483Q2500J46817k3128k46940j76827J89872N05702M84442J54210k30972
36525A198159m03752k67349J6861J67141Q4269o3615j35452k35617m54153n51498
36515f45006k24623L61505O71509M76862Q0888k10524m20289n31371k78512L31359
36505c88202P25059M84622K3030k7244J91326O8194l63537m45207l9710J89206
36495D17537j28111m78152l50072j7371N7118K110J36651K63445K2528l66961
36485d41278l80595k3362K24943K02306K13601L87990M33140J51084k19296l44939
36475B03594k13663o9782r3721k20121k12632M1807L02012K32531n5343o5560
36465a50878L06659M91138Q6717m31572l71530J36527L91740K07263L8815R2685
$$ plain form
36455 797564 836155 560637 73859 -250885 -262190 -74287 247748 665660 934540 805996
36445 805996 444324 260638 319500 276000 -52396 -420348 -565873 -544572 -490085 -345472
36435 -345472 -66055 131572 -5328 -394161 -694339 -705645 -506741 -234509 73268 375033
36425 375033 533612 444614 184572 -77599 -279640 -452890 -520640 -295394 216346 669420
36415 669420 741084 542695 431375 470238 387251 88929 -160959 -227803 -399948 -901577
36405 -901577 -1398436 -1375383 -848068 -316936 -107302 -136824 -276871 -509961 -687391 -562760
36395 -562760 -209018 -22932 -128288 -144186 186611 486205 251875 -349216 -654001 -394246
36385 -394246 35286 228923 244531 266528 207644 -32890 -201506 -3497 337861 288270
$$ packed form
36455G97564L8591k75518m86778l24744j1305J87903L22035M17912K68880j28544
36445H05996l61672j83686N8862m3500l28396l67952j45525K1301N4487J44613
36435c45472K79417J97627j36900l88833l00178j1306J98904K72232L07777L01765
36425C75033J58579q8998k60042k62171k02041j73250o7750K25246N11740M53074
36415F69420P1664j98389j11320L8863q2987k98322k49888o6844j72145n01629
36405i01577m96859K3053N27315N31132K09634k9522j40047k33090j77430J24631
36395e62760L53742J86086j05356j5898L30797K99594k34330o01091l04785K59755
36385c94246M29532J93637J5608K1997n8884k40534j68616J98009L41358m9591
$$ plain form
36375 288270 -195178 -512246 -264945 139577 91306 -293616 -347391 115317 480347 213906
36365 213906 -398729 -718710 -629913 -523391 -583004 -577938 -392345 -308982 -558973 -900392
36355 -900392 -926944 -627391 -351305 -282434 -229551 4646 277646 289242 -1131 -320044
36345 -320044 -438162 -426579 -484606 -629203 -695617 -604957 -464417 -363193 -229462 -7205
36335 -7205 142941 -52 -391840 -731630 -826119 -785942 -796733 -858182 -880171 -899256 -991144
36324 -991144 -1033009 -816151 -443988 -351383 -750128 -1250234 -1288535 -829020 -347594 -155163
36314 -155163 -71496 148187 396769 433952 274312 100075 -39864 -172343 -171812 110246
36304 110246 547983 855529 973147 1074655 1207201 1201045 953317 538394 23684 -540262
$$ packed form
36375B88270m83448l17068K47301M04522m8271l84922n3775M62708L65030k66441
36365B13906o12635l19981Q8797J06522n9613N066J85593Q3363k49991l41419
36355i00392k6552K99553K76086O8871N2883K34197K73000J1596k90373l18913
36345c20044j18118J1583n8027j44597o6414R0660J40540J01224J33731K22257
36335g205J50146j42993l91788l39790r4489M0177j0791o1449k1989j9085r1888
36324i91144m1865K16858L72163R2605l98745n00106l8301M59515M81426J92431
36314a55163Q3667K19683K48582L7183j59640j74237j39939j32479N31K82058
36304A10246M37737L07546J17618J01508J32546o156k47728m14923n14710n63946
$$ plain form
36294 -540262 -925737 -861350 -455186 -161352 -187616 -252713 -105566 49394 -85185 -389506
36284 -389506 -515973 -413679 -323473 -335908 -268424 17871 410799 679708 671684 391561
36274 391561 2082 -287137 -408150 -452622 -475804 -432964 -360351 -403327 -554122 -590908 -424669
36263 -424669 -265703 -268339 -270171 -102130 112697 221127 300973 351481 62778 -663352 -1250030
36252 -1250030 -1048921 -232377 465705 740847 822859 712654 115321 -745155 -1046720 -469272
36242 -469272 263309 382271 80680 15134 253162 333318 108896 -86510 -24345 187862
36232 187862 432111 679700 761135 472520 -19865 -269208 -149364 -14599 -116685 -207826
36222 -207826 32718 439429 547243 219489 -209778 -399533 -342682 -195125 -6611 237809
$$ packed form
36294e40262l85475O4387M06164K93834k6264o5097J47147J54960j34579l04321
36284c89506j26467J02294R0206j2435O7484K86295L92928K68909q024k80123
36274C91561l89479k89219j21013m4472k3182M2840P2613m2976j50795l6786J66239
36263d24669J58966k636j832J68041K14827J08430P9846N0508k88703p26130n86678
36252a250030K01109Q16544O98082K75142Q2012j10205n97333q60476l01565N77448
36242d69272P32581J18962l01591o5546K38028Q0156k24422j95406O2165K12207
36232A87862K44249K47589Q1435k88615m92385k49343J19844J34765j02086r1141
36222b07826K40544M06711J07814l27754m29267j89755N6851J47557J88514K44420
$$ plain form
36212 237809 477866 665556 887087 1186778 1333115 1026792 368617 -155681 -264691 -191362
36202 -191362 -238916 -301787 -104863 295733 603258 748261 898859 1063355 1059882 886506
36192 886506 757303 725198 617967 408682 284326 253655 75926 -266430 -414512 -174349
36182 -174349 152224 254111 289275 530642 818576 786807 468512 255115 304780 358225
36172 358225 160932 -219939 -545978 -665633 -584006 -418307 -297721 -233786 -147702 -64430
36162 -64430 -109344 -225792 -146189 170097 335565 54599 -385487 -497223 -290938 -188432
36152 -188432 -349605 -516323 -496375 -378481 -233946 -4401 243049 325593 298316 423414
36142 423414 672290 651933 211492 -251717 -339479 -173564 -76094 -30018 165605 404853
$$ packed form
36212B37809K40057J87690K21531K99691J46337l06323o58175n24298j09010P3329
36202a91362m7554o2871J96924M00596L07525J45003J50598J64496l473j73376
36192H86506j29203l2105j07231k09285j24356l0671j77729l42356j48082K40163
36182a74349L26573J01887L5164K41367K87934l1769l18295k13397M9665N3445
36172C58225j97293l80871l26039j19655Q1627J65699J20586O3935Q6084Q3272
36162f4430m4914j16448P9603L16286J65468k80966m40086j11736K06285J02506
36152a88432j61173j66718J9948J17894J44535K29545K47450Q2544k7277J25098
36142D23414K48876k0357m40441m63209q7762J65915R7470M6076J95623K39248
$$ plain form
36132 404853 359979 -803 -340312 -413380 -310341 -200535 -96935 25643 74284 -63781
36122 -63781 -348139 -590209 -606676 -376161 -87384 27023 -10794 116215 600134 1121702
36112 1121702 1129727 530420 -155046 -427700 -369118 -375706 -535181 -563534 -295649 72666
36102 72666 292033 354636 358665 281621 68414 -181129 -301263 -276595 -220363 -199093 -226077
36091 -226077 -347754 -536898 -553982 -168464 455270 837710 733572 391114 170076 129207
36081 129207 142645 198024 332395 411722 252717 -67858 -253005 -145317 122549 334700
36071 334700 383092 247014 -40119 -345056 -488822 -425418 -298028 -273458 -372312 -485345
36061 -485345 -512900 -473650 -495772 -681164 -960039 -1130396 -1071896 -855009 -610178 -391194
$$ packed form
36132D04853m4874l60782l39509p3068J03039J09806J03600J22578M8641j38065
36122f3781k84358k42070j6467K30515K88777J14407l7817J27009M83919N21568
36112A121702Q025n99307o85466k72654N8582o588j59475k8353K67885L68315
36102G2666K19367O2603M029p7044k13207k49543j20134K4668N6232K1270k6984
36091b26077j21677j89144j7084L85518O23734L82440j04138l42458k21038m0869
36081A29207J3438N5379J34371P9327j59005l20575j85147J07688K67866K12151
36071C34700M8392j36078k87133l04937j43766O3404J27390K4570r8854j13033
36061d85345k7555L9250k2122j85392k78875j70357N8500K16887K44831K18984
$$ plain form
36051 -391194 -217628 -120465 -57658 77521 253656 261692 23093 -229615 -267318 -184966 -172148
36040 -172148 -149947 39674 237185 172246 -10239 92225 433485 489875 92777 -225835
36030 -225835 -20711 383783 420615 154061 124221 501861 902763 986725 779798 387476
36020 387476 -166355 -708658 -918980 -741529 -491673 -374046 -187310 261156 713217 758846
36010 758846 431734 166591 195814 296039 174213 -174843 -606755 -1072374 -1514559 -1679402
36000 -1679402 -1318681 -594150 -43722 -17853 -277619 -298402 97281 578850 767103 653164
35990 653164 464069 293708 89772 -65615 43910 390664 566034 241268 -355266 -657854
35980 -657854 -415926 102922 542070 802854 892951 742978 397719 169810 311147 638649
$$ packed form
36051c91194J73566R7163O2807J35179J76135Q036k38599k52708l7703Q2352J2818
36040a72148K2201J89621J97511o4939j82485J02464L41260N6390l97098l18612
36030b25835K05124M04494L6832k66554k9840L77640M00902Q3962k06927l92322
36020C87476n53831n42303k10322J77451K49856J17627J86736M48466M52061M5629
36010G58846l27112k65143K9223J00225j21826l49056m31912m65619m42185j64843
36000a679402L60721P24531N50428K5869k59766k0783L95683M81569J88253j13939
35990F53164j89095j70361k03936j55387J09525L46754J75370l24766n96534l02588
35980f57854K41928N18848M39148K60784R0097j49973l45259k27909J41337L27502
$$ plain form
35970 638649 761167 610823 467354 490587 540141 485934 382151 249174 -4569 -304275
35960 -304275 -362671 -126549 8017 -282484 -717274 -736771 -244891 313087 579082 663513
35950 663513 845387 1149296 1331671 1156442 639223 101219 -75464 116733 217114 -147660
35940 -147660 -711925 -887622 -599209 -401144 -646457 -942897 -732319 -128017 223756 15162
35930 15162 -374674 -439946 -136124 226740 433833 491414 432495 247367 13641 -105351
35920 -105351 -68304 -20396 -61346 -87655 2256 84599 2601 -113463 -2775 264498 311763
35909 311763 32195 -191848 -40712 264347 312018 97986 -68045 -101734 -214631 -485232
35899 -485232 -701189 -669375 -427966 -119047 135720 228262 140011 15009 -31788 -115096
$$ packed form
35970F38649J22518j50344j43469K3233M9554n4207j03783j32977k53743k99706
35960c04275n8396K36122J34566k90501m34790j9497M91880N57978K65995Q4431
35950F63513J81874L03909J82375j75229n17219n38004j76683J92197J00381l64774
35940a47660n64265j75697K88413J98065k45313k96440K10578O04302L51773k08594
35930A5162l89836o5272L03822L62864K07093N7581n8919j85128k33726j18992
35920a05351L7047M7908m0950k6309Q9911Q2343q1998j16064J10688K67273M7265
35909C11763k79568k24043J51136L05059M7671k14032j66031l3689j12897k70601
35899d85232k15957L1814K41409L08919K54767R2542q8251j25002m6797q3308
$$ plain form
35889 -115096 -360400 -585303 -512386 -227569 -52444 6601 237528 604412 649589 204268
35879 204268 -263457 -306922 -115771 -99973 -171692 96497 742480 1284590 1326267 973882
35869 973882 612118 493833 598134 729848 709528 537132 351938 204794 -5609 -288775
35859 -288775 -424088 -238399 97623 249562 131923 -39356 -64229 48867 198238 326116
35849 326116 384083 265729 -122971 -692847 -1103346 -983870 -331515 381992 650883 445132
35839 445132 134283 -13656 -27603 887 28693 -66892 -383080 -697893 -636711 -231730
35829 -231730 56762 8664 -79984 20992 82580 -78786 -148099 192237 659813 763696
35819 763696 542689 397608 379686 193728 -186854 -445485 -455009 -414775 -445898 -485002 -584486
$$ packed form
35889a15096k45304k24903P2917K84817J75125N9045K30927L66884M5177m45321
35879B04268m67725m3465J91151J5798p1719K68189O45983N42110M1677l52385
35869I73882l61764j18285J04301J31714k0320j72396j85194j47144k10403k83166
35859b88775j35313J85689L36022J51939j17639j71279k4873J13096J49371J27878
35849C26116N7967j18354l88700n69876m10499J19476O52355P13507K68891k05751
35839D45132l10849j47939j3947K8490K7806r5585l16188l14813O1182M04981
35829b31730K88492m8098q8648J00976O1588j61366o9313L40336M67576J03883
35819G63696k21007j45081j7922j85958l80582k58631r524M0234l1123l9104r9484
$$ plain form
35808 -584486 -866033 -1137380 -1012520 -500488 -43622 128941 242267 437483 471052 199442
35798 199442 -61844 -3363 177102 110661 -140376 -219249 -87943 -84557 -336787 -478175
35788 -478175 -139609 475124 767176 491236 91350 132626 555992 787892 556160 216798
35778 216798 144737 211610 174553 216679 624559 1155059 1276848 971149 750237 849620
35768 849620 926396 689014 354357 269642 447571 681327 824920 800870 607324 433887
35758 433887 482111 596321 417211 -24107 -279082 -167011 -25511 -88539 -110661 93369
35748 93369 209833 -76411 -539137 -790960 -859952 -935967 -868252 -444623 69367 238330
35738 238330 168060 348499 834515 1125569 910055 445892 84900 -169808 -466557 -777518
$$ packed form
35808e84486k81547k71347J24860N12032M56866J72563J13326J95216L3569k71610
35798A99442k61286N8481J80465o6441k51037p8873J31306L386k52230j41388
35788d78175L38566O14733K92052k75940l99886M1276M23366K31900k31732l39362
35778B16798p2061O6873l7057M2126M07880N30500J21789l05699k20912R9383
35768H49620P6776k37382l34657q4715J77929K33756J43593k4050j93546j73437
35758D33887M8224J14210j79110m41318k54975J12071J41500o3028k2122K04030
35748I3369J16464k86244m62726k51823o8992p6015O7715M23629N13990J68963
35738B38330p0270J80439M86016K91054k15514m64163l60992k54708k96749l10961
$$ plain form
35728 -777518 -942717 -857564 -543422 -193039 -125881 -474833 -939570 -1096293 -921268 -734393
35718 -734393 -669442 -550836 -315200 -172378 -232096 -311904 -281215 -298297 -503089 -719648
35708 -719648 -692363 -448598 -221505 -135898 -139003 -134361 -40700 176879 401991 394881 55970
35697 55970 -417663 -741222 -826212 -781526 -743777 -790357 -897400 -896686 -621430 -201462 -33035
35686 -33035 -284000 -598605 -529487 -136231 129745 64851 -95688 -148471 -226410 -467077
35676 -467077 -662224 -508329 -62365 312359 395573 287359 177987 158981 248094 374066
35666 374066 320834 -68397 -575219 -758033 -532362 -318031 -415602 -525331 -204499 418860
35656 418860 806572 780149 676941 732571 777634 677867 631737 783912 904541 752956
$$ packed form
35728g77518j65199Q5153L14142L50383O7158l48952m64737j56723J75025J86875
35718g34393O4951J18606K35636J42822n9718p9808L0689j7082k04792k16559
35708g19648K7285K43765K27093Q5607l105M642R3661K17579K25112p110l38911
35697E5970m73633l23559q4990M4686L7749m6580j07043P14K75256M19968J68427
35686c3035k50965l14605O9118L93256K65976o4894j60539n2783p7939k40667
35676d67077j95147J53895M45964L74724Q3214j08214j09372j9006Q9113J25972
35666C74066n3232l89231n06822j82814K25671K14331r7571j09729L20832O23359
35656D18860L87712k6423j03208N5630M5063r9767m6130J52175J20629j51585
$$ plain form
35646 752956 469262 287946 134834 -112288 -199020 185823 771472 903351 427544 -87979
35636 -87979 -155207 34475 47965 -113713 -124343 97229 293418 266167 51118 -285190
35626 -285190 -710562 -1034181 -956473 -491541 -114531 -228688 -609307 -681632 -327115 -63318
35616 -63318 -295763 -720915 -758860 -359068 -1131 13953 -131055 -191037 -174862 -109310 128887
35605 128887 504132 656334 355692 -89663 -201691 35972 224978 122395 -156486 -444073
35595 -444073 -699834 -870753 -860934 -703486 -551735 -459947 -352040 -207246 -78040 66407
35585 66407 285188 445985 318640 -46191 -272082 -105624 268416 465903 308757 -96936
35575 -96936 -544510 -882761 -1077749 -1186497 -1223230 -1093289 -780745 -518600 -537440 -674615
$$ packed form
35646G52956k83694j81316j53112k47122q6732L84843N85649J31879m75807n15523
35636h7979o7228J89682J3490j61678j0630K21572J96189k7251k15049l36308
35626b85190m25372l23619P7708M64932L77010j14157l80619p2325L54517K63797
35616f3318k32445m25152l7945L99792L57937J5084j45008n9982J6175O5552K38197
35605A28887L75245J52202l00642m45355j12028K37663J89006j02583k78881k87587
35595d44073k55761j70919R819J57448J51751R1788J07907J44794J29206J44447
35585F6407K18781J60797j27345l64831k25891J66458L74040J97487j57146m05693
35575i6936m47574l38251j94988j08748l6733J29941L12544K62145j8840j37175
$$ plain form
35565 -674615 -533880 -85097 223906 103271 -143066 -65555 290189 508722 431349 315437
35555 315437 386068 532305 532193 366265 180804 54035 -79761 -300833 -572880 -765315
35545 -765315 -796126 -714967 -600978 -418494 -83505 328262 590712 603058 502113 399888
35535 399888 183184 -235996 -605290 -546449 -75379 353209 387735 144447 -66787 -152875
35525 -152875 -191856 -160055 33462 316187 513782 624718 782485 935422 855855 550897
35515 550897 354714 438949 532997 392385 253295 433170 698750 533700 -44145 -464054
35505 -464054 -428382 -213158 -29982 313866 835303 1026671 548580 -155575 -450110 -375376
35495 -375376 -377626 -454655 -213306 357694 818047 962896 985141 922942 549121 -69368
$$ packed form
35565f74615J40735M48783L09003j20635k46337P7511L55744K18533p7373j15912
35555C15437P0631J46237j12j65928j85461j26769j33796k21072k72047j92435
35545g65315l0811Q1159J13989J82484L34989M11767K62450J2346j00945j02225
35535C99888k16704m19180l69294N8841M71070M28588L4526k43288k11234q6088
35525a52875l8981L1801J93517K82725J97595J10936J57767J52937p9567l04958
35515E50897j96183Q4235R4048j40612j39090J79875K65580j65050n77845m19909
35505d64054L5672K15224J83176L43848N21437J91368m78091p04155k94535P4734
35495c75376k250p7029K41349N71000M60353J44849K2245o2199l73821o18489
$$ plain form
35485 -69368 -478440 -502468 -485405 -639230 -662008 -311772 102339 181157 11207 -117110
35475 -117110 -243516 -553229 -900524 -975521 -813614 -720629 -762605 -713910 -489562 -272447
35465 -272447 -175659 -90483 39996 48002 -208370 -556958 -628036 -263562 248039 406722
35455 406722 14020 -596366 -921931 -811411 -481501 -128047 196969 357455 151730 -340527
35445 -340527 -758340 -944086 -1110156 -1369763 -1463352 -1190156 -768570 -467549 -194045 203469
35435 203469 506727 415585 58255 -195083 -263886 -307141 -314453 -190842 -113303 -311352 -559880
35424 -559880 -407313 74913 288999 -29196 -420917 -375464 -2272 211492 27617 -397897
35414 -397897 -795214 -1001422 -1026177 -1022455 -1094986 -1113395 -869039 -405447 22735 312619
$$ packed form
35485f9368m09072k4028J7063j53825k2778L50236M14111P8818j69950j28317
35475a17110j26406l09713l47295p4997J61907R2985m1976M8695K24348K17115
35465b72447R6788Q5176J30479Q006k56372l48588p1078L64474N11601J58683
35455D06722l92702o10386l25565J10520L29910L53454L25016J60486k05725m92257
35445c40527m17813j85746j66070k59607r3589K73196M21586L01021K73504L97514
35435B03469L03258r1142l57330k53338o8803m3255p312J23611P7539j98049k48528
35424e59880J52567M82226K14086l18195l91721M5453L73192K13764j83875m25514
35414c97897l97317k06208k4755L722p2531j8409K44356M63592M28182K89884
$$ plain form
35404 312619 574485 821364 905762 831835 813732 901511 846235 502718 111908 -1513
35394 -1513 183656 444636 568279 429714 41861 -340851 -398279 -170294 -73276 -335011
35384 -335011 -667080 -700390 -496814 -370463 -403057 -424811 -346378 -245692 -208260 -287942 -531494
35373 -531494 -864068 -1072754 -1073036 -1028292 -1017053 -802663 -219703 402588 568285 265096
35363 265096 -74407 -201030 -257936 -362001 -371804 -184579 45788 128508 52173 -109381
35353 -109381 -291123 -366184 -215988 42185 130099 6774 -45326 155133 425282 532275
35343 532275 535707 618347 761363 795864 646558 362062 43474 -123476 40295 415387
35333 415387 601664 434675 236331 276275 264259 -197802 -860939 -1061450 -657149 -189612
$$ packed form
35404C12619K61866K46879Q4398p3927j8103Q7779n5276l43517l90810j13421
35394a513J85169K60980J23643j38565l87853l82712n7428K27985R7018k61735
35384c35011l32069l3310K03576J26351l2594k1754P8433J00686L7432p9682k43552
35373e31494l32574k08686k82M4744J1239K14390N82960O22291J65697l03189
35363B65096l39503j26623n6906j04065r803J87225K30367Q2720p6335j61554
35353a09381j81742p5061J50196K58173Q7914j23325n2100K00459K70149J06993
35343E32275L432Q2640J43016L4501j49306k84496l18588j66950J63771L75092
35333D15387J86277j66989j98344L9944j2016m62061o63137k00511M04301M67537
$$ plain form
35323 -189612 -59228 -86447 -49474 -98274 -322641 -392393 -53670 371752 432906 223339
35313 223339 151080 258889 264725 118150 -3009 -149697 -498383 -812262 -598893 90371
35303 90371 586127 525021 318346 418998 627831 537140 258943 213600 440648 610872
35293 610872 595498 574036 621033 583715 397423 214201 176538 282101 455845 554415 375948
35282 375948 -83594 -463984 -431650 -190887 -265285 -750226 -1131841 -955519 -374509 122334
35272 122334 289990 250451 202993 207819 210475 172940 170029 313699 514583 441650 -69371
35261 -69371 -647792 -733764 -306351 70627 34282 -99502 121745 563802 686908 316207
35251 316207 -143363 -278426 -142255 -44333 -93022 -138990 -72795 21513 27385 -41001 -126547
$$ packed form
35323a89612J30384k7219L6973m8800k24367o9752L38723M25422O1154k09567
35313B23339p2259J07809N836j46575j21159j46688l48686l13879K13369O89264
35303I0371M95756o1106k06675J00652K08833r0691k78197m5343K27048J70224
35293F10872j5374k1462M6997l7318j86292j83222l7663J05563J73744R8570j78467
35282C75948m59542l80390L2334K40763p4398m84941l81615J76322N81010M96843
35272A22334J67656l9539m7458M826K656l7535k911J43670K00884p2933n11021
35261f9371n78421q5972M27413L76978l6345j33784K21247M42057J23106l70701
35251C16207m59570j35063J36171R7922m8689m5968O6195R4308N872o8386q5546
$$ plain form
35240 -126547 -284344 -600824 -973350 -1136105 -970768 -656045 -415959 -260321 -120639 -106736
35230 -106736 -384397 -828126 -1048103 -844220 -464803 -309208 -475396 -700748 -699060 -466558
35220 -466558 -235931 -159387 -107621 137900 534730 783129 709053 455060 216048 16833
35210 16833 -102086 52466 500914 834914 637047 51241 -390847 -419842 -173230 192275
35200 192275 604144 833039 633990 208160 73887 338798 528085 322264 35244 78333
35190 78333 326354 386889 238439 200569 389732 550161 410587 -17982 -496661 -772615
35180 -772615 -762743 -599085 -450594 -316065 -122378 31100 -21964 -181463 -174368 -14867
35170 -14867 3356 -141353 -93786 250530 480076 330892 171249 405878 770095 731713
$$ packed form
35240a26547j57797l16480l72526j62755J65337L14723K40086J55638J39682J3903
35230a06736k77661m43729k19977K03883L79417J55595j66188k25352J688K32502
35220d66558K30627P6544N1766K45521L96830K48399p4076k53993k39012j99215
35210A6833j18919J54552M48448L34000j97867n85806m42088k8995K46612L65505
35200A92275M11869K28895j99049m25830j34273K64911J89287k05821k87020M3089
35190G8333K48021O0535j48450l7870J89163J60429j39574m28569m78679k75954
35180g72615R872J63658J48491J34529J93687J53478n3064j59499P095J59501
35170a4867J8223j44709M7567L44316K29546j49184j59643K34629L64217l8382
$$ plain form
35160 731713 340756 122586 247168 347217 166926 -82300 -112043 51023 183949 145137
35150 145137 -47288 -265207 -385313 -442827 -574389 -719456 -598196 -166795 173721 106233
35140 106233 -122276 -100546 113458 191167 159114 309645 595306 657391 455619 352182
35130 352182 501272 631307 550116 434563 458277 489559 325516 -36910 -450914 -706188
35120 -706188 -591680 -181071 23301 -342212 -844909 -697999 104277 685944 471590 -132610
35110 -132610 -488435 -547251 -533033 -355838 115212 563934 573862 255705 51910 76425
35100 76425 89889 4657 -24800 34683 30397 -68885 -112452 -49050 -38054 -233340 -571359
35089 -571359 -762618 -484221 252182 900782 847762 188685 -315879 -238754 -6084 -124466
$$ packed form
35160G31713l90957k18170J24582J00049j80291k49226k9743J63066J32926l8812
35150A45137j92425k17919j20106n7514j31562j45067J21260M31401L40516o7488
35140A06233k28509K1730K14004P7709l2053J50531K85661O2085k01772j03437
35130C52182J49090J30035q1191j15553K3714L1282j64043l62426m14004k55274
35120g06188J14508M10609K04372l65513n02697J46910Q02276N81667k14354o04200
35110a32610l55825n8816J4218J77195M71050M48722R928l18157k03795K4515
35100G6425J3464q5232k9457N9483m286r9282m3567O3402J0996j95286l38019
35089e71359j91259K78397P36403O48600n3020o59077n04564P7125K32670j18382
$$ plain form
35079 -124466 -383026 -324744 -82842 -76325 -157465 162420 743239 879500 413993 30933
35069 30933 218413 617250 712235 560485 442541 322234 107579 9525 168186 303141
35059 303141 221537 296537 856040 1409487 1192801 339142 -235446 -133160 70454 -158339
35049 -158339 -550445 -645754 -562372 -640009 -744307 -515940 -65015 172936 162883 280355
35039 280355 596419 714123 449948 165801 168256 202362 -110958 -644363 -958705 -930627
35029 -930627 -802285 -724303 -627493 -496312 -398919 -242065 132727 539853 507810 -80158
35019 -80158 -703590 -792232 -384089 28857 133776 22385 -90889 -94302 44328 275126
35009 275126 408981 257058 -114812 -412730 -451320 -353020 -360862 -546681 -760924 -804310
$$ packed form
35079a24466k58560N8282K41902O517q1140L19885N80819J36261m65507l83060
35069C0933J87480L98837R4985j51750j17944j20307k14655r8054J58661J34955
35059C03141q1604P5000N59503N53447k16686q53659n74588J02286K03614k28793
35049a58339l92106r5309Q3382p7637j04298K28367M50925K37951j0053J17472
35039B80355L16064J17704k64175k84147K455L4106l13320n33405l14342K8078
35029i30627J28342P7982R6810J31181R7393J56854L74792M07126l2043n87968
35019h0158o23432q8642M08143M12946J04919j11391j13274l413J38630K30798
35009B75126J33855j51923l71870k97918l8590R8300p842j85819k14243m3386
$$ plain form
34999 -804310 -604998 -282093 -64406 -79635 -182874 -70076 357131 790336 800325 346208
34989 346208 -117551 -136269 215648 441674 241884 -156563 -351750 -255071 -59391 118949
34979 118949 289573 338507 67669 -421270 -677878 -437795 377 162150 -3330 -187430
34969 -187430 -265466 -405972 -613477 -556595 -74234 425501 412506 -25947 -248160 99143
34959 99143 621692 721656 345741 -66190 -219410 -233261 -313967 -479387 -669808 -856501
34949 -856501 -939245 -788772 -509749 -398396 -491468 -456175 -142636 86751 -88227 -370373
34939 -370373 -274113 107385 303810 279025 404880 653720 524261 -70215 -521915 -438307
34929 -438307 -211488 -277443 -388832 -160406 155107 91784 -177619 -123128 219068 337856
$$ packed form
34999h04310J99312L22905K17687j5229j03239J12798M27207M33205R989m54117
34989C46208m63759j8718L51917K26026j99790l98447j95187R6679J95680J78340
34979A18949J70624M8934k70838m88939k56608K40083M38172J61773j65480j84100
34969a87430p8036j40506k07505N6882M82361M99735j2995m38453k22213L47303
34959I9143N22549R9964l75915m11931j53220j3851q0706j65420j90421j86693
34949h56501q2744J50473K79023J11353r3072L5293L13539K29387j74978k82146
34939c70373R6260L81498J96425k4785J25855K48840j29459n94476m51700Q3608
34929d38307K26819o5955j11389K28426L15513o3323k69403N4491L42196J18788
$$ plain form
34919 337856 189239 308264 890371 1435792 1521214 1345122 1224798 1062920 684661 311322
34909 311322 276873 508718 662156 621942 552524 552504 548483 495046 450991 447001 419003 286113
34897 286113 45170 -173300 -151171 186882 585239 689860 508345 408424 576225 743801
34887 743801 614782 296879 73406 -29762 -144046 -181336 85404 590644 933372 822614
34877 822614 365651 -112377 -359870 -312466 -119284 -88282 -412392 -880565 -1015358 -582859
34867 -582859 129398 583697 451734 -185460 -929561 -1301965 -1060897 -429117 56253 30554
34857 30554 -377449 -750930 -839468 -722225 -574743 -425994 -212799 21151 125728 61482
34847 61482 -24113 -43231 -168907 -578867 -1040632 -1045628 -464884 194153 387835 176274
$$ packed form
34919C37856j48617J19025N82107N45421Q5422j76092j20324j61878l78259l73339
34909C11322l4449K31845J53438m0214o9418k0m021n3437m4055l990k7998j32890
34897B86113k40943k18470K2129L38053L98357J04621j81515r9921J67801J67576
34887G43801j29019l17903k23473j03168j14284l7290K66740N05240L42728j10758
34877H22614m56963m78028k47493M7404J93182L1002l24110m68173j34793M32499
34867e82859P12257M54299j31963o37194p44101l72404K41068O31780M85370k5699
34857C0554m08003l73481q8538J17243J47482J48749K13195K33950J04577o4246
34847F1482q5595j9118j25676m09960m61765m996N80744O59037J93682k11561
$$ plain form
34837 176274 5774 48888 119475 133716 227704 396690 432120 322089 324217 486213 495532
34826 495532 242045 126234 450782 853517 807799 433106 270449 396575 362299 15804
34816 15804 -228214 -114440 9444 -214510 -547891 -525298 -141237 208198 281693 165082
34806 165082 43133 92871 447538 967087 1204011 934236 578142 695760 1149363 1226993
34796 1226993 635464 -77104 -241400 167604 700107 1048559 1199271 1165725 902384 466930
34786 466930 58608 -140605 -85448 134888 341315 354303 126624 -211405 -454823 -453565
34776 -453565 -187295 189062 407473 342244 200452 282848 536653 575730 247755 -59438
34766 -59438 97069 574497 781512 444088 -46131 -166489 65055 180304 -62707 -387913
$$ packed form
34837A76274j70500M3114P0587J4241R3988J68986L5430j10031K128J61996R319
34826D95532k53487j15811L24548M02735m5718l74693j62657J26126l4276l46495
34816A5804k44018J13774J23884k23954l33381K2593L84061L49435P3495j16611
34806A65082j21949M9738L54667N19549K36924k69775l56094J17618M53603P7630
34796A226993n91529p12568j64296M09004N32503L48452J50712l3546k63341m35454
34786D66930m08322j99213N5157K20336K06427J2988k27679l38029k43418J258
34776d53565K66270L76357K18411o5229j41792Q2396K53805L9077l27975l07193
34766e9438J56507M77428K07015l37424m90219j20358K31544J15249k43011l25206
$$ plain form
34756 -387913 -476598 -456523 -643266 -963304 -1041183 -860218 -874261 -1279825 -1620540 -1458557
34746 -1458557 -1059843 -932828 -970040 -654745 -3399 351522 87321 -385465 -580361 -486384
34736 -486384 -266319 66547 381076 328698 -104028 -344764 29576 617274 704357 229082
34726 229082 -223083 -258537 -74788 -47040 -266662 -534466 -602591 -409612 -173468 -165310
34716 -165310 -335981 -364210 -142049 91456 222835 470022 872958 1009427 604991 55359
34706 55359 -116027 130 2212 -80967 46313 256060 134852 -269329 -480084 -361373
34696 -361373 -231028 -175825 93740 568455 757010 441663 87478 181565 581537 822382
34686 822382 714117 349111 -157454 -630849 -799669 -581387 -225075 21562 176883 296703
$$ packed form
34756c87913q8685K0075j86743l20038p7879J80965j4043m05564l40715J61983
34746a458557L98714J27015l7212L15295O51346L54921k64201m72786j94896R3977
34736d86384K20065L32866L14529n2378m32726k40736L74340N87698Q7083m75275
34726B29082m52165l5454J83749K7748k19622k67804o8125J92979K36144Q158
34716a65310j70671k8229K22161K33505J31379K47187M02936J36469m04436n49632
34706E5359j71386J16157K082q3179J27280K09747j21208m04181k10755J18711
34696c61373J30345N5203K69565M74715J88555l15347l54185R4087L99972K40845
34686H22382j08265l65006n06565m73395j68820K18282L56312K46637J55321J19820
$$ plain form
34676 296703 247952 -58518 -413530 -513687 -285280 128732 523334 658129 369880 -164290
34666 -164290 -480101 -323981 72614 356445 475278 557619 587207 456771 236103 152507
34656 152507 323801 637287 862048 822953 545300 278329 277140 516936 722998 706167
34646 706167 553659 470257 540264 648550 557372 137239 -373879 -503706 -132970 246826
34636 246826 158201 -179346 -201060 120995 266113 5164 -284419 -225356 113117 471337
34626 471337 651444 441741 -211251 -845652 -827690 -216879 232337 110841 -157427 -84481
34616 -84481 224886 493173 751230 1001507 948417 515502 142896 122160 128108 -116217
34606 -116217 -243666 107230 541992 484414 96413 -82322 -62795 -213714 -415138 -225469
$$ packed form
34676B96703m8751l06470l55012j00157K28407M14012L94602J34795k88249n34170
34666a64290l15811J56120L96595K83831J18833Q2341K9588j30436k20668q3596
34656A52507J71294L13486K24761l9095k77653k66971j189K39796K06062j6831
34646G06167j52508q3402P0007J08286r1178m20133n11118j29827L70736L79796
34636B46826q8625l37547k1714L22055J45118k60949k89583N9063L38473L58220
34626D71337J80107k09703o52992o34401J7962O10811M49216j21496k68268P2946
34616h4481L09367K68287K58057K50277n3090m32915l72606k0736N948k44325
34606a16217j27449L50896M34762n7578l88001j78735J9527j50919k01424J89669
$$ plain form
34596 -225469 244929 427945 228957 113204 240727 240413 -57637 -338433 -403464 -459260
34586 -459260 -643524 -806226 -908781 -1103455 -1262669 -989949 -321896 111755 -81711 -523249
34576 -523249 -662689 -504020 -382104 -347314 -165487 243577 684007 924170 880735 651667
34566 651667 466154 482126 575935 480400 159214 -138151 -217287 -132442 -10561 116792
34556 116792 266532 445147 623272 639513 263610 -424706 -906602 -812840 -471894 -439272
34546 -439272 -625886 -451511 173348 657778 648469 519066 676348 922223 879752 628800
34536 628800 497251 512843 462374 303142 168367 89119 -11532 -140399 -254034 -359225
34526 -359225 -443006 -414078 -226210 57202 363659 595043 513345 -45542 -762621 -996607
$$ packed form
34596b25469M70398J83016j98988j15753J27523l14k98050k80796o5031n5796
34586d59260j84264j62702j02555j94674j59214K72720O68053M33651j93466m41538
34576e23249j39440J58669J21916L4790J81827M09064M40430K40163m3435k29068
34566F51667j85513J5972R3809r5535l21186k97365p9136Q4845J21881J27353
34556A16792J49740J78615J78125J6241l75903o88316m81896R3762L40946L2622
34546d39272j86614J74375O24859M84430r309j29403J57282K45875m2471k50952
34536F28800j31549J5592n0469j59232j34775p9248j00651j28867j13635j05191
34526c59225q3781K8928J87868K83412L06457K31384q1698n58887p17079k33986
$$ plain form
34516 -996607 -545318 52007 184938 -130031 -450329 -539801 -510875 -510988 -541356 -507985 -299224
34505 -299224 78775 374454 307290 -10550 -151276 12554 111473 -109415 -357425 -275505
34495 -275505 -22851 20853 -119210 -117336 76560 191335 96210 -65465 -168033 -202526
34485 -202526 -123099 92425 266090 213822 77749 141387 348921 375664 181192 78717
34475 78717 168730 143226 -142628 -327758 -122861 104526 -190464 -823416 -1000177 -402006
34465 -402006 344982 509911 161040 -117811 -103846 -46258 -43559 130922 497960 671245
34455 671245 430960 108244 87414 236152 194351 -5358 -15599 255094 536769 607009
34445 607009 478467 240696 31678 90849 492910 879216 810694 361439 15773 18872
$$ packed form
34516i96607M51289N97325J32931l14969l20298q9472K8926j13l0368L3371K08761
34505b99224L77999K95679o7164l17840j40726J63830R8919k20888k48010Q1920
34495b75505K52654M3704j40063J874J93896J14775r5125j61675j02568l4493
34485b02526P9427K15524J73665n2268j36073O3638K07534K6743j94472j02475
34475G8717R0013k5504k85854j85130K04897K27387k94990o32952j76761N98171
34465d02006P46988J64929l48871k78851J3965N7588K699J74481L67038J73285
34455F71245k40285l22716k0830J48738m1801j99709j0241K70693K81675P0240
34445F07009j28542k37771k09018N9171M02061L86306o8522m49255l45666L099
$$ plain form
34435 18872 205820 420402 648417 733574 469653 72486 55204 454652 655301 227308
34425 227308 -479270 -849692 -736531 -382714 42504 489436 857563 1083832 1216219 1194897
34415 1194897 815494 133300 -385595 -404528 -162404 -85698 -181795 -142382 125528 407544
34405 407544 527434 511749 469652 506316 680456 902187 980422 878896 766407 720906
34395 720906 609039 381831 224166 239697 258896 161605 105922 187768 157405 -201033 -624120
34384 -624120 -650540 -215636 340145 750341 1020834 1216317 1313823 1272795 1092276 806639
34374 806639 492183 212226 -59096 -333919 -470691 -358186 -189079 -228501 -337435 -143069
34364 -143069 291646 468929 236181 20514 89486 152434 -13349 -125857 22629 112467
$$ packed form
34435A8872J86948K14582K28015Q5157k63921l97167j7282L99448K00649m27993
34425B27308p06578l70422J13161L53817M25218M46932L68127K26269J32387k1322
34415A194897l79403o82194n18895j8933K42124P6706r6097L9413K67910K82016
34405D07544J19890j5685m2097L6664J74140K21731P8235j01526j12489m5501
34395G20906j11867k27208j57665J5531J9199r7291n5683Q1846l0363l58438m23087
34384f24120k6420M34904N55781M10196K70493J95483R7506m1028j80519k85637
34374H06639l14456k79957k71322k74823j36772J12505J69107l9422j08934J94366
34364a43069M34715J77283k32748k15667O8972O2948j65783j12508J48486Q9838
$$ plain form
34354 112467 -103746 -271119 -41572 266462 212708 3102 63594 233023 90866 -215496
34344 -215496 -202745 124591 405542 659083 1110348 1437247 1041058 71022 -618939 -627638
34334 -627638 -398753 -353626 -360853 -257828 -213813 -299040 -274192 -87705 -60632 -295174 -381913
34323 -381913 -5942 555710 828413 697523 356475 46730 46860 540199 1241948 1492096
34313 1492096 986483 151819 -411442 -567905 -518425 -360194 -95940 130531 142830 2724
34303 2724 -65779 2013 25550 -179836 -556232 -824598 -772053 -506545 -316477 -259870 -111014
34292 -111014 182632 298691 47979 -220642 -110840 172128 148080 -121441 -98408 381316
34282 381316 876930 1042296 1046118 1123516 1149810 922261 578459 476866 771623 1212699
$$ packed form
34354A12467k16213j67373K29547L08034n3754k09606O0492J69429j42157l06362
34344b15496J2751L27336K80951K53541M51265L26899l96189r70036o89961q699
34334f27638K28885M5127p227J03025M4015q5227K4848J86487K7073k34542q6739
34323c81913L75971N61652K72703j30890l41048l09745J30M93339P01749K50148
34313A492096n05613q34664n63261j56463M9480J58231K64254K26471J2299j40106
34303B724o8503O7792K3537k05386l76396k68366N2545K65508J90068N6607J48856
34292a11014K93646J16059k50712k68621J09802K82968k4048k69521K3033M79724
34282C81316M95614J65366L822P7398K6294k27549l43802j01593K94757M41076
$$ plain form
34272 1212699 1308977 751949 -188502 -814895 -727958 -227192 211941 556246 954278 1183931
34262 1183931 907430 301807 -119891 -212815 -210187 -170779 5654 137681 -17128 -179881
34252 -179881 119538 666511 769011 374073 158880 354650 336159 -276822 -883015 -745338
34242 -745338 17287 752678 1111813 1144613 991292 872042 1012091 1253670 1123181 557406
34232 557406 117107 170771 341325 145377 -263338 -433328 -330034 -243320 -241498 -148688
34222 -148688 95279 375775 566889 550632 265578 -119229 -330963 -398543 -602516 -922409
34212 -922409 -959091 -574656 -158148 -28791 -20306 83610 148454 26056 -123251 -159384
34202 -159384 -225223 -380589 -369059 -63424 242648 301300 278763 340515 278279 -85752 -498215
$$ packed form
34272A212699R6278n57028r40451o26393Q6937N00766M39133L44305L98032K29653
34262A183931k76501o05623m21698r2924K628L9408J76433J32027j54809j62753
34252a79881K99419N46973J02500l94938k15193J95770j8491o12981o06193J37677
34242g45338P62625P35391L59135L2800j53321j19250J40049K41579j30489n65775
34232E57406m40299N3664J70554j95948m08715j69990J03294Q6714J822R2810
34222a48688K43967K80496J91114j6257k85054l84807k11734o7580k03973l19893
34212i22409l6682L84435M16508J29357Q485J03916O4844j22398j49307l6133
34202a59384o5839j55366J1530L05635L06072N8652k2537O1752o2236l64031m12463
$$ plain form
34191 -498215 -649137 -605875 -533529 -347873 -9044 203310 105668 -17108 160122 491546
34181 491546 630461 522607 302698 7786 -275358 -292648 8312 290974 319788 308536
34171 308536 471833 599087 437328 151559 21196 -7980 -93362 -114067 106462 449220
34161 449220 693312 817968 859324 753120 539418 398432 307803 64025 -210528 -108199
34151 -108199 319707 474382 146409 -122630 26415 195335 65190 69076 591169 1148623
34141 1148623 1102375 644662 350420 246690 81980 42077 369706 660393 388068 -164504
34131 -164504 -329813 -155288 -230239 -588039 -645539 -207428 249511 361534 301893 335975
34121 335975 482403 691487 937131 1087337 995640 693558 289439 -144347 -402811 -207667
$$ packed form
34191d98215j50922M3262P2346J85656L38829K12354r7642j22776J77230L31424
34181D91546J38915j07854k19909k94912k83144j7290L00960K82662K8814j1252
34171C08536J63297J27254j61759k85769j30363k9176q5382k0705K20529L42758
34161D49220K44092J24656M1356j06204k13702j40986r0629k43778k74553J02329
34151a08199M27906J54675l27973k69039J49045J68920j30145L886N22093N57454
34141A148623m6248m57713k94242j03730j64710l9903L27629K90687k72325n52572
34131a64504j65309J74525p4951l57800n7500M38111M56939J12023n9641L4082
34121C35975J46428K09084K45644J50206r1697l02082m04119m33786k58464J95144
$$ plain form
34111 -207667 304159 553725 294611 -27827 -24655 55807 -88135 -209967 -11164 289866
34101 289866 423917 586396 948074 1198268 1124804 1051904 1130092 882401 131458 -362837
34091 -362837 -284 641970 779684 692654 1017506 1455275 1340083 942201 988667 1309014
34081 1309014 1166523 598669 243679 133075 -155770 -407769 -48731 653230 838819
34072 838819 408989 50988 48147 98955 139127 302459 284603 -197217 -586988 -238350
34062 -238350 357387 305223 -94240 138982 833754 889137 230676 -28995 503038 918483
34052 918483 566951 -151105 -793368 -1409442 -1828000 -1614254 -964294 -535765 -301671 267603
34042 267603 901122 752509 -5421 -236561 318115 671805 330733 -6294 146466 304923
$$ packed form
34111b07667N11826K49566k59114l22438L172Q0462j43942j21832J98803L01030
34101B89866J34051J62479L61678K50194p3464p2900P8188k47691p50943m94295
34091c62837L62553O42254J37714q7030L24852M37769j15192l97882M6466L20347
34081A309014j42491n67854l54990j10604k88845k51999L59038P01961J85589
34072H38819m29830l58001k841N0808M0172J63332j7856m81820l89771L48638
34062b38350N95737n2164l99463K33222O94772N5383o58461k59671N32033M15445
34052I18483l51532p18056o42263o16074m18558K13746O49960M28529K34094N69274
34042B67603O33519j48613p57930k31140N54676L53690l41072l37027J52760J58457
$$ plain form
34032 304923 118574 13683 267491 500939 469162 407308 388858 282114 353099 862170
34022 862170 1186871 572293 -400718 -471915 314830 766721 548345 424787 583345 431298
34012 431298 84319 315100 956534 1081699 769861 893508 1242676 856072 127039 369621
34002 369621 1295426 1315338 461819 444876 1522256 2004299 1338109 929566 1281579 1140175
33992 1140175 262147 152817 1115762 1473247 775298 810442 2208530 3062819 2344795
33983 2344795 1697518 2296032 2893261 2589607 2532011 3175741 2948288 1430912 702294
33974 702294 1626968 2099834 995177 370541 1478205 2217532 1138761 313071 1357663
33965 1357663 2278414 1365853 546839 1551072 2470488 1638180 1105547 2536704 3623307
$$ packed form
34032C04923j86349j04891K53808K33448l1777o1854j8450j06744P0985N09071
34022H62170L24701o14578r73011p1197P86745M51891k18376j23558J58558j52047
34012D31298l46979K30781O41434J25165l11838J23647L49168l86604p29033K42582
34002C69621R25805J9912q53519j6943J077380M82043o66190m08543L52013j41404
33992A140175q78028j09330R62945L57485o97949L5144J398088Q54289p18024
33983B344795o47277N98514N97229l03654n7596O43730k27453j517376p28618
33974G02294R24674M72866j104657o24636J107664P39327j078771q25690J044592
33965A357663R20751r12561q19014J004233R19416q32308n32633J431157J086603
$$ plain form
33956 3623307 2580167 2028727 4058711 5810940 4730182 3602158 5168374 6674813
33948 6674813 5554049 5165559 8317797 10904289 9572968 9397238 15040068 21312948
33940 21312948 23258406 27673398 40930564 54602282 63132327 88029029 154771412
33933 154771412 242005384 285039710 246792689 163038646 97952716 73345219 64679415
33926 64679415 51199986 38677404 35334347 34532142 29385095 24871126 26139743 28557169
33918 28557169 27488700 26962521 31034264 35471236 35055581 31847536 29844243 27749529
33910 27749529 23073968 18064589 15831787 14877966 12483243 9745503 8787125 8458392
33902 8458392 6990723 5723638 6289967 7039168 5945715 4356459 4351578 4922453 4153041
$$ packed form
33956C623307j043140n51440K029984J752229j080758j128024J566216J506439
33948F674813j120764l88490L152238K586492j331321j75730N642830O272880
33940B1312948J945458M414992J3257166J3671718Q530045K4896702O6742383
33933A54771412Q7233972M3034326l8247021q3754043o5085930k4607497q665804
33926F4679415j3479429j2522582l343057q02205n147047m513969J268617K417426
33918B8557169j068469n26179M071743M436972m15655l208045k003293k094714
33910B7749529m675561n009379k232802r53821k394723k737740r58378l28733
33902H458392j467669j267085N66329P49201j093453j589256m881N70875p69412
$$ plain form
33893 4153041 2861629 2791597 3273365 2797968 2001383 2146143 2427146 1596791 578214
33884 578214 756531 1284827 739183 -77956 364196 1400390 1353174 471456 199598 537674
33874 537674 503789 326582 892206 1728753 1642381 772338 190238 87003 -1982 88897
33864 88897 633591 999774 667959 401436 927338 1436101 956755 197927 309465 766777
33854 766777 323474 -707022 -975381 -320184 276653 481604 725485 955220 811112
33845 811112 667397 1064614 1503819 1166826 395407 109369 224182 13930 -419607 -447516
33835 -447516 -264957 -523073 -953780 -763948 -132633 50150 -265855 -316076 54295 245878
33825 245878 91018 17605 97046 1585 -166725 -3269 343479 370233 121771 10447
$$ packed form
33893D153041j291412p0032M81768m75397p96585J44760K81003q30355j018577
33884E78214J78317N28296n45644q17139M42152J036194m7216q81718k71858L38076
33874E37674l3885j77207N65624Q36547q6372q70043n82100j03235q8985R0879
33864H8897N44694L66183l31815k66523N25902N08763m79346p58828J11538M57312
33854G66777m43303j030496k68359O55197N96837K04951K43881K29735j44108
33845H11112j43715L97217M39205l36993p71419k86038J14813k10252m33537k7909
33835d47516J82559k58116m30707J89832O31315J82783l16005n0221L70371J91583
33825B45878j54860p3413P9441r5461j68310J63456L46748K6754k48462j11324
$$ plain form
33815 10447 -49016 -419620 -882081 -894573 -497567 -120730 219596 666189 818034 244421
33805 244421 -579279 -801806 -422072 -99356 -43753 -17822 -113936 -530353 -846992 -543209
33795 -543209 -16188 -77062 -628397 -849628 -531643 -215365 -127785 10041 179536 43175
33785 43175 -283268 -324149 -91814 -20478 -119115 -3483 308873 438098 383338 448752 557309
33774 557309 406809 138703 73786 13119 -363831 -677015 -354388 286206 467968 253419
33764 253419 331923 671439 566712 17235 -154212 292581 638934 487022 337527 554147
33754 554147 752565 636703 550966 740672 841193 574155 282000 308937 420102 276644
33744 276644 25975 27689 342186 774274 1128071 1244120 1064506 749892 482780 207911
$$ packed form
33815A0447n9463l70604m62461j2492L97006L76837L40326M46593J51845n73613
33805B44421q23700k22527L79734L22716N5603K5931r6114m16417l16639L03783
33795e43209N27021o0874n51335k21231L17985L16278Q7580J37826J69495j36361
33785D3175l26443m0881K32335P1336r8637J15632L12356J29225n4760O5414J08557
33774E57309j50500k68106o4917o0667l76950l13184L22627O40594J81762k14549
33764B53419P8504L39516j04727n49477j71447M46793L46353j51912j49495K16620
33754E54147J98418j15862q5737J89706J00521k67038k92155K6937J11165j43458
33744B76644k50669J714L14497M32088L53797J16049j79614l14614k67112k74869
$$ plain form
33734 207911 -138440 -327556 -193329 -72207 -347486 -743242 -690098 -255056 -43439 -246357
33724 -246357 -446542 -356878 -136870 23255 75289 -86633 -466347 -704038 -499604 -130348
33714 -130348 -3134 44709 356765 683177 569522 249415 296462 604664 608352 317828
33704 317828 184995 125992 -269236 -678474 -357939 472451 736717 146789 -407417 -337773
33694 -337773 -82344 -22393 186379 706410 956228 552938 1978 -114559 43514 45245
33684 45245 -128325 -259994 -211661 170118 874911 1349637 1026244 306885 162260 638156
33674 638156 751731 84943 -587146 -606500 -312790 -175787 -73816 67902 -73626 -397091
33664 -397091 -205794 575850 1044098 797002 690785 1356753 2040484 1847363 1163911 806206
$$ packed form
33734B07911l46351j89116J34227J21122k75279l95756N3144M35042K11617k02918
33724b46357k00185Q9664K20008J60125N2034j61922l79714k37691K04434L69256
33714a30348J27214M7843L12056L26412j13655l20107M7047L08202L688k90524
33704C17828j32833n9003l95228m09238L20535Q30390K64266n89928n54206O9644
33694c37773K55429N9951K08772N20031K49818m03290n50960j16537J58073J731
33684D5245j73570j31669M8333L81779P04793M74726l23393p19359j44625M75896
33674F38156J13575o66788o72089j9354K93710J37003J01971J41718j41528l23465
33664c97091J91297P81644M68248k47096j06217O65968O83731j93121o83452l57705
$$ plain form
33654 806206 644977 224356 -19657 564768 1466747 1554486 709031 -154497 -464808 -425781
33644 -425781 -289501 -125616 -167358 -562448 -909476 -750493 -332400 -225154 -457321 -686996
33634 -686996 -883834 -1131061 -1128723 -671392 -248921 -351228 -556393 -209139 364885 343175
33624 343175 -172652 -320291 73650 321538 148232 39993 198057 191232 -107449 -195646
33614 -195646 134495 406448 331223 272404 465988 517125 111137 -409316 -623107 -643946
33604 -643946 -731204 -776991 -615839 -441583 -499535 -678201 -753311 -753302 -790105 -808913 -772903 -818988
33592 -818988 -980602 -1036761 -889747 -813426 -1038994 -1322429 -1219327 -640969 94108 622224
33582 622224 758019 521992 161616 20529 184608 355281 253268 44000 143642 641154
$$ packed form
33654H06206j61229m20621k44013N84425R01979Q7739q45455q63528l10311L9027
33644d25781J36280J63885m1742l95090l47028J58983M18093J07246k32167k29675
33634f86996j96838k47227K338M57331M22471j02307k05165L47254N74024k1710
33624C43175n15827j47639L93941K47888j73306j08239J58064o825k98681q8197
33614a95646L30141K71953p5225n8819J93584N1137m05988n20453k13791k0839
33604f43946q7258m5787J61152J74256n7952j78666p5110Rl6803j8808L6010m6085
33592h18988j61614n6159J47014P6321k25568k83435J03102N78358P35077N28116
33582F22224J35795k36027l60376j41087J64079J70673j02013k09268R9642M97512
$$ plain form
33572 641154 1134319 1194646 834639 410602 176735 106957 121868 248079 438584 466266
33562 466266 242977 77675 282088 622742 582606 146071 -169481 -155462 -239620 -721584
33552 -721584 -1198036 -1151361 -708764 -357062 -207120 -25311 215814 301335 179825 1074
33542 1074 -170732 -343487 -397193 -219789 44390 159040 110556 37937 6933 58025 250186
33531 250186 432859 268312 -240293 -567880 -343768 128809 386067 441275 464703 259537
33521 259537 -332336 -834022 -633172 110416 688652 803591 679556 413758 -75706 -562794
33511 -562794 -689387 -583604 -628657 -692568 -339499 226063 274494 -277761 -650901 -388114
33501 -388114 37376 130246 128337 383238 622516 400327 -138333 -465799 -372160 -63480
$$ packed form
33572F41154M93165O0327l60007m24037k33867o9778J4911J26211J90505K7682
33562D66266k23289j65302K04413L40654m0136m36535l15552J4019q4158m81964
33552g21584m76452M6675M42597L51702J49942J81809K41125Q5521j21510j78751
33542A074j71806j72755n3706J77404K64179J14650m8484p2619l1004N1092J92161
33531B50186J82673j64547n08605l27587K24112M72577K57258N5208K3428k05166
33521B59537n91873n01686K00850P43588N78236J14939j24035k65798m89464m87088
33511e62794j26593J05783m5053o3911L53069N65562M8431n52255l73140K62787
33501c88114M25490R2870j909K54901K39278k22189n38660l27466R3639L08680
$$ plain form
33491 -63480 193721 200365 -157214 -704079 -983826 -730737 -194468 163299 134800 -147622
33481 -147622 -371128 -248173 167168 363834 -73547 -783324 -936983 -315534 393117 532305
33471 532305 246764 79035 211389 402437 376016 31610 -486616 -786120 -567900 -57972
33461 -57972 229088 186028 134762 125765 -182103 -761186 -981314 -498558 172926 401056
33451 401056 269263 226678 359086 511898 743249 1093323 1198005 699147 -149781 -781875
33441 -781875 -1043841 -1166583 -1209836 -1043531 -743271 -499809 -225352 265145 753716 805699
33431 805699 446627 164719 196532 280646 209322 145088 191209 71445 -442770 -1051141
33421 -1051141 -1212814 -818820 -310702 -140320 -308191 -481328 -420758 -169430 135794 469009
$$ packed form
33491f3480K57201O644l57579n46865k79747K53089N36269L57767k8499k82422
33481a47622k23506J22955M15341J96666m37381p09777j53659O21449P08651J39188
33471E32305k85541j67729J32354J91048k6421l44406n18226k99504K18220N09928
33461e7972K87060m3060n1266q997l07868n79083k20128M82756O71484K28130
33451D01056j31793m2585J32408J52812K31351L50074J04682m98858q48928o32094
33441g81875k61966j22742m3253J66305L00260K43462K74457M90497M88571N1983
33431H05699l59072k81908L1813Q4114p1324o4234M6121j19764n14215o08371
33421a051141j61673L93994N08118J70382j67871j73137O0570K51328L05224L33215
$$ plain form
33411 469009 831140 1069415 971203 546492 62041 -233192 -278015 -95027 278822 691062
33401 691062 900135 826557 649238 559048 532511 417960 131271 -271384 -586458 -533777
33391 -533777 -32315 572899 782577 493061 67938 -151569 -141943 9066 248323 400571
33381 400571 246826 -58891 -18499 512898 994407 877014 332597 -44731 -39195 69155
33371 69155 32962 -123403 -345518 -652454 -935873 -931540 -515762 92637 498804 469146
33361 469146 122048 -192144 -244606 -140090 -84031 -27879 220922 583619 741149 633222
33351 633222 568831 713609 832082 730513 590500 595332 557195 244809 -188304 -449859
33341 -449859 -558183 -690247 -773340 -612617 -301773 -127029 -113539 -5049 306112 610560
$$ packed form
33411D69009L62131K38275r8212m24711m84451k95233m4823J82988L73849M12240
33401F91062K09073p3578j77319r0190k6537j14551k86689m02655l15074N2681
33391e33777N01462O05214K09678k89516m25123k19507R626J51009K39257J52248
33381D00571j53745l05717M0392N31397M81509j17393n44417l77328N536J08350
33371F9155l6193j56365k22115l06936k83419M333M15778O08399M06167k9658
33361D69146l47098l14192n2462J04516N6059N6152K48801L62697J57530j07927
33351F33222o4391J44778J18473j01569j40013M832l8137l12386m33113k61555
33341d49859j08324j32064q3093J60723L10844J74744J3490J08490L11161L04448
$$ plain form
33331 610560 680393 540257 400342 414866 499746 388624 -6831 -325181 -119847 462567
33321 462567 731959 329380 -327709 -684067 -715253 -658099 -508550 -224048 -59628 -188559
33311 -188559 -281916 -26398 189333 -233981 -1052623 -1338233 -762920 -66578 -16233 -443612
33301 -443612 -646519 -350054 112536 353553 309905 134723 -26842 -108347 -94943 -468
33291 -468 135003 267663 405233 583842 710985 547068 52666 -350932 -214092 274709
33281 274709 482818 233096 -13346 -4052 -84903 -429384 -561355 -187338 111814 -254357
33271 -254357 -822429 -738771 -157943 -26181 -591962 -1083154 -928820 -423427 -1318 333126
33261 333126 578336 480981 79790 -101827 207895 595982 613098 398052 319474 422194
$$ packed form
33331F10560O9833j40136j39915J4524Q4880j11122l95455l18350K05334N82414
33321D62567K69392m02579o57089l56358l1186N7154J49549K84502J64420j28931
33311a88559r3357K55518K15731m23314q18642k85610N75313O96342N0345m27379
33301d43612k02907K96465M62590K41017m3648j75182j61565q1505J3404R4475
33291d68J35471J32660J37570J78609J27143j63917m94402m03598J36840M88801
33281B74709K08109k49722k46442R294q0851l44481j31971L74017K99152l66171
33271b54357n68072Q3658N80828J31762n65781m91192J54334N05393M22109L34444
33261C33126K45210r7355m01191j81617L09722L88087J7116k15046p8578J02720
$$ plain form
33251 422194 575367 786751 1022626 1051466 797691 555368 559196 643204 606739 596460 787950
33240 787950 959963 753725 191862 -354438 -583864 -443249 -68763 241850 180252 -240295
33230 -240295 -655469 -803524 -813198 -886387 -926204 -700637 -216920 265590 506180 467336
33220 467336 325692 301440 331269 15944 -815725 -1616249 -1650895 -981525 -376534 -212076
33210 -212076 -117969 135550 171915 -177178 -322946 197074 849198 830192 261382 -84896
33200 -84896 28743 158144 62469 -37215 -78056 -309044 -697322 -801585 -439888 19582
33190 19582 238432 330967 485660 574132 425892 189577 115099 155436 45833 -304845
33180 -304845 -681447 -789438 -530537 -81347 281862 451994 515225 478716 182546 -341551
$$ packed form
33251D22194J53173K11384K35875K8840k53775k42323L828Q4008l6465j0279J91490
33240G87950J72013k06238n61863n46300k29426J40615L74486L10613o1598m20547
33230b40295m15174j48055r674p3189l9817K25567M83717M82510K40590l8844
33220D67336j41644k4252K9829l15325q31669q00524l4646O69370O04991J64458
33210b12076R4107K53519L6365l49093j45768N20020O52124j9006n68810l46278
33200h4896J13639J29401r5675r9684m0841k30988l88278j04263L61697M59470
33190A9582K18850R2535J54693Q8472j48240k36315p4478M0337j09603l50678
33180c04845l76602j07991K58901M49190L63209J70132O3231l6509k96170n24097
$$ plain form
33170 -341551 -656510 -407270 100479 200903 -274467 -817484 -944032 -692739 -360587 -143794
33160 -143794 -187143 -608142 -1242893 -1663416 -1664700 -1463773 -1232529 -798502 -121604 295421
33150 295421 -29830 -771770 -1101873 -745592 -237652 -77314 -140028 -105399 15564 104598
33140 104598 296149 681987 921642 647498 134756 40502 454372 724186 385893 -197626
33130 -197626 -404243 -178987 75442 169935 272878 501938 743379 846764 726970 341700
33120 341700 -164146 -396796 -128049 294414 308846 -115743 -469036 -433352 -219421 -111253
33110 -111253 -106501 -148246 -298072 -472261 -392114 -54920 104743 -158845 -431620 -181020
33100 -181020 455796 838225 663476 264463 106836 314809 710738 1062183 1234483 1255893
$$ packed form
33170c41551l14959K49240N07749J00424m75370n43017j26548K51293L32152K16793
33160a43794m3349m20999o34751m20523j284K00927K31244M34027O76898M17025
33150B95421l25251p41940l30103L56281N07940J60338o2714L4629J20963Q9034
33140A04598J91551L85838K39655k74144n12742r4254M13870K69814l38293n83519
33130a97626k06617K25256K54429R4493J02943K29060K41441J03385j19794l85270
33120C41700n05846k32650K68747M22463J4432m24589l53293L5684K13931J08168
33110a11253M752m1745j49826j74189Q0147L37194J59663k63588k72775K50600
33100a81020O36816L82429j74749l99013j57627K07973L95929L51445J72300K1410
$$ plain form
33090 1255893 1251571 1238247 1071404 693563 289625 51153 -51485 -89392 33815 358985
33080 358985 611607 482603 72021 -261321 -427288 -652233 -1022497 -1326221 -1405221 -1351494
33070 -1351494 -1247429 -986389 -513507 -41157 167495 131609 121171 327453 649094 797577
33060 797577 594919 180667 -104770 -79206 91500 112455 -113311 -449986 -709541 -746389
33050 -746389 -484345 -22194 354668 434426 297643 134734 -48330 -335934 -615422 -667967
33040 -667967 -525120 -440404 -461820 -318089 162199 765381 1168504 1291421 1215607 954340
33030 954340 532652 169013 111273 300410 410709 272265 92307 172906 515003 806343
33020 806343 762361 398851 -21851 -253283 -269815 -256355 -404971 -698229 -909184 -852990
$$ packed form
33090A255893m322j3324j66843l77841m03938k38472j02638l7907J23207L25170
33080C58985K52622j29004m10582l33342j65967k24945l70264l03724p9000N3727
33070a351494J04065K61040M72882M72350K08652l5886j0438K06282L21641J48483
33060G97577k02658m14252k85437K5564J70706K0955k25766l36675k59555l6848
33050g46389K62044M62151L76862P9758j36783j62909j83064k87604k79488n2545
33040f67967J42847Q4716k1416J43731M80288O03182M03123J22917p5814k61267
33030I54340m21688l63639n7740J89137J10299j38444j79958Q0599L42097K91340
33020H06343m3982l63510m20702k31432j6532J3460j48616k93258k10955N6194
$$ plain form
33010 -852990 -604949 -398435 -346529 -387928 -485223 -683791 -922857 -1002580 -866961 -724109
33000 -724109 -721111 -701831 -503720 -282629 -246272 -258030 -88815 78603 -137670 -642914
32990 -642914 -893248 -656043 -278969 -101524 -61339 -19440 9016 135580 594843 1188402
32980 1188402 1256522 594527 -73446 -14023 513423 702102 326222 -151045 -369894 -372678
32970 -372678 -228805 55824 268732 140247 -201380 -343669 -165082 95349 309033 561380
32960 561380 791404 799801 685456 821137 1261719 1582752 1480199 1173075 1003856 942411
32950 942411 736658 354717 29137 -62628 3843 19202 -98899 -191477 -69519 168133
32940 168133 209020 -14189 -190511 -107125 38591 47277 108731 416290 689697 557329
$$ packed form
33010h52990K48041K06514N1906m1399r7295j98568k39066p9723J35619J42852
33000g24109K998J9280J98111K21091L6357j1758J69215J67418k16273n05244
32990f42914k50334K37205L77074J77445M0185M1899K8456J26564M59263N93559
32980A188402O8120o61995o67973N9423N27446J88679l75880m77267k18849k784
32970c72678J43873K84629K12908j28485l41627j42289J78587K60431K13684K52347
32960E61380K30024Q397j14345J35681M40582L21033j02553l07124j69219o1445
32950I42411k05753l81941l25580r1765O6471J5359j18101r2578J21958K37652
32940A68133M0887k23209j76322Q3386J45716Q686O1454L07559K73407j32368
$$ plain form
32930 557329 190055 32811 84099 21492 -87478 133258 589675 716413 380390 133618
32920 133618 340741 645753 605091 336815 194569 222512 292012 429293 647657 720025
32910 720025 447570 -28112 -419160 -620239 -667012 -567462 -347746 -108250 69271 128450
32900 128450 -23631 -346807 -518003 -311025 -47335 -194219 -556643 -464743 174185 677605
32890 677605 622364 388669 376159 380419 192590 158801 548316 893369 617979 -62126
32880 -62126 -504131 -580327 -623939 -709477 -649942 -530698 -602819 -751992 -671759 -480697 -567983
32869 -567983 -859286 -835084 -328585 235254 481526 475161 374232 178128 -17761 51894
32859 51894 418079 720368 663227 385590 206017 215531 294368 369514 481078 656113 821031
$$ packed form
32930E57329l67274j57244N1288o2607j08970K20736M56417J26738l36023k46772
32920A33618K07123L05012m0662k68276j42246K7943O9500J37281K18364P2368
32910G20025k72455m75682l91048k01079m6773R9550K19716K39496J77521N9179
32900A28450j52081l23176j71196K06978K63690j46884l62424R1900O38928N03420
32890F77605n5241k33695j2510M260j87829l3789L89515L45053k75390o80105
32880f2126m42005p6196m3612q5538N9535J19244p2121j49173Q0233J91062q7286
32869e67983k91303K4202N06499N63839K46272o365j00929j96104j95889O9655
32859E1894L66185L02289n7141k77637j79573R514P8837P5146J11564J75035J64918
$$ plain form
32848 821031 842278 660922 391219 206560 115157 -1575 -104783 -1110 276668 404065
32838 404065 270821 223326 522388 885326 939061 834240 953392 1236351 1299698 1073429
32828 1073429 808751 574324 288236 165747 521237 1098117 1218467 741337 293380
32819 293380 333817 549033 492741 320543 438055 771113 888969 686401 487044 501296
32809 501296 564151 488202 394099 520095 828088 981432 745355 297097 23153 48757
32799 48757 130762 38035 -156058 -236441 -94187 288513 846944 1278278 1192945 674649
32789 674649 361430 612865 921478 631593 -43136 -343071 -134414 -27841 -301735 -448213
32779 -448213 -26904 655477 1061936 1131276 1098193 1001958 767215 494140 300207 56075
$$ packed form
32848H21031K1247j81356k69703j84659r1403j16732j03208J03673K77778J27397
32838D04065j33244m7495K99062L62938N3735j04821J19152K82959O3347k26269
32828A073429k64678k34427k86088j22489L55490N76880J20350m77130m47957
32819B93380M0437K15216n6292j72198J17512L33058J17856k02568j99357J4252
32809E01296O2855p5949r4103J25996L07993J53344k36077m48258k73944K5604
32799D8757Q2005r2727j94093q0383J42254L82700N58431M31334q5333n18296
32789F74649l13219K51435L08613k89885o74729k99935K08657J06573k73894j46478
32779d48213M21309O82381M06459O9340l3083r6235k34743k73075j93933k44132
$$ plain form
32769 56075 -421648 -1041661 -1510826 -1615365 -1317588 -764830 -298988 -210853 -365455 -321253
32759 -321253 83391 559465 866425 1094139 1292258 1257209 951864 716817 724959 623657
32749 623657 133669 -366760 -376358 -111260 -211932 -738721 -1067484 -816317 -340091 -166406
32739 -166406 -374034 -719887 -1035383 -1255373 -1271602 -996753 -511398 -33168 237442 248745
32729 248745 150892 173021 345225 419790 204826 -131760 -289847 -267864 -306329 -458153
32719 -458153 -514224 -363427 -122172 150116 549730 1016334 1220201 975074 547789 325749
32709 325749 341991 375875 386947 537500 809673 903996 612458 90203 -348505 -556360
32699 -556360 -582872 -520445 -439036 -372546 -269282 -59115 144791 76111 -296479 -591679
$$ packed form
32769E6075m77723o20013m69165j04539K97777N52758M65842Q8135j54602M4202
32759c21253M04644M76074L06960K27714J98119l5049l05345k35047Q142j01302
32749F23657m89988n00429r598K65098j00672n26789l28763K51167M76226J73685
32739a66406k07628l45853l15496k19990j6229K74849M85355M78230K70610J1303
32729B48745r7853K2129J72204P4565k14964l36586j58087K1983l8465j51824
32719d58153n6071J50797K41255K72288L99614M66604K03867k45127m27285k22040
32709C25749J6242L3884J1072J50553K72173R4323k91538n22255m38708k07855
32699e56360k6512O2427Q1409O6490J03264K10167K03906o8680l72590k95200
$$ plain form
32689 -591679 -479664 -174343 -111284 -221441 4967 655822 1099446 813736 104002 -357863
32679 -357863 -369615 -157388 199248 755210 1260821 1309780 938858 589206 430612 213768
32669 213768 -124031 -239558 13717 236313 51259 -337408 -487957 -346248 -200143 -225825
32659 -225825 -397295 -681868 -1021242 -1228614 -1164353 -928233 -677679 -381604 34126 429477
32649 429477 572529 422668 97220 -313761 -687202 -780534 -491743 -105079 20206 -55409
32639 -55409 26237 333822 520938 351640 39649 -87823 -30559 -27001 -174788 -342709
32629 -342709 -398829 -350262 -264613 -205347 -276207 -575802 -995006 -1172079 -846412 -244686
32619 -244686 99844 -24862 -288324 -351329 -356831 -615428 -1004752 -1072784 -682151 -175900
$$ packed form
32689e91679J12015L05321O3059j10157K26408O50855M43624k85710p09734m61865
32679c57863j1752K12227L56636N55962N05611M8959l70922l49652j58594k16844
32669B13768l37799j15527K53275K22596j85054l88667j50549J41709J46105k5682
32659b25825j71470k84573l39374k07372O4261K36120K50554K96075M15730L95351
32649D29477J43052j49861l25448m10981l73441r3332K88791L86664J25285p5615
32639e5409Q1646L07585J87116j69298l11991j27472N7264L558j47787j67921
32629c42709n6120M8567Q5649N9266p0860k99595m19204j77073L25667O01726
32619b44686L44530j24706k63462o3005n502k58597l89324o8032L90633N06251
$$ plain form
32609 -175900 110049 151279 35469 -156629 -210363 66050 418692 314938 -270717 -682408
32599 -682408 -481771 -85984 -105537 -426066 -478534 -175472 27977 -52024 -42006 324056
32589 324056 712251 624805 75720 -424635 -470328 -168116 61157 -6108 -172155 -131326
32579 -131326 114243 323887 426836 577616 777298 758333 368034 -214873 -765442 -1207879
32569 -1207879 -1416292 -1226639 -847697 -803790 -1154742 -1239612 -622231 169289 399442 197098
32559 197098 176733 328083 136479 -338919 -438309 -38475 170542 -183361 -548571 -398101
32549 -398101 -97997 -266276 -763228 -945484 -648373 -342846 -420797 -767161 -1011393 -894811
32539 -894811 -427469 91625 277885 66339 -184178 -138495 117917 295354 324871 341207
$$ packed form
32609a75900K85949M1230j15810j92098n3734K76413L52642j03754n85655m11691
32599f82408K00637L95787j9553l20529n2468L03062K03449q0001J0018L66062
32589C24056L88195q7446n49085n00355m5693L02212K29273o7265j66047M0829
32579a31326K45569K09644J02949J50780J99682j8965l90299n82907n50569m42437
32569a207879k08413J89653L78942M3907l50952q4870O17381P91520K30153k02344
32559A97098k0365J51350j91604m75398r9390L99834K09017l53903l65210J50470
32549c98101L00104j68279m96952j82256K97111L05527p7951l46364k44232J16582
32539h94811M67342N19094J86260k11546k50517M5683K56412J77437K9517J6336
$$ plain form
32529 341207 392140 407176 354593 221590 -54909 -430279 -636045 -456422 -55349 183749
32519 183749 93098 -187895 -474254 -663275 -649911 -364105 79275 459293 705066 901975
32509 901975 1029087 906803 502033 102570 16894 188070 284647 162290 51104 193495
32499 193495 435494 378443 -66351 -484211 -438085 5450 413655 555214 580906 636274
32489 636274 580468 254156 -160954 -295237 -64149 223996 280148 184590 205752 382831
32479 382831 486673 397816 301968 372702 436786 210117 -198677 -326821 28136 488582
32469 488582 530400 53812 -596221 -996100 -916207 -442125 21171 67650 -232530 -395313
32459 -395313 -207055 -26142 -153530 -276083 30096 526985 598800 182950 -141525 6960
$$ packed form
32529C41207N0933J5036n2583j33003k76499l75370k05766J79623M01073K39098
32519A83749r0651k80993k86359j89021J3364K85806M43380L80018K45773J96909
32509I01975J27112j22284m04770l99463q5676J71176R6577j22357j11186J42391
32499A93495K41999n7051m44794m17860M6126M43535M08205J41559K5692N5368
32489F36274n5806l26312m15110j34283K31088K88145N6152r5558K1162J77079
32479C82831J03842q8857r5848P0734O4084k26669m08794j28144L54957M60446
32469D88582M1818m76588o50033l99879P9893M74082M63296M6479l00180j62783
32459c95313J88258J80913j27388j22553L06179M96889P1815m15850l24475J48485
$$ plain form
32449 6960 390597 616067 546061 171261 -453067 -999524 -1032195 -568690 -122997 -34578
32439 -34578 -116923 -122591 -147835 -331564 -504819 -436887 -192879 -6333 16089 -90550 -213809
32428 -213809 -144325 227032 602824 527521 73707 -135181 205470 631296 630883 386676
32418 386676 379194 602296 665825 465650 274947 274319 386734 504935 559253 454873 234333
32407 234333 174323 421865 678588 566962 165505 -165187 -348190 -587742 -889515 -1005364
32397 -1005364 -873081 -756040 -880520 -1187232 -1468406 -1547658 -1354550 -1014383 -787927 -737029
32387 -737029 -604927 -260880 -33965 -240187 -578484 -478231 36013 327166 14747 -581595
32377 -581595 -916205 -732355 -81844 726624 1145854 833158 193715 23804 479781 894788
$$ packed form
32449F960L83637K25470p0006l74800o24328n46457l2671M63505M45693Q8419
32439c4578q2345n668k5244j83729j73255O7932K44008J86546K2422j06639j23259
32428b13809O9484L71357L75792p5303m53814k08888L40651M25826m13k44207
32418C86676p482K23102O3529k00175j90703o28J12415J18201N4318j04380k20540
32407B34333o0010K47542K56723j11626m01457l30692j83003k39552l01773j15849
32397a005364J32283J17041j24480l06712k81174p9252J93108L40167K26456N0898
32387g37029J32102L44047K26915k06222l38297J00253N14244K91153l12419n96342
32377e81595l34610J83850O50511Q08468M19230l12696o39443j69911M55977M15007
$$ plain form
32367 894788 797742 548642 629227 841665 709925 281301 -24783 -96722 -108180 -18444
32357 -18444 316945 637967 489056 -42271 -366676 -267079 -162558 -311394 -340715 49056
32347 49056 402057 81703 -739003 -1234996 -1005600 -494670 -305560 -534200 -887669 -1086596
32337 -1086596 -985997 -601771 -202574 -137981 -415159 -665276 -657443 -577180 -632698 -695616
32327 -695616 -583755 -409872 -331191 -209204 109951 399434 362133 161286 170424 326315
32317 326315 264222 37923 108721 547711 834577 628514 205901 -100327 -378148 -734795
32307 -734795 -884380 -557372 -12358 245905 52096 -386832 -803952 -980665 -821299 -556630
32297 -556630 -571508 -807092 -713786 -81349 514922 486209 38288 -258598 -325698 -446114
$$ packed form
32367H94788r7046k49100Q0585K12438j31740m28624l06084p1939j1458Q9736
32357a8444L35389L21022j48911n31327l24405R9597J04521j48836k9321L89771
32347D9056L53001l20354q20706m95993K29396N10930J89110k28640l53469j98927
32337a086596J00599L84226L99197O4593k77178k50117P833Q0263n5518o2918
32327f95616J11861J73883P8681J21987L19155K89483l7301k00847R138J55891
32317C26315o2093k26299P0798M38990K86866k06063m22613l06228k77821l56647
32307g34795j49585L27008N45014K58263j93809m38928m17120j76713J59366K64669
32297e56630j4878k35584R3306O32437N96271k8713m47921k96886o7100j20416
$$ plain form
32287 -446114 -592713 -519015 -341413 -413702 -698746 -803276 -574560 -180230 293032 807111
32277 807111 1066428 827694 452472 555742 1112470 1494659 1400431 1136735 937367 656483
32267 656483 285838 142994 302310 385392 180058 -21725 33746 143548 57678 -101864
32257 -101864 -119760 -37145 30283 107994 188886 151696 9946 -82586 -169428 -423833 -651188
32246 -651188 -378157 369394 911952 808742 397846 162252 102084 90167 278459 671346
32236 671346 809677 438051 47185 157097 459766 341481 -69756 -127497 251126 490648
32226 490648 308064 47373 -11998 -41879 -186632 -222306 77793 602652 1084866 1318479
32216 1318479 1132324 504713 -203155 -480243 -250872 79662 235938 355935 530988
$$ packed form
32287d46114j46599P3698J77602p2289k85044j04530K28716L94330M73262N14079
32277H07111K59317k38734l75222J03270N56728L82189r4228k63696j99368k80884
32267F56483l70645j42844J59316Q3082k05334k01783N5471J09802q5870j59542
32257a01864j7896Q2615O7428P7711Q0892l7190j41750r2532q6842k54405k27355
32246f51188K73031P47551N42558j03210m10896k35594o0168j1917J88292L92887
32236F71346J38331l71626l90866J09912L02669j18285m11237n7741L78623K39522
32226D90648j82584k60691n9371k9881j44753l5674L00099N24859M82214K33613
32216A318479j86155o27611p07868k77088K29371L30534J56276J19997J75053
$$ plain form
32207 530988 475948 -35617 -672899 -840260 -389759 215914 443153 212613 -136544 -277113
32197 -277113 -200792 -112837 -113430 -93412 57021 279048 447181 506272 431515 217412 19818
32186 19818 112358 513778 834135 728193 362556 173714 276281 394030 300260 39349
32176 39349 -234676 -350277 -100035 536951 1146242 1195306 692126 240895 321261 754196
32166 754196 1018389 885132 569645 390756 445921 571071 520924 201575 -248263 -611613
32156 -611613 -777745 -741156 -538191 -292565 -191431 -249791 -221461 49808 310113 187311
32146 187311 -276920 -674610 -771117 -701209 -638855 -586219 -533118 -534136 -555064 -487710 -355486
32135 -355486 -255002 -101357 244232 589110 566653 263119 213812 569707 759882 339844
$$ packed form
32207E30988n5040n11565o37282j67361M50501O05673K27239k30540l49157j40569
32197b77113P6321Q7955n93K0018J50433K22027J68133N9091p4757k14103j97594
32186A9818R2540M01420L20357j05942l65637j88842J02567J17749r3770k60911
32176C9349k74025j15601K50242O36986O09291M9064n03180m51231Q0366M32935
32166G54196K64193j33257l15487j78889N5165J25150n0147l19349m49838l63350
32156f11613j66132L6589K02965K45626J01134n8360K8330K71269K60305j22802
32146A87311m64231l97690r6507O9908O2354N2636N3101j018k0928O7354J32224
32135c55486J00484J53645L45589L44878k2457l03534m9307L55895J90175m20038
$$ plain form
32125 339844 -272237 -418384 -228952 -387354 -1000605 -1393910 -1136059 -650022 -506340 -593171
32115 -593171 -426773 4834 210767 -52877 -438097 -512837 -306775 -169349 -259253 -375005
32105 -375005 -248021 133803 513268 624428 460364 273098 264231 310337 122945 -307198
32095 -307198 -609695 -483350 -76158 251041 388699 470859 520876 425324 250417 248654
32085 248654 455989 570423 374816 38639 -162555 -215179 -281731 -430651 -617036 -760668
32075 -760668 -703764 -307156 245233 490704 265734 -8866 101883 438082 537940 293985
32065 293985 -94058 -585159 -1167665 -1400388 -757246 479020 1303291 1218517 832074 885557
32055 885557 1207073 1145061 673475 398654 557985 659463 288131 -224914 -277715 136768
$$ packed form
32125C39844o12081j46147J89432j58402o13251l93305K57851M86037J43682q6831
32115e93171J66398M31607K05933k63644l85220p4740K06062J37426q9904j15752
32105c75005J26984L81824L79465J11160j64064j87266q867M6106j87392m30143
32095c07198l02497J26345M07192L27199J37658Q2160N0017r5552j74907j763
32085B48654K07335J14434j95607l36177k01194n2624o6552j48920j86385j43632
32075g60668N6904L96608N52389K45471k24970k74600J10749L36199R9858k43955
32065B93985l88043m91101n82506k32723O43142J236266Q24271q4774l86443N3483
32055H85557L21516o2012m71586k74821J59331J01478l71332n13045n2801M14483
$$ plain form
32045 136768 430192 218796 -224940 -417382 -295389 -180384 -247494 -321245 -221360 -43055
32035 -43055 45278 86576 226581 446082 598297 635150 611800 526309 336015 89083 -126764
32024 -126764 -314694 -485952 -528998 -366146 -169641 -183566 -371743 -486029 -448453 -395120
32014 -395120 -361675 -241096 -91899 -159428 -479988 -755241 -761143 -620134 -517222 -414696
32004 -414696 -252603 -188410 -364397 -590807 -538601 -179775 193567 348788 307632 184971
31994 184971 39894 -72092 -61239 95204 300447 464702 632749 895152 1176873 1223270
31984 1223270 884576 358493 21737 27292 205552 361156 469073 531070 490036 419056
31974 419056 534541 813102 853828 414885 -136418 -270776 -26294 108006 -82773 -365209
$$ packed form
32045A36768K93424k11396m43736j92442J21993J15005o7110p3751R9885J78305
32035d3055Q8333M1298J40005K19501J52215L6853k3350q5491j90294k46932k15847
32024a26764j87930j71258m3046J62852J96505j3925j88177j14286L7576N3333
32014c95120L3445J20579J49197o7529l20560k75253n902J41009J02912J02526
32004d14696J62093O4193j75987k26410N2206L58826L73342J55221m1156j22661
31994A84971j45077j11986J0853J56443K05243J64255J68047K62403K81721M6397
31984A223270l38694n26083l36756N555J78260J55604J07917O1997m1034p0980
31974D19056J15485K78561M0726m38943n51303j34358K44482J34300j90779k82436
$$ plain form
31964 -365209 -541297 -647071 -670871 -526967 -346908 -353827 -404979 -136124 373785 621140
31954 621140 501548 533703 996333 1407981 1259471 778430 491771 421286 242165 -45887
31944 -45887 -162755 -107885 -164079 -398306 -585164 -603340 -544607 -444392 -228701 68789
31934 68789 304130 427713 477413 429509 275837 163519 218424 307874 216212 -23211 -210770
31923 -210770 -316367 -482907 -740123 -927461 -861934 -444076 264659 899971 945326 307979
31913 307979 -425511 -626643 -377265 -250477 -476132 -722437 -647764 -269513 218645 632426
31903 632426 784643 642782 526615 786659 1233120 1265029 680527 -8601 -246319 -89379
31893 -89379 33653 -50292 -163337 -157269 -105228 -135571 -261042 -396378 -458842 -446403 -444755
$$ packed form
31964c65209j76088j05774k3800J43904J80059o919n1152K68855N09909K47355
31954F21140j19592L2155M62630M11648j48510m81041k86659p0485j79121k88052
31944d5887j16868N4870n6194k34227j86858j8176N8733J00215K15691K97490
31934F8789K35341J23583M9700m7904j53672j12318N4905Q9450r1662k39423j87559
31923b10770j05597j66540k57216j87338O5527M17858P08735O35312M5355o37347
31913C07979p33490k01132K49378J26788k25655k46305P4673L78251M88158M13781
31903F32426J52217j41861j16167K60044M46461L1909n84502o89128k37718J56940
31893h9379J23032q3945j13045O068N2041l0343j25471j35336o2464J2439J648
$$ plain form
31882 -444755 -523120 -609546 -532918 -226185 151223 329767 175733 -165982 -393055 -363901
31872 -363901 -264166 -345619 -539831 -544299 -318899 -212627 -445960 -729613 -639674 -182700
31862 -182700 270442 467787 435446 277756 86184 -31801 -65584 -166194 -403240 -581101
31852 -581101 -513486 -337967 -312230 -435783 -521477 -484135 -297911 129228 712799 1035186
31842 1035186 834680 479689 506979 818413 826232 321431 -309870 -707540 -857335 -774900
31832 -774900 -402616 83705 344804 363062 422731 548160 455363 145633 -3584 95319
31822 95319 33604 -394241 -795582 -771662 -450954 -151677 41718 82537 -183487 -625218
31812 -625218 -740949 -351749 39151 -22566 -279467 -280951 -139083 -220860 -441752 -474535
$$ packed form
31882d44755p8365q6426P6628L06733L77408J78544j54034l41715k27073K9154
31872c63901R9735q1453j94212m468K25400J06272k33333k83653Q9939M56974
31862a82700M53142J97345l2341j57690j91572j17985l3783j00610k37046j77861
31852e81101O7615J75519K5737j23553q5694L7342J86224M27139N83571L22387
31842A035186k00506l54991K7290L11434P819n04801o31301l97670j49795Q2435
31832g74900L72284M86321K61099J8258N9669J25429r2797l09730j49217R8903
31822I5319o1715m27845m01341K3920L20708K99277J93395M0819k66024m41731
31812f25218j15731L89200L90900o1717k56901j484J41868q1777k20892l2783
$$ plain form
31802 -474535 -397954 -498106 -596935 -239022 504613 1036763 1066830 889874 773768 606516
31792 606516 288857 -6810 -166955 -332410 -562351 -638589 -411761 -64903 165231 298267
31782 298267 466343 669256 841622 979566 1037887 868312 432449 -50496 -326136 -376165
31772 -376165 -336412 -254645 -95054 86858 168565 181452 349833 806444 1336182 1529460
31762 1529460 1215106 645654 195055 -24319 -126708 -145888 3626 265453 400762 296827
31752 296827 91733 -120764 -465008 -973604 -1331140 -1210678 -745356 -384862 -339001 -425280
31742 -425280 -446137 -439965 -488342 -501028 -345502 -88458 43413 -40737 -135770 11807 296939
31731 296939 285300 -190408 -644220 -478106 165809 535572 319903 66829 305070 735115
$$ packed form
31802d74535P6581j00152r8829L57913P43635N32150L0067j76956j16106j67252
31792F06516l17659k95667j60145j65455k29941p6238K26828L46858K30134J33036
31782B98267J68076K02913J72366J37944N8321j69575m35863m82945k75640n0029
31772c76165L9753Q1767J59591J81912Q1707J2887J68381M56611N29738J93278
31762A529460l14354n69452m50599k19374j02389j9180J49514K61827J35309j03935
31752B96827k05094k12497l44244n08596l57536J20462M65322L60494M5861q6279
31742d25280k0857O172m8377j2686J55526K57044J31871q4150r5033J47577K85132
31731B96939j1639m75708m53812J66114O43915L69763k15669k53074K38241M30045
$$ plain form
31721 735115 736992 323106 36521 99503 225950 206839 139620 54012 -182310 -487596 -552275
31710 -552275 -339932 -183916 -222476 -162651 154584 363028 104553 -349783 -448581 -177799
31700 -177799 -82051 -466185 -981261 -1159330 -1054863 -1073201 -1298104 -1333852 -902421 -319630
31690 -319630 -113351 -290953 -325623 92391 633735 825600 661809 444577 275636 90828
31680 90828 45826 393434 952529 1137526 680092 1505 -318602 -184664 98713 311437
31670 311437 449428 512778 451442 307396 196079 125426 10425 -91193 49386 478288
31660 478288 805622 557251 -190337 -776222 -721254 -331965 -278106 -706512 -1135887 -1191202
31650 -1191202 -1007996 -816842 -585962 -310260 -232780 -431176 -530119 -231399 152699 137841
$$ packed form
31721G35115J877m13886k86585O2982J26447j9111o7219q5608k36322l05286o4679
31710e52275K12343J56016l8560N9825L17235K08444k58475m54336r8798K70782
31700a77799R5748l84134n15076j78069J04467j8338k24903l5748M31431N82791
31690c19630K06279j77602l4670M18014N41344J91865j63791k17232j68941j84808
31680I0828m5002L47608N59095J84997m57434o78587l20107J33938K83377K12724
31670C11437J37991O3350o1336j44046j11317p0653j15001j01618J40579M28902
31660D78288L27334k48371p47588n85885N4968L89289N3859m28406m29375n5315
31650a191202J83206J91154K30880K75702P7480j98396r8943K98720L84098j4858
$$ plain form
31640 137841 -197931 -397583 -346258 -281780 -228027 658 286185 299839 135895 252058
31630 252058 679568 894492 656075 384102 433397 550311 418962 268895 489672 976912
31620 976912 1285801 1191685 751789 68430 -648925 -1016903 -849384 -442472 -196499 -141780
31610 -141780 -114859 -155658 -372873 -622960 -708573 -738229 -911295 -1088863 -976206 -630903
31600 -630903 -395282 -388721 -439663 -458624 -494734 -469850 -261795 -40847 -110259 -385176 -445662
31589 -445662 -166965 136951 306850 602943 1139183 1479784 1177392 449266 -76809 -164286
31579 -164286 -164109 -440258 -895176 -1135574 -942014 -497263 -198876 -255066 -473012 -522930
31569 -522930 -391019 -387055 -656511 -935792 -956246 -849716 -883802 -992179 -942117 -862389 -1134405
$$ packed form
31640A37841l35772j99652N1325O4478N3753K28685K85527J3654j63944J16163
31630B52058M27510K14924k38417k71973M9295J16914j31349j50067K20777M87240
31620I76912L08889r4116m39896o83359p17355l67978J67519M06912K45973N4719
31610a41780K6921m0799k17215k50087q5613k9656j73066j77568J12657L45303
31600f30903K35621O561n0942j8961l6110K4884K08055K20948o9412k74917o0486
31589d45662K78697L03916J69899K96093N36240L40601l02392p28126n26075q7477
31579a64286J77k76149m54918k40398J93560M44751K98387n6190k17946m9918
31569e22930J31911L964k69456k79281k0454J06530l4086j08377N0062P9728k72016
$$ plain form
31558 -1134405 -1692613 -1907825 -1412328 -659655 -316366 -393292 -420743 -286569 -341228 -663688
31548 -663688 -789351 -401454 131256 242220 -72602 -315986 -152368 291775 697140 862721
31538 862721 800799 714423 812084 1001828 915585 418203 -99140 -190736 57811 227128
31528 227128 183647 118574 76303 -110174 -404438 -502316 -270578 72046 275171 277757 114579
31517 114579 -79469 -14647 408288 734519 420642 -321106 -701638 -472080 -240687 -463990
31507 -463990 -784595 -752640 -582907 -653608 -756742 -490001 -50258 24427 -293865 -535986
31497 -535986 -482099 -348563 -309355 -335476 -452513 -683633 -786124 -505311 -50690 129781
31487 129781 6514 -59298 45522 79229 -18645 -13244 121352 95441 -148228 -247880 14688
$$ packed form
31558a134405n58208k15212M95497P52673L43289p6926k7451J34174n4659l22460
31548f63688j25663L87897N32710J10964l14822k43384J63618M44143M05365J65581
31538H62721o1922q6376R7661J89744q6243m97382n17343r1596K48547J69317
31528B27128m3481o5073m2271j86477k94264r7878K31738L42624K03125K586j63178
31517A14579j94048O4822M22935L26231l13877p41748l80532K29558K31393k23303
31507d63990l20605L1955J69733p0701j03134K66741M39743P4685l18292k42121
31497e35986N3887J33536L9208k6121j17037k31120j02491K80813M54621J80471
31487A29781j23267o5812J04820L3707r7874N401J34596k5911k43669r9652K62568
$$ plain form
31476 14688 372505 517757 534611 650737 848822 962567 942672 841118 709819 632170
31466 632170 666111 691832 547003 351811 405120 694003 842050 657261 385419 261413
31456 261413 157436 -97656 -350433 -338970 -63220 278272 530679 595256 426998 190476
31446 190476 167463 323527 251657 -210518 -605871 -443945 59710 229698 -189108 -775178
31436 -775178 -1027454 -872878 -533052 -194699 39191 63755 -159484 -464063 -538486 -229804
31426 -229804 208154 301104 -92507 -527942 -482944 -48070 174487 -142568 -692674 -1034228
31416 -1034228 -1104641 -1078738 -1033352 -977884 -958055 -889317 -514947 217942 934144 1226380
31406 1226380 1105903 849960 616122 452290 451334 576756 531590 154967 -208477 -117076
$$ packed form
31476A4688L57817J45252J6854J16126J98085J13745j9895j01554j31299p7649
31466F32170L3941K5721j44829j95192N3309K88883J48047j84789k71842j24006
31456B61413j03977k55092k52777J1463K75750L41492K52407O4577j68258k36522
31446A90476k3013J56064p1870m62175l95353J61926N03655J69988m18806n86070
31436g75178k52276J54576L39826L38353K33890K4564k23239l04579p4423L08682
31426b29804M37958R2950l93611m35435M4998M34874K22557l17055n50106l41554
31416a034228p0413K5903M5386N5468J9829O8738L74370P32889P16202K92236
31406A226380j20477k55943k33838j63832r56J25422m5166l76623l63444R1401
$$ plain form
31396 -117076 304516 518848 336561 97436 72956 121023 64356 34139 208231 460579
31386 460579 520166 348183 153043 93969 139773 223540 402246 761847 1180060 1318737
31376 1318737 986349 442617 136424 140621 101796 -184994 -455942 -399810 -115720 84022
31366 84022 85284 -60774 -329771 -597451 -583619 -265921 -88485 -352080 -663065 -500780
31356 -500780 -101034 -129575 -585918 -762421 -361747 65919 16119 -301817 -508599 -664731
31346 -664731 -910044 -989791 -636621 -77604 294872 468638 613240 640282 426027 212377
31336 212377 282739 432006 270050 -102882 -271051 -252685 -466161 -918811 -1048281 -571995
31326 -571995 28269 171810 -73189 -254980 -252709 -324060 -575472 -760642 -638506 -301561
$$ packed form
31396a17076M21592K14332j82287k39125k4480M8067n6667l0217J74092K52348
31386D60579N9587j71983j95140n9074M5804Q3767J78706L59601M18213J38677
31376A318737l32388n43732l06193M197l8825k86790k70948N6132K84090J99742
31366H4022J262j46058k68997k67680J3832L17698J77436k63595l10985J62285
31356e00780L99746k8541m56343j76503M00674M27666m9800l17936k06782j56132
31346f64731k45313p9747L53170N59017L72476J73766J44602K7042k14255k13650
31336B12377P0362J49267j61956l72932j68169J8366k13476m52650j29470M76286
31326e71995O00264J43541k44999j81791K271p1351k51412j85170J22136L36945
$$ plain form
31316 -301561 -74699 -185027 -557033 -884671 -910222 -652365 -336370 -124492 -6668 51727
31306 51727 5185 -152174 -273792 -189400 76663 296268 267931 43223 -95702 76926
31296 76926 467792 769854 843622 839325 856864 700093 198251 -394604 -650194 -541881
31286 -541881 -405047 -335891 -61244 484769 901959 888958 677330 567745 380431 -177494
31276 -177494 -833851 -985195 -555513 -112946 -67009 -207036 -185277 -41889 4275 -19756
31266 -19756 70615 273272 407069 385323 292854 232203 203801 96486 -222386 -686005 -914618
31255 -914618 -571935 106696 452578 190626 -187760 -128044 223432 327789 84257 -111709
31245 -111709 -28424 158829 269708 306558 194601 -205896 -705866 -850053 -566157 -333155
$$ packed form
31316c01561K26862j10328l72006l27638k5551K57857L15995K11878J17824N8395
31306E1727m6542j57359j21618Q4392K66063K19605k8337k24708j38925J72628
31296G6926L90866L02062P3768m297J7539j56771n01842n92855k55590J08313
31286e41881J36834O9156K74647N46013M17190j3001k11628j09585j87314n57925
31276a77494o56357j51344M29682M42567M5937j40027K1759J43388M6164k4031
31266a9756R0371K02657J33797k1746r2469o0651k8402j07315l18872m63619k28613
31255i14618L42683O78631L45882k61952l78386N9716L51476J04357k43532j95966
31245a11709Q3285J87253J10879L6850j11957m00497m99970j44187K83896K33002
$$ plain form
31235 -333155 -451296 -560485 -245190 243076 340921 18981 -239979 -203882 -116248 -143190
31225 -143190 -89339 187278 476682 541864 437607 295676 71919 -229669 -311695 92075
31215 92075 735328 1032573 749362 275585 135763 420344 812319 1020175 1007386 850960
31205 850960 568234 160973 -268598 -558791 -639893 -579063 -474197 -365710 -263061 -187933
31195 -187933 -155507 -168392 -261946 -482353 -752497 -824599 -484259 180092 780658 947324
31185 947324 646194 194702 -33841 62585 280861 399998 417671 423852 365843 162997
31175 162997 -6790 124148 390088 243171 -427118 -920173 -606795 102790 257799 -289774
31165 -289774 -714950 -471415 -11916 55932 -97435 30533 348335 358251 47678 -93360
$$ packed form
31235c33155j18141j09189L15295M88266R7845l21940k58960L6097Q7634k6942
31225a43190N3851K76617K89404O5182j04257j41931k23757l01588q2026M03770
31215I2075O43253K97245k83211m73777j39822K84581L91975K07856j2789j56426
31205H50960k82726m07261m29571k90193q1102O0830J04866J08487J02649P5128
31195a87933L2426j2885r3554k20407k70144p2102L40340O64351O00566J66666
31185I47324l01130m51492k28543R6426K18276J19137J7673O181n8009k02846
31175A62997j69787J30938K65940j46917o70289m93055L13378P09585J55009n47573
31165b89774m25176K43535M59499O7848j53367J27968L17802R916l10573j41038
$$ plain form
31155 -93360 79546 144578 -121049 -320383 -51654 494758 879578 1010344 1027187 864307
31145 864307 371754 -241154 -524056 -375506 -159791 -151984 -181666 19940 384450 646760
31135 646760 751011 851180 966864 898837 540056 78531 -218813 -310997 -362800 -497742
31125 -497742 -686862 -829047 -806953 -497147 86501 616811 638479 101930 -440215 -423075
31115 -423075 11343 193550 -140260 -455250 -170061 502493 833674 540295 43017 -216402
31105 -216402 -268031 -296784 -256138 -80122 28955 -125310 -369447 -417480 -331209 -336458 -306733
31094 -306733 81717 670715 820573 277099 -403470 -572311 -263422 77234 306055 587205
31084 587205 893469 985790 830227 608688 333765 -119425 -570043 -589760 -160647 151251
$$ packed form
31155i3360J72906O5032k65627j99334K68729N46412L84820J30766J6843j62880
31145H64307m92553o12908k82902J48550K15715P807k9682K01606L64510K62310
31135F46760J04251J00169J15684o8027l58781m61525k97344r2184n1803j34942
31125d97742j89120j42185K2094L09806N83648N30310K1668n36549n42145J7140
31115d23075M34418J82207l33810l14990K85189O72554L31181k93379m97278k59419
31105b16402n1629k8753M0646J76016J09077j54265k44137m8033Q6271n249K9725
31094c06733L88450N88998J49858n43474o80569j68841L08889L40656K28821K81150
31084E87205L06264R2321j55563k21539k74923m53190m50618j9717M29113L11898
$$ plain form
31074 151251 -63050 -491179 -591698 -357416 -187433 -186991 -67317 267973 477934 274971
31064 274971 -151794 -407639 -383883 -269584 -207290 -168199 -131062 -168146 -286610 -316558 -68966
31053 -68966 419381 872207 1031240 905425 727151 652200 563922 263905 -159230 -308535
31043 -308535 60082 659700 943990 735091 363691 137076 -62413 -449477 -834586 -808468
31033 -808468 -375264 -25361 -82901 -307667 -326370 -176223 -151211 -307683 -438147 -433640
31023 -433640 -362113 -226730 50348 381616 526212 411174 209235 36933 -183398 -469214
31013 -469214 -635210 -570896 -470311 -585635 -864628 -1014731 -863800 -507693 -142851 113063
31003 113063 241038 259974 179337 13631 -138694 -94164 212763 549482 582184 281594
$$ packed form
31074A51251k14301m28129j00519K34282J69983M42J19674L35290K09961k02963
31064B74971m26765k55845K3756J14299O2294L9091L7137l7084j18464k9948K47592
31053f8966M88347M52826J59033j25815j78274p4951q8278l00017m23135j49305
31043c08535L68617N99618K84290k08899l71400k26615j99489l87064l85109K6118
31033h08468M33204L49903n7540k24766j8703J50147K5012j56472j30464M507
31023d33640P1527J35383K77078L31268J44596j15038k01939j72302k20331k85816
31013d69214j65996O4314J00585j15324k78993j50103J50931L56107L64842K55914
31003A13063J27975J8936q0637j65706j52325M4530L06927L36719L2702l00590
$$ plain form
30993 281594 -45274 -169132 -169701 -170906 -99493 108062 270567 186903 -31132 -100441 32828
30982 32828 160221 121200 -70003 -353228 -642741 -748470 -531728 -162631 15857 -65928
30972 -65928 -118322 72317 350914 467836 442711 461054 544218 546604 420930 254617 29713
30961 29713 -414582 -1054888 -1502838 -1378178 -805095 -299286 -138705 -102610 60323 202476
30951 202476 80631 -156259 -195521 -159316 -471270 -1081530 -1357106 -961873 -365544 -144086
30941 -144086 -201563 -128789 26581 -85233 -407505 -530962 -390472 -333100 -468835 -501270
30931 -501270 -299994 -123657 -117838 -77929 78984 64117 -286351 -652036 -665807 -402941
$$ packed form
30993B81594l26868j23858n69j205P1413K07555J62505q3664k18035o9309J33269
30982C2828J27393l9021j91203k83225k89513j05729K16742L69097J78488q1785
30972f5928n2394J90639K78597J16922k5125J8343Q3164K386j25674j66313k24904
30961B9713m44295o40306m47950J24660N73083N05809J60581L6095J62933J42153
30951B02476j21845k36890l9262L6205l11954o10260k75576L95233N96329K21458
30941a44086n7477P2774J55370j11814l22272j23457J40490N7372j35735l2435
30931e01270K01276J76337N819L9909J56913j4867l50468l65685j3771K62866
$$ [...]
##END NTUPLES=NMR SPECTRUM
##END=
