##TITLE=31Pdec_LY-TMF-9.100+TMF
 D2O, 24 sc
 4.3.2020
##JCAMPDX= 6.0         $$ Bruker NMR JCAMP-DX V2.0
##DATA TYPE= NMR SPECTRUM
##DATA CLASS= NTUPLES
##ORIGIN= UXNMR, Bruker Analytische Messtechnik GmbH
##OWNER= root
$$ XWIN-NMR		Version 3.5
$$ Wed Mar  4 13:58:59 2020 Russian Standard Time (UT+4h)  she@DPX200
##.OBSERVE FREQUENCY= 81.013821
##.OBSERVE NUCLEUS= ^31P
##.ACQUISITION MODE= SIMULTANEOUS
##.ACQUISITION SCHEME= undefined
##.AVERAGES= 24
##.DIGITISER RES= 17
##SPECTROMETER/DATA SYSTEM= spect
##.PULSE SEQUENCE= zgpg30
##.SOLVENT NAME= D2O
##.SHIFT REFERENCE= (INTERNAL, D2O, 0, 182.463)
##AUDIT TRAIL= $$ (NUMBER, WHEN, WHO, WHERE, WHAT)
$$ ##TITLE= Audit trail, XWIN-NMR		Version 3.5
$$ ##JCAMPDX= 5.01
$$ ##ORIGIN= Bruker BioSpin GmbH
$$ ##OWNER= she
$$ F:/spectra/data/she/nmr/P31/1/pdata/1/auditp.txt
$$ ##AUDIT TRAIL=  $$ (NUMBER, WHEN, WHO, WHERE, WHAT)
(   1,<2020-03-04 13:57:18.75 +0400>,<she>,<DPX200>,
      <created by zg, POWCHK disabled, PULCHK disabled
       configuration hash MD5:
       00 E9 B6 7A A2 85 ED C7 34 08 36 98 17 FE 4E 26
       data hash MD5: 32K
       0D B8 01 79 A8 04 B2 3A 68 79 DB CB FF DD D9 5F>)
(   2,<2020-03-04 13:57:21.32 +0400>,<she>,<DPX200>,
      <Start of raw data processing
       efp BC_mod = 2 LB = 1 FT_mod = 6 PKNL = 1 PHC0 = -1325.095 PHC1 = 73.8017 SI = 64K 
       data hash MD5: 64K
       02 28 26 6E 27 FE B7 DD 1E 77 D4 EA 0E 42 0E 23>)
(   3,<2020-03-04 13:57:40.14 +0400>,<she>,<DPX200>,
      <pk PHC0 = 4.77962 PHC1 = 0 
       data hash MD5: 64K
       20 4D B0 C4 D9 6C 88 85 9C F7 80 57 F3 A0 DF FD>)
(   4,<2020-03-04 13:57:55.26 +0400>,<she>,<DPX200>,
      <pk PHC0 = -1.000004 PHC1 = 0 
       data hash MD5: 64K
       CF D9 8D 69 9D 8D 62 B0 71 B3 7F 46 EB C0 6A 27>)
(   5,<2020-03-04 13:58:23.07 +0400>,<she>,<DPX200>,
      <pk PHC0 = -0.5999984 PHC1 = 0 
       data hash MD5: 64K
       21 C2 66 48 87 56 E8 59 CD 09 A2 98 42 62 A3 A1>)
(   6,<2020-03-04 13:58:25.28 +0400>,<she>,<DPX200>,
      <abs ABSG = 5 
       data hash MD5: 64K
       03 7A 3F FC 19 D7 46 32 D1 76 3D B1 EC B8 6A DA>)
$$ ##END=
$$ 
$$ hash MD5
$$ 94 DB C5 78 1B 67 47 F5 D5 24 5F E9 0E 10 70 4A
##$RELAX= 
##$RELAX= 
##$RELAX= 
##$RELAX= 
##$RELAX= 
##$RELAX= 
##$RELAX= 
##$RELAX= 
$$ Bruker specific parameters
$$ --------------------------
##$DU= <F:/spectra>
##$EXPNO= 1
##$NAME= <P31>
##$PROCNO= 1
##$TYPE= <nmr>
##$USER= <she>
##$AMP= (0..31)
100 100 100 100 100 100 100 100 100 100 100 100 100 100 100 100 100 100 
100 100 100 100 100 100 100 100 100 100 100 100 100 100 
##$AQSEQ= 0
##$AQ_mod= 1
##$AUNM= <au_zg>
##$AUTOPOS= <>
##$BF1= 81.014009
##$BF2= 200.13
##$BF3= 200.13
##$BF4= 200.13
##$BF5= 200.13
##$BF6= 200.13
##$BF7= 200.13
##$BF8= 200.13
##$BYTORDA= 1
##$CFDGTYP= 0
##$CFRGTYP= 5
##$CHEMSTR= <none>
##$CNST= (0..31)
1 1 145 1 1 1 1 1 1 1 1 1 1 1 1 1 1 1 1 1 1 1 1 1 1 1 1 1 1 1 1 1 
##$CPDPRG= <waltz16>
##$CPDPRG1= <>
##$CPDPRG2= <waltz16>
##$CPDPRG3= <>
##$CPDPRG4= <mlev>
##$CPDPRG5= <mlev>
$$ [...]
##$SUBNAM3= <"">
##$SUBNAM4= <"">
##$SUBNAM5= <"">
##$SUBNAM6= <"">
##$SUBNAM7= <"">
##$SUBNAM8= <"">
##$SUBNAM9= <"">
##$SW= 369.568048894756
##$SWIBOX= (0..15)
0 1 3 0 0 0 0 0 0 0 0 0 0 0 0 0 
##$SW_h= 29940.119760479
##$TD= 32768
##$TD0= 1
##$TE= 0
##$TE2= 300
##$TE3= 300
##$TEG= 300
##$TL= (0..7)
0 120 53 12 22 120 120 120 
##$TP= (0..7)
150 150 150 150 150 150 150 150 
##$TP07= 0
##$TPNAME0= <>
##$TPNAME1= <>
##$TPNAME2= <>
##$TPNAME3= <>
##$TPNAME4= <>
##$TPNAME5= <>
##$TPNAME6= <>
##$TPNAME7= <>
##$TPOAL= (0..7)
0.5 0.5 0.5 0.5 0.5 0.5 0.5 0.5 
##$TPOFFS= (0..7)
0 0 0 0 0 0 0 0 
##$TUNHIN= 0
##$TUNHOUT= 0
##$TUNXOUT= 0
##$USERA1= <user>
##$USERA2= <user>
##$USERA3= <user>
##$USERA4= <user>
##$USERA5= <user>
##$V9= 5
##$VALIST= <valist>
##$VCLIST= <CCCCCCCCCCCCCCC>
##$VD= 0
##$VDLIST= <DDDDDDDDDDDDDDD>
##$VPLIST= <PPPPPPPPPPPPPPP>
##$VTLIST= <TTTTTTTTTTTTTTT>
##$WBST= 1024
##$WBSW= 4
##$XGAIN= (0..3)
0 0 0 0 
##$XL= 0
##$YL= 0
##$YMAX_a= 50449
##$YMIN_a= -53981
##$ZGOPTNS= <>
##$ZL1= 120
##$ZL2= 120
##$ZL3= 120
##$ZL4= 120
##$ABSF1= 182.463
##$ABSF2= -187.1042
##$ABSG= 5
##$ABSL= 3
##$ALPHA= 0
##$AQORDER= 0
##$ASSFAC= 0
##$ASSFACI= 0
##$ASSFACX= 0
##$ASSWID= 0
##$AUNMP= <proc_1d>
##$AZFE= 0.1
##$AZFW= 0.5
##$BCFW= 0
##$BC_mod= 2
##$BYTORDP= 0
##$COROFFS= 0
##$CY= -3
##$DATMOD= 1
##$DC= 0
##$DFILT= <>
##$DTYPP= 0
##$F1P= 0
##$F2P= 0
##$FCOR= 1
##$FTSIZE= 65536
##$FT_mod= 6
##$GAMMA= 0
##$GB= 0
##$INTBC= 1
##$INTSCL= 5.30512e-09
##$ISEN= 30
##$LB= 1
##$LEV0= 0
##$LPBIN= 0
##$MAXI= 10000
##$MC2= 0
##$MEAN= 0
##$ME_mod= 0
##$MI= 50
##$NCOEF= 0
##$NC_proc= -2
##$NLEV= 6
##$NOISF1= 182.463
##$NOISF2= 159.3651
##$NSP= 0
##$NTH_PI= 0
##$NZP= 0
##$OFFSET= 182.463
##$PC= 4
##$PHC0= -1321.915
##$PHC1= 73.8017
##$PH_mod= 1
##$PKNL= yes
##$PPARMOD= 0
##$PSCAL= 0
##$PSIGN= 0
##$REVERSE= no
##$SF= 81.0140089999434
##$SI= 65536
##$SIGF1= 159.3651
##$SIGF2= -187.1042
##$SINO= 113.3802
##$SIOLD= 16384
##$SREGLST= <1H.CDCl3>
##$SSB= 0
##$STSI= 65536
##$STSR= 0
##$SW_p= 29940.119760479
##$SYMM= 0
##$S_DEV= 0
##$TDeff= 32768
##$TDoff= 0
##$TI= <>
##$TILT= no
##$TM1= 0
##$TM2= 0
##$TOPLEV= 0
##$USERP1= <user>
##$USERP2= <user>
##$USERP3= <user>
##$USERP4= <user>
##$USERP5= <user>
##$WDW= 1
##$XDIM= 65536
##$YMAX_p= 398052404
##$YMIN_p= -748302
$$ End of Bruker specific parameters
$$ ---------------------------------
##NTUPLES= NMR SPECTRUM
##VAR_NAME=  FREQUENCY,     SPECTRUM/REAL,   SPECTRUM/IMAG
##SYMBOL=    X,             R,               I
##VAR_TYPE=  INDEPENDENT,   DEPENDENT,       DEPENDENT
##VAR_FORM=  AFFN,          ASDF,            ASDF
##VAR_DIM=   65536,         65536,           65536
##UNITS=     HZ,            ARBITRARY UNITS, ARBITRARY UNITS
##FACTOR=    0.456856943014862, 1,           1
##FIRST=     14782.0589164792, 0,            0
##LAST=      -15158.0608439998, 0,           0
##MIN=       -15158.0608439998, -748302,     0
##MAX=       14782.0589164792, 398052404,    0
$$ Real data points
##PAGE= N=1
##DATA TABLE= (X++(R..R)), XYDATA
$$ [...]
##PAGE= N=2
##DATA TABLE= (X++(I..I)), XYDATA
36964B94181n6467k139R4782J07028J9764m9361m3643k4125j7865K1643P5027
36953D18825N1480l5844n8534J5019O4316K4809k1036j9727l5147q6544p7666
36942B39951J7751O9997K595o8299k2834P3314R0887K7308l9262p4244o2252K5590
36930B80502J39109J44828J8790q0260l9805L5911R388o9379p6977l5540m7020
36919B79547r3865p7626k85N2632O8732R8796J20762N9980o2184j27746p9912
36908B38831J3470O0557L8899q072j7016L5568Q9038O0409k5307m8751J8684N2011
36896E08321l0896j23302q9210K7178P9923L6472j8153l8155m5701l8522O699
36885B74654N8111O1039K7719O016j0384n3101r7983j01333p6170m7587J1555
$$ y = [294181, 237714, 235575, 330357, 437385, 457149, 407788, 364145, 340020, 322155, 343798, 418825, 470305, 434461, 375927, 390946, 455262, 480071, 459035, 439308, 404161, 317617, 239951, 257702, 327699, 330294, 261995, 239161, 312475, 403362, 430670, 391408, 317164, 254912, 280502, 419611, 564439, 583229, 502969, 463164, 499075, 508463, 439084, 362107, 326567, 279547, 185682, 108056, 107771, 160403, 229135, 327931, 448693, 508673, 446489, 318743, 238831, 252301, 312858, 351757, 343685, 326669, 362237, 451275, 511684, 486377, 437626, 456310, 508321, 477425, 354123, 264913, 292091, 372014, 408486, 390333, 352178, 306477, 267955, 274654, 332765, 393804, 421523, 427539, 417155, 364054, 266071, 164738, 88568, 40981, 52536]
36874E2536J03456J32008L1584q7695o8870N3633J00431J8799n5435k5972L2863
36863B87338K7870o149N301L8766J9644m4378o3945N612R5341R9137L928q1324
36851C87141n1224N5240R6932K3373n5458l6731K5842K5001k1640j5188M2410
36840D75698M4464l7487r1118k7474Q2749R9236q568j26740j30072j9968P9704
36829C40424O5226k5113o7288k1478K4125K513k3655L1465J27945J46320M9728
36818F50212p9616j46246j17742j8709Q4504J11866M5112l9322o2362l8538k7596
36807C61563l0672p008L5385M4306O472l8844n7623m0140J3802P4916Q2145K0059
36795D64361l7539k5747J2880M094k9925j4486L9342M9343J788l1520j8050l811
$$ y = [52536, 155992, 288000, 319584, 231889, 163019, 216652, 317083, 335882, 280447, 254475, 287338, 315208, 309059, 314360, 353126, 372770, 328392, 264447, 270059, 365400, 464537, 468465, 387141, 335917, 391157, 488089, 511462, 456004, 419273, 445115, 470116, 448476, 433288, 475698, 520162, 482675, 391557, 364083, 446832, 546068, 537500, 410760, 280688, 260720, 340424, 405650, 380537, 313249, 291771, 315896, 318409, 294754, 326219, 454164, 600484, 650212, 570596, 424350, 306608, 287899, 372403, 484269, 529381, 490059, 427697, 389159, 361563, 330891, 323883, 359268, 403574, 410046, 371202, 313579, 273439, 287241, 362157, 444302, 464361, 426822, 401075, 413955, 418049, 388124, 373638, 412980, 462323, 464111, 432591, 414541, 410730]
36783D10730j3702q551L2077O6063N8023K5404q187m2543o3629m0787J4442M4625
36771D73965K5754l065j0322j5765l5997m1862r714K7889K8611J0855L0334R1944
36759E72627J25319O5308o0780j51462j41472p0497k0400p482J7549P1160J00396
36748E00266O2805j0752o2337p3115n6338k5884L06L244p796n957L270p046k0600
36735C00066N007M6745L2221k8935l6123L4639P0366J697p1176l6080M7913N0927
36723D17267k0090n0974p676M1433O0492P3583P2249J9543n2727o1632J300N5303
36711E48071M9502J2325k3282n9869q7162o8291K474P7495J04391O6760j3377
36700F09037q3053r0673m1520P851K8766M0236L3258l4397j26219j21144L163
$$ y = [410730, 397028, 388477, 420554, 486617, 544640, 570044, 561857, 519314, 455685, 414898, 429340, 473965, 499719, 496654, 486332, 470567, 434570, 392708, 382994, 410883, 439494, 450349, 480683, 572627, 697946, 763254, 702474, 551012, 409540, 339043, 318643, 311161, 328710, 399870, 500266, 563071, 552319, 489982, 416867, 360529, 334645, 334951, 338195, 330399, 324442, 327712, 320666, 300066, 305073, 351818, 384039, 355104, 318981, 353620, 423986, 425683, 354507, 318427, 366340, 417267, 397177, 346203, 338527, 379960, 440452, 514035, 586284, 605827, 553100, 491468, 492768, 548071, 597573, 609898, 586616, 526747, 439585, 371294, 373768, 451263, 555654, 622414, 609037, 525984, 435311, 393791, 401642, 430408, 470644, 503902, 469505, 343286, 222142, 225305]
36689B25305R3482L2861p7647p9702j004K1974j3162O732Q9909J25385Q1823M5252
36677E51208M4829O549q5289j30417o9453K2288N2293K5409o181k5500l8271l6899
36665C10566r969M4325J11939J43512Q2249m3818j19680r6035o4630r8742j18177
36654A41540l3516P4038P2503k959k5600r70k2898o0925m750J07910J27703N0999
36642D23075K0865O4254N6231k5341m2742M5681R4155J4543q7424j06063p8346
36631C78888m8785K0177J09569J00820k1283r3941j6488R4271R7616K2191m1567
36620F01468q4703j04351m4934O6478Q5772k1824q5029N386J01480L6713j00181
36609D56275j22209l9105J2557K4520Q2146J49884J10959j5173r1386p9548o4910
$$ y = [225305, 318787, 351648, 274001, 194299, 193295, 215269, 202107, 208839, 298748, 424133, 505956, 551208, 596037, 602586, 517297, 386880, 317427, 339715, 392008, 417417, 411236, 385736, 347465, 310566, 300597, 344922, 456861, 600373, 682622, 638804, 519124, 423089, 358459, 259717, 141540, 108024, 182062, 254565, 251606, 226006, 225036, 202138, 141213, 136463, 244373, 372076, 423075, 443940, 508194, 564425, 539084, 496342, 542023, 636178, 650721, 563297, 457234, 378888, 330103, 350280, 459849, 560669, 539386, 445445, 428957, 523228, 620844, 643035, 601468, 516765, 412414, 367480, 433958, 519730, 497906, 412877, 418263, 519743, 556456, 456275, 334066, 294961, 307518, 332038, 414184, 564068, 675027, 659854, 568468, 488920, 424010]
36598D24010q0529p2230l1654j1266o498L8810J09205J27855Q8296N4923L7754
36587F78676j0282p2865p2018k061M9973L3217j5455n4952p7149n7849K4247J07465
36575E30947R1360j4821q5455n1324J2779J2796l7946p1067p2211p1490o9088
36564A74480l7946J5203M6629L6912J7238K1171L6291K8562L289N842N1003Q7914
36552D86588O5336K712m3852n9936o5661n2847M470Q3505J21996R6429L5843l3445
36540F41138r3188r8496k1296P3322Q2191M510n8056n1206k6359l0861l4164M37
36528C87972M7407N9821K5536l2295o5002k5552N4891O1521m5962j31356o3895
36517B73086O2919O4731l3727m6425M7028P2666j2260l2406Q3382J53204M7680
$$ y = [424010, 343481, 271251, 239597, 228331, 221833, 260643, 369848, 497703, 585999, 640922, 678676, 668394, 595529, 523511, 521450, 571423, 604640, 589185, 534233, 457084, 399235, 423482, 530947, 622307, 607486, 522031, 470707, 483486, 496282, 458336, 387269, 315058, 243568, 174480, 136534, 151737, 198366, 235278, 252516, 273687, 309978, 338540, 341829, 347671, 398674, 486588, 551924, 554636, 510784, 450848, 385187, 332340, 336810, 420315, 542311, 638740, 674583, 641138, 547950, 449454, 428158, 501480, 583671, 588181, 530125, 478919, 452560, 421699, 387535, 387972, 435379, 495200, 520736, 488441, 423439, 397887, 452778, 514299, 468337, 336981, 273086, 336005, 400736, 367009, 320584, 367612, 440278, 428018, 395612, 478994, 632198, 679878]
36506F79878r0246r2381k2277n599L802Q3663J35170M0684r6967r9181l77K8326
36494E64495k9794m4058Q838J2933o7738j24024p8800J3471O9541P4373N7362
36483D56599M4395L8437J2945m5253p5290n880J04252J13345J9249k1298M3836
36472F85337O6736l1644j01522k6705M9636l6506j71863j40197K7850J19220O8849
36461E09191k031j8209j1968O54J9657j0643j05070j42367l7882P9573N2620m1045
36449B92480k2946Q0748J04704M2067K6729O6981M7403l0123m8840m921k746l7584
36437E13952j1011N1259K9613m9767m2644M2925M2995p5845j56885j13047l2928
36426A98617O677L4855O3661N7787M5149Q0824J06113K9255p7910o9948J8591
$$ y = [679878, 589632, 497251, 474974, 469375, 473177, 556840, 692010, 732694, 635727, 536546, 536169, 564495, 534701, 490643, 499481, 512414, 444676, 320652, 241852, 255323, 324864, 399237, 456599, 500994, 539431, 552376, 507123, 431833, 425953, 530205, 643550, 662799, 641501, 685337, 752073, 720429, 618907, 592202, 641838, 605332, 433469, 293272, 321122, 440342, 509191, 507160, 488951, 476983, 477637, 497294, 486651, 381581, 239214, 201332, 280905, 333525, 292480, 269534, 350282, 454986, 497053, 523782, 590763, 638166, 608043, 559203, 554282, 551536, 513952, 502941, 554200, 583813, 534046, 491402, 534327, 577322, 501477, 344592, 231545, 198617, 205294, 240149, 303810, 361597, 406746, 487570, 593683, 622938, 545028, 475080, 493671]
36415D93671L6634o247J6642O5511r493j41807j06136P2798J14454m7116j39054
36404C49857j1741J19162N8737n5880l7750L0111r539r3592p7329K74R422m0301
36392B41431n0405r515L2056O6083Q9570P0607L6444O7861J37687J12326j8215
36381G75930r5084n2645k2760q2879j15145l4647N3505N4720L4817M1079n625
36370E51266j00937p9461Q4632J47304k8519k06271j30942O8136J09773J0637
36360D25618o779P8947R3512M651m4576j0246O190k5561l1380r910l4845q1675
36348C63946m4336O6909J15482M3287n5853q1317l1923L5060O3157K9824j7741
36337D86495n390M4702K5920o4201q2737K4222J02617L1898p1949n3906K6768
$$ y = [493671, 530305, 524058, 540700, 606211, 596718, 454911, 348775, 421573, 536027, 488911, 349857, 338116, 457278, 516015, 460135, 422385, 452496, 442957, 349365, 272036, 272310, 281732, 241431, 191026, 181511, 213567, 279650, 369220, 439827, 476271, 544132, 681819, 794145, 775930, 680846, 628201, 605441, 522562, 407417, 372770, 426275, 480995, 515812, 556891, 551266, 450329, 370868, 455500, 602804, 574285, 368014, 237072, 305208, 414981, 425618, 418839, 497786, 591298, 595949, 551373, 541127, 547317, 521756, 490376, 480466, 445621, 363946, 319610, 386519, 502001, 545288, 489435, 408118, 376195, 411255, 474412, 504236, 486495, 481105, 525807, 551727, 487526, 404789, 429011, 531628, 563526, 491577, 437671, 464439]
36326D64439K4726m0055n8668m8639q3532j02743q817J19516J27631M1045J1299
36315D46202N2945M4051l9307q8666n3447N540L9671M4528M767n5588l3987Q9377
36303D56086J42668j319j75646j30071Q3712J89179J03559J0593J9039K2654n1475
36292F68979j04730o2719m915o545j9180O349K4336q08k2309j1962j7493n9241
36280C89762p6984l5882R968J0380n866R877N8075J07122J22739P8370j0322p5800
36268E81439p4722l9783q032L5028P5969L5523r0369j54813n4199R9749J46703
36257E52493J12446J04576P9314o9042k56207k84071j42470j0968K7049M9927
36247A63047Q2785N1291k4554j5943Q5571J27459M0486o3856r3762r0619q3209
$$ y = [464439, 489165, 449110, 390442, 341803, 258271, 155528, 146711, 266227, 393858, 434903, 446202, 499147, 543198, 503891, 415225, 361778, 367318, 406989, 451517, 456284, 400696, 366709, 456086, 598754, 597435, 421789, 291718, 375430, 564609, 668168, 678761, 697800, 720454, 668979, 564249, 501530, 496615, 490070, 470890, 477239, 501575, 500767, 478458, 466496, 449003, 389762, 312778, 276896, 286864, 297244, 291378, 301255, 359330, 466452, 589191, 667561, 657239, 581439, 506717, 466934, 458902, 493930, 569899, 605422, 515053, 360240, 306041, 405790, 552493, 664939, 769515, 848829, 779787, 523580, 239509, 97039, 86071, 113120, 163047, 245832, 297123, 272569, 256626, 342197, 469656, 510142, 446286, 352524, 261905, 178696]
36236A78696j2134J22450K00600J52651N2987j8490p1332j07690p8644l234R908
36225D25768o6345j11762l6590Q8572J46977J15313L2906o5371j30283j06630
36215B92555j1772O9204R1385P7169L9076k5225o8349l8067J8094J1468l6337
36204D19201l0326K5601M0131Q626J7297P1708Q1123K3209k9959n2621p5650o7880
36192D30460J7620R3947L5803q5177q2233K9116M6520o0722q5999N0044J49992
36181E39371P4342l5357k0890L9438J6383l7378k7281j3351p4488j24321n2329
36170B84139P1688J08893O1330J3889k6111p7084p5677K0975J15842J02532K8988
36159F29404o786k7898r5753j47647q3796M6663J05848P0347L2021L1687K5713
$$ y = [178696, 166562, 289012, 489612, 642263, 695250, 676760, 605428, 497738, 419094, 415860, 425768, 359423, 247661, 211071, 299643, 446620, 561933, 594839, 529468, 399185, 292555, 280783, 349987, 441372, 518541, 557617, 532392, 464043, 425976, 444070, 455538, 419201, 388875, 414476, 454607, 463233, 480530, 552238, 633361, 656570, 626611, 573990, 498340, 430460, 448080, 542027, 577830, 492653, 410420, 439536, 486056, 425334, 339335, 389379, 539371, 613713, 578356, 557466, 596904, 613287, 575909, 548628, 535277, 460789, 336468, 284139, 355827, 464720, 526050, 539939, 513828, 436744, 361067, 382042, 497884, 600416, 629404, 622618, 594720, 498967, 351320, 267524, 314187, 420035, 490382, 522403, 554090, 579803]
36148E79803m289k6654l3184m5475o1317o2426m9537k0199M0921J04876R9413
36137E21932J9265m1218k3832P505j8344o2307m6870K6062R6551J22265Q5373
36126F86382k476o7914l9647K9214J7005o2906o1526N6597J33444O7336k9193
36115G26316l1579J697k7576o8752l5359J7361n522n7351l4638L4440M2354j6886
36103E44505n9856n5579l1914P410O0347P7682L9308J5036N2200P9406K6866l9666
36091G15745k2721M1876M5597k3604q3776q4496l9193J9436M6288P451n1509m5072
36079E26022P587O74n5549k0654J13803J50762K472j27957n7102P8215N2182p9598
36067E90857r7614P887N1334k1501p9592n8109l1960l5569j1201M8232P3593M6736
$$ y = [579803, 575514, 548860, 515676, 470201, 408884, 346458, 296921, 276722, 317643, 422519, 521932, 541197, 499979, 476147, 483652, 465308, 403001, 356131, 382193, 478744, 601009, 686382, 683906, 615992, 576345, 605559, 622564, 559658, 498132, 554729, 688173, 755509, 726316, 694737, 696434, 668858, 600106, 564747, 582108, 576586, 519235, 484597, 519037, 561391, 544505, 484649, 429070, 397156, 404566, 464913, 542595, 581903, 596939, 649139, 728545, 755411, 715745, 693024, 734900, 780497, 756893, 673117, 588621, 549428, 568864, 615152, 622603, 571094, 526022, 533609, 534283, 478734, 458080, 571883, 722645, 725117, 597160, 540058, 618273, 670455, 590857, 493243, 501130, 552464, 530963, 451371, 393262, 361302, 325733, 314532, 362764, 436357, 483093]
36055D83093J4155j3674m7104l8677M2094J04182N4575l1343j9612N8514O9445
36044F75648J3173K079L7267R453q4885j25411p6195k9906k7787r616L3753K5725
36032D43298m3043p7074k9836L3879N7347N4163L2951k3581q7350r7170m9427
36021B14157J3653Q4794J60522J70646O3957p2119j10479o6454m2463l5941L4739
36010D15012J43303J69631R3871J4859k0022m8328o9597n0914l9675r8771j45350
35999C64019m5367J33800J72789K6302j07869r2771k1244r201j4742L1556P7286
35988E14558M9838r382k0635J0265K8923K2436Q846j411P554M6443P4788L4168
35976G66391o0470j31168j35617q5817K940R1610Q9874l0299j33416p4684P6424
$$ y = [483093, 497248, 483574, 436470, 397793, 439887, 544069, 598644, 567301, 547689, 606203, 675648, 688821, 690900, 728167, 737620, 652735, 527324, 451129, 421223, 393436, 383820, 417573, 443298, 400255, 323181, 293345, 327224, 384571, 438734, 471685, 448104, 360754, 263584, 214157, 227810, 312604, 473126, 643772, 707729, 635610, 525131, 458677, 416214, 380273, 415012, 558315, 727946, 821817, 836676, 816654, 768326, 698729, 647815, 608140, 509369, 364019, 318652, 452452, 625241, 651543, 543674, 450903, 429659, 420458, 405716, 437272, 514558, 564396, 555014, 534379, 544644, 573567, 596003, 604849, 603438, 610992, 657435, 732223, 766391, 705921, 574753, 439136, 353319, 356259, 447869, 537743, 507444, 374028, 299344, 375768]
35965C75768J25749M3364j8977N107J4760l8557n1807L2352J03334N8514l4778
35954F14829n5889n315L2022K1912k60K908L2817N0938P225q4370j26811o3833
35942D26173K3239L3767M353K7675P6999O1420M705r20K0419k5574j02249q7339
35930D62668l592Q877n0137l8152N5581P1445l3156r3563j7127O6310L6431l1242
35918D34343k4061L3193P0468Q5563P1122j7630j33044j31178Q543J16423Q1141
35907E94883P166J9612O9964N8035P329r342k537q147j873K6245J5693n2238q9420
35894F35370l5978M0979O2670M8331L6474O275m8028p0191l8089o091j034J2017
35882F42705K2245l4266j31158j47015n3980L7113O3539P7942Q6871J5595j00841
$$ y = [375768, 501517, 544881, 525904, 531011, 545771, 507214, 455407, 487759, 591093, 649607, 614829, 558940, 553625, 585647, 607559, 607299, 610207, 643024, 693962, 701187, 616817, 490006, 426173, 449412, 483179, 487532, 515207, 592206, 653626, 658331, 657411, 677830, 652256, 550007, 462668, 459076, 467953, 417816, 379664, 435245, 506690, 473534, 379971, 362844, 429154, 465585, 434343, 410282, 443475, 513943, 599506, 670628, 652998, 519954, 388776, 397319, 513742, 594883, 602049, 621661, 691625, 749660, 756989, 747647, 745110, 736963, 735090, 761335, 777028, 724790, 635370, 599392, 640371, 703041, 751372, 787846, 794121, 746093, 675902, 637813, 631722, 630688, 642705, 664950, 630684, 499526, 352511, 298531, 335644, 399183, 477125, 563996, 579591, 478750]
35871D78750r9256M4568J34059N0712o2510m5923L8917O0963L3803K4371N402
35860F63856m9561o7970j4037K1643o274Q56Q2870J01471k2595j37474j00819
35849D71966j3299j8059m2415L9047J39304J00402k1616n8131j8738l9712j15631
35838D23118j18959l9297J6046K5201N3999Q7454N2737j2927j223P4355R3239
35827F53743K6335l3651l3390j2849n121j936p010k3552j5057L4720O9088M7355
35815F98675J9480K7349J7063n3603j14267r5119m4759k6593l522N7750Q3338
35804E65792K4761k1061L2604R9539O3924k3138m6872k3481l2714n7528m8519
35793E33307m6048q4009q2233R500Q2825M8530N586N4706R4336R554q7349m2872
$$ y = [478750, 379494, 424062, 558121, 608833, 546323, 500400, 539317, 600280, 634083, 658454, 663856, 614295, 546325, 532288, 553931, 547657, 548513, 631383, 732854, 710259, 572785, 471966, 458667, 440608, 398193, 437240, 576544, 676946, 655330, 597199, 578461, 538749, 423118, 304159, 264862, 280908, 306109, 360108, 447562, 500299, 487372, 486149, 560504, 653743, 680078, 646427, 613037, 600188, 595067, 593131, 586121, 562569, 547512, 582232, 651320, 698675, 718155, 745504, 762567, 708964, 594697, 499578, 454819, 428226, 424704, 482454, 565792, 590553, 569492, 602096, 701635, 765559, 742421, 695549, 672068, 639354, 581826, 533307, 487259, 403250, 321017, 330517, 413342, 461872, 467458, 522164, 616500, 626054, 538705, 495833]
35781D95833N0837J6427q3891o5019M0622N4313j4294o518O5170M4187n1852m7657
35769D98158N9477Q7618M306k2271N7463Q9149N843o2291m0149k3011o4519p9501
35757E10272l4498j7996m6768j4367R0494J22480K2827p1113n1056Q103J2250
35746E30628k096K0229L7844N742l4502l3189k593L5094P2953P8629L5929J5640
35734G60308P6679J25826L6216j23436j66717p8716j8303l4949j3916P1087R0705
35723G24784N967m4544J3980P0666L8716o446L338K184o0354j04717o4949o408
35711E72217m69q396K0317N0612M1137J3931j3780n8409q9190m0719N5246Q0429
35699F22926J1474m1919j6445K4592K7246K3043L0604J8260j860K0628N2860J1443
$$ y = [495833, 546670, 563097, 479206, 414187, 454809, 509122, 494828, 488310, 553480, 597667, 545815, 498158, 557635, 645253, 649559, 627288, 684751, 773900, 779743, 717452, 677303, 654292, 589773, 510272, 475774, 457778, 411010, 396643, 487137, 609617, 632444, 561331, 510275, 518378, 530628, 528532, 548761, 586605, 592347, 557845, 524656, 522063, 557157, 630110, 708739, 744668, 760308, 836987, 962813, 999029, 875593, 708876, 630160, 611857, 576908, 562992, 634079, 724784, 730751, 686207, 700187, 770853, 809569, 803123, 806461, 808645, 748291, 643574, 578625, 572217, 571748, 563352, 583669, 634281, 675418, 689349, 675569, 617160, 527970, 487251, 542497, 622926, 634400, 592481, 576036, 600628, 627874, 650917, 681521, 699781, 697921, 718549, 771409, 782852]
35687G82852o6339n0883N3884R1304K224q2094n6022J5332L1018j0685o5539j00610
35675E44442o9710L3509R6207J6209j05386r1213J5253J4470r1765q5647Q0916
35664C57285J79743Q2565l6114r063O5428L9343l2350l2145R762J5071J0821L1539
35652F81885J3719p3340j29885q3059n527K9170N9617J04403Q4845q170m3222
35641F30436L2693P7877o576r5157m5740O8040R3711L4026j3934l6072o7828q4465
35629E87011n7634l0656k9781O22P9655J16171M6566n9078j07583r3502m2810
35618D08981L1977P6613L2523l9888k9207K8377J1840k8315O7243K27010J81349
35607I68503q5973k45148j13583P7283Q2035j700J1356O8800N1310J6548L2219
$$ y = [782852, 716513, 665630, 719514, 810818, 813042, 730948, 674926, 690258, 721276, 710591, 645052, 544442, 474732, 508241, 604448, 620657, 515271, 424058, 439311, 453781, 362016, 276369, 357285, 537028, 619593, 583479, 574416, 639844, 679187, 646837, 614692, 624454, 639525, 650346, 681885, 695604, 622264, 492379, 409320, 403793, 432963, 492580, 596983, 681828, 673658, 630436, 663129, 741006, 734430, 639273, 593533, 661573, 755284, 789310, 775376, 739304, 671476, 587011, 529377, 498721, 468940, 469562, 549217, 665388, 711954, 652876, 545293, 451791, 408981, 440958, 517571, 550094, 510206, 480999, 509376, 521216, 492901, 560144, 787154, 968503, 882530, 637382, 523799, 601082, 683117, 681417, 692773, 761573, 812883, 829431, 861650]
35596H61650J647j10114j20236N4301J73406M4167j28771p0419J09257J21871
35586I36759k5667j11093r7743j07246j12400j256J38801J24134m720n9008k6695
35575F53866l8944q8012o1832Q857J2090p990N6105J25669N6433p0472o3995M2202
35563F23977N9546j7511l6459J0541N139l0333J6154Q0034J2877j03698n8489
35552E61778J04574J33886m761q4088j2285N5133L6338L3366O4581j33j56787
35541G31602k10853r6287J3592M732j9807K7962P2818N8935N7898R6997Q4470
35530H22059m381n8732k7990j165k5829l4194n758j0166l3867L2056J67818J96745
35518A016596O1676o7658n4921J6540J4435m7601q4033p1969l0519K0188K8571
$$ y = [861650, 863297, 753183, 632947, 687248, 860654, 904821, 776050, 705631, 814888, 936759, 911092, 799999, 702256, 595010, 482610, 481354, 620155, 744289, 739569, 680561, 653866, 614922, 526910, 465078, 473935, 486025, 478035, 534140, 659809, 716242, 645770, 581775, 623977, 683523, 666012, 629553, 640094, 645233, 614900, 631054, 711088, 723965, 620267, 561778, 666352, 800238, 795477, 711389, 699104, 754237, 790575, 823941, 888522, 888389, 731602, 520749, 424462, 438054, 442786, 422979, 450941, 523759, 582694, 640592, 737589, 822059, 817678, 758946, 730956, 729791, 703962, 669768, 664010, 653844, 619977, 652033, 819851, 1016596, 1078272, 1010614, 955693, 972233, 986668, 939067, 855034, 783065, 752546, 772734, 801305]
35507H01305m4992j27953j04824J761N8445L2237J8487N2735O1219J4582k8890
35496G34112m5836o1527m8299K7878Q1500J1257r5297o4703P3092J18345J7521
35485G48043q1878r2779p0059k6525Q3651J81184J20664l4591n9633O7172J17517
35474I52766r104j39093j39243j01603j06862o9188N1230J22301O5997m695n05
35463F22001L481l9901l6106M4948O7184k8548r1910k0338N8972K3538k7563L1592
35451F07350J20208J00178J3536j1305K4944L2143j0174o4667j13852j24409m2588
35440E31364Q7137J24891M0935k3594J0950K8791p1855j88343j63995r364J41737
35429E08654J93951J24371k8114j35913p5952Q3970J33517J2954j04305q4503
$$ y = [801305, 756313, 628360, 523536, 525297, 583742, 615979, 634466, 687201, 748420, 763002, 734112, 688276, 626749, 578450, 606328, 687828, 699085, 603788, 539085, 612177, 730522, 748043, 666165, 573386, 503327, 476802, 560453, 741637, 862301, 827710, 768077, 835249, 952766, 943662, 804569, 665326, 563723, 456861, 387673, 438903, 561204, 627201, 622506, 622001, 625482, 585581, 549475, 594423, 661607, 633059, 541149, 520811, 579783, 603321, 575758, 607350, 727558, 827736, 841272, 829967, 854911, 887054, 876880, 812213, 698361, 573952, 531364, 618501, 743392, 784327, 760733, 771683, 800474, 728619, 540276, 376281, 366917, 508654, 702605, 826976, 798862, 662949, 586997, 670967, 804484, 817438, 713133, 628630]
35419F28630m170L3875O0276J06018R5118k431p3391m0698R466q659m0843k3325
35407G39866J08o328P760M7662K9267m3698m1109N6339Q0456m5006j51897r7265
35395E76155R687J1036m8253m3818R161L0312L2445N1100M1642j6495m0735P615
35383F19852L4784j3871m6347l299J9859m4039r4181l8871M4644N6850L1071K7075
35371E93527K5622K5228O9129R7030j4916j84972j59986O9581J88456M8825p8528
35360F78996L4193J81640Q9856j12183j29510J1644P3203L4521N2893J12657O0302
35349A088212p9805j35031q3903n7415q6738q8437m9663j5695L6237J13995J03698
35338G45455m7562j61897o9046J06900J37855M6328J3180M4722P481r0033j20276
$$ y = [628630, 624460, 658335, 718611, 824629, 919747, 917316, 843925, 803227, 812693, 804034, 763191, 739866, 739974, 733646, 741406, 789068, 818335, 774637, 733528, 789867, 870323, 825317, 673420, 576155, 585842, 596878, 548625, 504807, 513968, 544280, 576725, 627825, 669467, 652972, 612237, 619852, 654636, 640765, 594418, 591119, 610978, 566939, 472758, 433887, 478531, 535381, 566452, 593527, 619149, 644377, 713506, 810536, 795620, 610648, 450662, 520243, 708699, 757524, 678996, 713189, 894829, 984685, 872502, 742992, 754636, 827839, 862360, 915253, 1027910, 1088212, 1008407, 873376, 789473, 732058, 645320, 556883, 507220, 491525, 527762, 641757, 745455, 697893, 535996, 466950, 573850, 711705, 758033, 771213, 815935, 823416, 733383, 613107]
35327F13107p7478n0913k7778M4955Q7910J5217o1054M886J24552J21443L5096
35316H29943J3847K2357n1695j14901j7366J12041L3886j61563j55979P2260K00279
35305G83109P0609j05909j29443p0339m6354k1178N2247J08757J00410P6487O4463
35294H82859K5779l2540n1550l6851l6216k1143N3306J14819P5273R120L7317
35283A020173R7601M4412q3776j24479o3192j6571m166K9570L7999l4144o3481
35272H39946P2751K19203J48525m0681p3320K5238j4405k02188k52968q3570N8072
35261F96603L1524j2776J9198J0333n9428j8561J41042J71576j606j05629K5708
35250H97984J53231K9994j90251k16199o4505L6703K3465P739K2204n524p3343
$$ y = [613107, 535629, 484716, 456938, 501893, 589803, 605020, 543966, 548852, 673404, 794847, 829943, 843790, 866147, 814452, 699551, 682185, 794226, 828112, 666549, 510570, 582830, 783109, 853718, 747809, 618366, 548027, 501673, 480495, 532742, 641499, 741909, 818396, 882859, 908638, 876098, 824548, 787697, 751481, 730338, 783644, 898463, 973736, 982856, 1020173, 1117774, 1162186, 1078410, 953931, 890739, 874168, 870002, 899572, 937571, 903427, 839946, 912697, 1131900, 1280425, 1239744, 1166424, 1191662, 1177257, 975069, 722101, 638531, 696603, 728127, 715351, 734549, 744882, 685454, 666893, 807935, 979511, 977905, 872276, 897984, 1051215, 1081209, 890958, 674759, 610254, 646957, 670422, 678161, 700365, 694841, 621498]
35239F21498q4458M208J20260J50554M4149j14810j53935k0693J08079O4125m1989
35228F96988J094J29956R6131r2006j52327N21J13773L4413m8258L5440J38996
35217I54721Q0280l9190l5309M1728L3867l7044m1083J3013J7078k5402j3549
35206I49110O6645J15201N4860r0572k22833k32174r2981Q0340J46635J05547
35196H79778N7606K7532l1893q6390m8170M4480N8981j1146m0630N525L3684J1250
35184I00607j32j716m5120p2447J0834J19921R0805k3650k9315N4976K8108j04635
35172I28236j14602L6741J17398L1339m3209j3699j7446r3730p2539O9780J03834
35161I32103m0769j13763J9831J36903O0914l8102J2755P7701O903o7440o202
$$ y = [621498, 537040, 541248, 661508, 812062, 856211, 741401, 587466, 566773, 674852, 738977, 696988, 698082, 828038, 924169, 832163, 679836, 680357, 794130, 828543, 780285, 815725, 954721, 1035001, 995811, 960502, 1002230, 1036097, 999053, 957970, 970983, 988061, 962659, 949110, 1015755, 1130956, 1185816, 1095244, 872411, 640237, 547256, 627596, 774231, 879778, 937384, 964916, 933023, 846633, 798463, 842943, 901924, 890778, 850148, 855673, 889357, 900607, 900475, 898759, 853639, 781192, 792026, 911947, 1002752, 979102, 949787, 1004763, 1032871, 928236, 813634, 850375, 967773, 999112, 955903, 942204, 924758, 831028, 758489, 828269, 932103, 891334, 777571, 797402, 934305, 995219, 957117, 969872, 1047573, 1054476, 987036, 980834]
35150I80834N4776j9069p9579J5795R9573j0425j54443r4299P8396J21534M4871
35139A037964J7711L9578Q489k8799J7239O0981l036p1657j7893N1802j2689j17257
35127I82433r4131l759O197j3056N2223J07169O428j49840j66071p3930k7887
35116F25776j0355P2813J33839M2667q7223n4982Q2905J17742M3246J1166K5329
35105A002923j7848o3935J6497J41341J16959k1227o3939J0683K4062o8309j11621
35094I65586l5510M5060L9675r103m1219l9341R961P6793O7390k6378o0199L7010
35082A029725J13142M0462n4731j7997N6258J8455m3556J4593Q7039J804j35002
35071A110192j09297J2058O474r5390q2955L2349N1593k9171l0254N2438N2737
$$ y = [980834, 1035610, 1016541, 936962, 952757, 1052330, 1041905, 887462, 793163, 871559, 993093, 1037964, 1055675, 1095253, 1103742, 1074943, 1092182, 1153163, 1150127, 1078470, 1060577, 1112379, 1099690, 982433, 888302, 884543, 890740, 877684, 929907, 1037076, 1043504, 893664, 727593, 653663, 625776, 615421, 688234, 822073, 864740, 777517, 722535, 805440, 923182, 966428, 977594, 1002923, 985075, 921140, 937637, 1078978, 1195937, 1174710, 1110771, 1121454, 1145516, 1077207, 965586, 930076, 975136, 1014811, 1005708, 964489, 925148, 935109, 1011902, 1079292, 1052914, 992715, 1029725, 1142867, 1183329, 1128598, 1110601, 1166859, 1185314, 1141758, 1156351, 1243390, 1245194, 1110192, 1000895, 1012953, 1019427, 924037, 841082, 873431, 925024, 895853, 865599, 918037, 970774]
35060I70774k2909p412Q2760O4757m8187n3172N6546O6689n7208r6799K2340R9897
35048A078076K3566n0977k68O6339L2458l9486o5722p4700q4792m0831M5450P0235
35036I59348J6146j3752J7368L0614j863j2827J4488K1735N069J1189J8285j7856
35024A047944l7278L0679J04732P2303j193P115L9514k0035q7018j8943P9041
35013A216861R920j30449p9176J25016J77176J3034j02024l5564L4061j6509o6948
35002A145398l9843m7850j28467j31672m742Q5081M1448n472M0838P6270K0442
34991A051431k2640L6379J12787J07667N0288j0746q4662j37650r4617N42P826
34980A016605q0901j21770n8844Q482K2060L0314L9448J131m2808o918N5142K5581
$$ y = [970774, 947865, 940453, 1023213, 1087970, 1039783, 986611, 1043157, 1109846, 1052638, 955839, 978179, 1078076, 1101642, 1050665, 1050397, 1116736, 1149194, 1109708, 1043986, 969286, 884494, 843663, 889113, 959348, 975494, 961742, 979110, 1009724, 1007861, 995034, 1009522, 1031257, 1036326, 1047515, 1065800, 1047944, 1010666, 1041345, 1146077, 1218380, 1217187, 1224302, 1263816, 1243781, 1156763, 1137820, 1216861, 1226781, 1096332, 1017156, 1142172, 1319348, 1332382, 1230358, 1194794, 1228855, 1212346, 1145398, 1105555, 1057705, 929238, 797566, 792824, 877905, 919353, 913881, 954719, 1030989, 1051431, 1028791, 1065170, 1177957, 1285624, 1335912, 1325166, 1240504, 1102854, 1008237, 1008779, 1016605, 935704, 813934, 755090, 763572, 785632, 815946, 855394, 856525, 813717, 806799, 861941, 887522]
34968H87522n0248m3633j12n0374j17436k1100J61541J76336K1432n2544K2208
34957I33592N7291m535l122Q4926P8998m3058p6476L3530R8859N0111L2289O5703
34945A308108q359j57069j32366P0493J40583k4181j33315j2087J16104N5338
34935A223249m6013k6381N355n4408q4494j5010N403p7133p7088O4128J22202
34924A039810O724m0748J04876J93231N1559r0372k7338M6507p3089j90198o1547
34913I59415J47680J47221J816m6492o726k7333o1644N800P9165K0711o9890l9876
34901A109847L0425K302n1332k0049M077p0391j08121J211R2878J4419p3177J5888
34889I47977J41013R5565j3421J3404Q7244K8070o3658j757J03694L5669j18893
$$ y = [887522, 837274, 793641, 793529, 743155, 625719, 604619, 766160, 942496, 963928, 911384, 933592, 990883, 986348, 983226, 1068152, 1147150, 1104092, 1027616, 1061146, 1160005, 1210116, 1242405, 1308108, 1299749, 1142680, 1010314, 1080807, 1221390, 1197209, 1063894, 1051807, 1167911, 1223249, 1177236, 1150855, 1156210, 1101802, 1017308, 1002298, 1007701, 930568, 853480, 917608, 1039810, 1046534, 1005786, 1110662, 1303893, 1355452, 1265080, 1237742, 1284249, 1211160, 1020962, 959415, 1107095, 1254316, 1256132, 1209640, 1202914, 1175581, 1113937, 1119737, 1198902, 1219613, 1149723, 1109847, 1140272, 1142574, 1091242, 1071193, 1075270, 1004879, 896758, 897969, 990847, 1005266, 932089, 947977, 1088990, 1184555, 1171134, 1184538, 1271782, 1299852, 1236194, 1234437, 1338131, 1373800, 1254907]
34878A254907j20745M82M1385Q945M6449R6448M387j37246j04432O9914J49118
34867A309612O9112l2252q3400j02576n2277O6107R4432m5433j52043n5789O0144
34856A075637l1161j70144o6910J79487K29517N3541p7733o9502o4745q6596j5286
34845I56105J03651R7045n666k0109M4380K0946o6008l6591Q2108P9384n4415
34834A200830j03691k158Q5091P2919N2026N5332R211o4893n9148O081J5954j4041
34822A253513J3448N3499M76o5115J0906J50535J39985r032q5090l1373J3449
34811A445201J119J5494M7647L651p8689p7054j9860k6954o3010m743R9794R7327
34799A439923q68o4092q3247j17983j02145L0993J40120P4210m4008k8189K6500
$$ y = [1254907, 1134162, 1134644, 1176029, 1184974, 1231423, 1327871, 1332258, 1195012, 1090580, 1160494, 1309612, 1378724, 1346472, 1263072, 1160496, 1108219, 1174326, 1268758, 1223325, 1071282, 1015493, 1075637, 1044476, 874332, 807422, 986909, 1216426, 1269967, 1192234, 1122732, 1057987, 971391, 956105, 1059756, 1156801, 1151135, 1131026, 1175406, 1196352, 1130344, 1093753, 1175861, 1255245, 1200830, 1097139, 1094981, 1180072, 1252991, 1305017, 1360349, 1369560, 1304667, 1245519, 1251600, 1267554, 1253513, 1266961, 1320460, 1320936, 1255821, 1266727, 1417262, 1557247, 1548215, 1463125, 1431752, 1445201, 1446320, 1461814, 1509461, 1513112, 1434423, 1357369, 1337509, 1310555, 1247545, 1242802, 1342596, 1439923, 1439055, 1374963, 1291716, 1173733, 1071588, 1102581, 1242701, 1316911, 1272903, 1244714, 1271214]
34788A271214n7788j56099m2210J58688J41815n2546j22561l5034j8459p9227
34778A007793N13J91952K21136O8071L429P8898M0295j69438k67708j13691P1962
34767A133212R8461N0233K2776l8769j22495r6053K8591P8010L0420L8125J00329
34756A322840N1419q5502r1811M8133J03581R254m5582J420p703r4980q0968M3471
34744A173572O4192m9254p0679N4080J00972j013l3526Q5370J35279O115j01341
34733A363767m9515J9267k578n381N4751L7416p0565p3387O0570J00698k5409
34722A409634q4170L0320R4142k6172j21951k6486R2454N0118n4403o9188l6515
34711A257783j9695L8528J20153Q0307o4435r8334J3595L9432r3641j47731k585
$$ y = [1271214, 1213426, 1057327, 1015117, 1173805, 1315620, 1263074, 1140513, 1105479, 1087020, 1007793, 1008306, 1200258, 1421394, 1489465, 1492894, 1571792, 1612087, 1442649, 1174941, 1061250, 1133212, 1231673, 1281906, 1304682, 1265913, 1143418, 1047365, 1075956, 1153966, 1184386, 1222511, 1322840, 1374259, 1288757, 1196946, 1245079, 1348660, 1357914, 1312332, 1313752, 1306049, 1211069, 1130101, 1173572, 1237764, 1188510, 1117831, 1171911, 1272883, 1271870, 1238344, 1323714, 1458993, 1465108, 1363767, 1314252, 1333519, 1330941, 1325560, 1380311, 1417727, 1347162, 1273775, 1334345, 1435043, 1409634, 1325464, 1355784, 1449926, 1423754, 1301803, 1275317, 1367771, 1417889, 1363486, 1294298, 1257783, 1238088, 1276616, 1396769, 1477076, 1412641, 1314307, 1327902, 1367334, 1273693, 1125962, 1123377]
34700A123377J36120J28181J18882J81161J30779q4293j99267p7784L7463k9451
34690A465168p6636N8791J53200n623k10839j74951R766Q4950M8765M7102O7622
34679A467315L5392J0593M0574K4768o1727n6389P7817J14834m0757j37091m586
34668A470743J21902O044j71790j31029M1185Q2313n395l7462J1348M4545O1332
34657A493736Q4754M1441p0764q9396L9960J20231K6968p3044k9945L0179k8164
34646A545956r7401o5801l4146p1969m4778R2977J38237J760r3776j4356L9549
34635A396252n4532o8918J26099K37606M0378j82306r8363J14461J09498l5185
34625A584990k7652R0949P8081l7889n9998j9230n8277r4536Q195J10595K5246
$$ y = [1123377, 1259497, 1387678, 1506560, 1687721, 1818500, 1734207, 1534940, 1457156, 1494619, 1465168, 1388532, 1447323, 1600523, 1594900, 1384061, 1209110, 1218876, 1303826, 1352591, 1399693, 1467315, 1502707, 1513300, 1553874, 1578642, 1516915, 1460526, 1538343, 1653177, 1612420, 1475329, 1470743, 1592645, 1598689, 1426899, 1295870, 1337055, 1419368, 1413973, 1376511, 1387859, 1432404, 1493736, 1578490, 1619931, 1549167, 1459771, 1499731, 1619962, 1646930, 1573886, 1543941, 1574120, 1545956, 1448555, 1382754, 1348608, 1276639, 1231861, 1324838, 1463075, 1464835, 1371059, 1356703, 1396252, 1341720, 1272802, 1398901, 1636507, 1676885, 1494579, 1396216, 1510677, 1620175, 1584990, 1557338, 1648287, 1726368, 1688479, 1628481, 1609251, 1550974, 1456438, 1464633, 1575228, 1600474]
34614A600474j08380n7481Q0024O7261m1350m7849l722o0693j08448L1342K09885
34603A561063J58965m3553j08837r913N6543N1930P1956P0053l6675j13241m364
34592A653927J47802J16215l0413q5416o8763r7168q2442P7253J94041N9848j54880
34581A730004j54042J710M6706k5711l8482o603n0234q7678J0549J22033Q5601
34570A633853K5246R9449J51014J119j48128m1482J34830N8501j46410j31800
34560A636192O0051J16792K5070M229K1989j00369k31239j06671J41757J56723
34550A724524m0667j22311l1986J3570K157Q7136J64635J8061j96238j41655R2676
34539A569902J21204o4015j07980N1570J09696j4982o1810N5773J19430M2937
$$ y = [1600474, 1492094, 1434613, 1514637, 1581898, 1540548, 1492699, 1488977, 1428284, 1319836, 1351178, 1561063, 1720028, 1676475, 1567638, 1557725, 1614268, 1666198, 1738154, 1808207, 1771532, 1658291, 1653927, 1801729, 1917944, 1887531, 1802115, 1733352, 1636184, 1553742, 1630995, 1825036, 1884884, 1730004, 1575962, 1577672, 1624378, 1598667, 1560185, 1553582, 1503348, 1415670, 1426219, 1548252, 1633853, 1659099, 1758548, 1909562, 1910681, 1762553, 1721071, 1855901, 1914402, 1767992, 1636192, 1696243, 1813035, 1838105, 1842334, 1864323, 1763954, 1532715, 1426044, 1567801, 1724524, 1683857, 1561546, 1529560, 1543130, 1545287, 1632423, 1797058, 1815119, 1618881, 1477226, 1569902, 1691106, 1627091, 1519111, 1570681, 1680377, 1665395, 1603585, 1659358, 1778788, 1821725]
34529A821725j6502j3088n1724q1296K9684J54131P2718r5772p7570N0555K4398
34518A817259o8475M3662K28758J28244j58587j94454L2025J04204o3263j15573
34508A753800M8412J19338P39l2189Q9718Q6797j05491j92306o9850J5076k7969
34497A686075N511J36937J14759q1062j53199j4919Q4788M6906M4379R9549L9183
34486B008907q6573n0399P1634J945j65391q0691J78916J82712p8091j63300J5890
34475A835559P3604q3769r4042J17675J61975o1500j48597N1412J59709p112j16027
34464A888887J7562J04275j0955n9047O7280P6925j04485j27329J02621J89568
34454B145302k4778j58605j2383P5765q0814j47194N7902J78091n712j53825j6468
$$ y = [1821725, 1805223, 1792135, 1740411, 1659115, 1688799, 1842930, 1915648, 1819876, 1742306, 1792861, 1817259, 1748784, 1792446, 2021204, 2149448, 1990861, 1796407, 1828432, 1932636, 1869373, 1753800, 1802212, 1921550, 1922289, 1890100, 1979818, 2066615, 1961124, 1768818, 1698968, 1714044, 1686075, 1691586, 1828523, 1943282, 1862220, 1709021, 1694102, 1778890, 1825796, 1870175, 1969724, 2008907, 1922334, 1871935, 1943569, 1945514, 1780123, 1699432, 1878348, 2061060, 1982969, 1819669, 1835559, 1909163, 1825394, 1731352, 1849027, 2011002, 1949502, 1800905, 1852317, 2012026, 2004914, 1888887, 1906449, 2010724, 1999769, 1940722, 2008002, 2084927, 1980442, 1853113, 1955734, 2145302, 2120524, 1961919, 1949536, 2025301, 1944487, 1797293, 1855195, 2033286, 2027574, 1873749, 1857281]
34443A857281J12935p968j23558k4214N2162n0873o9858J09689J54793o1576j38978
34432A809835J15281K75612N6270j71456q3849K7738j05127j72137Q4216K98228
34422B134611J22684j29894o8177R9115M0390p3607K156N5375j07334j70788J08218
34411B012749L39658J32660j98559j84328J4279L888j03590k777J60302R7833
34401B272115l0447N0922J63162K1219j91918j59087M038L9648M0068J44173J42867
34390B496760r9371k50070n5738J56078M6701j29207l6670J10111J2298j10958
34380B139934R156J12958o9994k23711k0266K11542P7586j26060K7023K74239
34370B412407J69169o8417n356J50611k4292l05415k23412M7073M4851r7123K1170
$$ y = [1857281, 1970216, 1962248, 1838690, 1814476, 1866638, 1815765, 1745907, 1855596, 2010389, 1948813, 1809835, 1925116, 2200728, 2256998, 2085542, 2001693, 2029431, 1924304, 1752167, 1836383, 2134611, 2257295, 2127401, 2059224, 2158339, 2198729, 2125122, 2127278, 2182653, 2075319, 1904531, 2012749, 2352407, 2485067, 2286508, 2102180, 2116459, 2120347, 2016757, 2013980, 2174282, 2272115, 2241668, 2292590, 2455752, 2476971, 2285053, 2125966, 2130004, 2169652, 2209720, 2353893, 2496760, 2397389, 2147319, 2091581, 2247659, 2294360, 2165153, 2128483, 2238594, 2250892, 2139934, 2149090, 2262048, 2192054, 1968343, 1948077, 2159619, 2237205, 2111145, 2138168, 2412407, 2581576, 2513159, 2507803, 2658414, 2634122, 2328707, 2105295, 2152368, 2197219, 2100096, 2121266]
34359B121266K18054Q3083j60697m2732K26080J28456j55142p1839K34938J71160
34349B752627j91276k45098L3938R0265j53611k05206L7424J45235Q306k4551
34339B248053J09513J04508l2590J2936J77989R7626j54545j58798N1536N1152
34329B507380j51298j32589J14568J58814m8132r8761Q6648J47771j915n8607
34319B523879M1149N1065j9799O3454J98783Q4462j41790q9299J41473J14863
34309B968240j32170j79306k4107k3811j29114J7704K90523K17233j28311k07155
34299B669726K9409J03430p2171q7598J21421J63806j5635m3799J21590J24735
34289C114914n0998n2890J08034O8320j38696j30028M8035k201k06591j20888
$$ y = [2121266, 2339320, 2422403, 2261706, 2218974, 2445054, 2573510, 2418368, 2346529, 2581467, 2752627, 2561351, 2316253, 2350191, 2440456, 2286845, 2081639, 2119063, 2264298, 2272604, 2248053, 2357566, 2462074, 2429484, 2442420, 2620409, 2718035, 2563490, 2404692, 2456228, 2507380, 2356082, 2223493, 2338061, 2496875, 2448743, 2349982, 2436630, 2584401, 2582486, 2523879, 2565028, 2616093, 2596294, 2659748, 2858531, 2942993, 2801203, 2711904, 2853377, 2968240, 2836070, 2656764, 2632657, 2608846, 2479732, 2497436, 2787959, 3005192, 2876881, 2669726, 2699135, 2802565, 2730394, 2642796, 2764217, 2928023, 2912388, 2868589, 2990179, 3114914, 3063916, 3011026, 3119060, 3187380, 3048684, 2918656, 2966691, 2964490, 2757899, 2637011]
34279B637011J77101J80795q0599q7287J65374J56068j40121j89724P4506J40575
34269C033699q2662j25314Q2049Q5376j43160j22930J47737J34208j68820j56536
34259B683647K30898L35451j9340k18290k40J38092l2663q8098J05416R2505k02948
34248C024430k35367J07746K34339l6506j33058J43313K23666j00581k36468P4161
34238C065675K45154l4075k16368L4743K14190k2054k03553J9612K20373N6917
34228C380614r8777M3155J32818m7750j16810R7847J55446j08617j90022J12571
34218C360475K64636J3506j28651Q7035J45305j73092k70775J34676L96774R6669
34208C926558k09055o2139R5974j05571k12361R7593K93327k466k50510j6513
$$ y = [2637011, 2814112, 2994907, 2914308, 2827021, 2992395, 3148463, 3008342, 2818618, 2893124, 3033699, 2951037, 2825723, 2907772, 2993148, 2849988, 2727058, 2874795, 3009003, 2840183, 2683647, 2914545, 3249996, 3230656, 3012366, 3012126, 3150218, 3117555, 3029457, 3134873, 3227378, 3024430, 2789063, 2896809, 3131148, 3094642, 2961584, 3104897, 3328563, 3227982, 2991514, 3065675, 3310829, 3276754, 3060386, 3095129, 3309319, 3287265, 3083712, 3103324, 3323697, 3380614, 3281837, 3324992, 3457810, 3410060, 3293250, 3391097, 3546543, 3437926, 3247904, 3360475, 3625111, 3638617, 3509966, 3597001, 3742306, 3569214, 3298439, 3433115, 3829889, 3926558, 3717503, 3655364, 3751338, 3645767, 3433406, 3530999, 3824326, 3821860, 3571350, 3554837]
34198C554837K01610l4800k40049L6126L12471J00181j69362p874K03743K0576
34188C977459j79242J9674K21049J3007j98658J504K10250K0974j56826P0612
34178C999803K66631K4085k06985n79J97687l7075k50535j9563J81779p0198k59404
34167C825646O9984L62410Q8514k08413N6659L69242J01326k72849r3483K23265
34157D522301K1132l22405j55604J90393R6458j38040L4910K68990L1460k66767
34147D282828l0247L36584J76070j89701j27771J13310K3789r2695J84133L87975
34137E064275K9976l30690p3033K68981J8092l01953L1472M78300K10106k94478
34127E101048j33721L20197J64453l09682k23276K00925J44375j94634o6512K95316
$$ y = [3554837, 3756447, 3721647, 3481598, 3517724, 3830195, 3930376, 3761014, 3753140, 3956883, 3977459, 3798217, 3817891, 4038940, 4051947, 3853289, 3854793, 4065043, 4086017, 3929191, 3999803, 4266434, 4290519, 4083534, 4082955, 4280642, 4243567, 3993032, 3973469, 4155248, 4085050, 3825646, 3895630, 4258040, 4346554, 4138141, 4194800, 4564042, 4665368, 4392519, 4299036, 4522301, 4543433, 4221028, 4065424, 4255817, 4352275, 4214235, 4249145, 4518135, 4549595, 4282828, 4252581, 4589165, 4765235, 4575534, 4447763, 4561073, 4584862, 4492167, 4676300, 5064275, 5094251, 4763561, 4690528, 4959509, 4977601, 4675648, 4707120, 5185420, 5395526, 5101048, 4967327, 5287524, 5451977, 5142295, 4919019, 5119944, 5264319, 5069685, 5003173, 5298489]
34117E298489J56982k19455q9838K78963J41946k24484o8373L27923K00888j78584
34107E624457o6872K46248M1841l13735n2444M00975J62241l80722k56788K52096
34097E657297J92194k14839p6370L67029K41419j85416m7807L32677O5107m47133
34087E884158j83683M71792L70527k32131j84682L39250K26516l64655l15138
34078F011954K64097K89168j47130k7973M71790K97494l23821k38549L65505K87028
34068G249563l28702k54152L98620L71946k72753k71448L63739L93793j85407
34059G465199j68556M09749L24242l51496l17262L73586L66796l13900k67001
34050G521357N13571N59156k15986l23779L92702M54939l28999m63534L01332
$$ y = [5298489, 5455471, 5236016, 5146178, 5425141, 5567087, 5342603, 5274230, 5602153, 5803041, 5624457, 5557585, 5803833, 5845674, 5531939, 5479495, 5880470, 6042711, 5661989, 5405201, 5657297, 5849491, 5634652, 5558282, 5925311, 6166730, 5981314, 5933507, 6266184, 6331291, 5884158, 5700475, 6172267, 6542794, 6310663, 6125981, 6465231, 6691747, 6327092, 6011954, 6276051, 6565219, 6418089, 6390116, 6861906, 7159400, 6835579, 6597030, 6962535, 7249563, 6920861, 6666709, 7065329, 7437275, 7164522, 6893074, 7256813, 7650606, 7465199, 7296643, 7706392, 8030634, 7679138, 7361876, 7735462, 8102258, 7788358, 7521357, 8034928, 8594084, 8378098, 8054319, 8447021, 8901960, 8572961, 8109427, 8410759]
34041H410759M73224k53706m11759L36218N42320j51650l14062M22426O23256
34032I677026j10680l69444K60360M15025k69081m09735L26204N11559j92277
34023I838957l34812M16795N84545j49665k67442N24353O30304k42122m00303
34014A0600610M90650O58769k88961n14459M47225P14487k46470n26679M61585
34005A1796757P79082k12455n40016M90422Q80753j13767m81125N45026R11161
33996A4055838j70876n76064N40532R98954j03076n36939O45248J146408m5304
33987A5954721n70944O45049J179097j08391p19300N66290J197503q9144o48234
33978A7406647Q31646J554892Q7500o62943Q55140J612539o6132r84598P55795
$$ y = [8410759, 8883983, 8630277, 8218518, 8554736, 9097056, 8945406, 8631344, 9053770, 9677026, 9566346, 9196902, 9457262, 9872287, 9603206, 9193471, 9519675, 10031234, 9838957, 9504145, 9920940, 10505485, 10355820, 10088378, 10612731, 11243035, 11000913, 10600610, 11091260, 11750029, 11461068, 10946609, 11393834, 12108321, 11861851, 11335172, 11796757, 12575839, 12363384, 11823368, 12313790, 13194543, 13080776, 12599651, 13144677, 14055838, 13884962, 13308898, 13849430, 14848384, 14745308, 14208369, 14853617, 16000025, 15954721, 15383777, 16028826, 17207923, 17099532, 16380232, 16946522, 18144025, 18054881, 17406647, 18238293, 19793185, 19880685, 19217742, 20072882, 21685421, 21619289, 20634691, 21390486]
33969B1390486J877332K65407p94465R19113K031926K19581r66234J000195K421503
33960B8364844N40074q46544J205442K759850P01790q16827J535669L341264R98545
33951C7784107p61828J992369M171020J452967o22243K788140N660785K529546
33943E4994863k6322M201306P952148M120836R01338O672538J2137209P248364
33935I8202280K692927J0595053J8065685J0458802O403426K7536227M1527060
33928B15481460r196919j11054969j68280387j19112160j7962468L8092696K8552060
33921a43480687P645600J0204652J7399832J0237611K206905O573567J1793795
33914g7418725O613026N87138L596627P736561M281938j33773K163492N351458
$$ y = [21390486, 23267818, 23533225, 22738760, 23657873, 25689799, 25909380, 24943146, 25943341, 28364844, 28904918, 28058374, 29263816, 32023666, 32725456, 31908629, 33444298, 36785562, 37784107, 37022279, 39014648, 43185668, 44638635, 44016392, 46804532, 52465317, 54994863, 54968541, 59169847, 67121995, 71242831, 72144169, 78816707, 90953916, 98202280, 100895207, 111490260, 129555945, 140014747, 146418173, 173954400, 215481460, 206284541, 95229572, -73050815, -192162975, -210125443, -172032747, -143480687, -135835087, -125630435, -108230603, -97992992, -95786087, -89212520, -77418725, -70805699, -70218561, -66621934, -58885373, -54603435, -54737208, -52573716, -47222258]
33906d7222258K493137j232497N83280L385703J309745j513387L80844L199542
33898c8615891J703642p85171O12132K910719J578127o21598N79188K595427J361466
33889b8681959o97051L44884K244722J203695p38426P3836J806946J004428o26274
33880b4065199J88119J782556R58184p04477m6794J493432Q39685o91725r3185
33871b0339404J454025J010207m28133q9935J130726O51703o17176j65574J111988
33862a6281573P29678m97986j53107J010527O43060n46325k51643Q86832O26789
33853a3833748m56102k07042Q22891N48718m78007k06027Q09390N06265n83105
33844a3076767l42059Q11038P54044k63437k35611O70997N79411l52879l20539
$$ y = [-47222258, -44729121, -45961618, -45378338, -41992635, -40682890, -42196277, -41815433, -38615891, -36912249, -37697420, -37085288, -34174569, -32596442, -33218040, -32638852, -30043425, -28681959, -29379010, -29034126, -26789404, -25585709, -26324135, -26250299, -24443353, -23438925, -24065199, -23877080, -22094524, -21136340, -21840817, -21887611, -20394179, -19554494, -20246219, -20339404, -18885379, -17875172, -18303305, -18393240, -17262514, -16610811, -17227987, -17393561, -16281573, -15551895, -16049881, -16202988, -15192461, -14549401, -15095726, -15347369, -14460537, -13833748, -14289850, -14496892, -13674001, -13125283, -13603290, -13809317, -12999927, -12493662, -13076767, -13418826, -12607788, -11853744, -12117181, -12352792, -11681795, -11102384, -11455263, -11775802]
33835a1775802N38538M85232l54040k93114N52168N35256k52198k15636N62499
33826a0217097N27243k50739k52719M62971M12532l52341l65901L51769L80523
33817i303759k70208k26321M81031M69899k50305k90563M07055N02542j15027
33808h595656k02963L30721L15175k68353k27481M36326M76045j79145l06212
33799h221543K30916K94928k39705k84447K69193L62788j10245j51748K89266
33790g560597K37831k70032j94188M06915M03419k13415k92891K49891L12524
33781f920543j96510k00609L61311L63914k85465m08543J99726M09739n4360j63399
33771f894739L24008L90239j99421m00536R9023L20165p4576j91694K52979L68278
$$ y = [-11775802, -11237264, -10752032, -11106072, -11399186, -10847018, -10311762, -10563960, -10779596, -10217097, -9689854, -9940593, -10193312, -9730341, -9317809, -9670150, -10036051, -9684282, -9303759, -9573967, -9800288, -9319257, -8849358, -9099663, -9390226, -8983171, -8480629, -8595656, -8798619, -8467898, -8152723, -8421076, -8648557, -8212231, -7736186, -7915331, -8221543, -7990627, -7695699, -7935404, -8219851, -7950658, -7587870, -7698115, -7849863, -7560597, -7322766, -7592798, -7786986, -7380071, -6976652, -7190067, -7482958, -7233067, -6920543, -7117053, -7317662, -6956351, -6592437, -6877902, -7286445, -7086719, -6676980, -6731340, -6894739, -6570731, -6180492, -6379913, -6780449, -6681426, -6361261, -6435837, -6627531, -6374552, -6006274]
33761f006274j14016k84605J63277L54994l3384j84662J90045K88309j40905k61250
33751f028471J95970L75749m9192k72029N5607K02986j22017j96677K21954L62691
33741e253429m6138k37576Q4070J99292j37466j86969K57226L70500j15612l49142
33731e415244L2386K44974q0280k01145K16743L92629n3325l40001r080K51573
33721d960770j388j53029J52056K66925j17342k58665K12819M99880R0106l02454
33711d571862r1735J55664q0977k82595R500K63637K2158k04003L1518K46790
33701d501905L1419j40178R5211K25957j01298l25397m5401J84075o7976k66291
33691d911784M0591L41163J54081q5630N4813J75472o4149j94275J16880L27372
$$ y = [-6006274, -6120290, -6404895, -6241618, -5886624, -5920008, -6104670, -5914625, -5626316, -5767221, -6028471, -5832501, -5456752, -5505944, -5777973, -5722366, -5519380, -5641397, -5838074, -5616120, -5253429, -5299567, -5537143, -5453073, -5253781, -5391247, -5578216, -5320990, -4950490, -5066102, -5415244, -5382858, -5137884, -5218164, -5419309, -5202566, -4809937, -4863262, -5203263, -5212343, -4960770, -4962158, -5115187, -4963131, -4696206, -4813548, -5072213, -4859394, -4359514, -4269408, -4571862, -4663597, -4507933, -4588910, -4871505, -4862005, -4598368, -4576210, -4780213, -4748695, -4501905, -4470486, -4610664, -4515453, -4289496, -4390794, -4716191, -4761592, -4577517, -4645493, -4911784, -4871193, -4530030, -4375949, -4461579, -4406766, -4231294, -4295443, -4489718, -4372838, -4045466]
33681d045466L9821k04744M2537K79461M4702j94545J4633K30602K5888j66543
33671c933654L4991J54015j70395l63637K2840L82659J35108k01123n248K85370
33661c659074N5450l02891j62439J63116Q9735j17155M4611K69075O4234k29036
33651c784374p9080J93732M1013k44496j06003K00413J24936j14477J647K64583
33641c502106J64201j15454q4117J08524L2552j46832l9201J54952N1603j30669
33631c506547j5165J64323M6442j02352P2235K44262J6701k44980n8728K39455
33621c144354J09446j81627r7281J39824K5952k08363n6520K40534J36088j64868
33611c201169r6355J92659J54374j04926q0494J30213N9797j76828j19233J10767
$$ y = [-4045466, -4005645, -4210389, -4167852, -3888391, -3843689, -4038234, -4023601, -3792999, -3767111, -3933654, -3898663, -3744648, -3915043, -4278680, -4255840, -3873181, -3738073, -3939196, -3944444, -3659074, -3603624, -3906515, -4068954, -3905838, -3816103, -3933258, -3888647, -3619572, -3555338, -3784374, -3863454, -3669722, -3628709, -3873205, -3979208, -3778795, -3653859, -3768336, -3766689, -3502106, -3337905, -3453359, -3537476, -3428952, -3396400, -3543232, -3582433, -3427481, -3375878, -3506547, -3521712, -3357389, -3310947, -3413299, -3341064, -3096802, -3080101, -3325081, -3383809, -3144354, -3034908, -3216535, -3313816, -3173992, -3148040, -3356403, -3412923, -3172389, -3036301, -3201169, -3297524, -3104865, -2950491, -3055417, -3135911, -3005698, -2945901, -3122729, -3241962, -3131195]
33601c131195N1661j78710j20506J18808R0541j05930m5763J58144R2960j05779
33591c175769j9388J97235J01699j52999j04426J13726M5582j71829p8915J76880
33581c068204J10121j45276q7740J71063J30191j09221m7297K10904J41597j66845
33571b860707j60675J29590J73850l1351j2228J93493J00472k20853k09399J23763
33561b774045J88340r8604j91775N0773J62487o627o9411P7018P7860j10618j11271
33550b805873J02632J30684o5592q9577R6644R9847j09517j26946Q6000J25755
33540b555943n3631n9979J41215J48406p6492j26919M7343N8900j16489p5950
33530b669539J78037J74277j33111k37175O863J58138M2785J3515J75886J65003
$$ y = [-3131195, -3079534, -3258244, -3378750, -3259942, -3169401, -3275331, -3321094, -3162950, -3069990, -3175769, -3195157, -2997922, -2896223, -3049222, -3153648, -3039922, -2994340, -3166169, -3245084, -3068204, -2958083, -3103359, -3191099, -3020036, -2889845, -2999066, -3046363, -2835459, -2693862, -2860707, -3021382, -2891792, -2717942, -2749293, -2761521, -2568028, -2467556, -2688409, -2897808, -2774045, -2585705, -2684309, -2876084, -2825311, -2662824, -2669451, -2738862, -2661844, -2583984, -2694602, -2805873, -2703241, -2572557, -2638149, -2727726, -2631082, -2531235, -2640752, -2767698, -2681698, -2555943, -2609574, -2669553, -2528338, -2379932, -2456424, -2583343, -2536000, -2477100, -2593589, -2669539, -2491502, -2317225, -2450336, -2687511, -2680648, -2522510, -2479725, -2466210, -2290324, -2125321]
33520b125321r7867k08369m6973J9216j06617o8512J74112J92348p7821j49191
33510b494995J18765K36021j9383k06805m7925J12622J6319o4367N2986Q6684
33500b210078j01051j81837n03J02194n0177j19425Q7746K28968N7116j43685
33490b330732j07205j3271l5309o867J43531J62762k2166j02544L4588P5096j11449
33479b313566j98628j8878J18769J6171p0467L5741J09750J9603q371J05129Q0679
33468b124068j52268k40170l2931J37020O9022J2727J12719J30217j4559l3486
33458b135777J26619J07067j58013k27997M5039J98118j0807j63417K2697J71864
33448b024607q705j56995M8623K64969J15920j36577j20996j2470r3528j71530
$$ y = [-2125321, -2223188, -2431557, -2478530, -2459314, -2565931, -2634443, -2460331, -2267983, -2345804, -2494995, -2376230, -2140209, -2159592, -2366397, -2414322, -2301700, -2285381, -2349748, -2296762, -2210078, -2311129, -2492966, -2493469, -2391275, -2441452, -2560877, -2473131, -2244163, -2187047, -2330732, -2437937, -2451208, -2486517, -2493384, -2349853, -2187091, -2209257, -2311801, -2277213, -2202117, -2313566, -2512194, -2531072, -2412303, -2396132, -2466599, -2430858, -2321108, -2301505, -2309876, -2204747, -2124068, -2276336, -2516506, -2549437, -2412417, -2343395, -2330668, -2217949, -2087732, -2102291, -2135777, -2009158, -1902091, -2060104, -2288101, -2243062, -2044944, -2055751, -2219168, -2196471, -2024607, -2033312, -2190307, -2141684, -1876715, -1760795, -1897372, -2018368, -2030838, -2124366, -2295896]
33438b295896p019J52700L4683j12184J5371J90311Q8507j04873p1608M4611l5714
33427b101111j67702q2208Q4780P0648j8731L3613J15231M6665l5916K0174M5176
33416a989381q7983j36327O1439K09233O6827q1184N9825K34010J02184j32452
33406a693809j10049L9875m718j45041j04004J2664n0665j67990o8687J28272
33396b164152J26326j6870m3487L0706L7971L1441J18649J59278K6199r0689k1645
33385a806273L8865r0220j89846m4858J17098L4678r4728j451J33691M3466q5150
33374a944728L5418K19021J30809j01001j37912k6434j3898l7667P5324J64529
33364a636539J8869j57582q4294O2863j4958j59144o0458J34586J01778m1394
$$ y = [-2295896, -2302915, -2150215, -2115532, -2227716, -2212345, -2022034, -1933527, -2038400, -2110008, -2065397, -2101111, -2268813, -2351021, -2266241, -2195593, -2214324, -2180711, -2065480, -2018815, -2054731, -2034557, -1989381, -2077364, -2213691, -2152252, -1943019, -1876192, -1957376, -1897551, -1663541, -1561357, -1693809, -1803858, -1763983, -1768701, -1913742, -2017746, -2005082, -2055747, -2223737, -2292424, -2164152, -2037826, -2054696, -2098183, -2067477, -2029506, -1998065, -1879416, -1720138, -1693939, -1784628, -1806273, -1767408, -1857628, -2047474, -2092332, -1975234, -1940556, -2035284, -2036735, -1903044, -1859578, -1944728, -1909310, -1690289, -1559480, -1660481, -1798393, -1824827, -1838725, -1876392, -1801068, -1636539, -1617670, -1775252, -1859546, -1796683, -1811641, -1970785, -2031243, -1896657, -1794879, -1836273]
33354a836273J4783J54256O9905j17234q2048P9696N7005o2925j137J14023q732
33343a618681j94497q2086J64576J17239j19427r5366J39295J32308j08349j22402
33333a787390J39593K17972k8732k10359j25078l1418p1940m3174J11956J50833
33323a677737J9169k9152O9834P0538q6293j42635o349R3772M5148Q354M5373
33312a589978J3272r1716r1051J5022L7653j8894L2948J62601J46427j271m6371
33301a431358K0141r711j18978q5406O1713O7662o1798o8384N8656O6832o0343
33290a560974p0726O1981Q9959k7300o5525O987j3218j19765q5728P2521J02750
33279a609038J2171N6652K08943J62818q1191j70397j7760O8175l3233p3693M3976
$$ y = [-1836273, -1821490, -1667234, -1597329, -1714563, -1796611, -1716915, -1659910, -1722835, -1723972, -1609949, -1618681, -1813178, -1895264, -1730688, -1613449, -1732876, -1828242, -1688947, -1556639, -1664988, -1787390, -1647797, -1429825, -1458557, -1668916, -1793994, -1825412, -1897352, -1940526, -1828570, -1677737, -1658568, -1687720, -1617886, -1547348, -1633641, -1776276, -1782625, -1688853, -1643705, -1635351, -1589978, -1576706, -1668422, -1759473, -1744451, -1706798, -1725692, -1692744, -1530143, -1383716, -1384987, -1431358, -1411217, -1420928, -1539906, -1625312, -1563599, -1495937, -1557735, -1626119, -1567463, -1500631, -1560974, -1631700, -1569719, -1479760, -1507060, -1572585, -1565598, -1578816, -1698581, -1784309, -1711788, -1609038, -1596867, -1540215, -1331272, -1168454, -1249645, -1420042, -1437802, -1369627, -1402860, -1476553, -1432577]
33268a432577Q9276j4985m2416O3251O2750q4483j00579P7047J40260l2141j48570
33257a423167l5586P2943n775r2665j7940R1208R8879P5866O3628k1987j28399
33246a322995p8676O2228L3836j35531j35660N8871J18203m2312j08937L9117
33236a511856J12416k9081j17654K246R3949N810m9631N8257J12348j7838j13510
33225a454544k5580O6628M2441N4303J40512P9246j45653k07023n277J11646l5805
33214a379106j30284M5523J92029M0652j55124q3550R1603P8765l2580k1628L7696
33203a316004q455n6786J4943O7204j3521n2473P2544J53833L5129p2967Q660
33192a167893P0327q2319k19435q1974J37269J25233k6228m5988K5625q981q9992
$$ y = [-1432577, -1343301, -1358286, -1400702, -1337451, -1274701, -1359184, -1459763, -1382716, -1242456, -1274597, -1423167, -1458753, -1385810, -1391585, -1484250, -1502190, -1410982, -1312103, -1236237, -1172609, -1194596, -1322995, -1401671, -1339443, -1305607, -1441138, -1576798, -1517927, -1399724, -1442036, -1550973, -1511856, -1399440, -1428521, -1546175, -1543929, -1449980, -1444170, -1493801, -1435544, -1323196, -1341034, -1454544, -1480124, -1413496, -1371055, -1316752, -1176240, -1096994, -1242647, -1449670, -1454947, -1343301, -1379106, -1509390, -1463867, -1271838, -1231186, -1386310, -1469860, -1378257, -1299492, -1332072, -1353700, -1316004, -1324459, -1381245, -1366302, -1299098, -1312619, -1365092, -1292548, -1138715, -1103586, -1176553, -1167893, -1097566, -1179885, -1399320, -1481294, -1344025, -1218792, -1245020, -1291008, -1265383, -1274364, -1364356]
33181a364356n1263J5821n5921j47470n2757J26336J47762M4150K8097J15141
33171a194460J54823J16775P0143M662q8249j04476j2485K6477p5285j52003p0835
33160a324913L4096K0367k1391K570j2370j16573j35378J1723J11671K2838o2090
33149a469450K6350J26746O7083k4849j0452j2183j08301j01999R2844J94060
33139a220151J9885j49561n0616R4086k139j58930q1921Q1155L3935j02106k7944
33128a564307J61841J62207K0630J5611J26794J06520m1762j01058m8724k5734
33118a187982j8287N7500R6361j0976j01792o717J05796J8804j18693n9905Q3484
33107a142407O7764k7201R30N2334m8945j42059j7971J20108n958j91057q0435
$$ y = [-1364356, -1415619, -1399798, -1455719, -1603189, -1655946, -1529610, -1381848, -1337698, -1309601, -1194460, -1039637, -922862, -852719, -848057, -936306, -1040782, -1053267, -1026790, -1102075, -1254078, -1324913, -1290817, -1270450, -1291841, -1289271, -1301641, -1418214, -1553592, -1541869, -1430198, -1407360, -1469450, -1443100, -1316354, -1249271, -1274120, -1284572, -1296755, -1405056, -1507055, -1414211, -1220151, -1200266, -1349827, -1400443, -1306357, -1308496, -1467426, -1549347, -1468192, -1434257, -1536363, -1564307, -1402466, -1240259, -1219629, -1204018, -1077224, -970704, -1012466, -1113524, -1162248, -1187982, -1206269, -1148769, -1052408, -1063384, -1165176, -1171893, -1066097, -1047293, -1165986, -1225891, -1142407, -1074643, -1101844, -1100914, -1048580, -1097525, -1239584, -1257555, -1137447, -1143405, -1334462, -1414897]
33096a414897J60572J15683j23440j12678J47425K30353M7879n6832J5829r373
33086i99479j80720j93667K3879J53308M3887o9002l2608Q59n1910m2590P1386
33075a276657J20494N9912M6367J04201P4558n0052r7510n1719n7977r1939l037
33064a223359J24169O0583j23807j33720L5540R8540J924j7193P9900O4254q6541
33053a119710j19586J1508N9340l9401n9447N0004O3023n8258o3434R9656J60350
33042a015955K3819o1748J5250L7211r0665j44168k0976N5441l1724p7454K5097
33031a285872O5532o3849j33883j506J17412M6563m1732K9200J26329R4471M1831
33020a005504Q3636R5732k6198j35032r6375k4937l6545k3151J02780J87671Q6759
$$ y = [-1414897, -1254325, -1138642, -1262082, -1374760, -1227335, -996982, -949103, -1005935, -990106, -999479, -1180199, -1373866, -1349987, -1196679, -1152792, -1221794, -1254402, -1253543, -1305453, -1348043, -1276657, -1156163, -1096251, -1049884, -945683, -871125, -921177, -1018687, -1070406, -1128383, -1220322, -1223359, -1099190, -1038607, -1162414, -1296134, -1260594, -1162054, -1160130, -1177323, -1097423, -1033169, -1119710, -1239296, -1227788, -1168448, -1207849, -1267296, -1217292, -1154269, -1212527, -1275961, -1176305, -1015955, -992136, -1053884, -1038634, -1001423, -1092088, -1236256, -1257232, -1201791, -1233515, -1310969, -1285872, -1220340, -1284189, -1418072, -1419578, -1302166, -1255603, -1297335, -1268135, -1141806, -1047335, -1005504, -921868, -826136, -852334, -987366, -1083741, -1108678, -1145223, -1168374, -1065594, -877923, -791164]
33009g91164q3129j46191j23422j08204q2363j6077L2848M6144Q6994J31057O9359
32998i84148n7313p2967K7100N4225l5732p6748j7884N463j8802N3181J77395
32987i46230J23016r1816j59974L888J18480L6865l0344M0256N0518r6736j61999
32976a114076o305J26888L5391r8286o1310L0248K747n7343k3706K2080L026J9400
32964a121246R8959Q2943m5010n8411Q9403J23861n3426j43319J5067J23010m6861
32953i35030k25582j21766P7398Q0662L277P7904J81918R1262p5754r0607l0021
32942i66339o0666p8117L8943R5370p7318k24496o5141J82518J50394n0995o1503
32931a117350Q5778Q6801l4843m258J37016Q8973j27840j77732j31R4982l0307
$$ y = [-791164, -874293, -1020484, -1143906, -1252110, -1334473, -1350550, -1317702, -1271558, -1184564, -1053507, -984148, -1041461, -1114428, -1087328, -1033103, -1068835, -1145583, -1163467, -1158004, -1176806, -1123625, -946230, -823214, -915030, -1075004, -1071116, -952636, -915771, -946115, -905859, -855341, -952077, -1114076, -1120381, -993493, -958102, -1056388, -1117698, -1087450, -1084703, -1142046, -1165752, -1143672, -1140646, -1121246, -1022287, -939344, -984354, -1042765, -953362, -829501, -882927, -1026246, -1011179, -888169, -935030, -1160612, -1282378, -1204980, -1124318, -1121041, -1043137, -861219, -769957, -845711, -936318, -966339, -1027005, -1105122, -1066179, -970809, -1048127, -1272623, -1337764, -1155246, -1004852, -1055847, -1117350, -1031572, -944771, -979614, -983872, -846856, -757883, -885723, -1063455, -1063586, -968604, -998911]
32920i98911j46234q0642M3441Q4112P2663N3882M826l8997p068M8645K7534k8082
32908i64831k3082r904p2585j17262k8894P9449M3482m7809j0478R5585Q9539
32897i66790J1192K2627Q1274L7512m6778r316Q2563M6882o6633q0219l1886o9657
32885i89229j17794j9027J04175L0471j20423n8214J46382J58251l4644j04962
32875a005014L5317J13072O937p1745n986L9702k2985m5988L4958P5030K9388
32864h17314M4550J33117J02200p6008j64327o2963K1172m6910j06909k6109N9178
32853i40323J5397m4282J2093R1266N5519l6884m8591K3813Q9335R0911Q834j30919
32841h13831k03548r8239Q4404J27051J1547o1282N728Q3438N8762j9467q7895
$$ y = [-998911, -1145145, -1225787, -1182346, -1098234, -1025571, -971689, -966863, -1005860, -1012928, -964283, -936749, -964831, -987913, -997817, -1070402, -1187664, -1216558, -1137109, -1093627, -1141436, -1151914, -1056329, -966790, -955598, -932971, -851697, -814185, -860963, -870279, -787716, -740834, -807467, -887686, -919572, -989229, -1107023, -1126050, -1021875, -991404, -1111827, -1170041, -1023659, -865408, -900052, -1005014, -969697, -856625, -849688, -921433, -927419, -887717, -910702, -956690, -921732, -846702, -817314, -772764, -639647, -537447, -613455, -777782, -840745, -819573, -866483, -973392, -999501, -940323, -924926, -969208, -957115, -865849, -810330, -847214, -895805, -871992, -782657, -691746, -682912, -813831, -1017379, -1115618, -1031214, -904163, -892616, -953898, -948170, -864732, -805970, -825437, -913332]
32830i13332j50324j64084n4097J12690J67750Q9578J5415j137k5417m3028K2966
32819i43020R8097L3182r8585p6307Q0063J17355j5341q4579n47L3988p4205j15169
32807a045068L9098J80291J05882o0728j08520n7650k9521j2600L6871M8599j7998
32796i21344n3987J0142O6086K6457j8426J3041L8806p529l4233J9159M3211l2850
32784h51467q8814l3806K0586j6259k3609R3682J76940O1391j15895j15767K4163
32773h68855Q0027K3749L7765J72638K44040J12013j22545k60012k21602q2040
32763h84822L7603P2698M5863J1431j9627o3111q9329m9434K4432M0392j7247
32752h91151o7024n6876j5683K4714N6380N1223J947j4010O0185J28072O9701
$$ y = [-913332, -1063656, -1227740, -1281837, -1169147, -1001397, -911819, -896404, -897541, -922958, -965986, -943020, -844923, -811741, -910326, -986633, -906570, -789215, -804556, -889135, -889682, -855694, -929899, -1045068, -1005970, -825679, -719797, -780525, -889045, -946695, -976216, -988816, -951945, -903346, -921344, -975331, -965189, -899103, -872646, -891072, -878031, -839225, -846754, -880987, -861828, -818617, -851467, -940281, -974087, -953501, -969760, -993369, -899687, -722747, -661356, -777251, -893018, -868855, -788828, -765079, -727314, -554676, -310636, -198623, -321168, -581180, -802782, -884822, -847219, -774521, -728658, -717227, -736854, -799965, -889294, -938728, -914296, -873904, -891151, -958175, -1015051, -1030734, -1006020, -949640, -898417, -896470, -910480, -850295, -722223, -652522]
32741f52522l9534l5152M6364J8653j19644j61332l6036Q3295Q2772N8099P7167
32730f77870M8699n7329r7528K189J02284P8749J884l3128n9092j02705r2144
32719h85991j6692J1389l6855l6253N4083R5084J9270m7892l4312m6488j17267
32708a041924q9985Q1134J78371O6089o2978r813J01812O7305m5806n8440o668
32697h20903k7155p2235j9891O1876L3130m8729m1044J0347k4722q3273j6446
32686a049045J02405O7539r9359j62383m3407Q1464Q6601O0505J02976J53672
32676f99032J09627j4397j14650j14458k2935P1203P2184j3889p8497n4101Q987
32665h49958M5529N7721M6729j7931r7389q8016l759K31j15856j66247j9058J77633
$$ y = [-652522, -692056, -727208, -680844, -662191, -781835, -943167, -979203, -895908, -813136, -755037, -677870, -629171, -686500, -784028, -781839, -679555, -600806, -598922, -632050, -691142, -793847, -885991, -902683, -891294, -928149, -964402, -910319, -815235, -795965, -843857, -878169, -924657, -1041924, -1131909, -1050775, -872404, -806315, -869293, -879106, -777294, -709989, -755795, -814235, -820903, -848058, -920293, -940184, -878308, -845178, -893907, -934951, -924604, -949326, -1032599, -1049045, -946640, -879101, -978460, -1140843, -1184250, -1102786, -1016185, -955680, -852704, -699032, -589405, -603802, -718452, -832910, -855845, -784642, -712458, -726347, -804844, -858945, -849958, -804429, -746708, -699979, -717910, -815299, -903315, -907074, -906843, -1022699, -1188946, -1208004, -1030371]
32653a030371K11084J01739J1647j7766n1112q3847o4386j8085M028K5908O6900
32642h44261N8424k9884r1254m4984K0691J1492J248Q0025J57421J03086k2498
32631f00494o4347j4376J5848j3241n8188r3311r0854j064J24678J20892m7098
32620g21555j75020j07789K7714M8974P36J0745L8431k21j7513Q4003J76759R8016
32608e36720n3029p7323j5942m4478j32096j05556K1026P7078M2796M1012O9136
32597g14096K1837n8756l9866K7409j9477j27043p2410J48395K70774J49600n7879
32586d71512j52608j14841j8616P1709Q1326j7904j12600p5174L2238N5678L190
32575g19114l230K7563m941n7011k962R8371P3047m6959n8004N3907Q1679l7594
$$ y = [-1030371, -819287, -717548, -705901, -723667, -774779, -858626, -923012, -941097, -937069, -911161, -844261, -785837, -815721, -906975, -951959, -931268, -919776, -918528, -838503, -681082, -577996, -600494, -664841, -679217, -663369, -676610, -734798, -828109, -918963, -920027, -795349, -674457, -721555, -896575, -1004364, -976650, -927676, -926940, -916195, -877764, -877985, -895498, -811495, -634736, -536720, -589749, -667072, -683014, -727492, -859588, -965144, -944118, -867040, -824244, -783232, -714096, -692259, -751015, -790881, -763472, -782949, -909992, -982402, -834007, -563233, -413633, -471512, -624120, -738961, -757577, -685868, -604542, -622446, -735046, -810220, -777982, -722304, -719114, -722344, -694781, -699722, -756733, -759695, -661324, -588277, -635236, -693240, -639333, -557654, -595248]
32563e95248j19999o3942k023l0576m3479M8392J47936J39233N2369k8496p2379
32552e68212o2536K141M1242j9393j00296q0445j9443n2943j12815k3446J44583
32541h51563J33371o2203j47112m68J32345N4096q4672p6370J8789L9825L337
32530h40625J3550N8550P1682N9583L1016n9220j74897j65937Q70J37824R8971
32519g68633o744r349O1175O9734J2278j3514M946n420n6600p5460j4664Q5716
32507g16535J39297R1370j9630q8551p2517m8472p5471q3294j2874L6422k6499
32496h76754p1782O4031K51222K09701m3205j89307q4118O3077N5120l0144m9831
32485g01990j8412J501K2029M0853J5777p897N5161J23082L1017j45083j41266
$$ y = [-595248, -715247, -779189, -781212, -811788, -855267, -806875, -658939, -519706, -467337, -495833, -568212, -630748, -628607, -587365, -606758, -707054, -787499, -806942, -859885, -972700, -996146, -851563, -718192, -780395, -927507, -927975, -795630, -741534, -826206, -902576, -883787, -843962, -840625, -827075, -768525, -696843, -637260, -606244, -665464, -840361, -1006298, -1005428, -867604, -768633, -775377, -784726, -723551, -653817, -641539, -655053, -650107, -655527, -712127, -787587, -802251, -716535, -577238, -485868, -505498, -594049, -666566, -715038, -790509, -873803, -886677, -850255, -876754, -948536, -884505, -633283, -423582, -466787, -656094, -740212, -677135, -622015, -652159, -701990, -720402, -718901, -696872, -656019, -640242, -648139, -592978, -469896, -438879, -583962, -725228]
32474g25228N6518J53588L0063o4676L6875J23739r239j92931j76210l0278K7609
32463g70170J720J8995M1557k9074r9860k1453J27583J52217N5724M356M2165
32452d76240O1347J3903l6843m7032k9436K332K3377l287m3154j3800M5867r616
32440e12582j68063k12226n6394Q8553M6083n2532k4303N1445J7741m5863L2353
32429h35788J89737K17256Q7046m6629j00579j05596p2547j1384l802p6970j00644
32418h59900J4291J31865R5091j2551j9400M2880K7494n3372p3600k3471K3773
32407g06900Q2665J75635J85540K1948j59902j48086J164O5885J455o1903p9516
32396f22015r6242p0545M2816J11997N641j24078l6291J79530K06455K89j50472
$$ y = [-725228, -668710, -515122, -485059, -549735, -512860, -389121, -398360, -591291, -767501, -797779, -770170, -768450, -749455, -707898, -736972, -836832, -858285, -730702, -578485, -522761, -518405, -476240, -414893, -400990, -437833, -484865, -514301, -511969, -488592, -491879, -535033, -548833, -502966, -512582, -680645, -892871, -949265, -860712, -814629, -867161, -891464, -840019, -822278, -868141, -835788, -646051, -428795, -341749, -388378, -488957, -594553, -667100, -678484, -682286, -759256, -859900, -845609, -713744, -618653, -631204, -650604, -607724, -580230, -633602, -707202, -730673, -706900, -624235, -448600, -263060, -241112, -401014, -549100, -547936, -482051, -480596, -542499, -622015, -718257, -788802, -745986, -633989, -628348, -752426, -788717, -609187, -402732, -402443, -552915]
32385e52915q7026K7447M0219K3073N3292N3492k6209q7150n7395m667J1849K9140
32373e76850N4412K7872l1315k0908M9923M5891o0916j31188r1469l7169l5762
32362h07479j9061M6430O7984L338m0152J3178P8210O3281J3606K40k506k7374
32350f10305k5170K9327N3595j1907q4216n8766K6197N4112O976k2578K6395J05199
32338e11141J20164L7034q0494j29834p5376J6561O0960L8933j9889q2898j06692
32327g32672n4873K7371L9368j8355k0406P5415J30231M8304m4559o037P4232
32316d81981L0369q7476j05044k6775k512m3175k2759N7099N8964k4867m3140
32305f91297M3838R0904J6089p9375r1774l8453L6857J13441J28156L2375p9748
$$ y = [-552915, -639941, -612494, -572275, -549202, -495910, -442418, -468627, -555777, -613172, -617839, -605990, -576850, -522438, -494566, -525881, -546789, -496866, -450975, -511891, -643079, -734548, -771717, -807479, -826540, -780110, -712126, -708788, -748940, -735762, -657552, -594271, -580665, -580425, -582931, -610305, -635475, -606148, -552553, -564460, -648676, -707442, -681245, -627133, -620157, -642735, -616340, -511141, -390977, -353943, -434437, -564271, -639647, -623086, -562126, -523193, -543082, -625980, -732672, -787545, -760174, -720806, -739161, -759567, -684152, -553921, -505617, -550176, -556213, -481981, -451612, -539088, -644132, -670907, -673419, -716594, -739353, -682254, -623290, -648157, -691297, -647459, -556555, -540466, -619841, -711615, -750068, -713211, -599770, -471614, -439239, -518987]
32294e18987p8779j9761m6689j05079j1131J89948K33687N9940p6796k2199N0810
32283c45036k2663j16963o4151N0700O1479K195l265J7096l3265j11219j11902
32272f76994o3469n8338o8590q461Q1721Q6975J4715j5378M0040J00362R4295
32261d73122L6261k4928n4141l7150L00P55n1562r6662p7255j2450M2512O7612
32249f79830P5636P7294P3939N4263k414p9993j04567l3522N8913O3531j9728
32238e16478j00111j22630q6313R593J21925J27688k2406j70236j37125O912N1432
32227h37749k2575m3029M0797R2476N2741K5156N3994N1002j108q02N8309N6537
32215d74251r933r18Q6208P3328o7025j19098N379Q7147l4162j79083j29275K0466
$$ y = [-518987, -597766, -617527, -664216, -769295, -780426, -590478, -356791, -296851, -373647, -395846, -345036, -367699, -484662, -548813, -498113, -436634, -434439, -437704, -420608, -453873, -565092, -676994, -740463, -798801, -867391, -875852, -794131, -707156, -692441, -707819, -667779, -567417, -473122, -436861, -461789, -515930, -553080, -552780, -552025, -603587, -700249, -777504, -789954, -747442, -679830, -604194, -526900, -452961, -398698, -401112, -481105, -585672, -619194, -560281, -496750, -516478, -616589, -739219, -825532, -815939, -694014, -566326, -588732, -758968, -896093, -889181, -837749, -860324, -903353, -862556, -770080, -717339, -692183, -638189, -587187, -588295, -589097, -530788, -474251, -484184, -485102, -398894, -325566, -392591, -511689, -506310, -419163, -453325, -632408, -761683, -741217]
32203g41217N0297k9637n5748k398L0686J8900J0102J2118K8616R5917J64934
32192d17430R7976r2631j87139q3672K7676j0115n2356O3402J89197J09238o9885
32181d25739q8605L5710P2110j7348n7666m905j1p8774j05961k4802O3934R7753
32169e34304J18956J28006O4933m5074j00463q4491o3385m3597Q645M1144j4891
32158e24521q6052n2073L8107M1777k3927j9059N2749M5450o0137j17897p0321
32147g75904j9329q269M6369J50212J71299O4035l7157l4454m195k8818n6033
32136e32244k8965r438n4412q8198j8694J04861J59614J13952L3920k7740o9406
32125d16750r6358j01843q4076n1853j9691m25J1922L8096P2608P7197M2587J1885
$$ y = [-741217, -690920, -720557, -776305, -778703, -748017, -729117, -719015, -706897, -678281, -582364, -417430, -319454, -412085, -599224, -682896, -655220, -665335, -717691, -654289, -465092, -355854, -425739, -514344, -478634, -406524, -423872, -481538, -486443, -486454, -565228, -671189, -695991, -632057, -534304, -415348, -287342, -222409, -267483, -367946, -452437, -515822, -559419, -550774, -509630, -524521, -610573, -662646, -624539, -582762, -606689, -625748, -572999, -527549, -587686, -705583, -775904, -795233, -803502, -757133, -606921, -435622, -371587, -408744, -443198, -447393, -476211, -532244, -561209, -570647, -625059, -713257, -731951, -627090, -467476, -353524, -319604, -347344, -416750, -513108, -614951, -699027, -750880, -770571, -770996, -759074, -720978, -648370, -571173, -528586, -516701]
32113e16701O861r486n0103n6651J292N7668N5787M0090N8527O6873L0340J7848
32101b97655P2285R1315j4373j40722j36385m4353j4537m9389l7106J9307K0633
32090e30980j7342R093P1573M0917o1731p3827K5042O5892k4227j06349p0579
32079f72518N335K3654J4458K2878P667n0106p3362j6710M6736M1748j0748o4880
32067g25848j06143r5560J2114J47004J58395K7426q8778q2424k3996l048J0114
32056g70744N8355R2660P2591N3085P5234Q0440K4530l2207m1013n8316j21351
32045e66736j41196m1808Q5574R8828J1228m5214j7162L0132M3859M0935L5653
32034d65907M049n8980j06313q7311q213O5102O5754Q0m7074j1275O2202P4770
$$ y = [-516701, -509840, -519326, -569429, -626080, -624788, -567120, -511333, -471243, -412716, -345843, -315503, -297655, -225370, -134055, -148428, -289150, -425535, -469888, -484425, -533814, -570920, -551613, -530980, -548322, -539229, -467656, -426739, -488470, -562297, -537255, -471363, -495590, -601939, -672518, -667183, -643529, -629071, -606193, -598526, -648632, -721994, -738704, -691968, -650220, -660968, -725848, -831991, -927551, -915437, -768433, -610038, -582612, -671390, -753814, -777810, -780858, -770744, -712389, -619729, -547138, -494053, -418819, -338379, -313849, -346056, -387069, -445385, -566736, -707932, -749740, -664166, -565338, -554110, -599324, -616486, -586354, -542495, -501560, -465907, -461858, -520838, -627151, -714462, -722675, -657573, -591819, -591739, -638813, -650088, -587886, -513116]
32022e13116P104o3736p2981l0426K3013N6114M5233n684m4452k6864J8469L7201
32010e70125L1473K8185R180l9848n9328j597O0543L5284k4183k967O7898N8988
31998d06497k1835l3399M7045P3240k3435j22036j14537n3361j9400M942M6806
31987f22467O3817L7523K4312M1369K2710m6383p8385l2939J2082M466k453J8939
31975e57409N362n2062m9490M4884R6799J2598r7231q9534j578M2997L4641M2569
31963e67454O2451L7238k6622p5135q7327n7253L2652J41118J56748M4126q2542
31952d22000j11650o6770j2647N2497J14581Q2250o3390j69323j04760L5581O6657
31941e98974k5341j00631q0624m724P4575J21769R1431o756o4407r502P1661O1061
$$ y = [-513116, -506012, -569748, -642729, -673155, -650142, -594028, -548795, -554479, -598931, -625795, -607326, -570125, -538652, -510467, -501287, -541135, -600463, -602060, -541517, -506233, -530416, -533383, -465485, -406497, -428332, -461731, -414686, -341446, -364881, -486917, -601454, -654815, -674215, -669273, -622467, -558650, -521127, -496815, -455446, -432736, -479119, -557504, -590443, -578361, -573895, -576348, -557409, -552047, -604109, -653599, -608715, -511916, -499318, -596549, -686083, -687661, -644664, -610023, -567454, -505003, -467765, -494387, -569522, -656849, -714102, -681450, -540332, -383584, -339458, -422000, -533650, -600420, -613067, -560570, -445989, -363739, -427129, -596452, -701212, -665631, -598974, -624315, -724946, -805570, -810294, -735719, -613950, -522519, -529275, -593682, -603184, -531523, -470462]
31929d70462r978l2806o873j0137l7905k1338K8560M0011J8642K9825O3885N1049
31917c57527n736l8747l7615m0470k8886L3254P7857J715j40887j68605k6337
31906g31984J27133J30021M531j11767j25188l5337Q7749J35882N0163q8461j29538
31895f86796m3843L7525J5007l6664Q393J25443J64407O7493l9340k0896P0054
31884c39217O5165o3588j41160m1246J10490J09312k5748q9895r019P3943N6045
31873b94918J7501K8749P443j02271j73666q6632N3643O7636k1414m6781K8363
31862e22347Q2966N3250L371j3191j5294j5860n997j0818n1448p4938l3046J0770
31850e92582j8160m7920L7253J70592J64826K535j22034q4448K0797O2975M0126
$$ y = [-470462, -480440, -513246, -520119, -530256, -568161, -589499, -560939, -520928, -502286, -472461, -408576, -357527, -363263, -402010, -439625, -480095, -508981, -475727, -397870, -396155, -537042, -705647, -731984, -604851, -474830, -470299, -582066, -707254, -742591, -654842, -518960, -468797, -557258, -686796, -730639, -693114, -678107, -714771, -706378, -580935, -416528, -349035, -388375, -409271, -339217, -274052, -337640, -478800, -520046, -409556, -300244, -325992, -415887, -424906, -350963, -294918, -277417, -248668, -241225, -343496, -517162, -603794, -550151, -482515, -503929, -550710, -522347, -439381, -386131, -382760, -395951, -411245, -427105, -433102, -443920, -495368, -570306, -603352, -592582, -610742, -658662, -621409, -450817, -285991, -283456, -405490, -489938, -469141, -406166, -366040]
31839c66040p786r1130j80523j63454q418J33741J13909r372o6246j3217N1325
31828f07211O7469P2959Q2605L8615p1471j43070p7746P0465J51356J06111K2093
31817b87825r120o596k6736m9392k4361J3271j4436q1838p7502J1468N8486o352
31805e00933p8199l8299O8423J18783R3287N8049K6534l4044r0374o4012L2981
31794d07804Q7697L2981o9081j11064n8236L0123O6417K0151m9147o1551j7982
31783e37496J4890J7851L4824O0597K3025p3039j01481N88J09042Q0447m2428
31772d13180j07961o6824J1536O9733Q7138K8732j01722j94874j46137p968P7425
31761g64102O8787M2011M5495N0377K8367j5189o6740q8838k5709R6290J43736
$$ y = [-366040, -373826, -464956, -645479, -808933, -817351, -683610, -569701, -579073, -645319, -658536, -607211, -539742, -466783, -384178, -345563, -417034, -560104, -637850, -567385, -416029, -309918, -287825, -296945, -303541, -330277, -379669, -404030, -390759, -405195, -487033, -564535, -553067, -494581, -500933, -579132, -617431, -549008, -430225, -336938, -278889, -252355, -286399, -376773, -440785, -407804, -320107, -287126, -356207, -467271, -525507, -495384, -428967, -408816, -457963, -519514, -537496, -522606, -504755, -469931, -409334, -386309, -459348, -560829, -560241, -451199, -370752, -413180, -521141, -587965, -576429, -506696, -419558, -390826, -492548, -687422, -833559, -841527, -764102, -695315, -653304, -607809, -557432, -529065, -544254, -610994, -699832, -725541, -629251, -485515]
31750d85515N2055n3164l4782L9099J3620q6828r9236K781P0665K7424k9005p965
31738e90851M3630M8085J1252k2593l4743j3223M7556J03917R4125K5399l4689
31727c22135m8372k7706Q596K9217j4582j05850j30295k5692R9907J12317M4383
31716c80212J3277J8303j7927o7011l5988M5251O2534K0177J8279M5286n705j11861
31704c95597j20862o231P6263L6389k9318k2588J8358K9704K1170N171l6031o6369
31692d89941j6343P5583Q5248Q83n1521j6774J3965j9656n5059m5320l5194m3108
31680e97237j8039L4148L5557l968K2007J10624J15189p506r6666l4653P2318
31669c68226P5686j421n2626o0775n9393l1047L8673R1553P6115K1612l0117p7108
$$ y = [-485515, -433460, -486624, -521406, -482307, -468687, -555515, -654751, -651970, -581305, -553881, -582886, -590851, -547221, -499136, -487884, -510477, -545220, -558443, -510887, -406970, -312845, -287446, -322135, -370507, -398213, -389617, -360400, -374982, -480832, -611127, -636819, -536912, -424595, -380212, -366935, -348632, -366559, -433570, -469558, -424307, -361773, -341596, -323317, -278031, -283736, -395597, -516459, -522690, -446427, -410038, -439356, -461944, -443586, -413882, -392712, -387541, -423572, -489941, -506284, -430701, -345453, -344570, -396091, -412865, -398900, -418556, -473615, -518935, -554129, -597237, -615276, -581128, -545571, -549539, -527532, -416908, -301719, -309225, -405891, -440544, -368226, -292540, -293961, -346587, -407362, -466755, -497802, -459129, -367576, -291461, -269849, -299966, -377074]
31657c77074r5632l8338N7257P9066O520o0620p4447q6835q7911J4668J84495
31646d78851K24993O7470r7061r9898k6955k4115m8006R138R1325P2071k5335
31635c35224q1025p3093n8257l3088L0965P9593M9505o320r28L5926J7418m4989
31623d19517p0966m7659k0020R278O0785J01719Q8326M3490O971l8724j07912
31612c94229j38278p3073L2143P4956M0330m268r520K1114N9152O8258L3229p212
31600b97398r585l455l8284p0887k5769M7612L0947n3444o9088r706p261o6155
31588e72473l0562J13569J58773J1252j41127j36083p1295p0032n5142M6745J06021
31577f40354K3255m4870N9164J94678J42045l3721j07103m9860J309J9907O3889
$$ y = [-377074, -472706, -511044, -453787, -374721, -368201, -428821, -503268, -590103, -678014, -663346, -478851, -253858, -186388, -283449, -383347, -410302, -434417, -482423, -473285, -381960, -309889, -335224, -416249, -489342, -547599, -580687, -549722, -470129, -420624, -426944, -427872, -391946, -374528, -419517, -490483, -538142, -558162, -548884, -488099, -386380, -298054, -254564, -247593, -286317, -394229, -532507, -605580, -573437, -498481, -458151, -462419, -471939, -450825, -391673, -323415, -290186, -297398, -306983, -310438, -348722, -419609, -445378, -397766, -366819, -420263, -489351, -499057, -506318, -572473, -603035, -489466, -330693, -319441, -460568, -596651, -667946, -737978, -793120, -746375, -640354, -617099, -661969, -602805, -408127, -266082, -299803, -406906, -456766, -455457, -435550, -371661]
31566c71661P2784l8654j59525j16599L2676Q8055K3910k7423m3764j03021j53298
31555g96520o2259J20223J97728J20589J8273m3387j07279j42837n8626R2984
31545f61111J44051O1463k6362n4506p7067r9474n4017M7337J12760J20766J09703
31534c76457N4665o5559j33167l3697J13204R3530o6742j46945q3820k3057k7838
31523f95883j601P8059J04246N6761L6044M7411j2660j19683j12320L0355J35422
31512d53849J12260N6359L0722k1012q8733o4677L3500M5906n0149q4181M310
31501d79544N9639P922Q4J17186J82141M7359j38494j53645l2459K8660k4014
31490c85165p9614o8307k6545M06L350j3230k6577o570L3358N1574N2519O6260
$$ y = [-371661, -298877, -337531, -497056, -613655, -580979, -492924, -469014, -496437, -540201, -643222, -796520, -858779, -738556, -540828, -420239, -401966, -445353, -552632, -695469, -754095, -661111, -517060, -455597, -481959, -536465, -613532, -713006, -767023, -719686, -606926, -486160, -376457, -321792, -387351, -520518, -554215, -441011, -347481, -414223, -561168, -644988, -668045, -695883, -697484, -619425, -515179, -458418, -422374, -374963, -387623, -507306, -619626, -589271, -453849, -341589, -285230, -254508, -275520, -364253, -428930, -395430, -349524, -399673, -483854, -479544, -419905, -411983, -411899, -294713, -112572, -65213, -203707, -357352, -389811, -361151, -385165, -464779, -533086, -559631, -559225, -555875, -569105, -595682, -602252, -568894, -517320, -464801, -398541]
31478c98541O4128K809o2596m1429L1072M4397O822J5125M4301k8154j75920k16263
31466g14249q8049O3945J23032J19666Q3951m938q0879k9310Q6143P1717o6503
31455d35474r9507M0714J32333L6593p6862l6230N5554L7706l6590m3953j5847
31444d41563k4202j1557P3482J23902M2677p3246q9883m7174m9681p4404m9689
31433f21338r611j7007l6721j5768J6270L2707P0633J14660P3175l4525m6736
31422d74261P3428J34847J6973j27708j25395m0261j1683k0748r23j787n5271
31411f32789n2143O1281J38276P0726j2183K0038O3076m403p1475j0185N8856
31400c70925j0681r2803j5937Q8555K101j61840j20919R1296J80070P8673R390
$$ y = [-398541, -334413, -331604, -394200, -435629, -404557, -360160, -353338, -338213, -293912, -322066, -497986, -714249, -802298, -738353, -615321, -495655, -411704, -416642, -497521, -526831, -440688, -368971, -435474, -534981, -494267, -361934, -325341, -402203, -438433, -382879, -345173, -381763, -425716, -441563, -465765, -477322, -403840, -279938, -237261, -310507, -400390, -447564, -497245, -571649, -621338, -630949, -647956, -684677, -700445, -684175, -651468, -580835, -466175, -393000, -427525, -474261, -400833, -265986, -249013, -376721, -502116, -542377, -554060, -574808, -575731, -577518, -632789, -684932, -623651, -485375, -414649, -426832, -406794, -343718, -348121, -419596, -429781, -370925, -381606, -474409, -490346, -401791, -399690, -561530, -682449, -591153, -411083, -332410, -323020]
31389c23020O1826P3688k5489q5844l0229J5599k4371n0352n974R045n6091r3378
31377e34590l3810K5155p366o7062n5414J4491P6129J12871J35986J37816J12156
31366h3638O3707j1419r6737j29078p4075L971K3030r076l9439n6498n4111L195
31354d60168Q8615R0889j2604q0979k6139L6904j224m3867K2092R5701M0501n0823
31342c01102j6857P3279M6287n6721o6091J605N75n0450k6076K5247l0896j08310
31330e09510j5400J64223J62479j2746p9522L0717P0914o3705j53772n6710N7972
31319d05060L2890k5848O496N0565K0132j565M9117P3540J2039k7792J1300J1475
31307a92711p9630j10871M903J05559M3458o9850p3590k2599m0220p5129j5862
$$ y = [-323020, -261194, -187506, -212995, -298839, -329068, -313469, -337840, -388192, -394166, -385121, -441212, -534590, -568400, -543245, -550611, -617673, -673087, -658596, -582467, -469596, -333610, -195794, -83638, -19931, -31350, -128087, -257165, -331240, -327269, -304239, -313315, -352754, -409252, -463363, -460168, -371553, -280664, -293268, -374247, -400386, -363482, -364706, -408573, -386481, -290780, -250279, -301102, -317959, -244680, -198393, -255114, -321205, -319600, -319025, -369475, -395551, -370304, -401200, -509510, -524910, -360687, -198208, -210954, -290476, -259759, -188845, -252550, -406322, -463032, -405060, -372170, -398018, -391522, -340957, -320825, -322390, -273273, -199733, -187694, -215486, -204186, -192711, -272341, -383212, -378309, -272750, -229292, -299142, -372732, -395331, -435551, -510680, -526542]
31296e26542Q7469J15022P8413N4381K6992m0277q4599n3829k8528q1637j26539
31285e79674n9459N3924R0292O4708N8694N2340p965o2122k4919M5641K9261n8057
31273c97336r2753l2928M7576Q1374O0498N643l3843j382P4275P9148k3753j19190
31261c52671j00826j1201N6042Q4965Q3646K1586p8948j08167l2130L1655J1750
31250c94299J3386J13472J74799N0210j47488j89853o6944L5028L7622L3901O4463
31239b75703M5567m5524r5696l1513O4039P7915J4339m4296n5537m1875l4524
31228d22808l0484m71O2994J10124Q0087r665p0058n3242j095L6614N9217O2925
31216a75862J6070o9134j18910r8732n6568k7152J7318P6425Q2026J0901n5744
$$ y = [-526542, -439073, -324051, -245638, -191257, -164265, -204542, -289141, -342970, -371498, -453135, -579674, -639133, -585209, -494917, -430209, -371515, -319175, -327140, -389262, -414181, -368540, -339279, -397336, -490089, -523017, -475441, -394067, -333569, -327926, -361769, -363151, -288876, -209728, -233481, -352671, -453497, -464698, -408656, -323691, -240045, -218459, -297407, -405574, -437704, -406049, -394299, -380913, -267441, -92642, -42432, -189920, -379773, -446717, -411689, -374067, -340166, -275703, -230136, -275660, -371356, -402869, -338830, -260915, -246576, -290872, -346409, -388284, -422808, -453292, -453763, -390769, -280645, -200558, -210223, -280281, -333523, -334618, -298004, -238787, -175862, -159792, -228926, -347836, -446568, -503136, -530288, -512970, -436545, -354519, -343618, -399362]
31205c99362m8438J398M0389O3306N4782k2189j17309j00207M3058J47546R5320
31194b41706k2339o8012n0835l8462r290O4001R7457J8875q2563q0727n856L1991
31182c87466K9701M6192M8546k7040j18069j11505l7978k2241o5002m4578O4021
31171f25419J33246P7811k2181l8398M7875J37564J18297k1765j55927j35870
31161d84767J8777J21905O6414l0934k0230N1653L8082n7575r2088j5114N9651
31150c44226K9422o4810j06780l7669R1616J64141J08786j1240o7693l5489o410
31139b80352j7860K771P0239O9349n0652j52714j11995j2915p68m8711l2840N1335
31127e15113J08952J08516P4329q162j28628j70336n1115J20811J82608J34894
$$ y = [-399362, -447800, -446402, -406013, -342707, -287925, -310114, -427423, -527630, -484572, -337026, -241706, -264045, -332057, -382892, -421354, -430644, -366643, -269186, -250311, -332874, -413601, -419457, -387466, -357765, -311573, -263027, -290067, -408136, -519641, -557619, -579860, -644862, -689440, -625419, -492173, -414362, -436543, -474941, -427066, -289502, -171205, -192970, -348897, -484767, -465990, -344085, -277671, -308605, -328835, -277182, -239100, -296675, -388763, -403877, -344226, -314804, -379614, -486394, -524063, -432447, -268306, -159520, -170760, -238453, -273942, -280352, -298212, -295441, -225202, -155853, -206505, -359219, -471214, -484129, -484897, -533608, -566448, -515113, -406161, -297645, -223316, -231478, -360106, -530442, -581557, -460746, -278138, -143244]
31117a43244P4386L537j10860j77374r1252N0302O1212l9377o4379K6110P2775
31106c38164l02o6050j6024P4910Q1450j935q7958j04296l7841N9269R9485N3015
31094b84441j1936l5005m7369p9193p2229J6164J13147J43173J40739J39666P7019
31083I9735n8362j28145n9924l250p8330j42952m7353O0169k0117j50851p0083
31072e99463J31407J41820l5462r9885J3099N6033l9290m2289J07878J50621k4057
31061b39588j57511p0836M3290j172o3746J2962R4622L3839k8334O4584J60546
31050a51344N7787j24794j49650n4761l4159p6024l4355N7219N2793j2726Q126
31039d61888Q4286O7780j0301J0458J08113R7607m2298j26761p0061R234K2210
$$ y = [-143244, -68858, -65321, -176181, -353555, -444807, -394505, -333293, -372670, -437049, -410939, -338164, -338466, -404516, -420540, -345630, -264180, -266115, -354073, -458369, -496210, -436941, -337456, -284441, -296377, -331382, -378751, -457944, -530173, -514009, -400862, -257689, -116950, 22716, 99735, 41373, -86772, -146696, -149946, -228276, -371228, -418581, -358412, -378529, -529380, -599463, -468056, -326236, -361698, -461583, -448484, -392451, -431741, -474030, -366152, -215531, -239588, -397099, -467935, -424645, -425817, -489563, -476601, -381979, -348140, -376474, -311890, -151344, -93557, -218351, -368001, -422762, -456921, -532945, -567300, -510081, -457288, -470014, -461888, -377602, -309822, -320123, -309665, -201552, -103945, -146243, -273004, -343065, -333831, -311621]
31028c11621K4926N3799N0437P313O314N4599M9433l5182q5466l6576K2242M949
31016a94833l8961l0543R157J8435q70j1914q110Q206M8282Q7584O0265m0982
31004i4284j18564q6230J2191O3285L2708j2138j6105n208k1591m2015j2219N3245
30992b46925O6670j2937j04036r7118J665Q0692O7118J310l4206n186O0807J03824
30980a18322P4526q171n7395k7891Q071k8926q1556l9966N4113M0294j03451j95298
30968d83972j05092O3219J32729Q2212J4103j2398q198J8540N7853O1328m355
30957a84031r3874j33632j06072m1400L1985Q7374R4457N3201j939m7210p3227
30946d14368n0790K8634Q3079J7304j15786j49556l3091R3854J03903M1761J7547
$$ y = [-311621, -286695, -232896, -182459, -175146, -168832, -114233, -64800, -99982, -185448, -222024, -199782, -194833, -233794, -264337, -255180, -236745, -237615, -249529, -257639, -249433, -201151, -113567, -53302, -94284, -212848, -299078, -286887, -223602, -190894, -203032, -219137, -224345, -245936, -287951, -300170, -246925, -180255, -193192, -297228, -394346, -392681, -311989, -244871, -243561, -277767, -282953, -222146, -118322, -43796, -51967, -109362, -137253, -129182, -158108, -239664, -279630, -225517, -185223, -288674, -483972, -589064, -525845, -393116, -310904, -296801, -309199, -317397, -298857, -241004, -179676, -184031, -277905, -411537, -517609, -559009, -527024, -439650, -345193, -291992, -293931, -341141, -414368, -465158, -436524, -353445, -336141, -451927, -601483, -634574, -540720, -436817, -395056, -377509]
30935c77509M7839P5255O1285L251o4767o2427M6419J44339P8870r0660j36389
30924b74494J977J18608O3116m2411l8163J2299l0045j22052j22413l0079M1335
30913d22322N1433L8636Q580m0276m9182J1445N8472K3026k6342r979J6126k1973
30901c62356n8996q496O1809M3181j6925j1284J8604k9992r2204j4522J62667
$$ y = [-377509, -329670, -254415, -193130, -189879, -254646, -317073, -270654, -126315, -47445, -138105, -274494, -272517, -153909, -90793, -133204, -171367, -159068, -189113, -311165, -433578, -463657, -422322, -370889, -332253, -323673, -363949, -413131, -401686, -343214, -320188, -346530, -356509, -340383, -362356, -421352, -429848, -368039, -324858, -341783, -353067, -334463, -364455, -456659, -471181, -308514]
$$ [...]
##END NTUPLES=NMR SPECTRUM
##END=
