##TITLE=31Pdec_LY-TMF-8.70.3
 D2O, 24 sc
 3.3.2020
##JCAMPDX= 6.0         $$ Bruker NMR JCAMP-DX V2.0
##DATA TYPE= NMR SPECTRUM
##DATA CLASS= NTUPLES
##ORIGIN= UXNMR, Bruker Analytische Messtechnik GmbH
##OWNER= root
$$ XWIN-NMR		Version 3.5
$$ Tue Mar  3 13:47:40 2020 Russian Standard Time (UT+4h)  she@DPX200
##.OBSERVE FREQUENCY= 81.013821
##.OBSERVE NUCLEUS= ^31P
##.ACQUISITION MODE= SIMULTANEOUS
##.ACQUISITION SCHEME= undefined
##.AVERAGES= 24
##.DIGITISER RES= 17
##SPECTROMETER/DATA SYSTEM= spect
##.PULSE SEQUENCE= zgpg30
##.SOLVENT NAME= CDCl3
##.SHIFT REFERENCE= (INTERNAL, CDCl3, 0, 182.463)
##AUDIT TRAIL= $$ (NUMBER, WHEN, WHO, WHERE, WHAT)
$$ ##TITLE= Audit trail, XWIN-NMR		Version 3.5
$$ ##JCAMPDX= 5.01
$$ ##ORIGIN= Bruker BioSpin GmbH
$$ ##OWNER= she
$$ F:/spectra/data/she/nmr/P31/1/pdata/1/auditp.txt
$$ ##AUDIT TRAIL=  $$ (NUMBER, WHEN, WHO, WHERE, WHAT)
(   1,<2020-03-03 13:46:36.85 +0400>,<she>,<DPX200>,
      <created by zg, POWCHK disabled, PULCHK disabled
       configuration hash MD5:
       00 E9 B6 7A A2 85 ED C7 34 08 36 98 17 FE 4E 26
       data hash MD5: 32K
       D1 C8 3B 76 1E 14 88 D9 7C 13 B5 C7 86 E7 58 CE>)
(   2,<2020-03-03 13:46:39.15 +0400>,<she>,<DPX200>,
      <Start of raw data processing
       efp BC_mod = 2 LB = 1 FT_mod = 6 PKNL = 1 PHC0 = -1460.61 PHC1 = 359.6017 SI = 64K 
       data hash MD5: 64K
       03 21 12 A3 08 BB 39 BD 5A 1D 20 09 39 09 16 A1>)
(   3,<2020-03-03 13:46:53.96 +0400>,<she>,<DPX200>,
      <pk PHC0 = 0.9151643 PHC1 = 0 
       data hash MD5: 64K
       F0 5F 89 9D C5 18 F1 3F 7E 8F 5D 2F BC 87 B9 0A>)
(   4,<2020-03-03 13:47:12.01 +0400>,<she>,<DPX200>,
      <pk PHC0 = -4.800001 PHC1 = 0 
       data hash MD5: 64K
       F2 BD 0A FD 71 5D E8 B5 38 F2 F7 8F F9 E4 A0 27>)
$$ ##END=
$$ 
$$ hash MD5
$$ 19 F4 2B 9C 28 32 C0 4F C7 26 BF C9 C3 FD 1D EF
##$RELAX= 
##$RELAX= 
##$RELAX= 
##$RELAX= 
##$RELAX= 
##$RELAX= 
##$RELAX= 
##$RELAX= 
$$ Bruker specific parameters
$$ --------------------------
##$DU= <F:/spectra>
##$EXPNO= 1
##$NAME= <P31>
##$PROCNO= 1
##$TYPE= <nmr>
##$USER= <she>
##$AMP= (0..31)
100 100 100 100 100 100 100 100 100 100 100 100 100 100 100 100 100 100 
100 100 100 100 100 100 100 100 100 100 100 100 100 100 
##$AQSEQ= 0
##$AQ_mod= 1
##$AUNM= <au_zg>
##$AUTOPOS= <>
##$BF1= 81.014009
##$BF2= 200.13
##$BF3= 200.13
##$BF4= 200.13
##$BF5= 200.13
##$BF6= 200.13
##$BF7= 200.13
##$BF8= 200.13
##$BYTORDA= 1
##$CFDGTYP= 0
##$CFRGTYP= 5
##$CHEMSTR= <none>
##$CNST= (0..31)
1 1 145 1 1 1 1 1 1 1 1 1 1 1 1 1 1 1 1 1 1 1 1 1 1 1 1 1 1 1 1 1 
##$CPDPRG= <waltz16>
##$CPDPRG1= <>
##$CPDPRG2= <waltz16>
##$CPDPRG3= <>
##$CPDPRG4= <mlev>
##$CPDPRG5= <mlev>
##$CPDPRG6= <mlev>
##$CPDPRG7= <mlev>
##$CPDPRG8= <mlev>
##$CPDPRGB= <>
##$CPDPRGT= <>
##$D= (0..31)
0 1 0 0 0 0 0 0 0 0 0 0.03 2e-05 3e-06 0 0 0 0 0 0 0 0 0 0 0 0 0 0 0 0 
0 0 
##$DATE= 1583228796
##$DBL= (0..7)
120 120 120 11 120 120 24 19 
##$DBP= (0..7)
150 150 150 150 150 150 150 150 
##$DBP07= 0
##$DBPNAM0= <>
##$DBPNAM1= <>
$$ [...]
##$SUBNAM2= <"">
##$SUBNAM3= <"">
##$SUBNAM4= <"">
##$SUBNAM5= <"">
##$SUBNAM6= <"">
##$SUBNAM7= <"">
##$SUBNAM8= <"">
##$SUBNAM9= <"">
##$SW= 369.568048894756
##$SWIBOX= (0..15)
0 1 3 0 0 0 0 0 0 0 0 0 0 0 0 0 
##$SW_h= 29940.119760479
##$TD= 32768
##$TD0= 1
##$TE= 0
##$TE2= 300
##$TE3= 300
##$TEG= 300
##$TL= (0..7)
0 120 53 12 22 120 120 120 
##$TP= (0..7)
150 150 150 150 150 150 150 150 
##$TP07= 0
##$TPNAME0= <>
##$TPNAME1= <>
##$TPNAME2= <>
##$TPNAME3= <>
##$TPNAME4= <>
##$TPNAME5= <>
##$TPNAME6= <>
##$TPNAME7= <>
##$TPOAL= (0..7)
0.5 0.5 0.5 0.5 0.5 0.5 0.5 0.5 
##$TPOFFS= (0..7)
0 0 0 0 0 0 0 0 
##$TUNHIN= 0
##$TUNHOUT= 0
##$TUNXOUT= 0
##$USERA1= <user>
##$USERA2= <user>
##$USERA3= <user>
##$USERA4= <user>
##$USERA5= <user>
##$V9= 5
##$VALIST= <valist>
##$VCLIST= <CCCCCCCCCCCCCCC>
##$VD= 0
##$VDLIST= <DDDDDDDDDDDDDDD>
##$VPLIST= <PPPPPPPPPPPPPPP>
##$VTLIST= <TTTTTTTTTTTTTTT>
##$WBST= 1024
##$WBSW= 4
##$XGAIN= (0..3)
0 0 0 0 
##$XL= 0
##$YL= 0
##$YMAX_a= 9820
##$YMIN_a= -10313
##$ZGOPTNS= <>
##$ZL1= 120
##$ZL2= 120
##$ZL3= 120
##$ZL4= 120
##$ABSF1= 0
##$ABSF2= 0
##$ABSG= 0
##$ABSL= 0
##$ALPHA= 0
##$AQORDER= 0
##$ASSFAC= 0
##$ASSFACI= 0
##$ASSFACX= 0
##$ASSWID= 0
##$AUNMP= <proc_1d>
##$AZFE= 0.1
##$AZFW= 0.5
##$BCFW= 0
##$BC_mod= 2
##$BYTORDP= 0
##$COROFFS= 0
##$CY= -3
##$DATMOD= 1
##$DC= 0
##$DFILT= <>
##$DTYPP= 0
##$F1P= 0
##$F2P= 0
##$FCOR= 1
##$FTSIZE= 65536
##$FT_mod= 6
##$GAMMA= 0
##$GB= 0
##$INTBC= 1
##$INTSCL= 5.30512e-09
##$ISEN= 30
##$LB= 1
##$LEV0= 0
##$LPBIN= 0
##$MAXI= 10000
##$MC2= 0
##$MEAN= 0
##$ME_mod= 0
##$MI= 50
##$NCOEF= 0
##$NC_proc= -5
##$NLEV= 6
##$NOISF1= 182.463
##$NOISF2= 159.3651
##$NSP= 0
##$NTH_PI= 0
##$NZP= 0
##$OFFSET= 182.463
##$PC= 4
##$PHC0= -1464.495
##$PHC1= 359.6017
##$PH_mod= 1
##$PKNL= yes
##$PPARMOD= 0
##$PSCAL= 0
##$PSIGN= 0
##$REVERSE= no
##$SF= 81.0140089999434
##$SI= 65536
##$SIGF1= 159.3651
##$SIGF2= -187.1042
##$SINO= 113.3802
##$SIOLD= 16384
##$SREGLST= <1H.CDCl3>
##$SSB= 0
##$STSI= 65536
##$STSR= 0
##$SW_p= 29940.119760479
##$SYMM= 0
##$S_DEV= 0
##$TDeff= 32768
##$TDoff= 0
##$TI= <>
##$TILT= no
##$TM1= 0
##$TM2= 0
##$TOPLEV= 0
##$USERP1= <user>
##$USERP2= <user>
##$USERP3= <user>
##$USERP4= <user>
##$USERP5= <user>
##$WDW= 1
##$XDIM= 65536
##$YMAX_p= 498736615
##$YMIN_p= -24936710
$$ End of Bruker specific parameters
$$ ---------------------------------
##NTUPLES= NMR SPECTRUM
##VAR_NAME=  FREQUENCY,     SPECTRUM/REAL,   SPECTRUM/IMAG
##SYMBOL=    X,             R,               I
##VAR_TYPE=  INDEPENDENT,   DEPENDENT,       DEPENDENT
##VAR_FORM=  AFFN,          ASDF,            ASDF
##VAR_DIM=   65536,         65536,           65536
##UNITS=     HZ,            ARBITRARY UNITS, ARBITRARY UNITS
##FACTOR=    0.456856943014862, 1,           1
##FIRST=     14782.0589164792, 0,            0
##LAST=      -15158.0608439998, 0,           0
##MIN=       -15158.0608439998, -24936710,   0
##MAX=       14782.0589164792, 498736615,    0
$$ Real data points
##PAGE= N=1
##DATA TABLE= (X++(R..R)), XYDATA
$$ [...]
36784E74869k30053j65930J13536j28508n79550l14169N05299P97672L22652j03667
36774G92151j05141r0862j04784K62235P18008M57340l07284m51015J55881L54989
36764A681518k70487o39131r0675M64037J88114k92370k00212l8453m78253r01954
36754e77866m55947K59609M1749q72601j071303r1978J007145J231240P31123
36745B01171J64767j45373j98447r3995l0984j56798l84361n80714p13621n75230
36735b513585J68347J227942J567535O99300l96964m61932L30675P51867L14353
36726A687538l03134m97688l89057j81477J54378L91021J20957m32067n00149
36717E0322L2065L11848j99268q54194p57756j2658N36975M28571n4177l82471
$$ plain form
36784 574869 344816 178886 292422 163914 -415636 -729805 -224506 573166 895818 792151
36774 792151 687010 596148 491364 753599 1471607 1928947 1621663 1170648 1326529 1681518
36764 1681518 1411031 771900 681225 1145262 1333376 1041006 840794 802341 324088 -577866
36754 -577866 -1033813 -774204 -732455 -1605056 -2676359 -2768337 -1761192 -529952 201171
36745 201171 365938 220565 22118 -71877 -102861 -259659 -644020 -1224734 -1938355 -2513585
36735 -2513585 -2345238 -1117296 450239 1149539 752575 290643 621318 1373185 1687538
36726 1687538 1384404 886716 497659 316182 470560 861581 982538 550471 50322
36717 50322 82387 394235 194967 -659227 -1416983 -1429641 -892666 -464095 -518272 -900743
36707i00743k52367K46081O54681N58402J33202m6704J13069L7706n50841j041160
36697a048674p92650j11739K55516K46711L61588O21176M94828o3231l16472J72602
36687a80345P89084O84117p1269o98454q28865p98532q52168o75773k478P47618
36677a887065Q96284M29703M2296K07370N89453N77433J03608l78043n58044n48732
36667e25737n25842m51082k52317m927K10562M21333N90740N36966K05776j41499
36657F3973k27122j35467j76736m25020n83531l15895L79465J081235J208299
36648H69201N61688l01137n20344Q006L59659k11818j093406r99835K35822J338398
36638B46234J262187M42806n6442n950K4878k71613o39566q09833p12779k91520
$$ plain form
36707 -900743 -1153110 -907029 -252348 306054 439256 392552 505621 543327 -7514 -1048674
36697 -1048674 -1841324 -1953063 -1697547 -1450836 -1089248 -468072 26756 -36475 -352947 -180345
36687 -180345 608739 1292856 1221587 523133 -305732 -1104264 -1956432 -2632205 -2634683 -1887065
36677 -1887065 -990781 -561078 -518782 -311412 278041 855474 959082 581039 22995 -525737
36667 -525737 -1051579 -1502661 -1754978 -1759905 -1549343 -1128010 -537270 -304 205472 63973
36657 63973 -163149 -298616 -475352 -900372 -1483903 -1799798 -1420333 -339098 869201
36648 869201 1430889 1129752 609408 617414 977073 765255 -328151 -1327986 -1092164 246234
36638 246234 1508421 1951227 1894785 1888835 1913713 1642100 1002534 192701 -520078 -811598
36628h11598L05319N30058R9142l39062K030P26778P24125l0086l39983K12265
36618A078988M51492m30114j315720p96652N20240Q57341k0155n58931Q4528Q45255
36608G16272N13872n49481j156283q45206j4575Q03352J169337Q23003J18211
36599A578502j56530J10915N0672q05905j548645j129863n54N23548J79680q2827
36589a281007K31612M93881J71942k97580l33683j21832j18260k09860J959M26142
36579a036686N94535L98632K10164K85054M24882K94541j47375n99936p18299
36570b94488m69739j90460j76999k66976q2641L19380M54977K00683O1274K97678
36560a47311L24674l63827j060872n93074Q27640J552922O80620o67653r56793
$$ plain form
36628 -811598 -506279 23779 122921 -216141 -214111 512667 1236792 1206706 866723 1078988
36618 1078988 1530480 1100366 -215354 -1012006 -491766 365575 345420 -213511 -128983 716272
36608 716272 1230144 680663 -475620 -1320826 -1335401 -532049 637288 1460291 1578502
36599 1578502 1421972 1532887 1583559 777654 -770991 -1900854 -1901408 -1377860 -1198180 -1281007
36589 -1281007 -1049395 -555514 -383572 -681152 -1014835 -1136667 -1254927 -1464787 -1462828 -1036686
36579 -1036686 -442151 -43519 166645 451699 876581 1171122 1023747 423811 -294488
36570 -294488 -764227 -954687 -1131686 -1398662 -1481303 -1161923 -706946 -506263 -444989 -147311
36560 -147311 177363 -186464 -1247336 -1840410 -1012770 540152 1220772 553119 -403674
36551d03674l25325m3209m22602n71539j24051J79976j6026N5471P97949J185890
36541C12860L07186q79739p09396P12577J637246J176103K43962j76752k77457
36532B346590m14684j99733N34123R18975K68709o59003p26812j69302r4039o04693
36522A200131p20712j32478K33055k75032r91510r45925j78214N31585P43066
36513e36034O15362M25584L42548N01075Q56621J019532N96650k44417q12709
36504B764212o53779j40110m8252n06763p20159q6115P28791N39569n74078j177194
36494A26122n26590K82405p615q51502p65663L77306J248068J070115M07434r2840
36484A267240m26150m76354J25505R30214P49856n11531j305035n89536N51823
$$ plain form
36551 -403674 -728999 -772208 -1194810 -1766349 -1890400 -1710424 -1726450 -1670979 -873030 312860
36541 312860 620046 -259693 -969089 -256512 1380734 2556837 2800799 2624047 2346590
36532 2346590 1931906 1732173 2266296 3185271 3453980 2794977 2068165 1898863 1804824 1200131
36522 1200131 479419 346941 579996 304964 -686546 -1632471 -1810685 -1279100 -536034
36513 -536034 79328 504912 847460 1348535 2205156 3224688 3821338 3576921 2764212
36504 2764212 2110433 1970323 1922071 1415308 695149 609034 1337825 1877394 1303316 126122
36494 126122 -400468 -118063 -125678 -977180 -1742843 -1365537 -117469 952646 1360080 1267240
36484 1267240 841090 364736 490241 1420455 2170311 1658780 353745 -235791 316032
36475C16032N30996m25301q53564l11071L13857M26944L47574L60410L00160J69967
36465A176004K12558K77077k6187m99932n41686j65780N4294P2302L67115P44909
36455A670674L34829q14412j309179l13967J070835J242028K18780o30904n42086
36446I26598n4150O5860k53035n74360m72300J57511Q79494R26772P0007q97696
36436G74701j046831m92339r1309j24879n3396L63898N40151K7532o32182n90427
36426a325081J27603O95392O14326K56545J87323L27906J04063o33326j161123
36417h06372o63198N88092J280423O05274n95265p87801K88912J321929J188921
36408B420915K65638m19586o17705p31593p63050l49005K81526L68633j71044
$$ plain form
36475 316032 847028 421727 -431837 -742908 -429051 -2107 345467 705877 1006037 1176004
36465 1176004 1388562 1665639 1639452 1139520 597834 432054 486348 558650 925765 1670674
36455 1670674 2005503 1191091 -118088 -432055 638780 1880808 2099588 1468684 926598
36446 926598 872448 938308 685273 110913 -361387 -203876 675618 1602390 1672397 774701
36436 774701 -272130 -764469 -855778 -980657 -1034053 -670155 -130004 -102472 -734654 -1325081
36426 -1325081 -1197478 -502086 112240 368785 556108 884014 988077 354751 -806372
36417 -806372 -1469570 -881478 398945 1004219 408954 -378847 -89935 1231994 2420915
36408 2420915 2686553 2266967 1649262 917669 154619 -194386 87140 455773 284729
36399B84729m74190o4636L34347n6679p63206p36970L2957N47234L51363R8663
36389d46388L50269O86756M92697l2622k62182j20572n9183k95402o35557q92373
36379a214557r48286n41108M15804J317994J302368L59781n17539n56301j06829
36370d88673K7158k21639j92366M11851R60191O48675m08885j160746p89021K79926
36360i33529Q32582L49847l81713m12304N7019J21783l07059l29422M21332R80595
36350C99131L75423q77882j385101o72625M02935R22590Q10443M08908j01153
36341B82669n51057o21581k50183J31121J16385j57293k89257j51120J50236N64177
36331g75903R58079R14479J78131p53568j014575m50984J46148R1549l38984m30240
$$ plain form
36399 284729 -189461 -254097 80250 23571 -739635 -1476605 -1443648 -896414 -545051 -446388
36389 -446388 -96119 590637 1083334 1050712 788530 667958 608775 313373 -322184 -1214557
36379 -1214557 -2162843 -2703951 -2288147 -970153 332215 691996 174457 -381844 -488673
36370 -488673 -461515 -683154 -875520 -463669 496522 1145197 736312 -424434 -1213455 -933529
36360 -933529 -100947 248900 -132813 -545117 -488098 -366315 -673374 -1002796 -581464 399131
36350 399131 774554 -103328 -1488429 -2161054 -1758119 -835529 -25086 383822 282669
36341 282669 -268388 -889969 -1140152 -1009031 -892646 -1049939 -1339196 -1490316 -1340080 -775903
36331 -775903 182176 1096655 1274786 521218 -493357 -944341 -798193 -706644 -1045628 -1475868
36321a475868m4284L51201M62074M31841L57142R1501l17088m74339j96782J56773
36311f57829K14110J06627J08841J13197n9615j23958K73235P67330N96615k46748
36301A091805q77644p22027k14674K399m7183m5062p0727l26192n38349k81171
36291b028825K77782N19173J90022l69566p31217o97181k37113M36341Q09873
36282a830711N58288O7262K4931M93686Q26955N54001n6537m02930k06232K92792
36272C21505N53292J94883n33028q96462n57746l6366P9436j2755J59111L99906
36262c28224K54987L2074L47181P95373L39166q41616j251648k98682P13690N67719
36252C30020j20137j60837K60165J90795k99923l66793J8413J23092j03978q221
$$ plain form
36321 -1475868 -1520152 -1168951 -706877 -275036 82106 173607 -143481 -617820 -814602 -657829
36311 -657829 -443719 -337092 -228251 -115054 -174669 -298627 -25392 741938 1338553 1091805
36301 1091805 214161 -507866 -722540 -720141 -767324 -812386 -883113 -1209305 -1747654 -2028825
36291 -2028825 -1751043 -1231870 -1041848 -1411414 -2142631 -2839812 -3076925 -2640584 -1830711
36282 -1830711 -1272423 -1205161 -1180230 -686544 140411 694412 637875 234945 28713 321505
36272 321505 874797 1069680 536652 -359810 -917556 -953922 -874486 -887241 -728130 -328224
36262 -328224 -73237 -41163 306018 1101391 1440557 598941 -652707 -951389 -237699 330020
36252 330020 209883 49046 309211 500006 200083 -166710 -148297 -25205 -129183 -137404
36242a37404L77581K60686l93931n52540K34340R70073O38128l50641q37442m59139
36232b50289J58336L86496J90085r8727j93673q5535j9391j58913l03428j62686
36222e37725J68259L30501K13670k937j87947k47765n393M15008L92580l22612
36212B15639q80046l84838N69978N91804l39343p38251P9630R60132P88638J13493
36202I76836L144L59694M25063J45370m5548j69493m00590l65596K29326P40469
36192A898675L85473m79342q90694p50008p22119r21746p88087j83318L84540
36183b066626O46416Q12660R23357P41148K88089j70374n40461o89474k14776
36174b70041P61361J079117l2532j414021j237511L77511J510079J200929M51269
$$ plain form
36242 -137404 240177 500863 106932 -445608 -211268 758805 1396933 1046292 208850 -250289
36232 -250289 -91953 294543 484628 385901 192228 106693 87302 -71611 -375039 -537725
36222 -537725 -369466 -38965 174705 171768 -16179 -263944 -269337 145671 538251 215639
36212 215639 -664407 -1049245 -479267 112537 -226806 -965057 -885427 74705 863343 976836
36202 976836 979980 1339674 1764737 1910107 1864559 1695066 1294476 928880 1158206 1898675
36192 1898675 2284148 1804806 914112 164104 -558015 -1479761 -2267848 -2451166 -2066626
36183 -2066626 -1420210 -607550 315807 1056955 1345044 1174670 634209 -55265 -270041
36174 -270041 491320 1570437 1537905 123884 -1113627 -736116 773963 1974892 2426161
36165B426161K10248P3990l87786o09837k49890o0920n23564q28207l26882J55850
36155a20837k56998q03807l16742O57578O58761k26724m80518L22860Q24414Q5559
36145C43546r95862j163183n54891j15643l8533K33722Q07071J042763N34583
36136I3573k39289n30716k75718o2481k03506k74769J62890P46001P46390J65469
36126C27844k75055k56936k35729m86690n61148j01093N01606P51303P14878N41256
36116I20236J4194p96131j143514o26423N0015J49793O7886M52576Q43394L98551
36106C30577n11309p73077k99468K9580K612K05509N51257K32532o30629q29272
36096a691688j7467O11331K42851l03164o0237N35289N63672J24594j09139q8303
$$ plain form
36165 2426161 2636409 2710399 2322613 1712776 1462886 1401966 878402 50195 -276687 -120837
36155 -120837 -377835 -1181642 -1498384 -840806 -182045 -408769 -889287 -566427 257987 343546
36145 343546 -652316 -1815499 -2370390 -2486033 -2524566 -2290844 -1483773 -441010 93573
36136 93573 -145716 -676432 -952150 -1014631 -1218137 -1492906 -1330016 -584015 162375 327844
36126 327844 52789 -204147 -439876 -926566 -1487714 -1588807 -1087201 -335898 378980 920236
36116 920236 934430 138299 -1005215 -1631638 -1581623 -1431830 -1363944 -911368 -67974 330577
36106 330577 -180732 -953809 -1253277 -1223697 -1221085 -1015576 -464319 -231787 -862416 -1691688
36096 -1691688 -1709155 -1097824 -854973 -1158137 -1218374 -683085 -119413 5181 -103958 -192261
36086a92261j50187j91917K323J28713j01515k95689m9132K36076L6461k83252
36076h60380m1261N79831Q14091M67446k4477l78796n16023j93305N52328R37416
36066A336870L39260o07176p75953j70454K40099J10612J7046J98536J77132j82985
36056F82987l21165j1663J91551q7858m71954n65266m89580l35939J25757P67999
36046e15131Q89472J97758n96215o59108j6562P18353J068345Q19060L3536o89714
36036A249794o04105J44153N30763J17134l03138q4363J55284l10798q46880l49303
36026c01459Q52107J305894N55894k94244l03792J28222J96263j27880l97050
36017A613955n02695n88560n76990l20487K1007J79164J94625L05740N26753N94687
$$ plain form
36086 -192261 -342448 -534365 -532042 -403329 -504844 -800533 -849665 -613589 -577128 -860380
36076 -860380 -901641 -321810 492281 959727 935250 556454 40431 -152874 399454 1336870
36066 1336870 1676130 1068954 293001 122547 362646 473258 490304 688840 865972 682987
36056 682987 361822 350159 541710 453852 -18102 -583368 -1072948 -1408887 -1283130 -515131
36046 -515131 374341 572099 -24116 -683224 -699786 18567 1086912 1905972 1939508 1249794
36036 1249794 645689 789842 1320605 1437739 1134601 1050238 1205522 894724 47844 -301459
36026 -301459 550648 1856542 2412436 2118192 1814400 1942622 2138885 2011005 1613955
36017 1613955 1111260 522700 -54290 -374777 -353770 -174606 20019 325759 852512 1447199
36007A447199K96437k84917q00165q78178m57545J11566M21973M26534L50049
35998F32953L06611K66438K81092L82414L37860p0578n65182o55501m02134l26912
35988A87061m85093l14114L28866O94958K12067n62196o89463j14417M90132P70426
35978E18227Q25085N72622j24501p83515o69381M1217L37135j44524n88668l56277
35968c72580J7873j56515m76242j30174O67704R64062N65214K08529K25067O8945
35958A581883n43407r72575o61594o6738O4072j90906k27027L9142J60006J5647
35948h01497l0415J70162L13964K08379O1833O8458J24209J09949R5260J09755
35938D30057L2377j53297k90959l49153m69527o09260m98073j10415J98959K43882
$$ plain form
36007 1447199 1743636 1458719 658554 -219624 -677169 -565603 -143630 282904 632953
35998 632953 939564 1206002 1487094 1869508 2207368 2136790 1571608 916107 513973 187061
35988 187061 -298032 -612146 -283280 411678 623745 61549 -627914 -742331 -252199 518227
35978 518227 1343312 1915934 1791433 1007918 338537 379754 716889 572365 -16303 -372580
35968 -372580 -354707 -511222 -987464 -1117638 -449934 514128 1079342 1287871 1512938 1581883
35958 1581883 1038476 65901 -595693 -662431 -598359 -789265 -1016292 -977150 -817144 -801497
35948 -801497 -831912 -661750 -347786 -139407 -77574 -9116 115093 225042 320302 430057
35938 430057 462434 309137 18178 -330975 -800502 -1409762 -1907835 -2018250 -1819291 -1575409
35928a575409K93411N12827N22956k8881p40189q33402j68012O08669R13429P91258
35918B96657N71308L77243J58487q3892l11104n19082o45501n38178j56265K91605
35908e58722N48055O03947O64867Q00095P56735K80013m12417p41380n08454k52076
35898A180663n12416r64092q34947j09641M00834L26251K57118N91530O98043
35889A033343k2636r02351q19043J29487P91824O22927J56430j24210l30519m88095
35879D7157l45455p0569j46635l63531j1679O39572L80594q46176j335357j25195
35869b177274J223944Q20210o41709r61306J96587J033338O09885M6598K79377
35860D29650N05244j59451r40221o03290N35441J073389M90490m31573q61638
$$ plain form
35928 -1575409 -1281998 -769171 -246215 -275096 -1015285 -1848687 -2016699 -1408030 -494601 296657
35918 296657 867965 1245208 1403695 1319803 1008699 489617 -155884 -694062 -850327 -558722
35908 -558722 -10667 593280 1258147 2058242 2814977 3094990 2682573 1941193 1432739 1180663
35898 1180663 668247 -295845 -1130792 -1240433 -839599 -513348 -256230 335300 1033343
35889 1033343 1010707 108356 -710687 -581200 210624 833551 989981 865771 535252 47157
35879 47157 -298298 -368867 -515502 -879033 -890712 -251140 129454 -716722 -2052079 -2177274
35869 -2177274 -953330 -133120 -774829 -1736135 -1539548 -506210 103675 150273 429650
35860 429650 934894 775443 -164778 -768068 -232627 840762 1331252 899679 38041
35851C8041o59049n7136N45467N72969j72223r42863p34106L87226J274233J161714
35841A414273N20698J65802P4311l41446j046719j187317l19247O84319N73768
35832E38442n38326j132009k95253R26955R35703j66031p93870k34615M67811
35823b91193L08409k13298j86952J45654M755m00116j90885O02849R93099N82108
35813A354430P0195J362m71l34249o22755l97046N7991J92362P7951J33337K53819
35802G86926n1852p04449r29450l03561N88189Q94832N58525J83805K9990k82764
35792G70191r37386j346323q51457L11670J245802J417831R65952J82745o33773
35783A125252r05625k23142P62193P93740k68832j088128p49258n4156r0202m54364
$$ plain form
35851 38041 -621008 -678144 -132677 440292 268069 -674794 -1408900 -1021674 252559 1414273
35841 1414273 1934971 2100773 2175084 1833638 786919 -400398 -719645 -35326 538442
35832 538442 116 -1131893 -1427146 -500191 435512 269481 -524389 -759004 -291193
35823 -291193 17216 -196082 -383034 -237380 -232625 -632741 -823626 -220777 772322 1354430
35813 1354430 1424625 1425987 1425516 1091267 468512 71466 129457 321819 399770 533107 786926
35802 786926 735074 30625 -898825 -1202386 -614197 280635 839160 1022965 1052955 770191
35792 770191 -167195 -1513518 -2364975 -2053305 -807503 610328 1576280 1759025 1125252
35783 1125252 219627 -3515 758678 1552418 1283586 195458 -553800 -607956 -698158 -1152522
35773a152522j19598O31775O41924p7929l33109J77121L53446l24777p83434o9275
35763a056378J092980J376353O32358k89347q22976r21675n55930J47675O12397
35754B15457M08109j03539k97901j43852J2454J34023L45820M39774J68075k24833
35744I53587l35957k11136j09966r788J16041m2805n38082o82041J6432Q19918
35734b3797O37103l03078p03813p9895O76367P33804K98449j27936m84950p02107
35724g9853l94077L76808P35850J02231q42269j016645m26062j6620j88563k57633
35714b006833L95151J253036J236357J33298j038402j210169m37965L86994P16906
35705e71627P30564O57787M22075J28032J75830M84164L04817n89616j217523
$$ plain form
35773 -1152522 -1272120 -640345 1579 -76350 -409459 -232338 121108 -203669 -987103 -1056378
35763 -1056378 36602 1412955 2045313 1755966 932990 11315 -544615 -396940 215457
35754 215457 623566 520027 222126 78274 90728 224751 570571 1010345 1178420 953587
35744 953587 617630 406494 296528 286740 402781 359976 -178106 -860147 -843715 -23797
35734 -23797 613306 310228 -393585 -473480 202887 936691 1235140 1107204 622254 -79853
35724 -79853 -473930 -97122 638728 740959 -101310 -1117955 -1544017 -1560637 -1749200 -2006833
35714 -2006833 -1611682 -358646 877711 1011009 -27393 -1237562 -1675527 -1288533 -571627
35705 -571627 158937 816724 1238799 1366831 1542661 2026825 2331642 1742026 524503
35696E24503p10133K72307M73170p0447k83016Q5580K42553k4436r231L39856
35686H40706M0462j089719j646049o47574Q48274J276210P45410M33675N58634
35677A360029L64178k85272o85588n61520l55629k36944J06896O00412O86015
35668I92577K62963j31931k23994k71382l29416j19580J84570l3776p06098q67294
35658a243361q6433P07987N22967k26111l71231K72507P27487L51070k90184k94094
35648G0604L60320Q67489O46866m9484o07967p99762p88342n86861p970P38775
35638a56332R40912K76666n84909p98652m53547k65308m16059m46005j80566O2579
35628b021221K11674N16867P59445L41566n14934o66017K72846J081310O11744
$$ plain form
35696 524503 -185630 86677 559847 489400 206384 291964 534517 510081 500850 840706
35686 840706 881168 -208551 -1854600 -2502174 -1653900 -377690 367720 801395 1360029
35677 1360029 1724207 1438935 753347 191827 -163802 -400746 -293850 306562 992577
35668 992577 1255540 1123609 899615 628233 298817 179237 363807 330031 -376067 -1243361
35658 -1243361 -1329794 -621807 -98840 -324951 -696182 -423675 303812 654882 364698 70604
35648 70604 430924 1298413 1945279 1895795 1287828 488066 -300276 -887137 -895107 -156332
35638 -156332 784580 1061246 476337 -322315 -775862 -1041170 -1457229 -1903234 -2083800 -2021221
35628 -2021221 -1809547 -1292680 -533235 -191669 -706603 -1372620 -1099774 -18464 593280
35619E93280m63386o36046K34216Q92329O43167J19624r770J4296k13725m54247
35609G19738l11605O0441K76107L19381L45509K21057k33041p42289q08827l93040
35599e46569J7596N1212j30254j49081N0653J49681q5097m18956l73395J51781
35589a282429O70449O81415K88305K868M9512J91605J95832Q4950j04121m03245
35579C75141o34354m65328M2308L40402J48325p9696J43661M96012K80628m36568
35569B10531p77862k62511M98361O27552J09265l16183j71510K81045N51870N08612
35559A259170L10419O1101k08244l58322k44484R646J22461J01942K69184O40919
35549A963792O24241k34673j363350j617970p46219J64812N1336p66041j113742
$$ plain form
35619 593280 129894 -506152 -271936 620393 1263560 1383184 1373414 1387710 1173985 719738
35609 719738 408133 468574 744681 1064062 1409571 1630628 1397587 655298 -153529 -546569
35599 -546569 -528973 -477761 -608015 -757096 -706443 -556762 -641859 -1060815 -1434210 -1282429
35589 -1282429 -611980 69435 357740 360608 410120 601725 797557 882507 778386 375141
35579 375141 -259213 -724541 -682233 -341831 -193506 -273202 -129541 366471 647099 210531
35569 210531 -567331 -829842 -331481 296071 405336 89153 -82357 198688 750558 1259170
35559 1259170 1569589 1630690 1422446 1064124 819640 829286 951747 1053689 1322873 1963792
35549 1963792 2588033 2353360 990010 -627960 -1374179 -1209367 -1158031 -1924072 -3037814
35540c037814n75753J11085K65840J50091L18775O46530N95296K06042J43484
35531a176424O53847J068257P18386m4000k85493K01112O50943M92251J18796
35522B397675J13914K56770l3426n90893o77104k19870k456l83811o56693j54397
35512D9709O87662R85529N85166n8692o87659j167555j045148j05666Q67086Q70528
35502I80960J43334j53772K62292M26904j86297p46536m09139L71053O15224J93895
35492A497918l29937o45082p28527m46390J16040L63978l818l21565J04940P91021
35482C98578P24470q6050p12454p60931o67519o21649l29068N1599j00711o36994
35472b740729n28286M98096J260318P80861k44511n16745J3151L55559J10917
$$ plain form
35540 -3037814 -3613567 -3502482 -3236642 -3086551 -2767776 -2121246 -1525950 -1319908 -1176424
35531 -1176424 -522577 545680 1264066 1220066 934573 1135685 1786628 2278879 2397675
35522 2397675 2511589 2768359 2734933 2144040 1466936 1247066 1244610 860799 204106 49709
35512 49709 737371 1722900 2308066 2249374 1561715 394160 -650988 -756654 110432 980960
35502 980960 1124294 970522 1232814 1659718 1473421 726885 317746 688799 1304023 1497918
35492 1497918 1167981 522899 -205628 -652018 -535978 -172000 -175818 -497383 -392443 398578
35482 398578 1123048 1036998 324544 -436387 -1103906 -1725555 -2054623 -2003024 -2103735 -2740729
35472 -2740729 -3269015 -2770919 -1510601 -729740 -974251 -1490996 -1477845 -1122286 -1011369
35463a011369j60132o6847P2874k2087m7901L59238R62689J098655L97627p53964
35453H28783j458138j147168k41324L00474J85145R4783N28026R15097N00876
35444E06554l33986n01035J84747P29995M42451j52317k55422L0348N0503l01078
35434D00760m82559j84167K32465K63072j01047m07136k78492J64471M08680J20451
35424A36498l88332m42834J44516P28584N98172m9847k90572L08371J023105Q20759
35414B588420l23925j333986j273930l70506L68448L31878j49085l51201N965
35405e07922N42477O85172K46689m23765q02038o69250k25621J98727M14855L74137
35395a66539J08327k17730l47582j66790J87085M91358N67417K66340l53223p84884
$$ plain form
35463 -1011369 -1171501 -1238348 -1165474 -1187561 -1235462 -876224 86465 1185120 1582747 828783
35453 828783 -629355 -1776523 -2017847 -1717373 -1532228 -1437445 -909419 5678 506554
35444 506554 172568 -328467 -143720 586275 1028726 876409 620987 651335 701838 400760
35434 400760 -81799 -265966 -33501 229571 128524 -278612 -557104 -392633 16047 136498
35424 136498 -251834 -694668 -550152 178432 776604 726757 436185 744556 1767661 2588420
35414 2588420 2264495 930509 -343421 -713927 -345479 -13601 -162686 -513887 -507922
35405 -507922 34555 719727 966416 542651 -259387 -928637 -1154258 -955531 -540676 -166539
35395 -166539 -58212 -275942 -623524 -790314 -603229 -111871 455546 721886 368663 -416221
35385d16221m77041L26390O82713K28303k57909j09996J05503l79959r86466n33142
35375a817825P26942J264330N75129j38522j754K81972m0395l67249L7663N58560
35365A078851K88640k84219j20262M43243J97121p76241j068662j73604P53127
35356C37994P40113K87321K09494L03015l4897o37096q59266o02380l37139l39564
35346i32405m37229l98969k04298K8523J92177L10994N20411Q04001Q73101N55564
35336A311870J28202q4639k15385m91817o46739l34736R5460O0215j66641K04205
35326a40005J018046J162919L01009m89210l29742K14074K27926j13329j10189
35317A741499J58644J24092j34152p1819K30505J48136l71947o81288n07527l43282
$$ plain form
35385 -416221 -893262 -566872 115841 344144 86235 -23761 81742 -298217 -1284683 -1817825
35375 -1817825 -1090883 173447 748576 610054 608300 890272 849877 482628 520291 1078851
35365 1078851 1367491 1083272 963010 1406253 1603374 827133 -241529 -415133 337994
35356 337994 1078107 1365428 1574922 1877937 1843040 1205944 346678 -255702 -592841 -932405
35346 -932405 -1369634 -1768603 -1972901 -1944378 -1752201 -1441207 -920796 -116795 756306 1311870
35336 1311870 1440072 1355433 1140048 648231 1492 -333244 -237784 -177569 -344210 -140005
35326 -140005 878041 2040960 2341969 1852759 1523017 1737091 1965017 1851688 1741499
35317 1741499 1900143 2024235 1890083 1818264 2048769 2196905 1824958 1143670 636143 292861
35307B92861n17216n79874l7210P64678R93130M24649k26672j95736L36360M39800
35297A694770k93260j047037p89694K35944P36962J61657n43250l71942L00258
35288H4408M33176n5616k94902J13957N73475M84762L1118k85282l47643l41525
35278C95928l12948j38007J94422M74911M52995J17944j88982p9218L64733N67348
35268A849126J48863n50822q87169o84243l04214q6410n3091j01007j47895q4166
35258i01028J41749L60361L24936M4409k05377k18876o6834M1652q77r9150n5144
35247f34179J87890M17637L85618J29035j22664k96449m53417m83911k16086J78149
35237i08377L38421K97400L69684M18990m9991q59815j037365j85115P73297Q34579
$$ plain form
35307 292861 -224355 -804229 -841439 -76761 916369 1341018 1114346 918610 1254970 1694770
35297 1694770 1401510 354473 -435221 -199277 537685 699342 156092 -215850 84408
35288 84408 517584 461968 167066 281023 854498 1339260 1370378 1085096 737453 395928
35278 395928 82980 -55027 139395 614306 1067301 1185245 996263 917045 1281778 1849126
35268 1849126 1997989 1447167 559998 -124245 -428459 -514869 -567960 -668967 -816862 -901028
35258 -901028 -759279 -398918 -73982 -29573 -234950 -453826 -520660 -479008 -479885 -579035 -634179
35247 -634179 -446289 -28652 356966 486001 363337 66888 -386529 -870440 -1086526 -908377
35237 -908377 -569956 -272556 97128 516118 466127 -393688 -1431053 -1616168 -842871 -8292
35227h292K38499j54709j68772j31232N7226O35525J110158P65413r4791m73688
35217A775337k26794k16297p95414j194194p61363Q0615N63232N22678J90481
35208f1719k98132p01821n51360K27156R62127R77026L76101k66824o48257p61922
35198g47625n23989J06587P61534Q84471L80678k24192l63067l1514K71232J63218
35188F77333j81033l27020k03021j15388j44380J168L34793L42682k07709p06086
35178e28661m90377K26065P92606J009868R06834K20295r42666j468404n42092
35169h16532P41798N76243q11078j288007k661J321799J042716q9835m53505k9371
35159A91567J14399j65384k04568p7539m19114r48504o93560K71750O94403J9997
$$ plain form
35227 -8292 230207 75498 -93274 -224506 -167280 468245 1578403 2343816 2249025 1775337
35217 1775337 1548543 1332246 536832 -657362 -1418725 -1338110 -774878 -252200 -61719
35208 -61719 -359851 -1061672 -1613032 -1385876 -423749 553277 929378 662554 14297 -747625
35198 -747625 -1271614 -1165027 -403493 480978 861656 637464 274397 242883 514115 677333
35188 677333 496300 169280 -33741 -149129 -293509 -292341 42452 385134 177425 -528661
35178 -528661 -1019038 -792973 -367 1009501 1916335 2136630 1193964 -274440 -816532
35169 -816532 -74734 501509 -309569 -1597576 -1600237 -278438 764278 674443 220938 191567
35159 191567 305966 140582 -63986 -141525 -560639 -1509143 -2202703 -1930953 -1236550 -1216553
35149a216553p74084o49482J44224O90373O29571K57264l3664N7013O49660J355541
35139A109863J396314M64553p86883j454390j363578j021124p87163n05118L8356
35130b909170O29790Q22382N15770J17325L7018J85837J78674p3958k88037k97715
35120a082084k40623j73430O5830M17870M68555P1074k96235j89719J24929J07336
35110g26497k33881m36907k85392O2898M35956O52138M02525k97595p42156k94855
35100a463766N81100P79389N4477o74718o51839j51440K43957M72100O38167N02363
35090C29790m1996m48228j76306M11135N07767N0780k76809j97563k04122n59878
35080f05430o85075m4941Q75596J138157O21876N6156j21388k20743m79378m93076
$$ plain form
35149 -1216553 -1990637 -2640119 -2495895 -1805522 -1175951 -918687 -952351 -895338 -245678 1109863
35139 1109863 2506177 2970730 2183847 729457 -634121 -1655245 -2442408 -2947526 -2909170
35130 -2909170 -2279380 -1456998 -941228 -823903 -786885 -601048 -422374 -496332 -784369 -1082084
35120 -1082084 -1322707 -1496137 -1430307 -1012437 -543882 -472808 -769043 -958762 -833833 -726497
35110 -726497 -960378 -1397285 -1682677 -1619779 -1183823 -531685 -129160 -426755 -1168911 -1463766
35100 -1463766 -882666 -103277 -48800 -723518 -1375357 -1526797 -1282840 -810740 -172573 329790
35090 329790 287794 -160434 -336740 74395 582162 632942 356133 158570 -45552 -605430
35080 -605430 -1290505 -1335446 -459850 678307 1300183 1356339 1234951 1014208 534830 41754
35070D1754J02674Q64508J003257L91077l52787o41858m06293L8509K15924k37270
35060A019495j081786j446232p87720L00970Q22937P08918O62298Q19799N70066
35051A588745j65706n68376k75640o6412n06638q58742k88151O01900O03255j98944
35041a34709o08781k20470J20001j36703m21368j65583K58878K97091J22688J23832
35031g65124Q5906l46638p89441n35935K73887P16700M38537J88646N99037J048249
35021I13824M83171q69007j513487o60924N95374P03357k73896q90413m25532
35012a937533K59650J87350l58378m87123o3753L08884K98816J46581J15540K04822
35002a325144L52543N00653N08505L17305J01788J6041k0690n9436M9445K66459
$$ plain form
35070 41754 144428 1008936 2012193 2403270 2050483 1408625 1002332 1040841 1256765 1019495
35060 1019495 -62291 -1508523 -2296243 -1995273 -1172336 -463418 198880 1018679 1588745
35051 1588745 1423039 854663 579023 512611 5973 -852769 -1140920 -539020 64235 -134709
35041 -134709 -743490 -963960 -843959 -980662 -1402030 -1567613 -1308735 -1011644 -888956 -765124
35031 -765124 -679218 -1025856 -1815297 -2351232 -2077345 -1360645 -922108 -733462 -134425 913824
35021 913824 1396995 527988 -985499 -1646423 -1051049 -347692 -621588 -1512001 -1937533
35012 -1937533 -1677883 -1490533 -1848911 -2336034 -2399787 -2090903 -1792087 -1645506 -1529966 -1325144
35002 -1325144 -972601 -471948 36557 353862 455650 471691 451001 391565 441010 707469
34992G07469J82455l44331p24583l44763N13230R93089P15223J7509o34907r51643
34982A28748p31901n2850N69394O96452M90743K85798m2016o65184j107859p72093
34972a200768J1722L19862k6706l12884j32411J60885L23710N91563Q80809N67706
34962A183488m09971j035643m97465N86865R82962M99480L5046J06202J59472
34953A610436l97291j102946r80491j46O74392K18902o11586m90804M98006R24738
34943C43210K05725m66690m2708O89916M65013l28538l90435J75603P0377p81470
34933e9997r04702K23706J112689N51844n17079n71113J93483M56525p9831m95053
34923h9528k47063K38911M93764N36484M35818J14467l06467n45772o02836o85493
$$ plain form
34992 707469 889924 545593 -178990 -523753 -10523 982566 1697789 1715298 1080391 128748
34982 128748 -603153 -656003 -86609 609843 1100586 1386384 1344368 679184 -428675 -1200768
34972 -1200768 -1189046 -869184 -895890 -1208774 -1341185 -1180300 -856590 -265027 615782 1183488
34962 1183488 773517 -262126 -759591 -172726 810236 1309716 1344762 1450964 1610436
34953 1610436 1213145 110199 -870292 -870438 -196046 22856 -588730 -1079534 -581528 343210
34943 343210 548935 82245 39537 729453 1194466 865928 475493 651096 721473 -59997
34933 -59997 -964699 -740993 371696 923540 406461 -164652 28831 485356 405525 -89528
34923 -89528 -336591 -97680 396084 932568 1368386 1482853 1176386 630614 27778 -657715
34913f57715p05208l35111L73864Q80278Q00968L60928L6856l4805r4411k73128
34903C52516l07438P2570N82901O10489J15686j80373J38124M58204R1593n39840
34893A394432n50114o7817K7965l01217j98791M20156N05661l46494j018734n30684
34883f65637M87411Q60410N22578J61753m3389l15891m77747k63007k3190j87527
34873E5764l74120M0755P58036Q95621L20851k44960l71287l19729k81450j6651
34863D62830N46806R65182Q19607K74601j18630n9999J37173j17978q72560j338649
34853F98383q48341P7768L20762k38170o27602l84093j21176j89018l8485M70626
34843h79346M60823l38618o54438M04454J633699J427495K23813m01690k94890
$$ plain form
34913 -657715 -1362923 -1698034 -1324170 -443892 357076 718004 754860 720055 625644 352516
34903 352516 45078 117648 700549 1311038 1426724 1246351 1384475 1842679 1934272 1394432
34893 1394432 844318 776501 804466 503249 304458 724614 1230275 883781 -134953 -665637
34883 -665637 -178226 682184 1204762 1366515 1323126 1007235 529488 266481 243291 55764
34873 55764 -318356 -277601 480435 1376056 1696907 1451947 1080660 760931 479481 462830
34863 462830 1009636 1974818 2794425 3069026 2950396 2890397 3027570 2909592 2037032 698383
34853 698383 -149958 -72190 248572 10402 -617200 -1001293 -1122469 -1311487 -1349972 -879346
34843 -879346 -418523 -757141 -1411579 -1007125 626574 2054069 2277882 1876192 1581302
34834A581302n05263j028981q06790J36407N30102L2225k59572J70037M58617
34825C08084J23637l9970M35518O78953m5q21184p62673r3744K82899K06229O3624
34814C81328r6408l86146n33830k68609J65635M42918O26197P36669M57515j84098
34804A341171m67910K0234N77986L08733n41112r12076l90304L23454L78898k40476
34794C98598p66482n18480K75097O43688Q9327o42857n56244J08560K57869k64760
34784i75684l90102M15450J222871J036084J69428m47484n56315m61107l07594
34775b94453j57512j96569k72153J42052R44519J126244K06863q16463q17164
34766a34636j24962K14350J08222J97971M64660L33679n5750N1825O53716Q57157
$$ plain form
34834 1581302 1076039 47058 -759732 -623325 -93223 -60998 -320570 -150533 308084
34825 308084 431721 391751 827269 1506222 1506177 684993 -77680 -171424 111475 317704 381328
34814 381328 284920 -101226 -635056 -903665 -738030 -295112 331085 1067754 1525269 1341171
34804 1341171 873261 893495 1471481 1780214 1239102 327026 -63278 260176 639074 398598
34794 398598 -367884 -886364 -611267 32421 121748 -521109 -1077353 -968793 -710924 -975684
34784 -975684 -1365786 -950336 272535 1308619 1478047 1030563 474248 13141 -294453
34775 -294453 -451965 -648534 -920687 -778635 165884 1292128 1498991 682528 -134636
34766 -134636 -259598 -45248 62974 260945 725605 1059284 1003534 1055359 1709075 2566232
34756B566232K75959m45113p20271p21764p02770m63619R4051N36911M64559N9768
34746I43943k53402l39821l01178k13684j07442K5708K51503M85398L87216j49694
34736G28547n62864k27385N75657R27042N18817m2546k77909m19764o71043o28794
34726h0242K3371P85693R12056L95237j53637l88068m70327n42151m36408J5997
34716F1521O63943J082785Q84539J29801n12965l59037L47151N25477k98796j132759
34706A391660q05665K26591L98892o11682j235651k69906J243536J405702Q8030
34697A831507j051841r63944l44767j93693m03904l43746N1385M58398P89909
34688a70696R65038O14408k75159r05097o24893N0095J92528j18321o3742M54398
$$ plain form
34756 2566232 2842191 2397078 1676807 955043 252273 -211346 -117295 419616 884175 943943
34746 943943 690541 350720 49542 -164142 -271584 -245876 5627 491025 878241 728547
34736 728547 165683 -61702 513955 1440997 1959814 1917268 1639359 1219595 548552 -80242
34726 -80242 -56871 728822 1640878 2036115 1882478 1494410 1024083 481932 45524 61521
34716 61521 725464 1808249 2692788 2822589 2309624 1950587 2297738 2823215 2524419 1391660
34706 1391660 585995 812586 1211478 599796 -635855 -905761 337775 1743477 1831507
34697 1831507 779666 -184278 -529045 -722738 -1126642 -1470388 -1419003 -960605 -170696
34688 -170696 794342 1408750 1133591 228494 -396399 -346304 -153776 -272097 -335839 118559
34678A18559O71283K96037m0006P9050J76210k41437q39750r71345n40716N0793
34668a241322M58762N82270M83955L31348K03285n8066n20413q26078o25354j70850
34658a382463P8973K32916O34629R94754P74576K80104K79484N73966K23255o81211
34648B008983r19022k04746K00540l52709p05655P2467R21990N15947m67596n18028
34638E52171J48744J12242o69134p94413R9578O95727K08375m08437j24530O02344
34628D22667P27780J53553m01165m29417M2788O62655Q74957L36374n04330p86369
34618A099493m28080k75385p56965j141567o52190L31516Q52857P00087M37498
34609A67264L93302L38817J15931o0125n6876j04542l84205o39301m78301O1439
$$ plain form
34678 118559 789842 1085879 1045873 1124923 1301133 1059696 219946 -751399 -1292115 -1241322
34668 -1241322 -782560 -200290 283665 615013 818298 760232 239819 -586259 -1211613 -1382463
34658 -1382463 -1303490 -1070574 -435945 558809 1333385 1613489 1892973 2466939 2690194 2008983
34648 2008983 1089961 885215 1085755 733046 27391 99858 1021848 1537795 1070199 552171
34638 552171 700915 813157 144023 -650390 -550812 144915 353290 -55147 -179677 422667
34628 422667 1150447 1304000 902835 473418 516206 1178861 2053818 2390192 1885862 1099493
34618 1099493 671413 396028 -360937 -1502504 -2154694 -1823178 -970321 -270234 167264
34609 167264 560566 899383 1015314 955189 898313 793771 409566 -229735 -708036 -646597
34599f46597N06097N06213K07826j8261n3279o5853j65077k41429j60077O1156
34589f9281K80815L21405J00206j82876j60477J65981K70930j28252m86043k32068
34579a19660J75166p4504o04727k36230R49490J362695L17572p22449l47065N96720
34569A297008M42395n63265p21612L05483R69415L13544o31594n81304P5708K5305
34559I31083r16510j446874m92673J273942K038016R95000n28177o77562M50035
34550A626280R81751P0229q69089m95603K87306p8458j119509j095123J00841
34541e91375Q06747L18786j86117J86043P08784N22776j3026k69546m35476p95206
34531B52390r19068m60394K8201p3997m20735k81422K96620O13073L25130j92177
$$ plain form
34599 -646597 -140500 365713 573539 555278 501999 436146 271069 29640 -130437 -69281
34589 -69281 211534 532939 633145 450269 289792 455773 726703 598451 112408 -119660
34579 -119660 55506 -18998 -623725 -859955 89535 1452230 1769802 1047353 700288 1297008
34569 1297008 1739403 1176138 454526 760009 1729424 2042968 1411374 830070 905778 931083
34559 931083 14573 -1432301 -1924974 -651032 1386984 2381984 1853807 1176245 1626280
34550 1626280 2608031 2678260 1809171 1313568 1600874 1522416 402907 -692216 -591375
34541 -591375 215372 534158 348041 534084 1242868 1765644 1752618 1483072 1047596 252390
34531 252390 -666678 -1127072 -1098871 -1172868 -1593603 -1875025 -1578405 -965332 -640202 -832379
34521h32379l40651J02291P00695O78953j35673q53993n74707L16482O80970K83060
34511B5048o8673L8713J72189J26802K57894N13364L26375k28256l89468j49563
34501F24425l99671j191134j320666l26038O02568N95654M73880R93034J217350
34492A269402J86784j032766p85253N31135J119940N56280M2405J52419J71637
34483B211983k31287l77569O562J79460l04482q27870p71295l89143j45662K144
34473f47159K02842K98523K36317K91069N19849N40593J66016k51945l84928l46940
34463F24237l08004j87874J884k495k27165k48989J72378O00170M36988k80177
34453E80953r23492r87051n09908J34225O54305J003164J195405J088916N32659
$$ plain form
34521 -832379 -1173030 -1070739 -370044 308909 173236 -680757 -1255464 -938982 -258012 25048
34511 25048 -43625 -4912 167277 294079 551973 1065337 1391712 1163456 773988 624425
34501 624425 224754 -966380 -2287046 -2613084 -2010516 -1414862 -940982 52052 1269402
34492 1269402 1456186 423420 -361833 169302 1289242 1845522 1887927 2040346 2211983
34483 2211983 1980696 1603127 1609689 1789149 1484667 656797 -114498 -503641 -649303 -647159
34473 -647159 -444317 -145794 90523 381592 901441 1442034 1608050 1356105 971177 624237
34463 624237 316233 128359 130243 127748 -99417 -348406 -176028 424142 861130 580953
34453 580953 -342539 -1329590 -1839498 -1705273 -1050968 -47804 1147601 2236517 2769176
34444B769176k48167p10208o27426l84502l53592k92291J85690P79425P51149
34435A869254j7016q06055j009009p52204l77923J16597P10644Q99394K54912
34426H88594p04904r01847j11799O08089L10707m99297n82632K05113O79375R4487
34416a4114p36463o62562J49636O20784M10249J87397L49657M46188R0372l52690
34406D88454l57252M0388M28850N01577J39863n42416j055299q91569k20685K18000
34396a250089R3055j04710J68044P53828J057484P52983O0432m66736m40815j38636
34386D84840k66135q90256j067742j73681R26021R98422L00175O3741M16914L44820
34376A137119k67811k77994O06674J040873J60545r71999j037554l50022j61j29262
$$ plain form
34444 2769176 2521009 1810801 1183375 798873 445281 152990 338680 1118105 1869254
34435 1869254 1852238 1046183 37174 -715030 -1092953 -976356 -265712 633682 888594
34426 888594 183690 -718157 -829956 -221867 88840 -410457 -993089 -787976 -108601 -14114
34416 -14114 -750577 -1413139 -1263503 -642719 -232470 -45073 304584 750772 841144 488454
34406 488454 131202 171590 600440 1102017 1241880 699464 -355835 -1247404 -1468089 -1250089
34396 -1250089 -1157034 -1261744 -1093700 -339872 717612 1470595 1531027 1064291 623476 484840
34386 484840 218705 -671551 -1739293 -1912974 -986953 11469 311644 375385 792299 1137119
34376 1137119 869308 591314 1197988 2238861 2399406 1427407 389853 39831 39670 -89592
34366h9592j67080L816J53217L44390O15701O07929J85551k07472l23472m53715
34356F69273o00693l48936L6922k88487j021210o77990Q95256J764447Q25276
34347A253858l52270j36557N18134O338r59916o80279M47029O88876O826j84257
34337F07782K68512K54750k33481j58402L32950J14360n68769l41427O69622Q56265
34327A802162l2583m91211k1092J60246l29230k92526M75480L92894j027719j884817
34317a248396q91080M73769M60559j87011J50562J107111J130966J53893m80936
34308F69437k23855J86214J64981o6546j39146N7232M35322O12238J68028n68879
34298A295026o59479P6625O60233M30304m0830j36518k27164o58970p52767Q1014
$$ plain form
34366 -89592 -256672 -252856 -99639 244751 860452 1468381 1653932 1446460 1122988 669273
34356 669273 68580 -280356 -243434 -531921 -1553131 -2231121 -1335865 428582 1253858
34347 1253858 901588 765031 1283165 1289503 329587 -350692 96337 785213 792039 607782
34337 607782 876294 1131044 897563 739161 1072111 1186471 617702 276275 945897 1802162
34327 1802162 1769579 1278368 1257276 1417522 1088292 795766 1271246 1664140 636421 -1248396
34317 -1248396 -2139476 -1665707 -1205148 -1392159 -1241597 -134486 996480 1150373 669437
34308 669437 445582 631796 796777 730231 591085 648317 1083639 1695877 1863905 1295026
34298 1295026 635547 712172 1372405 1802709 1761879 1625361 1398197 739227 -13540 67474
34288F7474J033992Q96951j58212q78393o54571n831L98456L98305J98679J36887
34278A433737L84180N56802P6013q07508j046220k63711N99743O52555K42698
34269A828289J17117K11275J00690n8343M9977J25161j90513m85538k44400J01903
34259A555618k03587q55258p61785L05485J258673J094285Q5400p19992p69876
34250I88963m24052k24842j05793L72924J075515J161322K79785o76857p16461
34241A730504j61194J7910j38165J68119P69275N66796n21221j155332o28061
34232F48631P4836j3830l54240n9030N29914N07003r9498n14178m03868m7921
34222B67819K90470M99364M54802J97477m5351k38809m75696m88112L8304O09943
$$ plain form
34288 67474 1101466 1998417 1840205 961812 307241 301410 699866 1098171 1296850 1433737
34278 1433737 1817917 2374719 2450732 1643224 597004 333293 933036 1585591 1828289
34269 1828289 1945406 2156681 2257371 2199028 2249005 2374166 2183653 1698115 1453715 1555618
34259 1555618 1352031 496773 -265012 40473 1299146 2393431 2478831 1758839 988963
34250 988963 564911 340069 234276 607200 1682715 2844037 3123822 2446965 1730504
34241 1730504 1569310 1587220 1449055 1617174 2386449 2953245 2432024 1276692 648631
34232 648631 723467 709637 355397 296367 826281 1333284 1233786 719608 315740 267819
34222 267819 558289 1057653 1512455 1709932 1664581 1425772 950076 461964 500268 1110211
34212A110211L50583n47985q88364k78601K74234J1371n05945n25677j89318J20322
34202a069169M53171P10059M37593k05249l42615J85292M07298j82944q09043
34193d15607p98447n18541k75776L31604J169430J134632l1659q84499l62440
34184f51303N51836M69971k94740n49639j29782K81967L92786K69143j18532m49103
34174b27396r0236O90307P28160j27246n56805j4578L03504k45499m36890M55906
34164D79227R98923R4640p80747N904J294223J031819k80469o52224k9387L8449
34154B200358n73879n48304K30188M90636p8174m88592l83579l30735l19399J59116
34144C57636O93997M31097k20095j13859O18478Q17291L15351j5966M45k19070
$$ plain form
34212 1110211 1460794 912809 24445 -254156 20078 31449 -474496 -1000173 -1189491 -1069169
34202 -1069169 -615998 94061 531654 326405 -16210 169082 576380 393436 -415607
34193 -415607 -1214054 -1732595 -2008371 -1676767 -507337 627295 595636 -288863 -651303
34184 -651303 -99467 370504 75764 -473875 -603657 -321690 71096 340239 221707 -227396
34174 -227396 -317632 372675 1100835 973589 416784 402206 705710 460211 23321 479227
34164 479227 1478150 1572790 792043 797947 2092170 3123989 2843520 2191296 2161909 2200358
34154 2200358 1626479 1078175 1308363 1798999 1720825 1232233 848654 517919 198520 357636
34144 357636 1051633 1482730 1262635 1148776 1767254 2584545 2899896 2883930 2884375 2665305
34134B665305n77530m62202j29664l10280o77256k90474O85964J202371R45803
34125C052037L77695l37824j074002j117380k56178L54535q0067m87181J68919
34116F00554Q08990J39385p55582k11784Q82664N76288n76199n23103M89390M26018
34106A856621o82388p85556L67101Q08539j1745l99589L03604O49180o9256o80172
34096A356339n09197l21815l40766J90383J012311Q90342P319j66140L87163K42378
34086B748317n63549m86381M34492M51727n57407p56265J52654L23719o59464
34077A087843r11857J53505O55223k17550p27827P5452O76330J17559l23010J06110
34067F91778J77731n60159n69567O20696J136779J39480n24747K42079P50669
$$ plain form
34134 2665305 2087775 1625573 1495909 1185629 508373 217899 903863 2106234 3052037
34125 3052037 3429732 3091908 2017906 900526 644348 998883 918816 431635 600554
34116 600554 1409544 1548929 793347 581563 1464227 2040515 1464316 941213 1430603 1856621
34106 1856621 1174233 388677 755778 1564317 1552572 1152983 1456587 2105767 2036511 1356339
34096 1356339 847142 525327 184561 374944 1387255 2277597 2284916 2118776 2505939 2748317
34086 2748317 2184768 1698387 2132879 2584606 2027199 1270934 1423588 1747307 1087843
34077 1087843 175986 329491 984714 767164 39337 114789 791119 908678 585668 691778
34067 691778 869509 309350 -260217 360479 1497258 1636738 1111991 1354070 2104739
34058B104739j76906q75810N4388J133446P61415j4969K01381N43503j12006p90886
34048B828295l70309K04831j72022o43703k19231K33304k28112p66374m94515
34039C72164j05192j57594J46248R51904Q70553l34782p31592M48389J181775
34030B641873K00623o89923M4732Q58177N5944j119016q62169J37886M64272M97984
34020B230383Q75803P41421k44594n36201N00730R38908m02190j649027j103228
34011A352005m3505j7476j62602M09862M75406n95216r39150M66421J549415P26273
34001C221433l27149K9350N67238J44008M9578Q62953O51728j073668j591378
33992B534093J08592R81111n27319j348659M05673J597550m3129j393471K10571
$$ plain form
34058 2104739 1927833 1052023 1106411 2239857 3001272 2986303 3187684 3731187 3619181 2828295
34048 2828295 2457986 2662817 2490795 1847092 1627861 1861165 1633053 866679 372164
34039 372164 266972 109378 255626 1207530 2078083 1743301 1011709 1460098 2641873
34030 2641873 2842496 2152573 2197305 3055482 3111426 1992410 1130241 1268127 1732399 2230383
34020 2230383 3106186 3847607 3603013 3066812 3567542 4506450 4104260 2455233 1352005
34011 1352005 1308500 1291024 1128422 1538284 2013690 1418474 479324 945745 2495160 3221433
34001 3221433 2894284 2923634 3490872 3634880 3684458 4547411 5199139 4125471 2534093
33992 2534093 2642685 3623796 3096477 1747818 2153491 3751041 3707912 2314441 2525012
33983B525012J815930M84818j090193Q0327J481209K69971r16737O77489J989819
33974G317645p0106k151024n21451J720293N85146j137666L21499J927608n5244
33965G936700k018556K29532K676054M62070k209283K36128L547566J381436k225343
33956A0016304l97431L031132R17054k717115k52075L965472J650588k397270
33948A3816659J024202O552240L769925j206343L839122J2239832J0047629N442142
33940E5525408J5011103K7548585K2339541K0813369O5513298J33879745J33846226
33933D74477275K4259340j09046449j50277790r3854689l0575148j6976247k4834869
33926G3171423j6575383k880106n172330j2857094q223312K69486k229091q464526
$$ plain form
33983 2525012 4340942 4825760 3735567 3815894 5297103 5567074 4650337 5327826 7317645
33974 7317645 7247539 5096515 4575064 6295357 6880503 5742837 6064336 7991944 7936700
33965 7936700 5918144 6147676 8823730 9285800 7076517 7312645 10860211 12241647 10016304
33956 10016304 9618873 12650005 13567059 10849944 10597869 14563341 16213929 13816659
33948 13816659 14840861 21393101 25163026 23956683 27795805 40035637 50083266 55525408
33940 55525408 70536511 98085096 120424637 141238006 206751304 340631049 474477275
33933 474477275 498736615 389690166 239412376 145557687 114982539 98006292 73171423
33926 73171423 56596040 53715934 48543604 35686510 27463198 27732684 25503593 17039067
33918A7039067n116896J919492O00604m497039k776003J922928J96251m347276
33910D941128k747471K034697J509441k289398j917527R75798P9284k520675q03246
33901g37969K758524J619512k377783k614620J48782L01159j490577m17024K250918
33892e59078J462047j552332j417901J199933J031695j777089k177841L58036
33884c432530J500077M04020L69268J639415J092902j087281j404648L79901J018732
33875D79856r6356n06190L5441m35043j356450m85627J161431O90030j078463
33866a591371q74167R22735J037758m99389o02306Q27902P95161r35718j414333
33857b333728j22207K92262p43824q37246N10324R94397P3003j47845P63074P39698
$$ plain form
33918 17039067 11922171 13841663 14442267 9945228 7169225 9092153 9288404 4941128
33910 4941128 2193657 4228354 5737795 3448397 1530870 2506668 2585952 65277 -737969
33901 -737969 2020555 3640067 1262284 -1352336 -1203554 -902395 -2392972 -2809996 -559078
33892 -559078 902969 -649363 -2067264 -867331 164364 -1612725 -3790566 -3432530
33884 -3432530 -1932453 -1528433 -1159165 480250 1573152 485871 -918777 -538876 479856
33875 479856 383500 -122690 -87249 -522292 -1878742 -2364369 -1202938 -512908 -1591371
33866 -1591371 -2465538 -1542803 -505045 -1004434 -1606740 -778838 16323 -919395 -2333728
33857 -2333728 -2455935 -2163673 -2907497 -3744743 -3234419 -2240022 -2167019 -2314864 -1551790 -812092
33847h12092n99581j117725j93147L49817o3631N7964Q81443P75215k95636n26092
33837a543465J98281J18011p84043o48228N17337O91361k52679k78370P93447
33828a188348Q36391m96459j069217k74066N1520n73614l77586Q94918J115770
33819a080691k65047j056920k68332L70182p05J30101J206536J288721k20816
33810A03029j033521J3046P56291l93947j511886n13606J269734J446316K94185
33801D29641l59687k33814k34819l76639j35864J44929r8662m64231l16347J38667
33791a506826M32836N48323M05067k52294r66030q10215R8712O65838N81222M95291
33781c08076L96518l21208j070555m91568J030265J503093M51529l88740q0221
$$ plain form
33847 -812092 -1411673 -2529398 -2722545 -2372728 -2436359 -2378395 -1496952 -721737 -1017373 -1543465
33837 -1543465 -1345184 -1227173 -2011216 -2659444 -2142107 -1450746 -1703425 -1981795 -1188348
33828 -1188348 -351957 -848416 -1917633 -2191699 -2140179 -2713793 -3091379 -2196461 -1080691
33819 -1080691 -1345738 -2402658 -2670990 -2300808 -2301513 -2171412 -964876 323845 103029
33810 103029 -930492 -917446 -161155 -555102 -2066988 -2580594 -1310860 135456 429641
33801 429641 69954 -163860 -398679 -775318 -911182 -766253 -864915 -1329146 -1645493 -1506826
33791 -1506826 -1073990 -525667 -120600 -372894 -1338924 -2149139 -2050427 -1384589 -803367 -308076
33781 -308076 88442 -232766 -1303321 -1794889 -764624 738469 1189998 801258 721037
33772G21037K02156l30554o61207j17092K71567k26298o55210j84853M64670M82971
33762c2813J88183r4569o55651j153067o02716O47847R16231q5455o27875R4013
33752a405872O50637M3936n97280k48707K46254K1524k23305J25869K81092k41251
33742a347103m70796J30517N16781R0582p9645N77814Q11419j28611q89433l58561
33732a147036L83752J40681l35313r6572J45812k53252k80576O62459J110497
33723C30452P0214q23266m0952R37405J33834j323119j106746K58108M66236m87813
33713a585647o00833L51895N84156k65312n40705L09621P98970J53992m32593
33704a226456n5611M57521K10092l24912l75280r3368L471j49291l70946m79863
$$ plain form
33772 721037 923193 592639 -68568 -185660 85907 -140391 -795601 -980454 -515784 -32813
33762 -32813 155370 60801 -594850 -1747917 -2350633 -1702786 -786555 -872010 -1499885 -1405872
33752 -1405872 -755235 -711299 -1308579 -1557286 -1311032 -1289508 -1512813 -1386944 -1105852 -1347103
33742 -1347103 -1817899 -1687382 -1170601 -1080019 -1159664 -581850 229569 100958 -788475 -1147036
33732 -1147036 -763284 -622603 -957916 -1054488 -908676 -1161928 -1442504 -780045 330452
33723 330452 400666 -422600 -463552 473853 607687 -715432 -1822178 -1564070 -1097834 -1585647
33713 -1585647 -2186480 -1834585 -1250429 -1515741 -2056446 -1746825 -947855 -793863 -1226456
33704 -1226456 -1282067 -824546 -614454 -939366 -1314646 -1408014 -1404543 -1553834 -1924780 -2404643
33694b404643j54924O68662J274028Q80399j64278p51340m97810n7673k8626k86498
33684a522703l67578J669O14343P89757J51397n04135o4711R75757Q63337o18357
33674C18776j425028l51996R48023N72980o77992q93807j70720Q3676j18279K94959
33664a419408J058180R26561O6109j73658K90043J94981p02905j210095p86898
33655a757090k42092j35110q3248J77785M38276P00433R33810M71575r12479j846276
33645b254416j008461N86726R29259J55629O3441P95626O61916n66848r56478
33636a593606K69872J268439N66801o91470q44179j97574L9245j81588j90410
33627a554470K2989J44692L46631P31444P97111K96713j91541k32477j78260k65984
$$ plain form
33694 -2404643 -2559567 -1890905 -616877 263522 99244 -652096 -1149906 -1207579 -1236205 -1522703
33684 -1522703 -1890281 -1888612 -1274269 -484512 -333115 -837250 -901961 73796 937133 318776
33674 318776 -1106252 -1458248 -510225 62755 -615237 -1509044 -1679764 -1596088 -1714367 -1419408
33664 -1419408 -361228 565333 631442 457784 747827 942808 239903 -970192 -1757090
33655 -1757090 -1999182 -2134292 -2217540 -2039755 -1601479 -901046 32764 504339 -408140 -2254416
33645 -2254416 -3262877 -2676151 -1746892 -1591263 -1527822 -732196 -70280 -637128 -1593606
33636 -1593606 -1323734 -55295 511506 -179964 -1024143 -1221717 -1182472 -1364060 -1554470
33627 -1554470 -1531481 -1386789 -1040158 -308714 488397 785110 593569 361092 182832 -83152
33617h3152r5860L81087M48054j24699n03083j77840J78409M908j44056K17841
33607A01609M39336j03838p53664o23335r5604q2117m19670k20113N62808J041072
33597a53516P24991O4142k96484j65822K15518M00273Q4853m57397n61702n2938
33587a98082M12852J62646o69735j329413j129922N2550J499236J948039Q60536
33578A608707o60819j038388k45016L44309J03274j57569Q6467J37373m60877
33569b82539q78520l99832K57013J49107k65254N3197R17749J195807N63714j61632
33559A148810l38729j96091j69243k69940k58474l7113J96178O6041n24805j038495
33549a421861q29839p4622M21841M02698L66284M72836K50320k76147k91908L73783
$$ plain form
33617 -83152 -179012 202075 650129 525430 22347 -155493 22916 27824 -116232 101609
33607 101609 540945 437107 -316557 -939892 -1035496 -1117613 -1537283 -1757396 -1194588 -153516
33597 -153516 571475 635617 339133 173311 388829 789102 873955 416558 -145144 -198082
33587 -198082 214770 377416 -292319 -1621732 -2751654 -2699104 -1199868 748171 1608707
33578 1608707 947888 -90500 -335516 8793 112067 -45502 40965 178338 -282539
33569 -282539 -1161059 -1560891 -1303878 -1154771 -1420025 -1366828 -449079 746728 1310442 1148810
33559 1148810 810081 613990 444747 174807 -83667 -120780 75398 141439 -383366 -1421861
33549 -1421861 -2251700 -2326322 -1904481 -1501783 -1135499 -662663 -412343 -688490 -980398 -606615
33539f06615O58907m6203p08903k38828O84314O88668q3256l11124L37506Q45692
33529A220158N85495P6418j54014l03655n75373o78935m48849k32678k88176l52349
33519a151958j28671K39555M41902M06517K60455J59053K25932L99933L56581
33510A209299j14136o93803q43760n09600j73726j91443l92324l90448m4867M27294
33500a717514O33336L44764j86482l60937J09470P74697R13902L73083k91422
33491E92897n05200l11226k07858m23468n52808j34397N06560M86461l60072j021207
33481a930318o54310J66763L75975J24274M02807J135876J045022l00789j609972
33472a244672j631072o85945K27797Q06616J086078P18015l12352r76134l75569
$$ plain form
33539 -606615 52292 6089 -702814 -941642 -257328 431340 348084 36960 374466 1220158
33529 1220158 1805653 1882071 1728057 1424402 849029 170094 -278755 -511433 -799609 -1151958
33519 -1151958 -1280629 -1041074 -599172 -192655 67800 226853 452785 852718 1209299
33510 1209299 1095163 401360 -442400 -952000 -1125726 -1317169 -1709493 -2099941 -2144808 -1717514
33500 -1717514 -1084178 -739414 -925896 -1286833 -1177363 -402666 511236 884319 592897
33491 592897 87697 -223529 -431387 -854855 -1407663 -1542060 -1035500 -549039 -909111 -1930318
33481 -1930318 -2584628 -2417865 -2041890 -1917616 -1514809 -378933 666089 365300 -1244672
33472 -1244672 -2875744 -3561689 -3333892 -2527276 -1441198 -723183 -1035535 -2011669 -2387238
33463b387238Q07058J116006L03315n00817m61918M5853K49955k8847l65720l09914
33453a532267J10433L62284Q8686k31338J04976P32361N08599n96691j104130
33444a557087k21814P90210N44495l15913l33189L00238K51506n08740o81100
33435a731394L1675M19976j22570o50417l65054J74796K36582J04328K99550N66575
33425a035953M25804J4851l10381n94297q91301q37632k32995M14244M95885J05264
33415b446511k22000k16716P4484N78314J094844J194303O48810j69295o17635
33406h1402m34923O7084L45759J36657k35136j57760M35070P90307L10477m93067
33396F83066o62302j86019R6702q8136j11065L06887N07927K3567n76973n89995
$$ plain form
33463 -2387238 -1580180 -464174 -160859 -661676 -1123594 -1077741 -827786 -856633 -1222353 -1532267
33453 -1532267 -1421834 -1059550 -970864 -1202202 -1097226 -364865 143734 -452957 -1557087
33444 -1557087 -1778901 -988691 -444196 -760109 -1093298 -793060 -541554 -1050294 -1731394
33435 -1731394 -1699719 -1279743 -1402313 -2052730 -2417784 -2242988 -2006406 -1902078 -1602528 -1035953
33425 -1035953 -610149 -595298 -905679 -1499976 -2391277 -3228909 -3461904 -3047660 -2551775 -2446511
33415 -2446511 -2668511 -2885227 -2810743 -2232429 -1137585 56718 705528 536233 -81402
33406 -81402 -516325 -449241 -103482 33175 -201961 -359721 75349 865656 1176133 683066
33396 683066 20764 -165255 -68553 -156689 -267754 39133 547060 570627 -6346 -596341
33386e96341k46761j82298l67666l36992j21049j34815k57182J61163J171804
33377i10137J742205Q89435r17805k021062j416625L9082P14384K73900q4333
33368a690956M29017R86384N29503m68408o96006J7117O14739N14722J73028n8729
33358C50411m01223p68334o12186L172K87671P7779J63268P81251R93456K49718
33348A124983o04632p39257o27531q89800r23170q17J091399J002794p8928p07424
33338a352383l09793L00053M29979K56737J9801l75910p81661p78778l76529L0551
33328b937933L50584O50359N68083j17262n88468P1772J165472J063814k82385
33319e5964j090047l86758O86457Q61139M56974J98037j67532q40270r18740J21605
$$ plain form
33386 -596341 -843102 -1025400 -1393066 -1730058 -1851107 -1985922 -2243104 -2081941 -910137
33377 -910137 832068 1721503 803698 -1217364 -2633989 -2594907 -1880523 -1606623 -1690956
33368 -1690956 -1261939 -275555 253948 -214460 -910466 -893349 -278610 236112 409140 350411
33358 350411 -50812 -819146 -1431332 -1428160 -1140489 -1062710 -899442 -118191 875265 1124983
33348 1124983 520351 -218906 -846437 -1736237 -2659407 -2660224 -1568825 -566031 -644959 -1352383
33338 -1352383 -1662176 -1362123 -932144 -675407 -655606 -1031516 -1813177 -2591955 -2968484 -2937933
33328 -2937933 -2587349 -1936990 -1368907 -1486169 -2074637 -2002865 -837393 226421 -55964
33319 -55964 -1146011 -1532769 -846312 14827 471801 669838 502306 -337964 -1256704 -1135099
33309a135099R97754L44564r75146j089947k9618N45066J87525J17879P46325
33300b90697Q94903N5026n50605p8265M86838J30065m59189l09081j6050n71294
33290g08349j320296q76156M89337J138220N42152j88743k73791j75095k71815
33281a644536q7071O18904J171566J021210N26558J66866j50494m80520m24727
33272G17756P9602L72467R6336j89448p7676j33845p88271j218460m65665Q73674
33262g33530J302397N29793k53392j82986L01798M67051K84065N7046j78942m45964
33252A147336n40058l50820j09386n9869j74209l17680l73922j60651L69571P95762
33242B26074N76642j56901o51189n23823j92270j04491j10717M3538J32442j16269
$$ plain form
33309 -1135099 -137345 207219 -767927 -1857874 -1887492 -1342426 -1154901 -1037022 -290697
33300 -290697 604206 659232 108627 30362 517200 647265 188076 -121005 -137055 -708349
33290 -708349 -2028645 -2904801 -2415464 -1277244 -735092 -923835 -1197626 -1372721 -1644536
33281 -1644536 -1731607 -1112703 58863 1080073 1606631 1773497 1623003 1142483 717756
33272 717756 797358 1169825 1266161 1076713 999037 865192 76921 -1141539 -1607204 -733530
33262 -733530 568867 1098660 845268 662282 964080 1431131 1715196 1772242 1593300 1147336
33252 1147336 607278 256458 147072 87203 -87006 -404686 -778608 -939259 -569688 226074
33242 226074 802716 645815 -5374 -529197 -721467 -825958 -936675 -893137 -760695 -876964
33232h76964l78311j34830M55215O78436K69426k19066j83482K85506O38255N77872
33222A112057K83646O2870K7131R7163J45524Q8492o5279k32290l82488n98893
33212E37933q65486q67549l09294N15135Q66077N06418Q9912J95597M03828J0318
33202A082889o45166n13498M78618J087755M46162p89556j481340j392195r03709
33193b630040j35119Q06212J292196Q64415J10002n3345L00610L81307L6201j37930
33183H34509N5757J26978j70615m94476o28766p48542q19691n01102J45474N29200
33173a671274L31588j37316m96382o26715m20494J35521N97645N06556K04231
33164a576640M04033R31518Q53283l580o99878o31764k87093j83835j30407k7133
$$ plain form
33232 -876964 -1255275 -1390105 -934890 -256454 12972 -206094 -389576 -104070 534185 1112057
33222 1112057 1395703 1458573 1485704 1582867 1728391 1816883 1751604 1519314 1136826 537933
33212 537933 -327553 -1195102 -1504396 -989261 -123184 383234 473146 668743 1072571 1082889
33202 1082889 437723 -75775 402843 1490598 1936760 1147204 -334136 -1726331 -2630040
33193 -2630040 -2765159 -1958947 -666751 197664 307666 254321 554931 936238 972439 834509
33183 834509 890266 1017244 846629 352153 -276613 -1025155 -1844846 -2345948 -2200474 -1671274
33173 -1671274 -1339686 -1477002 -1973384 -2600099 -3020593 -2885072 -2287427 -1780871 -1576640
33164 -1576640 -1172607 -241089 612194 608614 -91264 -723028 -1010121 -1193956 -1324363 -1351496
33154a351496k75470p36535m29415Q62559J770236J193582N113l45189n6566l06130
33144C30689r76951q08875L30766J047872N70932j87867k37411R7058Q7593j15627
33134A38179K9103L87711M12944O1407k46343k98474j67078J18668M49998M39367
33124A325482j02727o62479n67574K6160K71525j71622o26841l43470M74394R53358
33114E76206O30389j23930o49299o14083j23984M40924O29778K47755m00127p77811
33104a64182o69808k64654K33856O82450P24224O2965p99205q12336J79295R34375
33094A06980M46237n30997n25075N07941J201614P93420n3964n50561p40723q14116
33084a59244n09850K10821P00560M52392j80500n58864n11180j63701L44285O11602
$$ plain form
33154 -1351496 -1626966 -2363501 -2792916 -1930357 -160121 1033461 1038574 693385 636819 330689
33144 330689 -646262 -1455137 -1124371 -76499 494433 306566 69155 166213 253806 138179
33134 138179 167282 554993 967937 1029344 783001 484527 317449 436117 886115 1325482
33124 1325482 1222755 560276 -7298 18862 290387 118765 -508076 -851546 -377152 576206
33114 576206 1206595 1082665 433366 -180717 -304701 136223 766001 1013756 613629 -164182
33104 -164182 -833990 -1098644 -864788 -182338 541886 604851 -194354 -1006690 -827395 106980
33094 106980 553217 22220 -502855 5086 1206700 2000120 1946156 1395595 654872 -159244
33084 -159244 -669094 -458273 242287 694679 514179 -44685 -555865 -719566 -375281 236321
33074B36321J62973o69755q12820N7931Q59018N95737k32666n28333k16827j5138
33064e63559q9948l130K67414K62427n7323j93262O8433L91084M67742K99245
33054H49123q5276o47523j079600r91952l96933K91727O70134N64859R8137k51939
33044i79243k8756N11426N56081j21253p63332p52965m33766k88774q1938M53029
33034a929491Q24081N83865K55686M61823P44443L67736k61482k32414K43732
33025A057979K15615k72907k77718K91368M82480L774l07217l7245J07940l48105
33015I15964p83013n60729k6875J86338O8350q5212k09722k40101K3899M26140
33005b84961M20754j25638o41344o26043k14939J87143L23552J05283k32962j08461
$$ plain form
33074 236321 399294 -270461 -1083281 -1025350 -166332 429405 196739 -331594 -548421 -563559
33064 -563559 -653507 -656637 -389223 -126796 -184119 -377381 -308948 82136 549878 849123
33054 849123 763847 116324 -963276 -1955228 -2352161 -2060434 -1390300 -825441 -727304 -979243
33044 -979243 -1007999 -496573 59508 -61745 -825077 -1578042 -2011808 -2300582 -2382520 -1929491
33034 -1929491 -1105410 -521545 -265859 195964 940407 1308143 1046661 814247 1057979
33025 1057979 1273594 1000687 722969 1014337 1496817 1500591 1193374 1156129 1264069 915964
33015 915964 132951 -427778 -454653 -268315 -199965 -285177 -494899 -735000 -711101 -284961
33005 -284961 135793 10155 -631189 -1257232 -1472171 -1285028 -961476 -856193 -1089155 -1197616
32995a197616O10940J043474M21370n37945n63342J47826L24123r7618Q9718R32282
32985A173212Q84260m66359j292359l75078P82187L12778j053745j296851k71125
32976a603080M66544L20082J24963K53483J50267k25582j84748K76753L35248
32967h6070j29090k44294K58283M80638r1066o51870l74424L18240N39009K67793
32957B87149J01680J65949O1470l16508n71098m27105j17846k7074j69875j95228
32947a208486J01283M08403K56912k54940m43472M8718O68666O50500M8531l81506
32937a05391k24809J17145L9612m81051q26263l99783O07982J213857P15961k88363
32927C68897n33998J64454N81889j09280j063198j053532l02096N7017j31531
$$ plain form
32995 -1197616 -586676 456798 878168 340223 -223119 -75293 248830 151212 240930 1173212
32985 1173212 2057472 1591113 298754 -76324 705863 1018641 -35104 -1331955 -1603080
32976 -1603080 -1136536 -816454 -691491 -438008 -287741 -513323 -698071 -421318 -86070
32967 -86070 -215160 -459454 -201171 279467 188401 -463469 -837893 -519653 19356 287149
32957 287149 388829 554778 616248 299740 -271358 -698463 -816309 -843383 -1013258 -1208486
32947 -1208486 -1107203 -698800 -441888 -696828 -1140300 -1091582 -422916 227584 276115 -105391
32937 -105391 -330200 -213055 -173443 -654494 -1480757 -1880540 -1272558 -58701 657260 368897
32927 368897 -165101 -647 581242 471962 -591236 -1644768 -1946864 -1889847 -2021378
32918b021378L2460P77607J153427N67314k62518m52935k17780k88620o54180
32909a366603o60059j16289M03014L97092P5937k780L53085Q06959R14427N50866
32899A355649l2382m35260m00852n1083J42914j28988m55592n7152J023567J595079
32889B555900P88312n91468j083927o46599n20387j065177j188715l49152L79211
32880a722002J19077k84028K26797J017841Q83051K05587K56260Q20652M15989
32871A939224j127916k100261j338830K50098J175955J140694O92730J62730k99862
32862D94562l92215o5757K26300J48695j06401k86943l89700l10826J19061N33907
32852b9317K61534n37664q08721j12695O46879N75234N8132m1860K22547J62823
$$ plain form
32918 -2021378 -1988918 -1211311 -57884 509430 246912 -206023 -423803 -712423 -1366603
32909 -1366603 -2026662 -2142951 -1739937 -1342845 -1266908 -1269688 -916603 -109644 804783 1355649
32899 1355649 1323267 888007 487155 436072 578986 449998 -5594 -62746 960821 2555900
32889 2555900 3344212 2752744 1668817 1022218 501831 -563346 -1752061 -2101213 -1722002
32880 -1722002 -1602925 -1886953 -1660156 -642315 240736 446323 702583 1523235 1939224
32871 1939224 811308 -1288953 -2627783 -2377685 -1201730 -61036 631694 794424 494562
32862 494562 102347 36590 262890 411585 305184 18241 -371459 -682285 -563224 -29317
32852 -29317 232217 -305447 -1114168 -1226863 -579984 -4750 53382 11522 234069 396892
32842C96892l08988n89038l54933N8249K08843J4022k68098k42791K41119P24454
32832a20269N28162k41898n91821M7549R17138R07161L2062p14966p03454k04762
32822a45098K50554M13074K37889j73248m72986l19529J81191N50915M81427J07565
32812A111754k14372k34299o636J12175j78342o70504q03667l77580K20396O10037
32802d31038P72904O39362k5421r11171j045998r4554Q28373N63722l36005m06894
32792d46720M10902O55085k64078j008353l89661P22821P41024k14123o46423
32783d39526j18010J67066n61005j346206j000845J06760P14827N05222K41177
32774a730540L60513M94742M33157N87240J148331J523637J095111P6599p91877
$$ plain form
32842 396892 87904 -501134 -856067 -797818 -588975 -574953 -843051 -1085842 -844723 -120269
32832 -120269 407893 165995 -425826 -378277 538861 1446022 1478084 763118 59664 -145098
32822 -145098 105456 518530 756419 583171 110185 -209344 -28153 522762 1004189 1111754
32812 1111754 897382 663083 656447 768622 590280 -80224 -883891 -1261471 -1041075 -431038
32802 -431038 341866 981228 955807 44636 -1001362 -1095916 -267543 296179 -39826 -446720
32792 -446720 -35818 619267 355189 -653164 -1042825 -320004 421020 206897 -439526
32783 -439526 -557536 -390470 -951475 -2297681 -3298526 -3191766 -2476939 -1971717 -1730540
32774 -1730540 -1370027 -875285 -442128 145112 1293443 2817080 3912191 3988790 3196913
32765C196913j054375p42540j49968K78073J78470k98492n91174m49666j57715
32756B09526R1346M23899O67404L05240n01581p24391Q522N75571n044r25558
32746A24934p86613K13586P25064M51492L12900N52777L62438m22817q61282n57439
32736A15040k99702n09060m69460K09942P04861L73662j58465j82822l7010j39591
32726c92605m0373N05375O01758m03186j500696j314261j09483P66252Q29740
32717a057479N74808K30307k45908m06713R1423N30526J16945m80652o1653R61269
32707B52873J014641r9803q33072k87628O11810P81605L74550k7157l21133m09070
32697A057616k192N19662K15186q52204j341564o14361K37124J95517q7145L54504
$$ plain form
32765 3196913 2142538 1399998 1250030 1528103 1706573 1408081 816907 367241 209526
32756 209526 300872 724771 1392175 1697415 1195834 471443 479965 1055536 1050492 124934
32746 124934 -661679 -448093 276971 728463 1041363 1594140 1956578 1533761 672479 115040
32736 115040 -184662 -693722 -1163182 -953240 -248379 125283 -33182 -216004 -253014 -392605
32726 -392605 -432978 72397 674155 270969 -1229727 -2543988 -2653471 -1887219 -1057479
32717 -1057479 -482671 -252364 -498272 -904985 -813562 -283036 -166091 -646743 -708396 252873
32707 252873 1267514 1167711 334639 47011 658821 1440426 1814976 1787819 1466686 1057616
32697 1057616 1055424 1575086 1790272 938068 -403496 -1017857 -780733 -585216 -672361 -317857
32687c17857R45448N28095n50933q71814j40801N06480L63394k7947j13717j90077
32677A30271n87247r18542o99035r0279M53816P93660R19653O10266j88692r05685
32667d81814q27458k3563O50196N80678R5850q1533J57265K14534l00942r58900
32657i75687j044872m53958K91998P61228R25734Q12631L52121k67085n29244
32648a27134j89380L20651L79361q8055n99156p13551m19913p53K88601L90516
32638g58813L79497K70849j2943m05316n85331l32121J27436M02787M47099M39394
32628b7462L24464k7545l06303o1278M35974L62583m00591r32732n86211Q0618
32618a138483K39765J2298K7931K83374K94385P2541O7962K71666K20028j12170
$$ plain form
32687 -317857 627591 1155686 604753 -267061 -407862 98618 462012 434065 320348 130271
32677 130271 -456976 -1375518 -2074553 -2164832 -1711016 -917356 2297 612563 423871 -481814
32667 -481814 -1309272 -1332835 -682639 -101961 -6111 -87644 69621 284155 -16787 -975687
32657 -975687 -2020559 -2474517 -2182519 -1421291 -495557 317074 669195 402110 -127134
32648 -127134 -316514 4137 383498 295443 -303713 -1017264 -1437177 -1437930 -1149329 -758813
32638 -758813 -379316 -108467 -121410 -526726 -1112057 -1444178 -1316742 -913955 -466856 -27462
32628 -27462 297002 269457 -36846 -98124 337850 700433 299842 -632890 -1219101 -1138483
32618 -1138483 -898718 -886420 -858489 -575115 -280730 -208189 -140227 131439 351467 239297
32608B39297k16117P0622L24241L07091K63573K62463j7262n48132p24281k98248
32598c36753J05901m8015l15571j589O63983Q42156L24822k97911n95815o77006
32588c35798n99883j59104N42977R46572P46430K55004j91856o53356j086262
32579e35276j016503k49888N35385N66606P3907p7946L04360N59085L00421n5583
32569D04568j24435j79584n04632p14142l40651K61849K94142k98544o43570r5002
32559a940001Q71371J182736L86662q74381j542743j153341j49611O85666R49697
32550a583945P45119L45020J0181l214L47399O68839N10800J5745k30755p3439
32540G51750N32l00957n85453m32346n993L59738O48352P95451M34421m00638
$$ plain form
32608 239297 23180 93802 418043 725134 988707 1251170 1233908 685776 -38505 -336753
32598 -336753 -230852 -278867 -594438 -596027 67956 910112 1234934 937023 341208 -335798
32588 -335798 -935681 -1094785 -551808 394764 1141194 1396198 1204342 550986 -535276
32579 -535276 -1551779 -1801667 -1266282 -699676 -625769 -703715 -399355 159730 460151 404568
32569 404568 280133 100549 -404083 -1118225 -1458876 -1197027 -902885 -1201429 -1844999 -1940001
32559 -1940001 -1068630 114106 500768 -373613 -1916356 -3069697 -3219308 -2533642 -1583945
32550 -1583945 -838826 -493806 -483625 -486839 -139440 529399 1040199 1055944 825189 751750
32540 751750 752282 451325 -134128 -566474 -572467 -212729 435623 1231074 1665495 1264857
32530A264857q91659m91509J42309R4617m08247n18068k50463k67785m44930k2889
32520a793767P89183Q05134k02727r08900l69984O15431Q07781J91642m31193
32511d97400o47600m59779J06482O68783N36143j74506l17520N75281J317407
32502A107291Q14497j83756l74585o1026m09378j178705j043436M6952P02973
32493e79173L79615K3502J46750O4655m03893k90324O03916Q64511k60979j284201
32483g35621o75058O37130P31896k72252o48616k6306J91105n62656r84853r3488
32473b438719J153809J327108M69985l33357n09744k58319J34295M53671M40199
32464D38928J29116m2169Q5604O8451l38271o16795k94919K40614M04205L41165
$$ plain form
32530 1264857 373198 -118311 23998 118615 -289632 -807700 -1058163 -1325948 -1770878 -1793767
32520 -1793767 -1004584 -199450 -402177 -1311077 -1681061 -1065630 -257849 -66207 -497400
32511 -497400 -1145000 -1604779 -1498297 -829514 -293371 -467877 -785397 -210116 1107291
32502 1107291 1921788 1738032 1363447 1302421 893043 -285662 -1329098 -1282146 -579173
32493 -579173 -199558 -176056 -29306 35349 -368544 -658868 -54952 809559 548580 -735621
32483 -735621 -1410679 -773549 -41653 -313905 -962521 -988827 -797722 -1360378 -2345231 -2438719
32473 -2438719 -1284910 42198 512183 178826 -330918 -589237 -454942 -1271 438928
32464 438928 568044 525875 611479 679930 341659 -275136 -570055 -329441 74764 415929
32454D15929M17281L15144l67001j008623o36802M37647Q89026L67627n0405K69645
32444A049468N17096j1278n48099j10756P38065O56103l92584j078695o38269
32435A81051K65174P25882O45918L18282j68643o53357o87584j42426L85191K64676
32425A134164l25643o64890m35877l2368L6245k33608l82640n5723N37783Q04725
32415C82168M62031q4829k20930J42813N30447M89085j7913o80334j044665q04617
32405h46744j83381J70797K488j38209K24307N77168J40362p57564r93232l05330
32395b109338M02803N60778O13305Q49620P25840J2073m62829r8374L68162N8407
32385I20447n51375n01061k9709m1953l81096j40016N16365M33249n03410r60237
$$ plain form
32454 415929 833210 1148354 781353 -227270 -864072 -426425 462601 830228 779823 1049468
32444 1049468 1566564 1555286 1007187 896431 1634496 2290599 1898015 819320 181051
32435 181051 446225 1172107 1818025 2136307 1967664 1314307 626723 484297 869488 1134164
32425 1134164 808521 143631 -292246 -324614 -288369 -521977 -904617 -960340 -422557 382168
32415 382168 844199 759370 538440 681253 1211700 1700785 1682872 1002538 -42127 -846744
32405 -846744 -1030125 -859328 -856840 -995049 -770742 -193574 -53212 -810776 -1804008 -2109338
32395 -2109338 -1706535 -1145757 -532452 317168 1043008 1055081 592252 493878 862040 920447
32385 920447 369072 -131989 -161698 -203651 -584747 -724763 -208398 224851 -278559 -1238796
32375a238796k09178P97378J023733P75935P36761O78122J32472m84300m93174
32366A718953j44870j90151o32082q24462n58848k24263o0089K7594O7328O4224
32356g56666K09459M63779L06249m05540q00857j60987P10701M89176n40361p74657
32346a259704K00443R12744K89775p80574r69219l64308J71716M64935P18480
32337f15712N90709j63953p72582m46966J93784L7859n98797m55817M84143R04097
32327h43235L23085k51571j55447K8329q6327Q7856O70221O17654m59806j159942
32317a229183k97074J082185J197586J68003m76924k85074j60492m73642o01551
32308a076166l39938k18676k73548O4612O54241O11608j05696m39656L7717M46448
$$ plain form
32375 -1238796 -1447974 -650596 373137 1149072 1885833 2563955 2696427 2212127 1718953
32366 1718953 1574083 1383932 751850 -72612 -631460 -855723 -915812 -888218 -820890 -756666
32356 -756666 -547207 -83428 222821 -182719 -983576 -1144563 -433862 55314 -485047 -1259704
32346 -1259704 -1059261 -146517 143258 -637316 -1606535 -1970843 -1799127 -1334192 -615712
32337 -615712 -25003 -188956 -961538 -1408504 -1214720 -1176861 -1775658 -2231475 -1747332 -843235
32327 -843235 -520150 -771721 -927168 -898839 -985166 -897310 -227089 390565 -69241 -1229183
32317 -1229183 -1526257 -444072 753514 921517 444593 159519 -973 -474615 -1076166
32308 -1076166 -1416104 -1634780 -1908328 -1843716 -1189475 -577867 -683563 -1123219 -1085502 -639054
32298f39054J62154k14998r6667Q4241j32443l04150O124L32545J81136m8218
32288f69330J14933K71755l8512l29442L5384O36925N96793p8654o62851p96336
32278i19335n67794K7835Q33719J173801O52686q0727k33586p9201l22306p31333
32268b46241n35504J19998L09263j77778n76946m12132l8683J38483J37288N3904
32258a228348j6637J90742O43166O46457j80546r25467m75645O94499J105489
32249D53710M85286j6597J54265K52734j78272n25639m10372l64546n86320l77567
32239a113318M30440Q10363J94504m56278k77198J9438m53175r78234m12242O71218
32229a564482P59114j01730l85748L43336P13744j45333j112900p85426L99684
$$ plain form
32298 -639054 -476900 -691898 -788565 -704324 -836767 -1140917 -1134793 -802248 -621112 -669330
32288 -669330 -554397 -282642 -321154 -650596 -615212 21713 618506 539852 -122999 -919335
32278 -919335 -1487129 -1459294 -625575 548226 1200912 1120185 886599 807398 485092 -246241
32268 -246241 -781745 -661747 -352484 -530262 -1107208 -1519340 -1558023 -1419540 -1282252 -1228348
32258 -1228348 -1244985 -1054243 -411077 235380 54834 -870633 -1346278 -651779 453710
32249 453710 938996 922399 1076664 1329398 1151126 625487 215115 -149431 -735751 -1113318
32239 -1113318 -682878 127485 321989 -134289 -411487 -392049 -845224 -1823458 -2235700 -1564482
32229 -1564482 -805368 -907098 -1292846 -949510 -235766 -381099 -1493999 -2279425 -1879741
32220a879741Q52301R9314p08760m97972L96327R04537O72701K88485K25398K06671
32210E59261j08279l51497j4204M86249J98679q05666j218271l08827Q78521R21405
32200B37371N580m74742j4084L98298j04425j006240j240342o42923L7221K69053
32190b535233K55152L26301L61664J04071k44675j88819L10283O77837N05183
32181d28236J04115l3357L7197P129K4928M26176Q85548O46644k72626q70347
32171E27171m79764L35127O11308K01210k92747m09511k06121K2996O2215o3498
32161C08386j21804m1980j42378n77583p54327m3053R85302J018548r4126r60304
32151d23319o14453J99818L91826J21274R8442K04153l2615k70540N8001M66699
$$ plain form
32220 -1879741 -1027440 -928126 -1636886 -2134858 -1738531 -833994 -161293 127192 352590 559261
32210 559261 450982 99485 85281 571530 770209 -35457 -1253728 -1562555 -684034 237371
32200 237371 242951 -231791 -245875 152423 47998 -958242 -2198584 -2841507 -2804286 -2535233
32190 -2535233 -2280081 -1953780 -1592116 -1488045 -1732720 -1921539 -1611256 -933419 -428236
32181 -428236 -324121 -357478 -320281 -313152 -288224 137952 1023500 1670144 1397518 527171
32171 527171 47407 382534 993842 1195052 902305 492794 286673 309669 371884 308386
32161 308386 186582 144602 2224 -575359 -1329686 -1372739 -387437 631111 536985 -423319
32151 -423319 -1037772 -837954 -446128 -324854 -226412 -22259 -54874 -325414 -267413 199286
32141A99286N2023q37125r18484K9174P71948M49804l36338o48190m46774k02454
32131a887130l6085J82509L83558M33322M14021M54695N22393N41047M72482K34259
32121A715071j72059m78129m44847k79662l56095n97404n97116k73714R8624M31090
32111i54241Q20851J062279Q01504K16065j12275r4032k20539n98548o47629j19476
32101A53959K76662j46712r14500r20105M9069R43479P54549k26307p86366l08110
32091a124382N02860O18463O2819k62789L586K34842r244k16752J06607M72558
32081C88568K38380k08438r9853L02597R6085o48539q62873j57225N96639O17248
32071B62589J56398k40718m93829n90420k81477L14400N27538J02227k64273J07525
$$ plain form
32141 199286 251309 -585816 -1504300 -1475126 -703178 -253374 -589712 -1237902 -1684676 -1887130
32131 -1887130 -1923215 -1740706 -1357148 -923826 -509805 -55110 467283 1008330 1480812 1715071
32121 1715071 1543012 1064883 620036 340374 -15721 -613125 -1210241 -1483955 -1385331 -954241
32111 -954241 -133390 928889 1730393 1946458 1834183 1740151 1519612 921064 273435 153959
32101 153959 430621 283909 -630591 -1550696 -1501627 -558148 196401 -29906 -816272 -1124382
32091 -1124382 -621522 -3059 59760 -203029 -199443 35399 26155 -190597 -83990 388568
32081 388568 626948 418510 318657 621254 717339 68800 -794073 -951298 -354659 262589
32071 262589 418987 178269 -315560 -905980 -1187457 -873057 -345519 -243292 -507565 -400040
32061d00040Q81940J211967Q23541J17628m47666o42194m57504k11309l61456
32052E14907q63690j021232l54769O21128Q90760J28145q69826r70081R9125J317370
32042e08163J334212M5512j123635r12481J87422O99542J86499m20246m02805
32033i14143j04006q280J8310J70656K16432J0587j78011k12114k89597l15267
32023a605433J46785R23018J071246K03835p74045q52928k24978J90684J034m31173
32013a351955n84517j99656M87303P40773J31848n96023l46172N57537O33438
32004e27424l94814r66493j36356Q77035P44380J84387N06980J185639P93537
31995B266871l97107q05052k11448j2538p30989j185174n72096K80309M00333
$$ plain form
32061 -400040 481900 1693867 2517408 2635036 2187370 1545176 1087672 876363 514907
32052 514907 -348783 -1370015 -1724784 -1103656 -212896 -84751 -954577 -1924658 -1825533 -508163
32042 -508163 826049 871561 -252074 -1164555 -977133 -277591 -91092 -511338 -914143
32033 -914143 -1018149 -1026429 -1008119 -837463 -621031 -610444 -788455 -1000569 -1290166 -1605433
32023 -1605433 -1458648 -535630 535616 739451 -34594 -887522 -1112500 -921816 -920782 -1351955
32013 -1351955 -1936472 -2136128 -1648825 -908052 -776204 -1372227 -1718399 -1160862 -527424
32004 -527424 -922238 -1888731 -2025087 -1148052 -403672 -219285 287695 1473334 2266871
31995 2266871 1869764 1064712 853264 840726 109737 -1075437 -1647533 -1367224 -966891
31986i66891O0060n3000M9376R8773K15509M11409K27792m41477q28188k90501
31976a517138O61192R85019M06830m29646q24586n84071L8188N58733N84013K12310
31966I0844j9879J91598M66684K06543n56898j020811m81994O77171J173105L25572
31956A051935q67763q53403L08977R00816L4868r67500n86223N47203O90063k71306
31946a2333p58057j7525Q97706R01994K36885l61121o73125p00570l81324o5332
31936i32802l21717q50989n93118N85242J357937P73134l23225n18857K64604
31927e59791R59848Q78314K40840m06206o29025k99071J46073L3458n62877p36004
31917i34441p0473O52385O52134L09299L71799O84845O16442J95241j46484n03623
$$ plain form
31986 -966891 -906831 -959831 -910455 -811682 -596173 -184764 43028 -398449 -1226637 -1517138
31976 -1517138 -855946 129073 535903 106257 -718329 -1302400 -1264212 -705479 -121466 90844
31966 90844 70965 262563 729247 935790 378892 -641919 -1123913 -446742 726363 1051935
31956 1051935 184172 -669231 -360254 540562 575430 -392070 -978293 -431090 258973 -12333
31946 -12333 -770390 -787915 109791 1011785 1248670 887549 214424 -486146 -867470 -932802
31936 -932802 -1254519 -2105508 -2698626 -2113384 -755447 17687 -305538 -824395 -559791
31927 -559791 400057 1278371 1519211 1113005 483980 184909 330982 364440 -198437 -934441
31917 -934441 -1004914 -352529 299605 608904 980703 1665548 2281990 2477231 2330747 1827124
31907A827124j123015j461873q04549L11864N07687m56776j228624p61400K98295
31898b891267O85938K47412j07636K14723Q20579R63373M25371l02178n59036
31889e02721k06201K33092J97009k39780n21176l72199r1847k7667p3624R9496
31879a505618M84110O60524L09666l37835o87856m29480J15690L94012K79092
31870g17695J41027K79472N20776M76349P0616k88502q5173O65582J169173N79811
31860B811436q23104j627247r18223M87019J098546O70931J46950n1446m33891
31851A360971j045784j029607j17603O55086M94322J8681j4192p7417p66730j237148
31841a759421k96399J408215J903479N67890j097592j549802q41309R2637O69147
$$ plain form
31907 1827124 704109 -757764 -1562313 -1250449 -742762 -1199538 -2428162 -3189562 -2891267
31898 -2891267 -2205329 -1957917 -2065553 -1850830 -1030251 -66878 358493 56315 -502721
31889 -502721 -708922 -475830 -278821 -518601 -1039777 -1411976 -1503823 -1531490 -1605114 -1505618
31879 -1505618 -1021508 -360984 -51318 -389153 -1077009 -1506489 -1390799 -996787 -717695
31870 -717695 -576668 -297196 223580 699929 770545 482043 396870 1062452 2231625 2811436
31860 2811436 1988332 361085 -557138 -70119 1028427 1699358 1846308 1794862 1360971
31851 1360971 315187 -714420 -832023 -176937 317385 336066 321874 244457 -522273 -1759421
31841 -1759421 -2055820 -647605 1255874 1823764 726172 -823630 -1664939 -1572302 -903155
31832i03155P39688L26082k25254m09819j84877O3328K07069L83338L61011k23931
31822A33480r36930q43319L4492N77892K44004j78764o599K25112j35985n88561
31812a475178l11238M16658O88468M11910K41500L57076L27704Q6960Q6906M02147
31802A232913M87223J8213o23369q80549n97625o948M65502M09679j44692n88950
31792b28603m29899M1642K53036K47692L93223M49546r8813q04805n15828P70419
31782G7610J449602M66133j004401j079157K23479J110210N35647o22668j074470
31773H1985o98725j35111L15972O49360N80809j29097r67639j043619k32509O12241
31763i66333P26063K60157j26096r3180K09307M85549N03261J65445l35526n67485
$$ plain form
31832 -903155 -163467 162615 -62639 -472458 -657335 -594007 -386938 -3600 357411 133480
31822 133480 -803450 -1646769 -1612277 -1034385 -790381 -969145 -975744 -750632 -886617 -1475178
31812 -1475178 -1786416 -1369758 -681290 -269380 -27880 329196 656900 743860 830766 1232913
31802 1232913 1720136 1738349 1114980 234431 -363194 -370142 95360 505039 360347 -228603
31792 -228603 -658502 -616860 -363824 -116132 277091 726637 627824 -176981 -692809 77610
31782 77610 1527212 1993345 988944 -90213 133266 1243476 1779123 1156455 81985
31773 81985 -616740 -751851 -435879 213481 794290 665193 -302446 -1346065 -1578574 -966333
31763 -966333 -240270 19887 -106209 -199389 9918 495467 998728 1164173 828647 261162
31753B61162l19898R1364K13873K4883j60063k12049k74427l87146m06104l08155
31743a476560k03147r912M57118R82622J010541M34237j29069j70561L3625k1660
31733I07234k58593k92063j70859k04390k91370j29957N9688j76830n65955l49985
31723a473080L60596M76142l98059j121272n72455O91127J213800N90300k83752
31714e16653o18614m76141k06615L9785J90322K48637L91845N75477K98385n78958
31704f52530j132032m33025Q97416J310562M74954l93043m72776l06526m48230
31695a155230m85799r2980J42854k02521n18039k49227J17110Q9651J80156P99339
31685a374686J158301N41125k71032k71197K000l83949p24134J64517J392440
$$ plain form
31753 261162 -58736 32628 246501 271384 111321 -100728 -375155 -762301 -1168405 -1476560
31743 -1476560 -1679707 -1689619 -1232501 -249879 760662 1194899 1065830 895269 928894 907234
31733 907234 648641 356578 185719 -18671 -310041 -439998 -380310 -557140 -1123095 -1473080
31723 -1473080 -1112484 -636342 -1034401 -2155673 -2728128 -2037001 -823201 -232901 -516653
31714 -516653 -1135267 -1611408 -1818023 -1778238 -1587916 -1339279 -947434 -371957 -73572 -652530
31704 -652530 -1784562 -2217587 -1320171 -9609 465345 72302 -400474 -707000 -1155230
31695 -1155230 -1641029 -1734009 -1591155 -1793676 -2311715 -2560942 -2443832 -2354181 -2174025 -1374686
31685 -1374686 -216385 324740 53708 -217489 -215489 -599438 -1323572 -1159055 233385
31676B33385R95795o99122j248909Q6008J249310Q22672R166J5379q9548j175092
31666A99044j863352p52512Q04359O09608p76609r06579O35463J717130J047567
31657G14119k22855o86661m79474k33992J37759P83185J212065J011154M19628
31648B654928k45708q89482j099469l61329P89482R22667l64814j621796j358744
31639a574265N8784J067569Q74280M1658m98173l71037J13958L63356J35938j50859
31629F1209n1870J04565k93625r17756p28492L51715J050388N38691l73629n45473
31619h04277j08539J23054P6286J92207L35566P4888k80867n9106N34986O67651
31609G51849L03681K22139N05306K52735p89530j494780r79757J014K27159j52774
$$ plain form
31676 233385 1229180 530058 -718851 -632843 616467 1439139 1448305 1463684 1374136 199044
31666 199044 -1664308 -2416820 -1612461 -1002853 -1779462 -2686041 -2050578 -333448 714119
31657 714119 491264 -195397 -674871 -908863 -771104 12081 1224146 2235300 2654928
31648 2654928 2409220 1519738 420269 58940 848422 1771089 1406275 -215521 -1574265
31639 -1574265 -1515481 -447912 426368 468026 -30147 -401184 -287226 76130 212068 61209
31629 61209 9339 113904 -179721 -1097477 -1825969 -1474254 -423866 114825 -258804 -804277
31619 -804277 -912816 -789762 -713476 -521269 -185703 -110815 -391682 -450788 84198 751849
31609 751849 1055530 1277669 1782975 2035710 1246180 -248600 -1228357 -1227343 -1000184 -1152958
31599a152958q8999N08226O63507O3548l87715j14621J55498l34850j016004q54805
31589b559173J5200N93255O06993O57640Q61796N95138j71622n07950l1487L49365
31579D09155l2484l98262Q6056O54819J02115j021350j058493O5519N83437l35517
31569i45005j226340n88875Q49720J310119M93040l43757l57920N8268L08035
31560d42715L72392M01213L03843K3627k54010l58030k84921n0374L03442N61753
31550E76220N24428L21114K11442J19978k21288o55847o13800O6151P33170O65429
31540A726997l9705o51469p05341l45098J20861N21380O15127J20285p23828j076751
31530d37542n02509K62910K22678l98610m59151K76052O68022l18p81204m54666
$$ plain form
31599 -1152958 -1241957 -733731 -70224 -6676 -394391 -509012 -353514 -688364 -1704368 -2559173
31589 -2559173 -2543973 -1950718 -1343725 -686085 175711 770849 599227 91277 59790 409155
31579 409155 376671 -21591 64465 719284 821399 -199951 -1258444 -1192925 -609488 -945005
31569 -945005 -2171345 -2760220 -1910500 -600381 -107341 -451098 -809018 -750750 -442715
31560 -442715 -70323 330890 634733 658360 404350 46320 -238601 -288975 14467 576220
31550 576220 1100648 1421762 1633204 1753182 1531894 876047 262247 328398 1061568 1726997
31540 1726997 1687292 1035823 330482 -14616 106245 627625 1242752 1363037 639209 -437542
31530 -437542 -940051 -677141 -454463 -853073 -1312224 -1036172 -368150 -368468 -1149672 -1604338
31520a604338O13103J083535O39831J79722J92771J48162l51347q46712p99006
31511g44279l10571K40708O36734O63313J78314m33961n21169j04685Q2855k70976
31501e83717n85537l63463L6603L7800k79425l87482l9651N27738Q55264O18563
31491a63307L7444j66188L16668P48813L40785m13294m22281J76755K22527l85059
31481B92863l80472O28877J234407M20047p48127p97669m9702J81854k92559n97424
31471a07905l78592m8002J78640L89515M19533R6380k65798l37415k83071k04469
31461e41184J88600O72317K80061j050326j683500m36381J450860J975654J123689
31452A979790L14265o5286o26624j085550n67859M11174M21995l97748m47641
$$ plain form
31520 -1604338 -991235 92300 732131 911853 1104624 1252786 901439 54727 -744279
31511 -744279 -1054850 -814142 -177408 485905 664219 230258 -290911 -395596 -312741 -583717
31501 -583717 -1169254 -1532717 -1496114 -1458314 -1737739 -2125221 -2164872 -1637134 -781870 -163307
31491 -163307 -125863 -292051 24617 773430 1114215 700921 278640 455395 677922 292863
31481 292863 -87609 541268 1775675 2195722 1447595 649926 600224 782078 489519 -107905
31471 -107905 -486497 -534499 -355859 33656 453189 549569 283771 -53644 -336715 -541184
31461 -541184 -352584 319733 599794 -450532 -2134032 -2570413 -1119553 856101 1979790
31452 1979790 2294055 2228769 1602145 516595 -51264 359910 781905 384157 -63484
31443f3484N47583R95055J38610p81628p79424n49883p31531o07418K97946R56465
31433e77709M80392l16819l07127J66843J85575r4177L835L03996K29979m7621
31423B7167m7970O3248k1553L6625M88057O83517R2395n61694l71397J74786j7383
31412E45798p64612q99975j90876M01320L40762J43534K56977M08775L20968J82649
31402G45320J44936M6944j58880l00684m00650o17710p43490l83668K73902N07320
31392h86660P1814l77018j53210N36537Q46970L28711n08418p44259j60631M14037
31382f32127J88491l86235j91084P72687J137404J51213j044583r49832J87587
31373g66479Q23793K74869o24174q77028m01783K83317O73564M83898j35724n19720
$$ plain form
31443 -63484 484099 1479154 1617764 836136 56712 -493171 -1224702 -1832120 -1534174 -577709
31433 -577709 -97317 -414136 -721263 -554420 -368845 -463022 -459187 -155191 74788 27167
31423 27167 -20803 42445 20892 57517 545574 1229091 1321486 759792 388395 563181 545798
31412 545798 -218814 -1118789 -1309665 -908345 -567583 -424049 -167072 241703 562671 745320
31402 745320 890256 937200 778320 477636 76986 -540724 -1284214 -1667882 -1393980 -886660
31392 -886660 -814846 -1191864 -1345074 -808537 38433 367144 -141274 -885533 -1046164 -632127
31382 -632127 -443636 -829871 -1020955 -248268 889136 1040349 -4234 -954066 -766479
31373 -766479 57314 332183 -291991 -1169019 -1570802 -1287485 -613921 -130023 -265747 -785467
31363g85467j47257N99233Q32607L12426k98221l61939l610J93245n7859m01631
31353a18473k28702M78521Q33768Q9667j068691j149577j1553O95198j09794j242586
31343a832222r88942L80791J194353Q57885K47042o1808l86508p56665o05598
31334a951672Q5747N65705N33100M89854O26935M76275j9395k13114P3083J73960
31324H40478j57708k21368L01383N72668l4641p25490m21538N44932Q98561K23180
31314A820457o22985p69427k81149J82391J72955j60520k94863K7972M01996K63260
31304G40087k56934m50735l7590M98717O73224N07754J41562m13189r10463r10261
31294d17828m35746R967K51391N48586P47101K55925p71548j226936n79010L08235
$$ plain form
31363 -785467 -932724 -333491 499116 811542 513321 151382 147772 341017 283158 -118473
31353 -118473 -347175 131346 965114 1054781 -13910 -1163487 -1175040 -479842 -589636 -1832222
31343 -1832222 -2821164 -2440373 -1246020 -388135 -141093 -202901 -589409 -1346074 -1951672
31334 -1951672 -1865925 -1300220 -767120 -277266 349669 825944 806549 593435 666518 840478
31324 840478 682770 461402 762785 1335453 1300812 575322 153784 698716 1597277 1820457
31314 1820457 1197472 428045 146896 329287 502242 341722 46859 74831 476827 740087
31304 740087 483153 32418 -5172 493545 1166769 1674523 1816085 1402896 492433 -417828
31294 -417828 -853574 -843607 -592216 -43630 703471 959396 187848 -1039088 -1618098 -1309863
31284a309863N35331M07567N33490O34182K65150r6879J36546M25603o0031q68851
31274F02245q93323k32900J5505k95913j53283P06548J161398N00934m14753n22043
31264D74415o7129P1994j98637l35546k18984k27345m87951p04974o20818k24588
31254b539563L29365O96861N17511n8906l56344n4844K98689J35949j92007N81
31244a222708M99372M10264l84316q83559l95858M53216O81244L41682K35340
31235b65323N54240O48125J53093m22943n12716k59551o1471J28202M62702N48180
31225I72538r7317j023337j111330r8079Q63792O42909l70430q22415k00443O09578
31215f34534O13807n3014m88100k26312L49367O62190N58336J81460l74586r66399
$$ plain form
31284 -1309863 -774532 -366965 166525 800707 1065857 968978 1105524 1531127 1471096 602245
31274 602245 -291078 -523978 -508473 -804386 -957669 -251121 910277 1411211 996458 474415
31264 474415 407286 479280 280643 -54903 -273887 -501232 -989183 -1694157 -2314975 -2539563
31254 -2539563 -2210198 -1513337 -995826 -1054732 -1411076 -1465920 -1167231 -1031282 -1223289 -1222708
31244 -1222708 -723336 -313072 -697388 -1580947 -1976805 -1523589 -842345 -500663 -265323
31235 -265323 288917 937042 1090135 667192 154476 -105075 -166546 -38344 424358 972538
31225 972538 875221 -148116 -1259446 -1357525 -493733 149176 -221254 -1043669 -1244112 -634534
31215 -634534 -20727 -73741 -561841 -788153 -438786 223404 781740 963200 588614 -377785
31205c77785j169310o08569M24398J093506R53153M38860J83757J83310J6076
31196A137396l72242n99376m57804j38512J28613K64595K11812l751j41794n6820
31186b7883n005j98801k72806J73815O86405M41239m06480q10647m10858J0496
31176h20525k9442N6781O28165Q46258q838j101749j105024j59914M42793K32139
31166a019356k9837J65573L87652K79590K08337M79704O94265L81930k40509n82707
31156G24642m43039j62253j83893n54653p44758j36729J049151J653437R09799
31147B111704m33340j005840n77989q6817n8676m9980K24426K91977j31845n28922
31137b45302m70817l46885n72107p45592l23206M01888P65703P94184R78803J194759
$$ plain form
31205 -377785 -1547095 -2155664 -1731266 -637760 315393 754253 938010 1121320 1137396
31196 1137396 765154 165778 -292026 -430538 -301925 -37330 174482 170731 28937 -27883
31186 -27883 -32888 -231689 -504495 -330680 355725 796964 390484 -420163 -831021 -820525
31176 -820525 -849967 -793186 -165021 681237 672399 -429350 -1534374 -1694288 -1251495 -1019356
31166 -1019356 -1049193 -883620 -495968 -216378 -8041 471663 1165928 1547858 1307349 724642
31156 724642 281603 119350 -64543 -619196 -1363954 -1500683 -451532 1201905 2111704
31147 2111704 1678364 672524 94535 7718 -50958 -100938 123488 415465 283620 -245302
31137 -245302 -716119 -1063004 -1635111 -2380703 -2703909 -2302021 -1536318 -742134 236669 1431428
31127A431428O99856o57951j873173j772862l48860J127321J337791K57220q20562
31118f19792p25321K78183R52146O78475j9601n17458q14648r42119n23581M47617
31108a806099J089641O85086k15182n30023j11955L37535M74316N02623L71114
31099G97056j87767q01478o63626J82251O93187L15510k21145q4561M23822M51750
31089I04999j05150n66257m54607L9783M48575M72950J43186k18278l31279l49761
$$ plain form
31127 1431428 2131284 1473333 -399840 -2172702 -2521562 -1394241 -56450 200770 -619792
31118 -619792 -1345113 -1066930 -114784 563691 544090 26632 -788016 -1730135 -2253716 -1806099
31108 -1806099 -716458 -31372 -246554 -776577 -888532 -550997 -76681 425942 797056
31099 797056 609289 -192189 -855815 -673564 19623 335133 113988 29427 453249 904999
31089 904999 799849 233592 -221015 -181232 267343 740293 883479 665201 333922 -15839
$$ [...]
##END NTUPLES=NMR SPECTRUM
##END=
