##TITLE=31Pdec_LY-TMF-8.70+TMF
 D2O, 24 sc
 2.3.2020
##JCAMPDX= 6.0         $$ Bruker NMR JCAMP-DX V2.0
##DATA TYPE= NMR SPECTRUM
##DATA CLASS= NTUPLES
##ORIGIN= UXNMR, Bruker Analytische Messtechnik GmbH
##OWNER= root
$$ XWIN-NMR		Version 3.5
$$ Mon Mar  2 15:57:32 2020 Russian Standard Time (UT+4h)  she@DPX200
##.OBSERVE FREQUENCY= 81.013821
##.OBSERVE NUCLEUS= ^31P
##.ACQUISITION MODE= SIMULTANEOUS
##.ACQUISITION SCHEME= undefined
##.AVERAGES= 24
##.DIGITISER RES= 17
##SPECTROMETER/DATA SYSTEM= spect
##.PULSE SEQUENCE= zgpg30
##.SOLVENT NAME= D2O
##.SHIFT REFERENCE= (INTERNAL, D2O, 0, 182.463)
##AUDIT TRAIL= $$ (NUMBER, WHEN, WHO, WHERE, WHAT)
$$ ##TITLE= Audit trail, XWIN-NMR		Version 3.5
$$ ##JCAMPDX= 5.01
$$ ##ORIGIN= Bruker BioSpin GmbH
$$ ##OWNER= she
$$ F:/spectra/data/she/nmr/P31/1/pdata/1/auditp.txt
$$ ##AUDIT TRAIL=  $$ (NUMBER, WHEN, WHO, WHERE, WHAT)
(   1,<2020-03-02 15:55:40.39 +0400>,<she>,<DPX200>,
      <created by zg, POWCHK disabled, PULCHK disabled
       configuration hash MD5:
       00 E9 B6 7A A2 85 ED C7 34 08 36 98 17 FE 4E 26
       data hash MD5: 32K
       FF A2 52 B6 36 2B B4 10 57 F5 8A 21 E1 8A A3 19>)
(   2,<2020-03-02 15:55:43.51 +0400>,<she>,<DPX200>,
      <Start of raw data processing
       efp BC_mod = 2 LB = 1 FT_mod = 6 PKNL = 1 PHC0 = -1159.135 PHC1 = -244.5984 SI = 64K 
       data hash MD5: 64K
       D1 E2 B6 1B 8B 01 86 FE 6B 11 03 5B 2A B6 B2 96>)
(   3,<2020-03-02 15:55:57.53 +0400>,<she>,<DPX200>,
      <pk PHC0 = -10.8833 PHC1 = 0 
       data hash MD5: 64K
       23 D4 17 E0 98 BF 6D AC A5 1D 64 7B B0 DD ED 35>)
(   4,<2020-03-02 15:56:01.56 +0400>,<she>,<DPX200>,
      <abs ABSG = 5 
       data hash MD5: 64K
       88 E5 31 24 1C 22 F4 64 E1 30 B0 F8 01 97 F6 7F>)
(   5,<2020-03-02 15:56:16.73 +0400>,<she>,<DPX200>,
      <pk PHC0 = -3.798968 PHC1 = 0 
       data hash MD5: 64K
       53 4E 68 D2 5C EB 9C 15 E3 BF C8 EF 11 D7 1D FA>)
(   6,<2020-03-02 15:56:39.75 +0400>,<she>,<DPX200>,
      <pk PHC0 = 2.2 PHC1 = 0 
       data hash MD5: 64K
       00 C2 5F D0 38 96 A6 0B 97 2A F6 65 39 33 D8 B6>)
$$ ##END=
$$ 
$$ hash MD5
$$ 7B 03 3B F2 8D 86 25 29 43 C0 DB F9 7A B2 58 0E
##$RELAX= 
##$RELAX= 
##$RELAX= 
##$RELAX= 
##$RELAX= 
##$RELAX= 
##$RELAX= 
##$RELAX= 
$$ Bruker specific parameters
$$ --------------------------
##$DU= <F:/spectra>
##$EXPNO= 1
##$NAME= <P31>
##$PROCNO= 1
##$TYPE= <nmr>
##$USER= <she>
##$AMP= (0..31)
100 100 100 100 100 100 100 100 100 100 100 100 100 100 100 100 100 100 
100 100 100 100 100 100 100 100 100 100 100 100 100 100 
##$AQSEQ= 0
##$AQ_mod= 1
##$AUNM= <au_zg>
##$AUTOPOS= <>
##$BF1= 81.014009
##$BF2= 200.13
##$BF3= 200.13
##$BF4= 200.13
##$BF5= 200.13
##$BF6= 200.13
##$BF7= 200.13
##$BF8= 200.13
##$BYTORDA= 1
##$CFDGTYP= 0
##$CFRGTYP= 5
##$CHEMSTR= <none>
##$CNST= (0..31)
1 1 145 1 1 1 1 1 1 1 1 1 1 1 1 1 1 1 1 1 1 1 1 1 1 1 1 1 1 1 1 1 
##$CPDPRG= <waltz16>
##$CPDPRG1= <>
##$CPDPRG2= <waltz16>
##$CPDPRG3= <>
##$CPDPRG4= <mlev>
##$CPDPRG5= <mlev>
$$ [...]
##$SUBNAM3= <"">
##$SUBNAM4= <"">
##$SUBNAM5= <"">
##$SUBNAM6= <"">
##$SUBNAM7= <"">
##$SUBNAM8= <"">
##$SUBNAM9= <"">
##$SW= 369.568048894756
##$SWIBOX= (0..15)
0 1 3 0 0 0 0 0 0 0 0 0 0 0 0 0 
##$SW_h= 29940.119760479
##$TD= 32768
##$TD0= 1
##$TE= 0
##$TE2= 300
##$TE3= 300
##$TEG= 300
##$TL= (0..7)
0 120 53 12 22 120 120 120 
##$TP= (0..7)
150 150 150 150 150 150 150 150 
##$TP07= 0
##$TPNAME0= <>
##$TPNAME1= <>
##$TPNAME2= <>
##$TPNAME3= <>
##$TPNAME4= <>
##$TPNAME5= <>
##$TPNAME6= <>
##$TPNAME7= <>
##$TPOAL= (0..7)
0.5 0.5 0.5 0.5 0.5 0.5 0.5 0.5 
##$TPOFFS= (0..7)
0 0 0 0 0 0 0 0 
##$TUNHIN= 0
##$TUNHOUT= 0
##$TUNXOUT= 0
##$USERA1= <user>
##$USERA2= <user>
##$USERA3= <user>
##$USERA4= <user>
##$USERA5= <user>
##$V9= 5
##$VALIST= <valist>
##$VCLIST= <CCCCCCCCCCCCCCC>
##$VD= 0
##$VDLIST= <DDDDDDDDDDDDDDD>
##$VPLIST= <PPPPPPPPPPPPPPP>
##$VTLIST= <TTTTTTTTTTTTTTT>
##$WBST= 1024
##$WBSW= 4
##$XGAIN= (0..3)
0 0 0 0 
##$XL= 0
##$YL= 0
##$YMAX_a= 61787
##$YMIN_a= -67742
##$ZGOPTNS= <>
##$ZL1= 120
##$ZL2= 120
##$ZL3= 120
##$ZL4= 120
##$ABSF1= 182.463
##$ABSF2= -187.1042
##$ABSG= 5
##$ABSL= 3
##$ALPHA= 0
##$AQORDER= 0
##$ASSFAC= 0
##$ASSFACI= 0
##$ASSFACX= 0
##$ASSWID= 0
##$AUNMP= <proc_1d>
##$AZFE= 0.1
##$AZFW= 0.5
##$BCFW= 0
##$BC_mod= 2
##$BYTORDP= 0
##$COROFFS= 0
##$CY= -3
##$DATMOD= 1
##$DC= 0
##$DFILT= <>
##$DTYPP= 0
##$F1P= 0
##$F2P= 0
##$FCOR= 1
##$FTSIZE= 65536
##$FT_mod= 6
##$GAMMA= 0
##$GB= 0
##$INTBC= 1
##$INTSCL= 5.30512e-09
##$ISEN= 30
##$LB= 1
##$LEV0= 0
##$LPBIN= 0
##$MAXI= 10000
##$MC2= 0
##$MEAN= 0
##$ME_mod= 0
##$MI= 50
##$NCOEF= 0
##$NC_proc= -2
##$NLEV= 6
##$NOISF1= 182.463
##$NOISF2= 159.3651
##$NSP= 0
##$NTH_PI= 0
##$NZP= 0
##$OFFSET= 182.463
##$PC= 4
##$PHC0= -1171.617
##$PHC1= -244.5984
##$PH_mod= 1
##$PKNL= yes
##$PPARMOD= 0
##$PSCAL= 0
##$PSIGN= 0
##$REVERSE= no
##$SF= 81.0140089999434
##$SI= 65536
##$SIGF1= 159.3651
##$SIGF2= -187.1042
##$SINO= 113.3802
##$SIOLD= 16384
##$SREGLST= <1H.CDCl3>
##$SSB= 0
##$STSI= 65536
##$STSR= 0
##$SW_p= 29940.119760479
##$SYMM= 0
##$S_DEV= 0
##$TDeff= 32768
##$TDoff= 0
##$TI= <>
##$TILT= no
##$TM1= 0
##$TM2= 0
##$TOPLEV= 0
##$USERP1= <user>
##$USERP2= <user>
##$USERP3= <user>
##$USERP4= <user>
##$USERP5= <user>
##$WDW= 1
##$XDIM= 65536
##$YMAX_p= 510808517
##$YMIN_p= -668056
$$ End of Bruker specific parameters
$$ ---------------------------------
##NTUPLES= NMR SPECTRUM
##VAR_NAME=  FREQUENCY,     SPECTRUM/REAL,   SPECTRUM/IMAG
##SYMBOL=    X,             R,               I
##VAR_TYPE=  INDEPENDENT,   DEPENDENT,       DEPENDENT
##VAR_FORM=  AFFN,          ASDF,            ASDF
##VAR_DIM=   65536,         65536,           65536
##UNITS=     HZ,            ARBITRARY UNITS, ARBITRARY UNITS
##FACTOR=    0.456856943014862, 1,           1
##FIRST=     14782.0589164792, 0,            0
##LAST=      -15158.0608439998, 0,           0
##MIN=       -15158.0608439998, -668056,     0
##MAX=       14782.0589164792, 510808517,    0
$$ Real data points
##PAGE= N=1
##DATA TABLE= (X++(R..R)), XYDATA
$$ [...]
37170d6666l7934k8252m3414k6934N1837J19278R4317l615r6501j31372q3278
37159b32534M1795J58445J45321J256j20474r9051P810O9655N4833J8231q083
37148C7204k0549K053N8967Q5840L8685j9932l624O3482Q2837K6609m0730p0583
37136B40259p3634n8457j1666M4777M7232k6721j11963j21374l8485O7355J06131
37125F3454M9167m1364p2768k1784M3599N4793K6187J9986N0709O4755J3911p7894
37113A72751j30437q7118J7874Q1471M1788m3599o6390r528L5261M580m7967m2656
37101g3970L954J5716j6028k3305J9951M9240J3378l4346j0578O3867Q2302J1708
37089A01889m6769n580O8503M9392n0055r1651k9052J8746l3689q9284k3227J04753
$$ plain form
37170 -46666 -84600 -112852 -156266 -183200 -131363 -12085 82232 78617 -17884 -149256 -232534
37159 -232534 -190739 -32294 113027 114283 -6191 -105242 -97432 -27777 27056 45287 37204
37148 37204 16655 18708 77675 163515 202200 182268 178644 242126 324963 351572 310842 240259
37136 240259 166625 108168 96502 141279 188511 161790 49827 -71547 -110032 -42677 63454
37125 63454 112621 71257 -1511 -23295 20304 75097 101284 121270 171979 236734 250645 172751
37113 172751 42314 -44804 -26930 54541 96329 52730 -13660 -23188 12073 16653 -31314 -73970
37101 -73970 -70016 -54300 -70328 -93633 -73682 -24442 -11064 -45410 -55988 7879 90181 101889
37089 101889 55120 49540 118043 167435 117380 25729 -3323 15423 -18266 -107550 -130777 -26024
37077b6024J30365L0576n3942l3888K6861M3856K3976N404p494J61O5960J55859
37065C61670J45412k2071k20250k70641j52957m524O3900O3719M3592M707n6152
37054d3595q6179l3040N8799Q3088J7945l0901K1854J07115R2621k3772j10771
37043E3164r4693m9067o0221j01014r5874l2344N4531J37571J75010J08411m1678
37032E3796j47173j19516k1739L9956N7188O4436L6559l8028o5034K8016J32471
37021B0932Q6553p5247j63972j08112j8441J6914L4600O9164P9997N0808L4448
37010B7644N3535O2757L9440R923k7556r4146j36441p0341N9704R8055o480j22919
36998a06825j19474j6550P9426R8182L4353n4124o5107L6700J37814J13030J4040
$$ plain form
37077 -26024 104341 134917 80975 47087 73948 117804 141780 147184 139690 139851 205811 361670
37065 361670 507082 485011 264761 -5880 -158837 -163361 -99461 -35742 7850 12557 -43595
37054 -43595 -129774 -162814 -104015 -20927 -2982 -33883 -12029 95086 187707 163935 53164
37043 53164 -41529 -90596 -150817 -251831 -347705 -380049 -325518 -187947 -12937 95474 53796
37032 53796 -93377 -212893 -234632 -194676 -137488 -73052 -36493 -74521 -139555 -111539 20932
37021 20932 107485 32238 -131734 -239846 -258287 -241373 -206773 -137609 -57612 -6804 27644
37010 27644 81179 143936 183376 193299 165743 71597 -64844 -135185 -75481 22574 16094 -106825
36998 -106825 -226299 -242849 -163423 -65241 -30888 -85012 -150119 -113419 24395 137425 151465
36987A51465j7804J1323k0114j01277r1362J6045O2865N948j0915O3717Q2884
36976A52775k0440r2596l3632K4499k0979l8720P5531J53282K3588j51262j02087
36965c0041J07028J71126J7773j11103n2520P1732R2266J3919p2033j25541j32034
36954d9428o9747K9207P8382M1873l2696r7558j40807j38739o4219M4962J05500
36943b93270Q8248L6730p316l2904k9568K984K9945L0770M8850J20070J78570
36932A73109J19703m8719j92243j93393o4729P2379R0607k9807j57092j25418
36922c55603O4170K21120J93074M4303n9047o4199m0180l3112k2766K724K2150
36911b7366K4412J4877o659l2331m0503l4809m2323m8718m269P7665J15415Q7213
$$ plain form
36987 151465 133661 144984 124870 23593 -67769 -51724 11141 17089 6174 69891 152775
36976 152775 132335 39739 6107 30606 9627 -29093 46438 199720 223308 72046 -30041
36965 -30041 76987 248113 265886 154783 102263 173995 266261 280180 208147 82606 -49428
36954 -49428 -119175 -89968 -11586 30287 -2409 -99967 -240774 -379513 -443732 -398770 -293270
36943 -293270 -205022 -168292 -175608 -208512 -238080 -235096 -205151 -174381 -125531 -5461 173109
36932 173109 292812 244093 51850 -141543 -206272 -133893 -43286 -73093 -230185 -355603
36922 -355603 -291433 -70313 122761 167064 108017 43818 3638 -29474 -52240 -49516 -27366
36911 -27366 -2954 11923 5264 -27067 -67570 -102379 -144702 -193420 -197689 -120024 -4609 82604
36899H2604O1591N7579J476j10228j45755l8715P6530N6288l7926n3352K1011
36888b8897P6752O4163J4695m6083q8808n7538L2928O5403m185n0786J5163P9294
36876G2101K0292n8631J328J24971J15776j5676q1189l6139k4971j02003j39496
36865a23637n9010L9274M2374k3174n7954q784R7376J61448Q3763q8416j56296
36854i3036k5839J26532R4647n5089j13266o1675m3866p1421k3828Q2654R3242
36843i0945m554m9177J5225O5740M4973M0460P0180K8911p9928r3636L3544J21326
36831A02119M2500q4085r9304k7895K5786M9800O6930L8570n0540j17635r6275
36820a50029l5444m840P997L8189O8225O9097M2271o603n8163n0113L8837J00327
$$ plain form
36899 82604 144195 201774 203250 93022 -52733 -91448 -14918 41370 3444 -49908 -28897
36888 -28897 47855 112018 126713 80630 -8178 -65716 -32788 32615 28430 -22356 -7193 72101
36876 72101 92393 33762 35090 160061 275837 260161 178972 142833 117862 15859 -123637
36865 -123637 -182647 -143373 -100999 -124173 -182127 -190911 -93535 67913 151676 63260 -93036
36854 -93036 -118875 7657 102304 47215 -66051 -127726 -171592 -243013 -266841 -184187 -90945
36843 -90945 -95499 -144676 -129451 -63711 -18738 21722 91902 120813 40885 -52751 -19207 102119
36831 102119 144619 60534 -38770 -66665 -40879 8921 75851 114421 63881 -53754 -150029
36820 -150029 -185473 -190313 -182316 -144127 -75902 -6805 35466 28863 -29300 -79413 -40576 59751
36808E9751K6118j02623j17871k7392J7464o340J7163P9812L4006j12834j50749
36797b83495k267J38971J14293J8147j0665q33j6954j3079M1830O6106K0804m367
36785F8491K8282J8366o7312r8776j5948M3695j1536n9400O196P5528K5458o1728
36773d8684n7622M001M3622Q5176J27162N9898j10653j66292r308J23204J7606
36762F8110j54569j15553O5263J16602J8456l0523J374k5822r5884m7318R3966
36751a05898J15625j7555r5477j2542P9839M4815m6632p8593n5045k3419J0426
36740a84456L2934K1304J6390O6729J06150L8315p5748r1228k4538k4668j01570
36729b20386j03972M314P3000K9536m561N2890J01707N8831J0610L4824M1947
$$ plain form
36808 59751 85869 -16754 -134625 -162017 -144553 -150893 -133730 -53918 -19912 -132746 -283495
36797 -283495 -285762 -146791 -32498 -14351 -25016 -25849 -42803 -55882 -14052 52054 72858 68491
36785 68491 96773 115139 47827 -50949 -66897 -23202 -34738 -94138 -87942 -12414 13044 -48684
36773 -48684 -106306 -102305 -58683 26493 153655 213553 102900 -63392 -72700 50504 68110
36762 68110 -86459 -202012 -136749 -20147 -1691 -32214 -30840 -56662 -152546 -199864 -105898
36751 -105898 9727 -7828 -103305 -115847 -36008 8807 -37825 -116418 -171463 -194882 -184456
36740 -184456 -151522 -130218 -113828 -47099 59051 97366 21618 -69610 -94148 -118816 -220386
36729 -220386 -324358 -320044 -247044 -217508 -222069 -169179 -67472 -8641 1969 36793 78740
36718G8740n0849j31405n8958Q1602Q5270n8934j46984o2706O2218N4071n6027
36707b03962r4222R50J00889P8329k1692o7210k7382K4119N5367R8450J28308
36696G1944O6658n4658q6779M610N4402m3449j41976o2908J12456J66550P3640
36685A60490n514q889l2143j05055j23636m7841J9861J8537K7781R9210J33052
36674A35853L5345j05020j23142j0163P9704M6718l0655k6221M8853O9603r249
36663A11626q0908n4070N40k5883q3519m3732O2387P3875k5586o9019J1993Q1732
36651d0564N5605L5361P3304L7222j24521k13056q7180O7386K7219r6402o1664
36640c27290Q2319J02001J021q537R2732J01700k8849j00011n284J13273J11336
$$ plain form
36718 78740 27891 -103514 -162472 -80870 4400 -54534 -201518 -264224 -202006 -147935 -203962
36707 -203962 -298184 -297234 -196345 -118016 -139708 -206918 -234300 -210181 -154814 -56364 71944
36696 71944 138602 83944 -2835 1775 56177 12728 -129248 -192156 -79700 86850 160490
36685 160490 154976 146087 113944 8889 -114747 -162588 -142727 -124190 -96409 2801 135853
36674 135853 171198 66178 -56964 -67127 12577 59295 28640 2419 51272 120875 111626
36663 111626 30718 -23352 -22812 -48695 -132214 -175946 -113559 -39684 -65270 -134289 -122296 -40564
36651 -40564 15041 50402 123706 160928 36407 -176649 -263829 -196443 -169224 -265626 -327290
36640 -327290 -244971 -142970 -141949 -150486 -57754 43946 15097 -84914 -90198 23075 134411
36629A34411J7288q5403j45354r4301P8027J98955R2588j18303j42770M1283J58763
36618A35184P3299m6548o0200n1304q6376o5732M6118J01036L0477j0764P5643
36607A40833J34485K0757j39504j47771l3145L3913K706m8704o2330k3201O7878
36596e4083J40359Q4354p7258j74205j22699k6756K3406P3197J36361J11154j2620
36585A01210o5129L5862J21590M1840q8339r6234l0612k8085n5342n602P3027
36574D186O6501J0593P597J9639m6837j32088j07160o71N7558N8853Q6332J21767
36562A46270Q2141K976j4279n19o2989j57914j29958J9302J05725L6394p0414
36551d3265q4964k9807J3472L2807N5516P8990Q4678O7705L3541N542J8719N7870
$$ plain form
36629 134411 151699 66296 -79058 -173359 -95332 103623 196211 77908 -64862 -23579 135184
36618 135184 208483 161935 101735 50431 -35945 -101677 -55559 45477 75954 65190 140833
36607 140833 275318 296075 156571 8800 -24345 9568 12274 -36430 -98760 -121961 -54083
36596 -54083 86276 170630 93372 -80833 -203532 -230288 -206882 -133685 2676 113830 101210
36585 101210 36081 71943 193533 235373 147034 50800 20188 -7897 -63239 -68841 4186
36574 4186 70687 81280 88877 108516 61679 -70409 -177569 -178240 -120682 -61829 24503 146270
36562 146270 228411 231387 217108 216589 153600 -4314 -134272 -114970 -9245 27149 -43265
36551 -43265 -128229 -158036 -144564 -111757 -56241 22749 107427 175132 208673 214215 232934 290804
36539B90804M4784m7143j20859q3336J0599M0776m478m5315n2967n8245n5805
36528h1185j8655K1437K1505K2412P9723J34909Q5359m0061j08882p7755k6944
36517A1863o063K0740O2885O5868J7342j8946j2133j4062o1980j09627r4921k0281
36505a59315O1180R6830O3584j0443n2974j8124N4983Q9291N8847j988m9230n3976
36493G8665j4786J8579j7465j01899j30483n8320L5042P3529Q3341R5644O0483
36482A22330m1125j04821n0667K7623L703p0945n6368M0036Q9408O1547M2495
36471F3216N2735K3900m3144o3358k3715n83p852J9922P6234P1058j672l9740
36459A27001j2019o762n3579n6123K8869R5973O1758l777j3817p900m6149p0322
$$ plain form
36539 290804 335588 288445 167586 84250 94849 135625 131147 85832 32865 -25380 -81185
36528 -81185 -99840 -78403 -56898 -34486 45237 180146 265505 225444 116562 38807 11863
36517 11863 5800 26540 89425 155293 172635 153689 141556 127494 65514 -44113 -139034 -159315
36505 -159315 -98135 -1305 62279 51836 -1138 -19262 35721 125012 183859 181871 132641 78665
36493 78665 63879 82458 64993 -36906 -167389 -225709 -190667 -117138 -33797 61847 122330
36482 122330 81205 -23616 -74283 -46660 -42957 -113902 -170270 -130234 -40826 20721 63216
36471 63216 115951 139851 96707 33349 9634 9051 1199 21121 97355 168413 166741 127001
36459 127001 114982 108220 54641 -1482 27387 123360 185118 181341 167524 159624 113475 43153
36447D3153l113R2722R3665R423l4081J0002N0164N175q3154j18862p2888n93
36435h387L0416N661l1398l0812O328L1020J1024k7875l9357j6422O386l31k9430
36422i3177m6260j8929M9504J07284Q7910j6180j16582j00130L9621J65841J36392
36411A95294k6157j54372j37781m0447J9254K9855M8981O6150K0610o4673q9112
36400a32398k4542M9645P6999P9770O4904l136r6380j13380l1801M4157M8475
36389c7687M3843P6111P0887k3067j10004r1274k8930k9087n3659k447Q5181P9228
36377b0905k0661p4156j1526Q1149J07109P4408L4921j399m8146q9413q0911L561
36365d5969J23404J75741R3181n8261j41367j14999n8726k5943J2197N2960L3204
$$ plain form
36447 43153 40040 132762 226427 235850 201769 211771 261935 267110 183956 65094 -7794 -8387
36435 -8387 22029 27690 -3708 -34520 -28192 2828 13852 -14023 -53380 -69802 -63416 -63747 -93177
36422 -93177 -139437 -158366 -108862 -1578 86332 70152 -46430 -146560 -106939 58902 195294
36411 195294 169137 14765 -123016 -163463 -144209 -114354 -65373 777 21387 -43286 -132398
36400 -132398 -156940 -107295 -30296 49474 114378 111242 14862 -98518 -130319 -86162 -37687
36389 -37687 6156 82267 153154 130087 20083 -71191 -100121 -129208 -182867 -185314 -100133 -20905
36377 -20905 -41566 -115722 -127248 -46099 61010 135418 170339 168940 120794 31381 -49530 -45969
36365 -45969 77435 253176 346357 288096 146729 31730 -26996 -52939 -40742 12218 45422
36354D5422l2279l2057M9284P7863K548l4192N4911J23546L5152q3094m4251P7134
36342B39987P0943n6807j12483m1856J9143J128k2111j6046l3852o8317m5581
36331f5852J7458K4198k3502k8122J7294J8564l4065m3177J3249M2517P804j5176
36319f8810J8886O3061Q0889Q5324O8329J3490l0303j2551P441n1175j29310j09433
36307f4162j9142J5973j4579k0459N73j7117l3616L8712J32715J05369m099l2525
36295H7643J2462j8623j00854m7554J27251J73346J2201j26800r3715m0326j00666
36284a15635j39096k3661R8947M4883q1588n7638R5624J63398P0678n0059q6416
36273h0563o4606m9364n3249n0878j5155M9592Q9510O2856J6229J7551L2234j2038
$$ plain form
36354 45422 13143 -18914 30370 108233 110781 76589 131500 255046 290198 207104 162853 239987
36342 239987 310930 254123 141640 99784 118927 120055 97944 81898 48046 -20271 -65852
36331 -65852 -48394 -24196 -47698 -75820 -58526 -39962 -74027 -117204 -103955 -61438 -53634 -68810
36319 -68810 -49924 13137 94026 179350 247679 261169 230866 218315 225756 174581 45271 -64162
36307 -64162 -83304 -67331 -81910 -102369 -101796 -118913 -152529 -113817 18898 124267 120168 87643
36295 87643 100105 81482 -19372 -66926 60325 233671 245872 119072 25357 -14969 -115635
36284 -115635 -254731 -278392 -179445 -134562 -216150 -273788 -178164 -14766 55912 5853 -80563
36273 -80563 -145169 -194533 -247782 -298660 -313815 -264223 -174713 -111857 -95628 -78077 -45843 -57881
36261e7881o0127L807J27558J27413j7450j15036n9025L1030L7817N524j0921
36250A2709m5451p8879j3824J07257Q8515r1329j75290r631J99651J98802M5598
36239B38128m9876n5554o3929o5741p620M6081K1626k604O1297J19689M7778p7118
36227B12157r6918l0755p142k6453j426L6085j7076j22491j33951k6773P4243
36216a40500Q4483L8649j852n755L5430P9359M6701n9738j26919r5599m5635l7890
36204b29266r593O8198Q5903j4061r6977m5812L9066K6933p312O1851J56787J25662
36192A61379J4333k5617q935n3759j17865n3698J03351J46821R870j41950j53108
36181a19178m8497N7137Q8445M3101p600J8437P9292K8171j41940k14409n3655
$$ plain form
36261 -57881 -118008 -114201 13357 140770 123320 8284 -50741 -19711 18106 23630 12709
36250 12709 -32742 -111621 -125445 -18188 70327 -21002 -196292 -205923 -6272 192530 238128
36239 238128 188252 132698 68769 3028 -4592 41489 63115 60511 121808 241497 289275 212157
36227 212157 115239 84484 77342 50889 49463 85548 68472 -54019 -187970 -214743 -140500
36216 -140500 -56017 -17368 -19220 -24975 10455 89814 136515 76777 -50142 -145741 -191376 -229266
36204 -229266 -238859 -170661 -84758 -98819 -195796 -241608 -202542 -175609 -182921 -121070 35717 161379
36192 161379 175712 150095 141160 87401 -30464 -84162 19189 166010 175880 33930 -119178
36181 -119178 -167675 -110538 -22093 21008 13408 31845 111137 139308 -2632 -217041 -270696
36170b70696J56554J69924L4003l3398j841q765p1964q6654n3193n2762m2489
36159b61281O8946J82490J16994o2815j05631K9673J14279K6365p9384n2704M0356
36148A7288P9895O5398L4759j7576o0020j7100Q5392J12817K2014o7859o1342
36137A93666j0723L453p780m310J219j8433n3600p4108m9924K8946J01885O5603
36125A75894o8927j30971j4621J40429J35114n894j00794q5394m1682j2453K7203
36114A7904N6090L5640O365L952l8769j41000j46287L9784K12292J35617o2134
36103A19454p8076O3900O2322j34697k36231r5187P5685Q2145J9330K7219N8841
36092c5295M4784M6577R5676R0165r849p5463k4136L7145P09p6250j00226q0183
$$ plain form
36170 -270696 -114142 55782 89785 56387 54546 45781 -26183 -112837 -166030 -218792 -261281
36159 -261281 -192335 -9845 107149 44334 -61297 -31624 82655 109020 29636 -23068 17288
36148 17288 97183 162581 197340 179764 119744 102644 188036 300853 322867 255008 193666
36137 193666 182943 186396 178616 174306 175525 157092 103492 29384 -20540 8406 110291 175894
36125 175894 106967 -24004 -38625 101804 236918 231024 130230 44836 3154 -9299 17904
36114 17904 73994 109634 115999 119951 81182 -59818 -206105 -166321 45971 181588 119454
36103 119454 41378 105278 167600 32903 -203328 -298515 -222830 -140685 -121355 -94136 -35295
36092 -35295 9489 56066 151742 241907 232058 156595 132459 169604 170313 94063 -6163 -86346
36080h6346n0395n331K2979j9736p3437k0475Q9486Q1153m1612p3667M4397J15833
36068a7151K5433o9011j9492P5732P8650M2931O5198Q6203J7345q0859j05969
36057I9010p3224l7048J7090Q2440O7700n3086j50502j12452M467Q4778R7353
36046B6526N7536k1968p7290l0831O3484O5172k1544m2386L6770O4321k5322r4935
36034d67m8660K4116M6811P8641J33583J00729l3269j02548l1598L0322k5650
36023A72010r0898o5239l1219n2020k6528Q8069J38699M0744m5827N455N9218
36012A92464k5034j29225r7913j8209l6602q1238j6129R1430J04640P0029R5583
36001A49796J15515J8012j15565j30765m9701O773K7802M8436J2963r8048j47168
$$ plain form
36080 -86346 -136741 -142072 -119093 -138829 -212266 -232741 -143255 -62102 -103714 -177381 -132984 -17151
36068 -17151 8282 -60729 -80221 -4489 74161 117092 182290 268493 285838 204979 99010
36057 99010 25786 -11262 5828 88268 155968 102882 -47620 -160072 -155605 -70827 26526
36046 26526 84062 62094 -15196 -46027 17457 82629 61085 18699 55469 119790 94468 -467
36034 -467 -49127 -25011 21800 100441 234024 334753 301484 198936 167338 197660 172010
36023 172010 81112 15873 -15346 -67366 -93894 -5825 132874 173618 127791 133246 192464
36012 192464 167430 38205 -59708 -77917 -114519 -195757 -211886 -120456 -15816 54213 149796
36001 149796 265311 283323 167758 36993 -12708 -5935 21867 70303 83266 -14782 -161950
35990a61950m6868O6037O1654M3459J22057J61249J6065j60891j47365k1688N950
35979f2291k1866O4992J81391J00658j20632j96028o0557O7319O4533K6244Q951
35968E2714m2331r4456m2215N3805J8509j26359j67248l9684R5172J39928J65246
35957A3081J88392J11510n3564j37340o7715K8556M0874M563k9440o9088q6688
35946e6859l1515L3533q699j12016j04388K9525J09842N2598n591N0783J31453
35935H8666R4625m7279j62419j53105l0659R3508R4186j7615p7869L804Q8128
35924b6029J7693j16231j13540R322O4850J6307M176O3874P0564q372m2993K4436
35912c5943Q1560M2340l7596r1908j25243j23858m3220P6407J24025P4308O328
$$ plain form
35990 -161950 -208818 -142781 -81127 -37668 84389 245638 261703 100812 -46553 -68241 -62291
35979 -62291 -84157 -19165 162226 262884 142252 -53776 -114333 -47014 17519 43763 52714
35968 52714 10383 -84073 -126288 -72483 -53974 -180333 -347581 -387265 -292093 -152165 13081
35957 13081 201473 312983 259419 122079 54364 82920 123794 128357 98917 29829 -56859
35946 -56859 -88374 -54841 -63540 -175556 -279944 -250419 -140577 -87979 -93570 -42787 88666
35935 88666 183291 136012 -26407 -179512 -210171 -116663 -22477 -40092 -117961 -114157 -26029
35924 -26029 -8336 -124567 -238107 -228785 -163935 -147628 -143452 -79578 -9014 -17386 -60379 -35943
35912 -35943 45617 87957 50361 -41547 -166790 -290648 -333868 -257461 -133436 -59128 -52800
35901e2800k8989l2938J3365R6136R6956m9103j82335j12204P2010J19688P916
35890e2298n0447K4764Q3378M1445P94J5620k082o7902n7304N7270J21467M7635
35878A62340m9621n9219l0921l6400m2914j5572J207j9550l5016k3762j1179P706
35866a52901M3686L4344n7210j09638J088J63864J71306M5603k6695l2836j06933
35855b6322j96843j06433J08637J53197k7630j42586l5655Q8116O4562L9089J34332
35844E2464J81166K8133j57969j60164n0509j1148k0039L5073J03469P7406R968
35833H7850N494J9295l1427q0688l2509M6253L5115l7808o5371l6325j231L1954
35821e9398M7546j0128j06778j00454L1019J09511L1299n8747j9723M5206j3406
$$ plain form
35901 -52800 -81789 -114727 -101362 -5226 91730 42627 -139708 -251912 -179902 -60214 -52298
35890 -52298 -102745 -77981 5397 46842 47636 63256 61174 -6728 -64032 -6762 114705 162340
35878 162340 112719 53500 22579 -13821 -56735 -72307 -71100 -90650 -125666 -149428 -160607 -152901
35866 -152901 -109215 -74871 -132081 -241719 -240631 -76767 94539 140142 113447 80611 -26322
35855 -26322 -223165 -329598 -220961 -67764 -95394 -237980 -273635 -185519 -120957 -81868 52464
35844 52464 233630 261763 103794 -56370 -106879 -118027 -138066 -102993 476 77882 87850
35833 87850 93344 112639 81212 524 -31985 14268 49383 11575 -53796 -90121 -91352 -59398
35821 -59398 -11852 -21980 -128758 -229212 -198193 -88682 -57383 -116130 -135853 -90647 -104053
35810a04053j22190j20227k5515L8601O5349J14342J44089Q7989Q255m393K494
35799H4741n3723j11295o2734M5265Q1357L6356N143J7511K5868J2137p118k8019
35787D5489k8770K6103Q3435K5414j25857j79556n4489Q0029O9835Q263M1540
35776h564J08843P3230k1263l2548L3350N2841o438p3374j08665j12757o5784
35765a61129K2837Q3044R4366J17055J34417K8489j78111k52692q4049J09082
35755h6691R4507l0899l9436N2074O2649k1847o4261m0861l9998n1793J0667J16412
35743c9477J42905O5491m0279j24560j45759l1771J70996K33551L4781k01583
35733F4295j88816J2973J20892O6912K5091N5250K3539j07635j83016j06927J9898
$$ plain form
35810 -104053 -226243 -346470 -371985 -333384 -268035 -153693 -9604 78385 86640 82247 84741
35799 84741 31018 -80277 -143011 -97746 -16389 19967 25110 42621 68489 80626 73508 45489
35787 45489 16719 42822 126257 151671 25814 -153742 -208231 -128202 -58367 -50104 -8564
35776 -8564 100279 173509 152246 119698 153048 205889 199451 126077 17412 -95345 -161129
35765 -161129 -138292 -55248 39118 156173 290590 319079 140968 -111724 -195773 -86691
35755 -86691 7816 -23083 -62519 -10445 52204 30357 -33904 -74765 -114763 -166556 -155889 -39477
35743 -39477 103428 168919 128640 4080 -141679 -173450 -2454 231097 265878 64295
35733 64295 -124521 -111548 9344 76256 101347 156597 180136 72501 -110515 -217442 -197544
35722a97544P4123N2848L655m3912n3042q064L1868J4222p467L0824P2958M4170
35710A4639P397N6271J23393P7158m4926q6015j4362N9209P3445N7034J4108o4285
35698B73066j11219o4878N640O377j4197L4223R4129N6291k7544k8249K6380Q205
35686B58224p1818r0528l7627q084q067K7170O0441N744q0948p2226L276J2776
35674a667l8010l1057K7954K4185m0035n7842l4245o0288r1693K199J70607K09586
35662G9694P6790n4954p9848o5629n5648j720O4282K4683r7048j18842J7737J41239
35650f9264J04810j9834p7231k1346P8525J14189J0084j70472k22610m2168J83614
35639a31703J99294L3647p5145m5897l793j779L6360R2779M7406p3090r5640J596
$$ plain form
35722 -197544 -123421 -70573 -66918 -110830 -163872 -171936 -140068 -125846 -133313 -102489 -29531 14639
35710 14639 22036 78307 201700 278858 233932 147917 133555 192764 266209 323243 337351 273066
35698 273066 161847 96969 102609 108986 94789 129012 223141 279432 251888 223639 250019 258224
35686 258224 186406 95878 58251 50167 42100 69270 129711 135455 54507 -17719 -14443 -1667
35674 -1667 -39677 -70734 -42780 -18595 -58630 -116472 -150717 -211005 -302698 -300499 -129892 79694
35662 79694 156484 101530 21682 -43947 -99595 -101315 -37033 -12350 -109398 -228240 -210503 -69264
35650 -69264 35546 15712 -61519 -82865 -4340 109849 119933 -50539 -273149 -315317 -131703
35639 -131703 67591 101238 26093 -19804 -23597 -25376 10984 103763 151169 78079 -17561 -15965
35627a5965M1018m4275r6761j3473Q6911P5259k016m2862l2798N926O1999Q3608
35615A06571K0688o1464n8860r761k5741o8541p553J16927J27383J1695n5095
35604I6249j2793J1377l5100n1278j2584k2863p9930m7130P3202R9097j4522p8388
35592g4663R218R3440L7799o1585o9420j8351M380L153J288j8253k4929M1502
35580g6421J17990P1148o0379r0014J0453O3257n813n8804j4570K5739M165Q990
35568d259O4671O2289j4266l7031J2747j614q8400p8404M9266R0686j9993p9373
35556d3681J3512O6671m9535j55900p6586P0727J06981P0832O2056L5480n0775
35545D9782r7608n6592m1861r0125n3395J01345J55331j793j45818p3992P4055
$$ plain form
35627 -15965 25053 -19222 -115983 -129456 -42545 32714 30698 -12164 -44962 -39036 22963 106571
35615 106571 127259 65795 6935 -2826 -28567 -97108 -104661 12266 139649 151344 96249
35604 96249 83456 94833 59733 8455 -4129 -26992 -106922 -154052 -80850 18247 3725 -74663
35592 -74663 -65445 27995 65794 4209 -65211 -83562 -79182 -76029 -74741 -92994 -117923 -76421
35580 -76421 41569 112717 52338 -37676 -27223 36034 30221 -28583 -43153 -17414 -13249 -4259
35568 -4259 60412 122701 108435 71404 84151 82537 -5863 -84267 -35001 55685 35692 -43681
35556 -43681 -30169 36502 -13033 -168933 -245519 -174792 -67811 3021 65077 100557 49782
35545 49782 -47826 -104418 -146279 -236404 -289799 -188454 -33123 -34916 -180734 -254726 -180671
35534a80671Q9279L2685M5202N8626k8636j02412l7051M4242j5804j14449p3778
35523b82767N2363J10581J15298J35112R0591p7030k06372j41924M360N8472O7217
35512g4099J25638J25719l6408j90414j33481K3188N0973j4234M534P6108N8098
35501A5622L825M5811R8935Q390j24109r6800J8259K485j02705p4512P4355J18887
35489a1557K5187k0905K4439J2746p4254p6377L2646P7857j6124j08834q2972
35478b18148J1136Q5368J07548N8708m0297q2538n701R0849J04393R1293J03926
35467C06537K9946j77948k92346j26004J04597P4240j23666j30389Q3527J93603
35457e7903P0600o0271m7772j3216m0244k0248Q2580J21987M1628j5583K5043
$$ plain form
35534 -180671 -91392 -58707 -13505 45121 16485 -85927 -122978 -78736 -94540 -208989 -282767
35523 -282767 -230404 -119823 -4525 130587 221178 144148 -62224 -204148 -199788 -141316 -74099
35512 -74099 51539 177258 140850 -49564 -183045 -159857 -108884 -123118 -118584 -42476 15622
35501 15622 19447 65258 164193 172583 48474 -48326 -30067 -27582 -130287 -204799 -130444 -11557
35489 -11557 13630 -7275 17164 29910 -44344 -120721 -88075 -10218 -26342 -135176 -218148
35478 -218148 -207012 -121644 -14096 44612 4315 -78223 -83924 6925 111318 202611 306537
35467 306537 336483 158535 -133811 -259815 -155218 -80978 -204644 -335033 -251506 -57903
35457 -57903 12697 -47574 -95346 -108562 -148806 -169054 -86474 35513 77141 61558 86601
35446H6601M6960j3703m5228J4769N7572J1893l2019r732n304q2080j50990j06755
35434b28016K3824J33514J40499L0681j06669j17109K6103J32452M5553j06649
35424b5817j03774K2020O8869J1758l748L6914Q191p9523p5333L2998R6528P1004
35412F0087N4989O2742J4089n3091k4616M0736j8297j46879j24718M5591J12256
35401B2889j3852j27087q2416Q099K7384L0218O3487N7337N61o32O7232P1382
35389A24602k5476p9504n532R1502R8685L3480m6778j04159p6446M4366J08979
35378A63719n118j49161r2921Q9389J19531l1957j27079q4874n9548p2389M0640
35367b09768K41832K53136K6880j29135n0299L4863o1757j67993r5528K2272k422
$$ plain form
35446 86601 133561 119858 74630 89399 146971 158864 126845 117113 111809 29729 -121261 -228016
35434 -228016 -204192 -70678 69821 100502 -6167 -123276 -97173 35279 80832 -25817
35424 -25817 -129591 -107571 -38702 -26944 -30692 6222 14413 -65110 -140443 -107445 -10917 60087
35412 60087 115076 177818 191907 138816 114200 154936 136639 -10240 -134958 -89367 22889
35401 22889 9037 -118050 -200466 -192367 -164983 -134765 -71278 -13941 -13380 -14012 53220 124602
35389 124602 99126 19622 14090 105592 204277 237757 190979 86820 10374 54740 163719
35378 163719 158601 9440 -83481 5908 125439 93482 -33597 -118471 -178019 -250408 -209768
35367 -209768 32064 285200 312080 182945 132646 167509 105752 -62241 -157769 -135497 -137919
35356a37919q0764m7205L9557N0094M1589J18559K01097J57067L3300l6144l7595
35345C01636m1552o9906j12025j56697j40982j4172J14505Q8175j7712J8891J69320
35334A39481J55922o9789j99273o3012R2901L0972j00694o9471M3667L2766o4770
35323g1300p2620J2881O6792O2228M4371J679o2483o1378K2689O4162L466l8403
35311b7916J8932O9495K9894n896L8433P3581L1470o023K373m0252j43649j49041
35299a08599j5314O9017J1669j8695P8466J33348L0194o1581o254M0825n5026
35288I8050j25935r835J29727Q9254k0292j1374K8074n6783j49440p0033P2605
35277b5982P1776r838O934O6019J1324p9753l3879Q0069P5624j0141j2196M5197
$$ plain form
35356 -137919 -218683 -265888 -226331 -176237 -134648 -16089 185008 342075 375375 339231 301636
35345 301636 260084 190178 78153 -78544 -219526 -233698 -119193 -31018 -48730 -29839 139481
35334 139481 295403 225614 26341 -36671 56230 87202 -13492 -82963 -39296 -6530 -71300
35323 -71300 -143920 -131039 -64247 -2019 42352 44031 -18452 -79830 -57141 7021 10487 -27916
35311 -27916 -8984 60511 90405 84509 122942 196523 227993 221970 224343 184091 40442 -108599
35299 -108599 -123913 -54896 -43227 -61922 16544 149892 180086 118505 112251 153076 98050
35288 98050 -27885 -37720 92007 181261 160969 149595 177669 120886 -28554 -98587 -25982
35277 -25982 45794 35956 42890 108909 120233 40480 6601 86670 162294 152153 139957 185154
35265A85154K9211k4991j1968J719p4261j12777J5443J44488O4465q9160o0196
35254F7127O4675J7369j45521j29450O9498J55461M1398m4159J3717O0966M165
35243A75246m5445k5125k0539n5392m6399o78o113k2013N7320J44239N3763j45924
35231F2940j87278k7481R1650M7637j0898J4803P673r9687j64429p5611N9589
35220b81092J03142Q2850Q3542Q7382L3140o2859j21365q0203N0283J59420J16535
35209A70775m2942j07742J8977J46354P3789r6558j38548o6870o3546j30902j03337
35198c40550L5609J24829J06211Q0302P8057J5844j03842j61156j11712l1579
35188c07987L1168Q5047R7408L2087m6622n7270l2863l0750r328N2948N1160n1002
$$ plain form
35265 185154 214365 189374 177406 179125 104864 -7913 7530 152018 216483 127323 67127
35254 67127 131802 149171 3650 -125800 -56302 99159 140557 96398 110115 171081 175246
35243 175246 129801 104676 84137 28745 -17654 -18332 -24445 -46458 10862 155101 208864 62940
35231 62940 -124338 -151819 -60169 -12532 -23430 -8627 -954 -100641 -265070 -340681 -281092
35220 -281092 -177950 -95100 -11558 75824 108964 46105 -75260 -155463 -105180 54240 170775
35209 170775 127833 20091 39068 185422 259211 162653 24105 -42765 -106311 -237213 -340550
35198 -340550 -304941 -180112 -73901 6401 84458 100302 -3540 -164696 -276408 -307987
35188 -307987 -276819 -191772 -94364 -62277 -108899 -166169 -199032 -229782 -239110 -186162 -135002 -186004
35176a86004q1473O5374J92566J03547m2920L144J36306Q2316j04421j35561L463
35165C6337N5305m0067q5695k6770j2133m8601J4301J29720P5344j23630j78795
35154b04684j4507J12780N5642k4532J40K6714j6197k4928M1407O5805J5214M125
35142C6979M4678J7222n4466p800J20487R4689j01933j94572o8723M9437l845
35131f7847q1745l9247K0602j1534m5662k491K7342o692O318J01350J25630J2595
35119C8619p4100j8510N8898L4252k4984l6318m8456p7206k1820J15833J50220
35108I6428l058j64454j53216k6930O6936J00421J10519R8170P5217O8140L2556
35097C00729p5143j45996n0461R5975O1638j13094j56474j0701Q7707J8220o4276
$$ plain form
35176 -186004 -267477 -202103 -9537 94010 51090 54234 190540 272856 168435 32874 36337
35165 36337 91642 51575 -34120 -60890 -73023 -121624 -107323 22397 97741 -25889 -204684
35154 -204684 -219191 -106411 -50769 -75301 -75161 -48447 -64644 -89572 -48165 17640 32854 36979
35142 36979 81657 98879 44413 36613 157100 251789 149856 -44716 -113439 -64002 -67847
35131 -67847 -149592 -188839 -168237 -179771 -225433 -227924 -200582 -207274 -200956 -99606 26024 38619
35119 38619 -35481 -53991 4907 39159 14175 -22143 -70599 -147805 -169625 -53792 96428
35108 96428 93370 -71084 -224300 -251230 -184294 -83873 26646 124816 200033 268173 300729
35097 300729 225586 79590 29129 125104 186742 73648 -82826 -93527 -5820 12400 -51876
35086e1876m8331j7140o373O2334J32793L7188j59351j90599l8434L0536m4731
35075b93984j8614J56977J88094k2821j53389j0728J34142L7168j06645n3550
35065a43350O3987L7080l1795J8378O9677j9944r9294M692J48053J22214R575
35054A79273j7821j9100j00273j41084j6574J21285Q4940k6256k9268K1249o448
35043D9923m8066j0327j718j14433j83975n3081J25454J34299M2177K7945N4548
35032B2746N452m6286P506O8738J9737l4647K4349P7945m975r7366m3792M6196
35020D5603J1012o5689m5566o344m6862n3493N5832J03793l0367j32686j8109
35009a82876J05256k97j51298o7129J09025O4961j14770j08876P5137J61628J10009
$$ plain form
35086 -51876 -100207 -117347 -123720 -61386 71407 108595 -50756 -241355 -279789 -249253 -293984
35075 -293984 -312598 -155621 32473 9652 -143737 -154465 -20323 16845 -89800 -143350
35065 -143350 -79363 -42283 -74078 -55700 13977 -5967 -105261 -100569 47484 169698 179273
35054 179273 161452 142352 42079 -99005 -115579 5706 90646 64390 35122 56371 49923
35043 49923 1857 -8470 -10188 -124621 -308596 -361677 -236223 -101924 -59747 -31802 22746
35032 22746 28198 -18088 -10582 58156 77893 43246 67595 145540 140565 43199 -593 45603
35020 45603 56615 -9074 -54640 -60984 -107846 -161339 -105507 -1714 -32081 -164767 -182876
35009 -182876 -77620 -77917 -229215 -296344 -187319 -122358 -237128 -346004 -270867 -109239 770
34998G70J04923J40020N0992j05563j19596j6535L275n3914k3636O5799N6882
34987A03417q028J6368N2887n3148j72822p3134J41880J75614L4542l1484N538
34976A91630k6266r2632j5718J19507P7752n6363N258J94630J45350j67609l46869
34965B8670k06857j3085K0794K0353R0118Q8568n1734j36470l0953J20926J51836
34954H2166Q9183P815q4286j28691l6294J07724J05749l9761j25795q1405l0478
34943a34073j4055N1265J21035M6690j13539j28439J4270P2975l1491r1997Q912
34932a98447J14306Q8124J0002k6242m7529n0623K9521J29854R2243n3403r7814
34921a0008K007N6207j9425p5801j8691M0726J0674m6721q1119j25741j45811
$$ plain form
34998 770 105693 245713 296705 191142 71546 55011 58286 4372 -19264 46535 103417
34987 103417 95389 111757 164644 111496 -61326 -134460 7420 183034 217576 186092 191630
34976 191630 165364 72732 57014 176521 254273 197910 203168 397798 543148 375539 28670
34965 28670 -178187 -191272 -170478 -150125 -60007 28561 -23173 -159643 -190596 -69670 82166
34954 82166 171349 179164 94878 -33813 -70107 37617 143366 103605 -22190 -103595 -134073
34943 -134073 -148128 -96863 24172 70862 -42677 -171116 -156846 -83871 -115362 -207359 -198447
34932 -198447 -84141 3983 13985 -12257 -59786 -110409 -80888 48966 141209 87806 -10008
34921 -10008 -8001 48206 28781 -47020 -65711 -24985 -14311 -61032 -142151 -267892 -413703
34910d13703m5892J19783J71389Q1236O592J9750L3115Q973Q907K2869j8046o2841
34898f7868j1859O0898J3769p8063l1974R3317P8506n6801p6906N5705J35255
34887A13979Q7821M4952L3730n1207j52217r3075N7991M7617j09420j31084L0229
34876a20684J00710k0422r7596o442O1107j3605o3681J7830P1536j1848q4227
34865a67322k0164P7573R7875Q3983O5657p698q4508l5802Q0684P1818m5050o9712
34853D7334m746m1809j43736o1772J76078K42169O5806m5071M1033P2219p9628
34842B67877j73266o0081N1940J2852j4866O3929O4183q1609j29799K6403J25899
34831A53462Q542r5897j2726N8015m3379j10859J7883J16717j9147j77324r9060
$$ plain form
34910 -413703 -459595 -339812 -168423 -87187 -80595 -60845 -27730 -18757 -9850 13019 -5027 -67868
34898 -67868 -79727 -18829 -5060 -83123 -115097 -21780 56726 -75 -76981 -21276 113979
34887 113979 201800 246752 280482 229275 77058 -16017 41974 89591 -19829 -150913 -120684
34876 -120684 -19974 -40396 -137992 -144434 -83327 -96932 -160613 -142783 -71247 -83095 -167322
34865 -167322 -187486 -109913 -12038 71945 137602 129904 45396 9594 90278 162096 117046 47334
34853 47334 42588 779 -142957 -204729 -28651 213518 279324 234253 275286 347505 267877
34842 267877 94611 34530 86470 99322 84456 148385 212568 130959 1160 27563 153462
34831 153462 162004 66107 53381 111396 68017 -42842 -24959 91758 72611 -104713 -203773
34820b03773P7622R7154J2309p088r240p9564r7611J6739Q7258L202l5744J09034
34808b9702K13356Q1670p6913j6059J06641L3753j23127j12864j851n766p2880
34797c742k3197P5562M3158n6709m2663M1549L1749m1973l9962J8578L4507L2710
34785F9567N2351N003j31756j77950l6533J03300P8105K0920P5120J06277j9629
34774A44775j36170o2338O0082L1025m5442J2127J03335M9277n4317k0819Q0418
34763A61953P7986J5020J3079J1716o7176r9117J2324R9646J2040r5384m1632
34752A00455N2784J6960m5333N923M4874n5668j23277M584J35195M6363j04864
34741G7996p4640K8064j3042r2973j4454R7842L5021p4770j1289R8644K6942r4025
$$ plain form
34820 -203773 -126151 -28997 -16688 -23776 -33016 -112580 -210191 -193452 -106194 -102992 -138736 -29702
34808 -29702 183654 265324 188411 172352 278993 312746 189619 76755 74904 69138 -3742
34797 -3742 -26939 48623 91781 35072 -7591 33958 65707 23734 -16228 2350 36857 69567
34785 69567 121918 126921 -4835 -182785 -219318 -116018 -37913 -16993 58127 164404 144775
34774 144775 8605 -53733 6349 37374 -8068 4059 107394 156671 102354 81535 161953
34763 161953 239939 254959 268038 279754 212578 113461 125785 225431 237471 142087 100455
34752 100455 153239 170199 124866 130789 175663 119995 -3282 1302 136497 182860 77996
34741 77996 3356 31420 18378 -74595 -89049 8793 43814 -30956 -42245 56399 83341 -10684
34729a0684j5335J33118P1049r6594o7344R4676Q4556p8453j08361J7211O1418
34718H5257p488r772M7888J51j06420q1683K5073M034j13379j11415J3855P7396
34706a76503N4689O6056R6317N4431O805M4912O3473l0491q2829J6650N5520j25724
34694D3306k57940o9071J94191J52391o1579o9550P8975O6534o2650k4792J11912
34683A01727N5636j16027q6292Q4791P1821q0346m1512J49565J35335q3422j33412
34672E7864N6120J50176J6282j12143j17685j26312j30068J5290K05800J89500
34662B04824L5178K0553J10180N3646p9774k2076J21100K0026k21500j93894O9656
34651A17919J34004n3376j01047O9827J03482p6355j22984M1040O6793j30257
$$ plain form
34729 -10684 -26019 107099 178148 81554 14210 108886 193442 114989 6628 23839 85257
34718 85257 77769 67997 115885 116036 9616 -72067 -46994 -42960 -156339 -267754 -253899 -176503
34706 -176503 -121814 -55758 40559 94990 101795 146707 210180 179689 96860 113510 169030 43306
34694 43306 -214634 -283705 -89514 62877 1298 -68252 10723 77257 14607 -10185 101727
34683 101727 157363 41336 -44956 39835 111656 31310 -10202 139363 274698 191276 57864
34672 57864 113984 264160 280442 168299 50614 -75698 -205766 -190476 15324 204824
34662 204824 240002 260555 370735 424381 344607 322531 443631 463657 242157 48263 117919
34651 117919 251923 198547 97500 167327 270809 194454 71470 112510 179303 49046
34641D9046j82822L6543J67570J8546j21469m3965N8713L9157L5409Q6262J9209
34630A62199j26630q2494J22303J50297k4992n9432J05306J34934l6214p7763
34620B67514O8096N6951j56217j75377P6095J57500q2426k07559P456J79124M6213
34609B37370p9778L9444J25674k2049j14612M1599J45582k505r4384P6623J78979
34598E31943l8931k51093j35687P2270O9980J3986R2955Q3764j72552l34087j10856
34587a78308J84588J48635n7411o4619O8355P3884r658j1603r091j07825j47541
34576a10594j2186Q5474j3919r7682R070R5920j1652q3499P8924K32785J19546
34565B92187p7805r6009l7278p2798q1696L5999P6509o2134r9754J18516K63232
$$ plain form
34641 49046 -133776 -97233 70337 88883 -32586 -76551 -17838 21319 56728 142990 162199
34630 162199 35569 -46925 75378 225675 200683 141251 246557 381491 345277 267514
34620 267514 335610 392561 236344 60967 137062 294562 212136 4577 12033 191157 237370
34609 237370 157592 197036 322710 300661 186049 227648 373230 370725 276341 352964 531943
34598 531943 493012 241919 106232 178502 248482 262468 355423 439187 266635 -67452 -178308
34587 -178308 6280 154915 97504 32885 101240 175124 165466 153863 144772 36947 -110594
34576 -110594 -122780 -37306 -51225 -148907 -139837 -43917 -55569 -139068 -60144 172641 292187
34565 292187 214382 118373 81095 8297 -73399 -37400 39109 -23025 -122779 -4263 258969
34554B58969P5392j55891j04063L8257k6525j47148o6651O7297J9590o4516K2991
34543h2298J18646K3819p8468J3849J04786j4774j38039l7801R3571M0838k439
34532D1690J44227K17749q130k32459j30998O0267m174j50021n7434J22289Q9887
34521I2893k5565K7437J00046j6792r6895J03556K97601J28465j71318j81049
34511B58379j1693j7206j18904m0164R4700J7247j21381m6547P7914k0557j46480
34500g4692J572K13263J35679o1583k7500R2269k1492j87470o1085J65206J02049
34489B76216r6919n0312R7077k0675k22489r6274J78026J23597j40997j19899
34479g2649J40693J72177l1947o7223P1032L3420j30817o1652J58085J19944j17508
$$ plain form
34554 258969 334361 178470 74407 112664 86139 -61009 -127660 -60363 -40773 -105289 -82298
34543 -82298 36348 60167 -18301 -4452 100334 85560 -52479 -90280 3291 44129 41690
34532 41690 185917 403666 395536 163077 32079 92346 88172 -61849 -119283 3006 92893
34521 92893 67328 94765 194811 178019 81124 184680 482281 610746 439428 258379
34511 258379 246686 229480 110576 70412 165112 182359 60978 14431 92345 71788 -74692
34500 -74692 -73120 140143 275822 214239 186739 279008 257516 70046 8961 174167 276216
34489 276216 179297 128985 226062 205387 -17102 -113376 64650 188247 47250 -72649
34479 -72649 68044 240221 208274 141051 212083 245503 114686 53034 211119 331063 213555
34468B13555j27845O8999P0628j02118n5906J71709J58180q3360j23313N7561
34458B48090N3381j52127j51860P6476J17722p5791j03520R3645J28946o3901
34448A71061j11956N5859Q5058q5964j05428Q7637J44366m591l5865R1877M5128
34437C37182j98364k58506n5988O4408N964M3063J92124J46796p3386j00497P3467
34426A76263O6017j39642j32265J36559K35582M9046m5103P2136O4755j46115
34416C37233k01990j3410O0717q5578j20536M1859P1391r7768j15084Q7231J41384
34405A05449m0125r6072O9326J11542m9065o8210J06137R5679j46526j85471Q1278
34394a6058K09713K8233q0553N5937J09429l7659n0842J35144J20972j64677k50495
$$ plain form
34468 213555 85710 154709 225337 123219 67313 239022 397202 313842 190529 248090
34458 248090 301471 149344 -2516 73960 191682 115891 12371 106016 234962 171061
34448 171061 59105 114964 200022 114058 8630 96267 240633 236042 200177 292054 337182
34437 337182 138818 -119688 -175676 -111268 -105304 -62241 129883 276679 203293 102796 176263
34426 176263 242280 102638 -29627 106932 342514 391560 346457 418593 483348 337233
34416 337233 135243 121833 182550 96972 -23564 18295 89686 -8082 -123166 -35935 105449
34405 105449 65324 -30748 38578 150120 101055 32845 138982 234661 88135 -97336 -16058
34394 -16058 193655 221888 141335 197272 306701 269042 218200 353344 474316 309639 59144
34383E9144J4401J60417l3999j55687K8557J49737p028q8507R5395J69693o8823
34372C23300k29319n7090J04193p346j02376L9478J35625r768j16389p712M8412
34361A21008p2549p3382J23059J35800j31570k20116N3244K20625N468j90894
34351b9307n7863R2287o938q2315O6743J51145J2034l0719J47645J69425q2596
34340C49541j49902J38445K76706N017j94685j5750R7955j55492l08611j1061
34330C2163K63889P3219j93716o8194J54872M6053j48528m8565J18828K0023j16642
34319A33402o25J14852l5510j57452K3488J85947K4166j50760k2329J20161j5922
34308B19418j29821N6503K11061L6719j31756P171J17687q0887k02237N9357K64209
$$ plain form
34383 59144 73545 233962 199963 44276 72833 222570 215542 127035 222430 392123 323300
34372 323300 93981 36891 141084 133738 31362 70840 206465 196697 80308 72596 121008
34361 121008 48459 -24923 98136 233936 102366 -117750 -64506 156119 161587 -29307
34351 -29307 -87170 5117 -1821 -84136 -17393 133752 145786 115067 262712 432137 349541
34340 349541 199639 338084 614790 619807 425122 409372 507327 351835 43224 32163
34330 32163 296052 369271 175555 107361 262233 308286 159758 111193 230021 250044 133402
34319 133402 132777 247629 212119 54667 78155 264102 288268 137508 115179 235340 219418
34308 219418 89597 146100 357161 393880 262124 269295 386982 306095 103858 163215 427424
34297D27424J7013k64951j11671J44201L4899j74641o8726J03185j6827j39044
34287d9138Q0635K96752J14077j31584j9783J42005m8085k64250q6960J60115
34277A93784M2650j34573M1058K36667K6010k31985o6615J74933l699k67968r7161
34266h6899J96675Q0480j57087R727K78935Q4619k94182k38068P8825R2414p7267
34255c1828K4917K22955J00087j02385L2519K00799m0504l14386p9712K91472
34245C03934J70540j37372O643L17763J28167l02801k57972R1008N8758k23758
34235A54910j19498K22432J53272j99367j91982Q1342L3011k01364l8957L22811
34225B16610K16712j93489j85550J64771J66112j45612j22400J97286J73899j69867
$$ plain form
34297 427424 444437 179486 67815 212016 246915 72274 3548 106733 89906 -49138
34287 -49138 31497 328249 442326 310742 290959 432964 384879 120629 33669 193784
34277 193784 236434 101861 142919 379586 405596 173611 106996 281929 278230 10262 -86899
34266 -86899 109776 190256 33169 42896 321831 406450 112268 -125800 -46975 45439 -31828
34255 -31828 -6911 216044 316131 213746 246265 447064 406560 92174 12462 303934
34245 303934 474474 337102 343745 661508 789675 486874 228902 319910 378668 154910
34235 154910 35412 257844 411116 211749 19767 101109 134120 -67244 -106201 216610
34225 216610 433322 239833 54283 219054 385166 239554 117154 314440 488339 318472
34215C18472k07487P4097J14603p8076m086K45551J51515j44673q1563J80600
34205E68953M6760k98923j93807K04899J85619j62250j48871J59894J05772k27499
34195B40547j82917J38136O9702k58711j37006L05552K99571q9266j09703J91741
34185D67646R8090k96165k30590J97616J83748j98070j24589L27070K76512k34806
34175D66462k71781K06626K68809j89655k66833J70942K38261k25190l43486Q9512
34165A43667K41978j16983k24751J21275K08721r4532p8351K94718K22023l11824
34155D05941l78974J31479K69556j56990k38345K23995L19279j58727k76980K01703
34145C41937L27066j89047m03226L2433K34887j41516k58145J80475L05999j69269
$$ plain form
34215 318472 110985 185082 299685 221609 217523 463074 614589 469916 388353 568953
34205 568953 615713 316790 122983 327882 513501 351251 202380 362274 468046 240547
34195 240547 57630 195766 265468 6757 -130249 175303 474874 385608 275905 467646
34185 467646 565736 269571 38981 236597 420345 222275 97686 424756 701268 466462
34175 466462 194681 401307 670116 480461 213628 384570 622831 397641 54155 143667
34165 143667 385645 268662 43911 165186 373907 279375 201024 495742 717765 405941
34155 405941 26967 158446 428002 271012 32667 256662 575941 417214 140234 341937
34145 341937 669003 479956 76730 109163 344050 202534 -55611 124864 430863 261594
34135B61594l30142J61017L93913j4658k13294J47443K33598k27950l15976K46895
34125C42440M33445j41940m38270M2166L33260r1101l32656J05409L37930j07984
34115D82699l28429J53201M12790n6247l42496P1392K99268j41460l41701J53775
34105C62792L71896j57445l87866K16568N59146j5218m51480j6511L33680j00124
34095G15438l84833J31049M54647j01347n10736j0253M09208m7109m28674N5150
34085B82540M67858K1763l60671P7027L83146j72438n42616P4389N82396N8383
34075H71777m55748J2201M77980k8560n35402n5088M63242K9088m29916N0248
34065C99822N20832K8620m35482Q8714N43795q3597o73671r2389N69471R4502
$$ plain form
34135 261594 -68548 92469 486382 471724 258430 405873 639471 411521 95545 342440
34125 342440 775885 633945 195675 237841 571101 480000 147344 252753 590683 482699
34115 482699 154270 307471 720261 664014 321518 392910 692178 550718 209017 362792
34105 362792 734688 577243 189377 405945 965091 949873 498393 481882 815562 715438
34095 715438 330605 461654 916301 814954 304218 293965 703173 656064 227390 282540
34085 282540 750398 772161 411490 488517 871663 699225 156609 230998 813394 871777
34075 871777 416029 428230 906210 877650 342248 287160 750402 779490 349574 399822
34065 399822 920654 949274 513792 602506 1146301 1062704 389033 296644 866115 960617
34055I60617n00861j411N88528M7321n98874p2019O22044J62442m95512n4800
34045F57475N16944o0383p38721j49252O55455K18933m71692K5406P00264Q8754
34035A443183p45017k30474O06258J41349o39934j00743P68070K79978o00223
34026I22447j67719O24304Q3385p73414j93043P57895K17042p58200k13026Q27009
34016A326680L32004p26734k95177O77459J44139q76198k51964R44971M23088
34007A698268q01154l38921Q60405L67113q80095l79757R39799M78974q82800
33998A061832m75872Q73487M66056q75681m08218J011733N38496r64330n32328
33989F95175R97352N67966r91071n22800J135606O94628j020900n85298J194961
$$ plain form
34055 960617 459756 458345 1046873 1094194 495320 423301 1045345 1207787 712275 657475
34045 657475 1174419 1114036 375315 226063 881518 1100451 628759 654165 1354429 1443183
34035 1443183 698166 467692 1073950 1215299 575365 474622 1242692 1522670 922447
34026 922447 754728 1379032 1462417 689003 495960 1253855 1470897 712697 499671 1326680
34016 1326680 1658684 931950 636773 1314232 1458371 582173 330209 1275180 1698268
34007 1698268 897114 558193 1418598 1785711 905616 525859 1465658 1944632 1061832
33998 1061832 585960 1459447 1925503 1049822 641604 1653337 2191833 1227503 695175
33989 695175 1692527 2260493 1269422 746622 1882228 2576856 1555956 970658 2165619
33980B165619P51838j131422p38608J174477P45268j276147q40357J326220R60626
33971C137514j270745q98557J482068J194699j254213j006776J492731J204388
33963D081109j438934j150372J658162J419226j470165j115596K085123J809325
33955E877878j615511j416677K184566J983350j816139j441737K897150K652137
33947I305017k074860j827770L523589L562508k054979j738230N104000N444216
33939A9243491j473021m57208R914636J2075510M155117P215217K3311158K5773836
33931I9758736J5450305M0168224J13672663J56626826Q5131763o1041073j50736739
33924B99030705j23104760m8816730j6059127k4037211k3987249p669577k175677
$$ plain form
33980 2165619 2917457 1786035 1047427 2221904 2967172 1691025 850668 2176888 3137514
33971 3137514 1866769 968212 2450280 3644979 2390766 1383990 2876721 4081109
33963 4081109 2642175 1491803 3149965 4569191 3099026 1983430 4068553 5877878
33955 5877878 4262367 2845690 5030256 7013606 5197467 3755730 6652880 9305017
33947 9305017 7230157 5402387 8925976 12488484 10433505 8695275 13799275 19243491
33939 19243491 17770470 17313262 27227898 39303408 43458525 50673742 73984900 99758736
33931 99758736 115209041 155377265 269049928 425676754 510808517 449767444 299030705
33924 299030705 175925945 127109215 111050088 87012877 63025628 55356051 53180374
33917E3180374j0620035j1292245j516345R75025o031625p201340k08072J690152
33909A8975889l800456n021666K83607J775849k673191l706833P28277K052741
33901H614217j805644k994705N67946J725431j510438k522681N88608J636508
33893D299242j228439k186457O08167J697064p76482j761056N00256J283045r83804
33884A451536j692670O79745J595394n76121j490859N52094J430216n80153j535466
33875a66284L47144J340868l74388j313024L22357J249564k95830j218321K03567
33866I5653J061657k74522j039481K68336R29387m66246j162022K83049J112918
33857H08729k20923j071822J64998R75639k46927j077750J20156J028956k1655
$$ plain form
33917 53180374 42560339 31268094 29751749 30726774 24695149 17493809 17285737 18975889
33909 18975889 15175433 10153767 10437374 12213223 9540032 5833199 6561476 8614217
33901 8614217 6808573 3813868 4381814 6107245 4596807 2074126 2662734 4299242
33893 4299242 3070803 884346 1492513 3189577 2413095 652039 1152295 2435340 1451536
33884 1451536 -241134 438611 2034005 1457884 -32975 519119 1949335 1369182 -166284
33875 -166284 180860 1521728 1147340 -165684 156673 1406237 1110407 -107914 95653
33866 95653 1157310 882788 -156693 111643 1041030 574784 -587238 -304189 808729
33857 808729 587806 -484016 -319018 656621 409694 -668056 -547900 481056 459401
33848D59401q61519J52359R61835l9087q77244K8037P94798j00333q14061J43453
33838a52361R24481j5536q91131r6168P17651m0644q22492o4934P67604J29006
33828D55476o26047j8015O68069K4077o98345j34273N12490n0951o23145L5601
33818d55063O85196O5649n91450j363O44033N8667n99007m2428O02719M8825o10617
33807a94839q1789N81084P7545n87518j12832N58703J44671m80227r8395M32715
33797B39118l9619o08231r9245N67654J61071m61911p1293N24181J16998n01568
33787a72845j25463M75518Q8315n42786j77669N05132K58015l49893j54514L26204
33777A30014N1032m08322o6753M18031L6197n01082j15942M81066J42430m65219
$$ plain form
33848 459401 -402118 -249759 712076 672989 -204255 -176218 618580 518247 -295814 -152361
33838 -152361 772120 756584 -134547 -230715 486936 446292 -376200 -441134 326470 455476
33828 455476 -170571 -188586 479483 503560 -194785 -329058 183432 132481 -490664 -455063
33818 -455063 230133 295782 -295668 -297031 347002 405669 -193338 -235766 366953 415778 -194839
33807 -194839 -276628 304456 382001 -205517 -318349 240354 385025 -95202 -193597 239118
33797 239118 199499 -408732 -507977 59677 220748 -241163 -312456 211725 328723 -172845
33787 -172845 -298308 177210 265525 -277261 -454930 50202 308217 -41676 -196190 130014
33777 130014 181046 -227276 -294029 124002 160199 -340883 -456825 24241 166671 -298548
33767b98548j44933N06857K69034l58003j87365L52849J54817l51719j01030M50951
33757B92910K23110l52898k05336K62513K3249m88750k32976L46923J73912l44018
33747c01361j29050M27648K32285l58509k40917K85391J52257l53993j82369L81401
33737h7217K66436k88093k23727K69896J85454k88949j71745L42197K64986k42553
33727B6685k18960K07420J44230k52072j34228K77259J29844k92720q4997M30634
33717B33095K49002l43838k62322K96214K22013l73509l78908J95688K89556j70166
33707d3175k33694J65688J60920k48424j91454K98328L02092j88382k50213J84489
33697d3825K46749j44866j76239K12387K34696j45792j61703J90502J46991k49573
$$ plain form
33767 -298548 -443481 63376 332410 -25593 -212958 139891 294708 -57011 -158041 292910
33757 292910 516020 163122 -42214 220299 243548 -245202 -478178 -131255 42657 -301361
33747 -301361 -430411 -2763 229522 -128987 -369904 -84513 67744 -286249 -468618 -87217
33737 -87217 179219 -108874 -332601 -62705 122749 -166200 -337945 4252 269238 26685
33727 26685 -192275 15145 159375 -92697 -226925 50334 180178 -112542 -197539 233095
33717 233095 482097 138259 -124063 172151 394164 20655 -358253 -162565 126991 -43175
33707 -43175 -276869 -111181 49739 -198685 -390139 -91811 210281 21899 -228314 -43825
33697 -43825 202924 58058 -118181 94206 328902 183110 21407 211909 358900 109327
33687A09327j96464K42663J97204l06070l50916J15376J99960j95706k25295K04928
33677b04993K55963j74821k51851J49504K16545j76973k31112J74339K32394j86173
33667a97178k62333J67569K98788o6157j72046J64823K20595j43049j80452K21955
33657E2515K61591k04347l28163J09822K75976j17728l01654K6300J59433j63944
33647b30199k40464J64962L12481o7234k40762Q9344K24043j13420k08627K18056
33637i1820M10291J2950k52674J5617J70327j62615l45652l218K39913o351j60471
33626a73703J34831K96390j7369k07641P3917K23470j11143l10532k048J86824
33616I2996j38740l32423N1322L57207M2497l06395q1088K53586J02049j78300
$$ plain form
33687 109327 -87137 155526 352730 46660 -304256 -188880 11080 -184626 -409921 -204993
33677 -204993 50970 -123851 -375702 -226198 -9653 -186626 -417738 -243399 -11005 -197178
33667 -197178 -459511 -291942 6846 -59311 -231357 -66534 154061 11012 -169440 52515
33657 52515 314106 109759 -218404 -108582 167394 49666 -251988 -225688 -66255 -230199
33647 -230199 -470663 -305701 6780 -60454 -301216 -211872 12171 -101249 -309876 -91820
33637 -91820 318471 331421 78747 94364 264691 102076 -243576 -246794 -6881 -13232 -173703
33626 -173703 -38872 257518 240149 32508 106425 329895 218752 -91780 -93828 92996
33616 92996 -45744 -378167 -326845 30362 72859 -233536 -314624 -61038 41011 -137289
33606a37289o4947J38746M812j48468M6714K21781P487k02390r463K14396O3973
33595A35352j32479j0770J13711o3828j88719J7592J42376j08807k72981L080
33585c65473K53814O7491j33627P3985K92700P9772k13539j46498J298j20463
33575b10540k02756N0907K47649N0609j24983Q9997K67632L278k62098n3027K35088
33564I1756Q4441j88311q4631J30153N153j99501o4384J39788J6032j30395J06322
33553i3577L70094J61336k16300k04655J9885k0345j67127p161K48161J40754
33543B31065j56798j72417J0995J3573q2523J7161J59661N3106j11898k5677J21427
33532E7675K7098j12986j2139J17048M68j24930O785J25029m0129j82360j5393
$$ plain form
33606 -137289 -202236 -63490 -58678 -207146 -160432 61349 68836 -133554 -143017 71379 135352
33595 135352 2873 -7897 105814 41986 -146733 -129141 13235 -95572 -368553 -365473
33585 -365473 -111659 -44168 -177795 -103810 188890 268662 55123 -91375 -90077 -210540
33575 -210540 -413296 -362389 -114740 -64131 -189114 -99117 168515 171793 -90305 -143332 91756
33564 91756 176197 -12114 -96745 33408 38561 -160940 -225324 -85536 -69504 -199899 -93577
33553 -93577 276517 437853 221553 16898 36783 16438 -150689 -157850 90311 231065
33543 231065 74267 -98150 -87155 -73582 -156105 -138944 20717 73823 -38075 -63752 57675
33532 57675 84773 -28213 -40352 76696 77164 -47766 -40981 84048 43919 -138441 -153834
33521a53834J23436o8586k06365N8976K94403N0267k56859p9085K48734J38147
33511A49234j74822j30960R2756K990k05834o2563J99645P8782j82061l6881K80135
33500A0421J61770k08957j75355J76138J96159j22162j86955O3324J11570j11443
33490h5490j36049J14485K10246M6996m0359Q590o4802k04115j12746R8417O8902
33479i5925j04454m6755J44523Q0155j38971r8653J15650P9146j35584r4202J48927
33468a46143J56574m2171l4414J40905P4979j72332j58511P6307P5264j46302
33458a75844j31214J18172J30093j25995j73823O7770J52836l3564r5442Q1147
33448a85864J32809m7365j15281M2876J22731K1755p049P7884K4197j49776j34952
$$ plain form
33521 -153834 -30398 -98984 -305349 -246373 48030 98297 -158562 -237647 11087 149234
33511 149234 -25588 -156548 -63792 -60802 -266636 -329199 -129554 -50772 -232833 -269714 10421
33500 10421 172191 -36766 -212121 -35983 160176 38014 -148941 -85617 25953 -85490
33490 -85490 -221539 -107054 103192 150188 109829 118419 53617 -150498 -263244 -164827 -95925
33479 -95925 -200379 -247134 -102611 -22456 -161427 -260080 -144430 -65284 -200868 -295070 -146143
33468 -146143 10431 -31740 -66154 74751 149730 -22602 -181113 -104806 -29542 -175844
33458 -175844 -307058 -188886 -58793 -184788 -358611 -290841 -138005 -171569 -267011 -185864
33448 -185864 -53055 -100420 -215701 -172825 -50094 -28339 -35388 42496 66693 -83083 -218035
33437b18035O3219J14540q941j3315J05662O4998j02205r3059M2165j0993j65248
33426b21212n8482J99944J56402j38761j87379M9240J00956j12889j53622P8312
33416b87491J64714j8055r1251O7741J17376l5279n5434J18543J27545q1341j08017
33405h0949J32792K13438l2844k31328j62473o9212p9282J1971J98839J70562
33395G1514o4101j18221N3102N7504j62442j85901P9723J91117j4084j27671N4353
33384a65107J85303O0582m1673K0731j3946j93235j60553J35129K34890k8570
33374C3551k15594p1817N9717n3050j08574P6207J67994l0896j71006l827J60865
33363a56430N0895q8781j1231Q4128L115o4903K1557N6262n7681o8500J06589
$$ plain form
33437 -218035 -154816 -40276 -49217 -62532 43130 108128 5923 -87136 -44971 -55964 -221212
33426 -221212 -279694 -79750 76652 -62109 -249488 -200248 -99292 -212181 -365803 -287491
33416 -287491 -122777 -140832 -232083 -164342 -46966 -82245 -137679 -19136 108409 27068 -80949
33405 -80949 51843 265281 232437 1109 -161364 -230576 -309858 -297887 -99048 71514
33395 71514 7413 -110808 -57706 -202 -162644 -348545 -268822 -77705 -91789 -219460 -165107
33384 -165107 20196 80778 39105 59836 45890 -147345 -307898 -172769 62121 33551
33374 33551 -182043 -253860 -194143 -247193 -355767 -279560 -111566 -142462 -313468 -317295 -156430
33363 -156430 -105535 -194316 -205547 -121419 -118304 -183207 -161650 -105388 -163069 -231569 -124980
33352a24980J62367j0638q8109O0292J01822j03977k01650j3404J14505j7905
33342a21677q7889Q9135J70161m4142j89860j7121J41591K1232q2295O9418J64986
33331A13539m0173k15099o9634J00920M268q8494R2430K49663P8267j38929o5945
33320B0813O2895o7722k25606q1810J56242J41892K963O764K7871j09797j79650
33309b45145J9605K01222Q8193n5531P1772K22017P6968j30676p0153M6022j05645
33298A18649k97400j66878Q1295M9374j20179m8893J49013J08321q3613p7461
33288b87772P3195O2375n9828k4430J04326P7564k8522J6298J18274O2391l1725
33277H2146M1179J14976m5189k42931j75292P738q78q4289L0364J93316R8357
$$ plain form
33352 -124980 37387 26749 -61360 -1068 100754 -3223 -204873 -218277 -103772 -121677
33342 -121677 -209566 -120431 49730 5588 -184272 -201393 -59802 -38570 -120865 -51447 113539
33331 113539 73366 -141733 -211367 -110447 -106179 -194673 -102243 147420 225687 86758 20813
33320 20813 83708 15986 -209620 -291430 -135188 6704 9667 16431 44302 -65495 -245145
33309 -245145 -225540 -24318 63875 8344 80116 302133 379101 248425 178272 224294 118649
33298 118649 -178751 -345629 -264334 -214960 -335139 -384032 -235019 -126698 -210311 -287772
33288 -287772 -214577 -152202 -212030 -236460 -132134 -54570 -83092 -66794 51480 113871 82146
33277 82146 123325 238301 193112 -49819 -225111 -217373 -218251 -302540 -272176 -78860 19497
33266A9497j17025j13187L9981N6355l3Q6825J65773q389k17336j06193J49012
33255d4720J23942j03916j24454N9902J02651j3206q439R3695K2451j68575j74823
33244b35492j5337K2469o6034m0611Q6073J03872M6988P9977R1170q8322k41423
33233b56670q4253J68353J33371n2293K358J91324J09651j57426j64754P2080
33223c8259J12991r6053j64242k871O4466l5587k5276J17345R9736p9484r4532
33212a41766P7174J05523m6811m4311J72918K59718Q4771q7236j21007j68116
33202I0857k29591j16511Q6005P2502j04277p4020J75508K50359N0895p8107M666
33191A28286L5369r0312j36763m2312l8467j27496k4055K41070K54697o6718k80334
$$ plain form
33266 19497 -97528 -210715 -170734 -114379 -114412 -27587 138186 129797 -87539 -193732 -44720
33255 -44720 79222 -24694 -149148 -89246 13405 199 -8240 85455 107906 -60669 -235492
33244 -235492 -250829 -228360 -294394 -335005 -248932 -145060 -98072 -18095 73075 -15247 -256670
33233 -256670 -340923 -172570 -39199 -91492 -89134 102190 211841 54415 -110339 -38259
33223 -38259 74732 -21321 -185563 -188434 -123968 -159555 -184831 -67486 32250 -47234 -141766
33212 -141766 -64592 40931 -5880 -50191 122727 382445 467216 379980 258973 90857
33202 90857 -138734 -255245 -169240 -96738 -201015 -275035 -99527 150832 201727 123620 128286
33191 128286 163655 73343 -63420 -105732 -144199 -271695 -295750 -54680 200017 133299 -147035
33180a47035j30794R4558J26330Q6408R2372J8484j31807j21849M7344O4585j10513
33169a11917j23657J22228K45204N0091j32041m1990R4244M4180l5664J1546K6294
33158A48518q9556j22569K7756J06893k3571j07564K0200J11349j9245j27481
33148g5270M206J51089N3596j22433j05092K0494K8340m3806l9420P994M221Q538
33136a07543P0904Q2712l61l2378M2456N5564o5826j38715n8734J3510k7118m6579
33124b12108J8980J3633r4955q2118J18222K26508P2760j12498r7526L930K4190
33113a20982L7679J14319J08764m2531j24447J092J38683R8395m459j7823j9770
33102A68920q7760j00139P048P6999K8414Q617O7415K3116j50370j80363L0912
$$ plain form
33180 -147035 -277829 -183271 -56941 29467 121839 140323 8516 -113333 -65989 -1404 -111917
33169 -111917 -235574 -113346 131858 181949 49908 7918 102162 146342 110678 122224 148518
33158 148518 58962 -63607 -35851 71042 47471 -60093 -39893 71456 52211 -75270
33148 -75270 -71064 80025 133621 11188 -93904 -73410 -45070 -88876 -128296 -120302 -116081 -107543
33136 -107543 -36639 46073 45712 13334 55790 111354 45528 -93187 -151921 -138411 -165529 -212108
33124 -212108 -193128 -179495 -274450 -356568 -238346 -11838 60922 -51576 -149102 -145172 -120982
33113 -120982 -83303 31016 139780 97249 -27198 -26106 112577 210972 206513 188690 168920
33102 168920 81160 -18979 -11931 65068 93482 102099 169514 192630 42260 -138103 -107191
33091a07191J75774M6946j08223l2427J11038P3801m9419n9458j4940l5493l0525
33080c0117O9487R4619n3433j56421m1478R8275M4755o7700k5759Q2013O9519
33069H3760q068j4151M583k2361p363P8088P0924o9805j14736L5186J26650j0784
33057A51923j50272p3540N2587J4333o8016j8779N3922J7576m090P7665P7965
33046A31274r2922j76981j8499J08416j4799j32672O460J51094j376k19153j25873
33035c85031J36114J77447L6556K8981J31691P2218j16744j58050m0507R243k8179
33024a36261J1519J00528Q0333L997L1870R3629K2429r8876q5391l892k5622q4790
33012i0527l9080P585q8499j71468l8301J59331J60223M7246N0856R8953r009
$$ plain form
33091 -107191 68583 115529 7306 -25121 85917 159718 110299 50841 35901 408 -30117
33080 -30117 39370 133989 80556 -75865 -117343 -19068 25687 -42013 -67772 14241 83760
33069 83760 75692 61541 66124 43763 36400 114488 185412 115607 871 36057 162707 151923
33057 151923 1651 -71889 -19302 -4969 -72985 -91764 -37842 -20266 -24356 53309 131274
33046 131274 38352 -138629 -157128 -48712 -63511 -196183 -189723 -38629 -40005 -259158 -385031
33035 -385031 -248917 -71470 -34914 -5933 125758 197976 81232 -76818 -117325 -108082 -136261
33024 -136261 -124742 -24214 56119 60116 91986 185615 208044 109168 23777 19885 -5737 -90527
33012 -90527 -129607 -122022 -210521 -381989 -420290 -260959 -100736 -53490 -2634 96319 87310
33001H7310j66639j38543j360K2805o056Q3349J71727O9876o1340J5367J30156
32990B06652K448j90859r9388J35190R9194j45886j65631P3713J66077j1202j40379
32979g0071o4935J3552l885K4143R9318N1301p1814m6145P6652L1103j46498j54709
32967b61988J3297N4714p3035q5690P4390J35236K2644j2798J06708J43336P362
32956A24176q8872m4477j0074l4532N984P1069j7376j73393j26698O8341Q8669
32945a37183o5870o3985J24704J53522m8903j28964M3857J51247L1777m9151M9986
32934F1037P7992p6974j22818Q0866K10018L6911j65354j12768K8999J6106m2903
32923h888K1662Q1660r189r9368k9766N8677P582o0812j1046L3683l7122p2966
$$ plain form
33001 87310 -79329 -217872 -219232 -196427 -202483 -119134 52593 122469 61129 76496 206652
32990 206652 209100 18241 -81147 54043 153237 7351 -158280 -84567 81510 70308 -70071
32979 -70071 -135006 -121454 -125339 -101196 -1878 49423 -22391 -68536 8116 39219 -107279 -261988
32967 -261988 -248691 -193977 -267012 -352702 -278312 -143076 -120432 -133230 -26522 116814 124176
32956 124176 35304 -9173 -19247 -53779 -47795 23274 5898 -167495 -294193 -225852 -137183
32945 -137183 -203053 -267038 -142334 11188 -37715 -166679 -122822 28425 60202 11051 61037
32934 61037 139029 62055 -60763 20103 230121 267032 101678 -11090 17909 34015 -8888
32923 -8888 12774 94434 85245 -14123 -43889 14788 22370 -38442 -49488 -15805 -52927 -125893
32911a25893L8686J18241J9821p4705K4264J69806J43581J7192k9777k0715m9678
32900B30823o2815j3913j3713j03357j18773Q677Q0288k3464j06525n562J13255
32889a5079O8428p892N7890J41746N9404q7302j02770l2700k2577l5100J8210
32878D2258N1916k1913q0679m063Q4409L7403m2462r59P8764M0446o1833r0377
32866C2910p2835r3301r5744j4458O2405N9721O6529J32854J25506j3662r6849
32855I3076p17R0432k238j33578r9525P370n95n8936j2177O2487N604j07101j01537
32842b57435k1892k1008o3440j8671O8158O7243J4961K4672O0180L0702j0821
32831a27351J5396L8947r109k8738M9703Q5685j7577q5171L7215J72406R4765
$$ plain form
32911 -125893 -87207 31034 50855 -23850 414 170220 313801 330993 301216 280501 230823
32900 230823 168008 154095 140382 37025 -81748 -73071 7217 -16247 -122772 -128334 -15079
32889 -15079 53349 45457 103347 245093 304497 217195 114425 81725 59148 24048 42258
32878 42258 94174 72261 -8418 -12481 71928 109331 66869 65910 144674 185120 123287 32910
32866 32910 -39925 -133226 -228970 -243428 -181023 -121302 -54773 78081 203587 189925 93076
32855 93076 92359 182791 180553 46975 -52550 -45180 -45775 -104711 -116888 -54401 -48797 -155898 -257435
32842 -257435 -279327 -300335 -363775 -382446 -314288 -247045 -232084 -207412 -147232 -116530 -127351
32831 -127351 -111955 -73008 -82117 -110855 -61152 24533 6956 -78215 -41000 131406 226171
32820B26171p2048p1299M4129L6460q7735j28883o9570n2697o9647l804Q5743
32809a63180M6901n9997m8914N7070P6837k92k9987K082j901j4372M8627R5550
32797H424k614j21558n4055J01837P7898q9123r7644J01737K12265P3569j14593
32786I6143j48040q5992m7373j1583N0522P1120K5123j0520j5156n8027j18258
32775b52041p5785N1278P4883n6964j20909P4694L85952M86631K53321j15319
32765G05741l30787k90597j27329k2038l898K4774R1832J00404M320r4312j00959
32754d2849n9782l9343j3479M3838P5241N8084O6542J06925N3887j18999k23777
32743i3712j33047Q279K5426j4674K1033O7167R297o4113j5548P2949M2580n4044
$$ plain form
32820 226171 154123 82824 126953 163413 75678 -53205 -122775 -175472 -245119 -248923 -163180
32809 -163180 -116279 -176276 -225190 -168120 -91283 -91575 -121562 -119480 -121381 -135753 -87126 8424
32797 8424 5810 -115748 -169803 -67966 9932 -79191 -176835 -75098 137167 210736 96143
32786 96143 -51897 -137889 -185262 -196845 -146323 -75203 -50080 -60600 -75756 -133783 -252041
32775 -252041 -327826 -276548 -201665 -258629 -379538 -304844 81108 567739 821060 705741
32765 705741 374954 84357 -42972 -65010 -68908 -44134 47698 148102 152422 58110 -42849
32754 -42849 -102631 -141974 -155453 -111615 -36374 21710 88252 195177 249064 130065 -93712
32743 -93712 -226759 -218480 -193054 -207728 -186695 -119528 -110231 -174344 -189892 -116943 -74363 -128407
32731a28407o1939m03K4847N9725J79443K50029J06802j26495j92928r4170l5462
32720a8958n9874m0900K4132K0768k4755J3170R7272Q6197J1064J3905O1758J1529
32708A95308r1294p9916J2660P966q1376q5020j0910j9140q1923j3397J58429
32697h8613J95516N3243n3763k6782L389j8987J1703Q3332L0099j41813k06040
32686a58716q5293L0623K7697K7273R6982J03756p405o5030L9734J51433R7366
32675B58420n7694j44431j14486k3950O3614Q2919J2928m8911l403O8572K0352
32664A13930r6767j06837j5653J2451l7339k8550K9657o010r3065k8160J65090
32653i1253K15834M8399r5485p2154k9141o0441j9847J48867K21945N0461j66700
$$ plain form
32731 -128407 -190346 -190749 -165902 -106177 73266 323295 430097 303602 110674 16504 -18958
32720 -18958 -78832 -119732 -95600 -74832 -99587 -86417 10855 97052 108116 122021 183779 195308
32708 195308 104014 24098 36758 44724 -36652 -121672 -132582 -151722 -233645 -247042 -88613
32697 -88613 106903 160146 106383 79601 82990 64003 75706 159038 189137 47324 -158716
32686 -158716 -244009 -213386 -185689 -158416 -61434 42322 34917 -30113 9621 161054 258420
32675 258420 200726 56295 -58191 -82141 -18527 64392 77320 28409 25006 93578 113930
32664 113930 17163 -89674 -105327 -92876 -130215 -158765 -129108 -135118 -228183 -256343 -91253
32653 -91253 124581 172980 77495 5341 -23800 -84241 -104088 44779 266724 317185 150485
32642A50485j84195n9081O767k1916n0171m0023m702M7246O1394j8610j02727
32631b15533m2228J00947J12696j0537m4682O0453R0368k7456p7858L5201R1655
32620G3026l8200j31783j263J66201J27512k3846o5149j2841m674j7390K5791
32609I7384M6988k8442p7596P482Q4261j0051j55016j34869J1166Q3101M3115
32598c2477r3j9932n3514n5460J5757O6000J7742k0658O2688J54735Q5450q6253
32586A33985j69843j29738o8315j5156O2034J14811P4553r225m8999n5705n8664
32575a70262o300J06209J46525M5508n5361k9052K2064k9997q7080q115J06462
32564D0601P3430m7595n5437N0516R2490K1521m3902m7060l8085k6992N423k115
$$ plain form
32642 150485 -33710 -92791 -86024 -107940 -158111 -198134 -202836 -155590 -94196 -112806 -215533
32631 -215533 -257761 -156814 -44118 -54655 -99337 -38884 51484 24028 -53830 -18629 73026
32620 73026 34826 -96957 -98220 67981 195493 171647 106498 93657 88983 71593 97384
32609 97384 144372 115930 38334 45816 130077 120026 -34990 -169859 -158693 -75592 -32477
32598 -32477 -32570 -52502 -106016 -161476 -145719 -79719 -61977 -82635 -19947 134788 220238 133985
32586 133985 -35858 -165596 -233911 -249067 -187033 -72222 2331 -6894 -55893 -111598 -170262
32575 -170262 -176562 -70353 76172 121680 66319 37267 59331 29334 -57746 -65861 40601
32564 40601 114031 66436 10999 61515 154005 175526 131624 84564 46479 19487 24910 22795
32552B2795r3662j50672m8922J06709J23426L0996J2000P3158M8679q0458j34993
32541i0944l8347O8366P1360L7319M7672N8966J7860k5171r753K5713R410n3361
32529A19090r3677o7712j087L9467J7742k6094l3179k4166o6280j34966j15779
32518c86641J8444J45737J62671J00042J9320p3470j43613j03024L8601J32348
32508h9585R3171J3677q397o547j9310N220P0308O7485k7394p1339L957N5988
32496H7234j7606q9863l5747M5672L1244O4M7416O4960n2812j59524p8081Q0110
32484g6933R0999j4420l7088L9050O1546k44m0800l4859l4364j6228M8953O3624
32472D9236m0184j15847j2356J40636J17609l6423j00427m5295j7452l3119R781
$$ plain form
32552 22795 -70867 -221539 -270461 -163752 -40326 -9330 2670 75828 124507 44049 -90944
32541 -90944 -129291 -60925 10435 47754 95426 154392 172252 147081 137328 163041 172451 119090
32529 119090 25413 -42299 -43386 -3919 13823 -12271 -45450 -69616 -135896 -270862 -386641
32518 -386641 -368197 -222460 -59789 40253 59573 -13897 -157510 -260534 -221933 -89585
32508 -89585 3586 17263 8866 2319 -16991 -11771 58537 126022 98628 27289 31246 87234
32496 87234 69628 -20235 -55982 -10310 20934 20998 68414 133374 80562 -78962 -157043 -76933
32484 -76933 14066 -354 -37442 1608 63154 62910 22110 -12749 -47113 -63341 -14388 49236
32472 49236 9052 -106795 -119151 21485 139094 102671 2244 -43051 -60503 -93622 -83841
32461h3841P1285K2858p7390n6088O1405R6001L8383L0628N7799k4910j65828
32450b9698j43886N2171J81503J31724M9023L7652J4654o7452j16450r3285p6522
32439f0566p9730k8219M9265L9400k2966R438J05884P3861r4741j73356o1306
32428b43036P5680J01708Q4384Q7368M7473m1416o2753L808K4316m0062n6024
32417a8554K2606N9169l817k9892M9851R8504K5296n1066k9545q22m7127p4672
32405f9o642M6238j9651r9749n1559O7130R9591K7604m1329m4660k638M6588N9608
32392H0462K950q1190r7544k6835M8106O3089K7141l8601j03698r1575K3249J13850
32380h0596N6832n5769n2371K6469J1413o7761k8843J00659R6185n3126r2370
$$ plain form
32461 -83841 -12556 10302 -67088 -123176 -61771 34230 72613 103241 161040 136130 -29698
32450 -29698 -173584 -121413 60090 191814 240837 278489 293143 225691 109241 15956 -60566
32439 -60566 -140296 -168515 -119250 -79850 -102816 -93378 12506 86367 -8374 -181730 -243036
32428 -243036 -167356 -65648 18736 106104 153577 112161 49408 53216 77532 37470 -18554
32417 -18554 4052 63221 59404 29512 79363 177867 203163 152097 122552 121730 74603 -69
32405 -69 -6711 39527 19876 -79873 -131432 -64302 35289 62893 21564 -23096 -25734 20854 80462
32392 80462 83412 2222 -95322 -122157 -74051 -10962 16179 -22422 -126120 -217695 -194446 -80596
32380 -80596 -23764 -79533 -131904 -105435 -94022 -161783 -190626 -89967 6218 -46908 -139278
32369a39278N4616J37666J2461j18252p3084J6600m760l3501M5900R9493r6r1901
32357i4136R086J63685J28258l5161p8403J7534N5666j6637n6483j3202J275n1798
32345B9684o0030L4234J26304J06063K634p4137o1049J2437O2188L7217j6276
32334A99269k1045L929k4964r1022q0242J4012M8775l3128r0270j3057Q8861O9041
32322G0159j8007k1776N6517Q3779R077q1258r6908l2305N4827Q8011K9409o4716
32310G6809r3253l6909K8134M6535K6900k1928q3447p7313M7209J75043J49007
32299B36787J6869l8992n248l3657j27207j11861K5821P3904l2515q0177L9118
32288c7158J20282J0120j11091m8774O6006K5007r0219p8745K0567L2949k8111
$$ plain form
32369 -139278 -84662 53004 65465 -52787 -125871 -109271 -114031 -147532 -101632 -2139 -2235 -94136
32357 -94136 -85050 78635 206893 171732 93329 110863 166529 149892 93409 80207 81482 29684
32345 29684 -30346 3888 130192 236255 238889 164752 103703 116140 178328 215545 199269
32334 199269 178224 182153 157189 66167 -14075 -63 48712 15584 -74686 -87743 1118 70159
32322 70159 52152 30376 86893 170672 179749 98491 1583 -30722 24105 112116 141525 76809
32310 76809 -16444 -53353 -25219 21316 48216 26288 -57159 -134472 -87263 87780 236787
32299 236787 253656 214664 209416 175759 48552 -63309 -37488 36416 3901 -76276 -37158
32288 -37158 83124 93244 -17847 -66621 -615 24392 -65827 -144572 -124005 -91056 -119167
32277a19167k4918K5542P348m7531k2871M6318M2335r3L8868J22121J08992L145
32265A80089o7580p5825r3510j07633m3300N6324O7975o995m8531j5543J7997
32254a36532R388j0531k3987l4519j6771L8234P1581M1002p022k9073n4264q0501
32242b32995k9487R2322J36188M1558l5410K3319Q3037j2888j53858j29652L1649
32231a86217J23308P1405k6327r7289j30098q7462K7623R1600K2437o2585k2188
32220b75793P7268Q5565J4748k7557l7528n2768j2952J09090J65553M7493q9365
32209C754n3166O2446N0495m3202k1795R7314J30982P0965O3677J01341M3653
32198E06464q5546j25073p4993p3776j04810l0555R8700Q6546n6223j12740k9931
$$ plain form
32277 -119167 -144085 -118543 -111195 -158726 -181597 -135279 -92944 -93037 -54169 67952 176944 180089
32265 180089 112509 36684 -56826 -164459 -207759 -151435 -83460 -90455 -138986 -154529 -136532
32254 -136532 -127144 -137675 -161662 -196181 -212952 -174718 -103137 -62135 -69157 -98230 -152494 -232995
32242 -232995 -262482 -170160 -33972 7586 -27824 -4505 78532 65644 -88214 -217866 -186217
32231 -186217 -62909 8496 -17831 -115120 -245218 -332680 -305057 -213457 -191020 -253605 -275793
32220 -275793 -198525 -112960 -98212 -125769 -163297 -216065 -229017 -119927 45626 93119 3754
32209 3754 -49412 13034 63529 20327 -1468 95846 226828 297793 361470 462811 506464
32198 506464 420918 295845 220852 147076 42266 11711 110411 196957 140734 27994 -1937
32187a937K2853j2678q729N2041K7918p1822m8928J23326K09667R1163n7011q5311
32175B40552q2399j28416j10892L6559J45949N9103j18147j79679r4120K7292
32165b04198J05000J07778J9009j00125j22761k3816O6988M7246l1239p2055n7154
32154b65327j1846M3850P2356M8303K2381N1237Q4213M5734j3206l463J8025n1005
32142D1252j26780m8074J13230J19502m6016j39858n0149N0072K0169m2985k7451
32131a37088M448k0585l4425K9402R9688Q6167P398o9788r9057l9229R0214J46526
32119F3671K7832j25458r9423N5688J02670N820m4266R124K0196l8804k0169P6470
32107C3351O2197p5158j06264K9564R9052n788p7697J0256P3243j9787r1794j665
$$ plain form
32187 -1937 20916 8238 -491 51550 79468 7646 -41282 82044 291711 382874 325863 240552
32175 240552 158153 29737 -81155 -44596 101353 160456 42309 -137370 -231490 -204198
32165 -204198 -99198 8580 27589 -72536 -195297 -219113 -152125 -104879 -136118 -208173 -265327
32154 -265327 -277173 -233323 -160967 -112664 -90283 -39046 45167 90901 77695 74232 92257 41252
32142 41252 -85528 -133602 -20372 99130 53114 -86744 -136893 -86821 -66652 -109637 -137088
32131 -137088 -132640 -153225 -187650 -158248 -58560 27607 35005 -34783 -133840 -173069 -82855 63671
32119 63671 91503 -33955 -133378 -77690 24980 30800 -13466 -4342 15854 -22950 -43119 33351
32107 33351 95548 20390 -85874 -56310 42742 36954 -40743 -30487 42756 22969 -68825 -70490
32095g0490Q1099J452q6682k5274L8545n4926j46170l9136J22806R9406l1851
32084a11221m1669M6343N4738N382L7901J01319N5532k8157Q475Q3326O15j71119
32072D1465j82753k3630P0555J7092k1246L7073O8644L037n3293k5640J0508l290
32060f1478k312O1268J15261Q0755j0649o9076n2897M022L4654J1922r825K6223
32048A27868O5330J1444q5803p3703M1426P2299l9035j11645l7550L4621j7177
32037a1925o3957J5027Q1800q815j17932n5563P9217Q2454Q549M0355J31733J02088
32025B83031j6502m8943j0549n0852j34569j03570k309j0350q9918m2332J02645
32014a24218J08679m0884r6151K5537J06544K2080o0465k914P6011M4456k1833
$$ plain form
32095 -70490 10609 12061 -74621 -99895 -61350 -116276 -262446 -301582 -178776 -79370 -111221
32084 -111221 -152890 -106547 -51809 -46427 -8526 92793 148325 120168 128643 211969 212584 41465
32072 41465 -141288 -164918 -94363 -77271 -98517 -61444 7200 10237 -43056 -68696 -58188 -61478
32060 -61478 -63790 -2522 112739 193494 182845 113769 60872 64894 99548 111470 101645 127868
32048 127868 193198 204642 118839 45136 86562 158861 119826 8181 -29369 5252 -11925
32037 -11925 -75882 -60855 20945 12130 -105802 -161365 -82148 306 8855 49210 180943 283031
32025 283031 266529 217586 207037 156185 21616 -81954 -84263 -94613 -184531 -226863 -124218
32014 -124218 -15539 -56423 -152574 -127037 -20493 1587 -58878 -61792 14219 58675 36842
32003C6842j6733J2367J386j653K4618p854j10937j31276J2088J60980J37305
31992A17133k984p9163m1218K0326L8544K1452p315k6560j4401J7843L1306K3534
31980I8497K6496L2249K060m2876l4222K6821O1405L6064J34j1470k1280m6551
31968A27327p6635j06362j12624l4906J18207J97597Q9053q5574j09995J2341
31958A8429P6260M443n0548K0314J04742N7941p9886j58423j11773L565R5695
31947a9241J07765N2857J741l526j832k6552k9885J7940L6582k9497p1718J9130
31935E3764J30026P4757q8355j24616P887J04253M7142m7888p0074o5282p8700
31924e7086n8020M655K6315K718L3655J09165P7959q1826j73468q1249M2655L1571
$$ plain form
32003 36842 20109 32476 33862 32209 56827 48973 -61964 -193240 -181152 -20172 117133
31992 117133 114149 34986 -6232 14094 52638 74090 66775 40215 25814 43657 74963 98497
31980 98497 124993 157242 159302 116426 82204 109025 170430 206494 206628 195158 173878 127327
31968 127327 50692 -55670 -168294 -203200 -84993 112604 201657 116083 6088 18429
31958 18429 94689 99132 48584 68898 173640 231581 151695 -6728 -118501 -114936 -19241
31947 -19241 88524 141381 143122 139596 137764 111212 81327 99267 135849 106352 34634 53764
31935 53764 183790 258547 170192 45576 53463 157716 204858 156970 86896 21614 -57086
31924 -57086 -115106 -110451 -84136 -81418 -47763 61402 139361 57535 -115933 -197182 -154527 -122956
31912a22956m0058j8021P0785R7007N2642K4177K3289l161n1277p3877p0795o9297
31900a81542o1780l5431p571K1050P2873J12101N9388n9874j00039P98J17862
31889f2165J21008M2836k3238p2891j28243j31619l0713J01823J50796J06889
31879G4483L8212k6278q8793j14171p0638n117P895k9691n1489j9964M0916Q2719
31867a61916P0620J3452l0971k0741M275j6798n3483k3930N8956R4985O0276L7782
31855C2507N8056M4750l1932q1661m6063l595l4763q4156n2981M6144J17258J12345
31843G5909O4302K7606L2199O1285N7314n690o5249n4318j6126l4133p4891l7273
31831C0935N2872N8617m1988j15048r1814n6685n9259j8451J00244J79514J29980
$$ plain form
31912 -122956 -163014 -181035 -110250 -13243 39399 63576 86865 83704 32427 -41450 -112245 -181542
31900 -181542 -243322 -278753 -286324 -265274 -192401 -80300 -20912 -80786 -180825 -180027 -62165
31889 -62165 58843 101679 78441 5550 -122693 -254312 -285025 -183202 -32406 74483
31879 74483 112695 86417 -2376 -116547 -187185 -192302 -184407 -214098 -265587 -285551 -244635 -161916
31867 -161916 -91296 -77844 -108815 -129556 -125281 -142079 -195562 -219492 -160536 -65551 -5275 32507
31855 32507 90563 135313 103381 21720 -24343 -27938 -62701 -146857 -199838 -153694 -36436 75909
31843 75909 140211 167817 200016 261301 318615 312925 247676 193358 177232 143099 68208 30935
31831 30935 83807 142424 100436 -14612 -106426 -163111 -222370 -240821 -140577 38937 168917
31820A68917L1194j5668m0569r4839j17425m3662N4699P1141K9776K8487P7300
31809A49351J01836O4969j555n4272o8974m9797l6824n8373p4456l9105L16k5011
31797i1895n7326J4951J44136J61300M4268m6168l5039k8824q0165q0083J4580
31786d0265O2852j9173r4992l3344P9995J09519Q3782Q2940O8873n744o1201l1045
31774B02197o392p4909j43765r1148K5962Q0542P5390P3956N4312k326m845Q8964
31762B77938J33299M655j68248j85969p7958q090J3215Q5287J63836J04993o4402
31751B78556j50807p3428M8776R3076N3695k8341j09416j27793p0124k4779n5532
31740a66117q1461p996R9883J20792P2760M6755K7608m1351r2605k9249P3688
$$ plain form
31820 168917 200111 184443 143874 49035 -68390 -112052 -57353 13788 43564 72051 149351
31809 149351 251187 316156 314601 260329 191355 141558 104734 46361 -28095 -67200 -66884 -91895
31797 -91895 -149221 -134270 9866 171166 215434 169266 134227 105403 25238 -54845 -40265
31786 -40265 22587 3414 -91578 -124922 -44927 64592 148374 231314 300187 294443 233242 202197
31774 202197 195805 120896 -22869 -114017 -88055 -7513 67877 141833 196145 193819 188974 277938
31762 277938 411237 415892 247644 61675 -16283 -24373 -11158 74129 237965 342958 278556
31751 278556 127749 54321 103097 196173 249868 221527 112111 -15682 -85806 -110585 -166117
31740 -166117 -247578 -255574 -155691 -34899 37861 84616 112224 70873 -21732 -50981 22707
31729B2707O2301m5462r6201m9480K677K6978O3352Q0865J8953n4097k4189N3427
31717F1831L1111o2858o0265M6908Q1924j3863q8002m3877J6480m338m3851j8216
31705i7016M3180Q4986J08621R9292P551j28261j72036p4087M9026Q0842M2805
31694D4903J0152k580j2959k0316l4456p2461r4180l0811R0826J45325O8298o0221
31682C1520j23256q9059q513M2683J2717p1213j05339l2831O4590Q1032M9471
31671a48198P7411J51391J42846J2972j14929j17653j4417P8777P4328j3369p8890
31660E0269l7575M6514K4629r9720j30351K4946J70344J00393p5069j03738J2287
31649a7071M8518o0146j34752n9558O3877J10360P8815Q537p2627q9171J7425
$$ plain form
31729 22707 85008 39546 -56655 -106135 -103458 -76480 -13128 67737 86690 32593 8404 61831
31717 61831 92942 30084 -30181 16727 98651 84788 -3214 -47091 -30611 -34949 -78800 -97016
31705 -97016 -53836 31150 139771 239063 246614 118353 -53683 -127770 -78744 2098 44903
31694 44903 55055 52475 39516 19200 -15256 -87717 -181897 -212708 -121882 23443 91741 31520
31682 31520 -91736 -180795 -189308 -146625 -133908 -205121 -310460 -343291 -278701 -197669 -148198
31671 -148198 -70787 80604 223450 236422 121493 3840 -10577 68200 142528 129159 50269
31660 50269 12694 59208 83837 -15883 -146234 -121288 49056 149449 74380 -29358 -17071
31649 -17071 31447 -28699 -163451 -223009 -159132 -48772 30043 38580 -34047 -123218 -105793
31638a05793J43967J21878k5754j06003m9851J2624j739j4825K7281M9542K799
31627E4126m3878l6230j4446o714J6133M2075J7238l1455k2682J8596p106p5548
31615h9891o0034L5550O7899L280l5997o489k494l7851n096Q8197Q8531j9343
31603B6262n0939N3712J04262p709j06024l0568R1441P1581m0245q5811n8588
31592c2626l4543M421Q1707J01841R704n9332J3679J03069L0228j26968j44412
31581e3232K587J24776J06968J0524q3274j47311j41949m3808O2124O6723P300
31570h8572J4902R6307J12110o796j46257j58108l8960Q5095J06884M0202j2650
31559D157J2901O4615N2460j3990m1174l761J4127m3817j20164j36083r0240k8276
$$ plain form
31638 -105793 38174 160052 134298 28295 -21556 -8932 -10671 -25496 1785 51327 54126
31627 54126 10248 -25982 -40428 -47142 -31009 11066 28304 -3151 -25833 -7237 -14343 -89891
31615 -89891 -149925 -114375 -46476 -43196 -79193 -85682 -88176 -126027 -131123 -42926 45605 26262
31603 26262 -24677 29035 133297 125588 19564 -11004 80437 152018 111773 25962 -32626
31592 -32626 -67169 -62748 18959 120800 130504 71172 84851 187920 218148 91180 -53232
31581 -53232 -50645 74131 181099 191623 108349 -38962 -180911 -224719 -162595 -95872 -88572
31570 -88572 -73670 22637 134747 127951 -18306 -176414 -215374 -130279 -23395 16807 4157
31559 4157 17058 81673 134133 120143 78969 75208 89335 45518 -74646 -210729 -300969 -329245
31547c29245J5768K4122J1612L7258J15184J40771L1035r4089m8148J12614J35677
31536A52559l3869j47301l8058J19942R4920n7166j19491m4936L5245M2484J5880
31525B0209j839q268p451j7309n7426q0882j2477J01555J12631l678r1702n8212
31513a04849j79K356L0647J32143J68334L1349j41450j55782m0317M0820M4860
31502G932M0880L7978m28m1182l2782p006o105P078N2496N3098k7961q7581m6471
31489e0054J1956l994l7094j3833J3915L392L0624J06853P7077j01580j85264
31478a48002P97K22536J58649q9874j57582J3701J29552M3772n7502j9619N2065
31467A48493K4799n3496q6134p4746m6764O769N7472M1855k1811m4427r871J6884
$$ plain form
31547 -329245 -313477 -289355 -277743 -240485 -125301 15470 46505 -47584 -95732 16882 152559
31536 152559 118690 -28611 -66669 53273 148193 91027 -28464 -73400 -38155 4329 20209
31525 20209 18370 10102 2651 -14658 -72084 -152966 -165443 -63888 48743 45065 -46637 -104849
31513 -104849 -105028 -102672 -72025 60118 228452 259801 118351 -37431 -77748 -36928 7932
31502 7932 48812 86790 86362 45180 12398 5392 -713 6365 58861 111959 83998 -3583 -50054
31489 -50054 -38098 -42092 -79186 -93019 -79104 -75712 -45088 61765 138842 37262 -148002
31478 -148002 -147205 75331 233980 144106 -13476 225 129777 173549 116047 96428 148493
31467 148493 173292 119796 33662 -41084 -87848 -81079 -23607 18248 -3563 -47990 -57861 -40977
31455d0977K0980M3037O6827M1748j011M017K3421j1177m9000k6P2870L3391q2999
31442A21101j06294p888O3639L2878j3866j5746k4961o7512q4516n5589l5734
31431a94488l7943j2742L7824N5259L8385L5776L6546O07k9176R543N7849J8184
31419A5624o0685n6487P648R250m2447l1700L0240K1576m5785l2045O7324J01420
31407a6067L6666J0182O2219N7659n0326j11870l7251M9084K7808k8559j1332
31396a1787M4488N9817N2100N8051L4895m9428j23783j08631k9367L2536L3538
31385g571k3670r7968j07414q572J14051J34260N3618k1524m8242o2278n4103
31374a29413J3243P8189L9797o0911q4838j3926M3874N5120P8072R0830J1199
$$ plain form
31455 -40977 -19997 23040 89867 131615 130604 134621 158042 146865 97865 97839 170709 204100 121101
31442 121101 14807 6919 70558 103436 89570 73824 48863 -18649 -103165 -158754 -194488
31431 -194488 -232431 -245173 -207349 -152090 -113705 -77929 -41383 -40776 -69952 -60409 -2560 15624
31419 15624 -45061 -101548 -93900 -84650 -127097 -158797 -128557 -106981 -152766 -184811 -117487 -16067
31407 -16067 20599 30781 93000 150659 100333 -11537 -48788 296 28104 -455 -11787
31396 -11787 32701 92518 144618 202669 237564 188136 64353 -44278 -73645 -41109 -7571
31385 -7571 -31241 -129209 -236623 -245195 -131144 3116 56734 35210 -13032 -75310 -129413
31374 -129413 -116170 -37981 1816 -59095 -143933 -157859 -113985 -58865 19207 110037 121236
31363A21236j06253j09438m311M5198m867k6410K5166M2974M485K9555J31818
31352A49153J53302L6447o8184o1632l9386p3206p6164l890K6400m8251r9962
31341a05373k7592O8209O1645r558n4017o9176o5531n824Q0143P9412j3912n6543
31329a18117J4061Q2792O6346L0017J8259k6639r3137o4068N6386J01955K4777
31318I2632j9133L7788N4788l0130o9252L43J9146p4379q5511P6022J80430O1982
31306B44726p5221j2439J01008L6517r2715n3013P2132M0694j02386j13311J7509
31295F3501P8368K0031n654M3889N4065k281l4981l0024m3421m5875J0044L8697
31283A46359m1765j14394m3236O1122K3639o0859J4681J68974J35969p5403j80902
$$ plain form
31363 121236 14983 -94455 -98766 -53568 -58435 -84845 -59679 -16705 -12220 17335 149153
31352 149153 302455 338902 270718 209086 169700 96494 20330 16440 42840 -5411 -105373
31341 -105373 -132965 -64756 -3111 -12669 -66686 -135862 -201393 -207217 -127074 -47662 -61574 -118117
31329 -118117 -104056 -21264 45082 75099 93358 66719 -26418 -90486 -34100 67855 92632
31318 92632 73499 111287 166075 135945 66693 67036 86182 11803 -73708 2314 182744 244726
31306 244726 169505 157066 258074 294591 201876 148863 220995 261689 159303 45992 63501
31295 63501 141869 161900 156246 200135 254200 251919 216938 186914 143493 97618 107662 146359
31283 146359 104594 -9800 -53036 8086 31725 -29134 -14453 154521 290490 215087 34185
31272C4185q3455R692k7940o8396j3738M4054L9118M3385P3141L1101p2510q3499
31260g4862J9016M9143p1713j58244n5571J12010J41431L8708m6603n0467j6286
31249a13438K0761N0366N0658K1520J739K080j5790n9363p7498m3298M684K4347
31237a33232Q741l7096q7140p8521J2132J01162J00035N0407M8315P5420M0933
31226A01156l7953n0847J6104N7264K7071p70J9814L1869j3123p3019q3294l4758
31214d0486L2654N8608K975q6606r6887o518N4651n886r1227p3546k234K640l0523
31201b82385J365O1078L8585k1030K0267J31086J38993K2448n0798o730K6892
31190G9771m4939j26818r1241M0707J48671J53111P0403o859N164O0374J6518
$$ plain form
31272 34185 -49270 -39578 -67518 -135914 -149652 -105598 -66480 -23095 50046 81147 8637 -74862
31260 -74862 -55846 -6703 -78416 -236660 -292231 -180221 -38790 -82 -46685 -97152 -113438
31249 -113438 -92677 -42311 8347 29867 31606 33686 17896 -41467 -118965 -162263 -157579 -133232
31237 -133232 -124491 -161587 -248727 -327248 -315116 -213954 -113919 -63512 -15197 60223 101156
31226 101156 63203 12356 28460 85724 112795 112025 131839 163708 150585 77566 -5728 -40486
31214 -40486 -7832 50776 53751 -32855 -129742 -136260 -81609 -87495 -178722 -252268 -254502 -251862 -282385
31201 -282385 -281020 -219942 -181357 -202387 -182120 -51034 87959 110407 59609 52879 79771
31190 79771 34832 -91986 -183227 -142520 6151 159262 229665 222806 227970 288344 304862
31179C04862j32088j82790k3197J47746J02844m9046m7152Q2406Q8253o0895j33022
31168I7921m2407K9925j9048n8215K024N6679L0122M136K4355J1772m3939l4378
31156E8947M0309L3986o5480o9788Q4431J93136J05221m5514p9164k8955o081
31145B21048p75K0891l989j01764j61117j06490k7704j5090j9166J0322J2273
31134a71561l6301k9215P7637J50271R1683J1791L4797Q8453M1846p6412j46898
31123C6091j34263o7148M2262J44611J39616K4643o0913l1724L1308M1382K4313
31112A90178p42q0440j73479j30098O0376J91412J30917L42n7170p7161j06691
31101e2556o5127N9873J01673j0884q9243k78Q3572j1491j33033o4268Q5382P3431
$$ plain form
31179 304862 172774 -10016 -33213 114533 217377 168331 121179 203585 291838 230943 97921
31168 97921 55514 85439 66391 8176 10200 66879 97001 101137 125492 137264 93325 58947
31156 58947 99256 133242 67762 -2026 82405 275541 380762 335248 256084 227129 221048
31145 221048 220273 241164 237175 135411 -25706 -132196 -159900 -174990 -194156 -183834 -171561
31134 -171561 -207862 -237077 -159440 -9169 82514 94305 129102 217555 259401 182989 36091
31123 36091 -98172 -165320 -123058 21553 161169 185812 124899 93175 124483 165865 190178
31112 190178 189436 108996 -64483 -194581 -134205 57207 188124 188466 131296 54135 -52556
31101 -52556 -117683 -57810 43863 32979 -56264 -56542 27030 15539 -117494 -181762 -96380 -22949
31089b2949m8716m5539P4580R2878j5297n3171K9349O1643k3093p7761j4910N7742
31077A4756M5664J347j8781m7991r2901q2761p22O4359N0824J430k6933l3489
31065a25198k9847j0543J8599M6595Q1036J11757R2632K0770k7134o959J9823
31054A91531o87k2570o494q525o0433q1052k5215P541n0264q4904R158J23035
31042h879R9871j3402p2864p6525r0762o0363P2986J69520O6738j23434j54706
31031a91820k0320P8648Q1855J00265J32367N4131j00219j43585n5984j5525o4902
31020a45089l9367R6966J40456P21j09914j4558J28085P1546j31441k10016o1189
31009b73800J35902J73125M6683p9460p5573J4894M2968l9191r9879j3362J48005
$$ plain form
31089 -22949 -71665 -117204 -42624 50254 34957 -18214 11135 72778 49685 -28076 -42986 14756
31077 14756 60420 61767 42986 -5005 -97906 -180667 -181389 -117030 -66206 -64776 -91709 -125198
31065 -125198 -155045 -165588 -146989 -100394 -19358 92399 185031 205801 178667 171708 191531
31054 191531 190844 168274 161780 153255 92822 11770 -13445 -5904 -56168 -141072 -131914 -8879
31042 -8879 90992 77590 4726 -71799 -162561 -222924 -149938 19582 86320 -37114 -191820
31031 -191820 -212140 -133492 -51637 48628 180995 235126 134907 -8678 -64662 -80187 -145089
31020 -145089 -184456 -87490 52966 53687 -56227 -70785 57300 128846 -2595 -212611 -273800
31009 -273800 -137898 35227 81910 2450 -73123 -58229 -15261 -54452 -154331 -167693 -19688
30998a9688K09958J26166p508j11077j56365j03516L7087J25152M5552r4810j05646
30987e4695p533J8388n6031p7284L469N9137L5588L3543Q4935P7660k0483q0971
30975A5723m3613j5573m8245k9778Q3933J40021L5527r0476p2964K6000M7579
30964D8134r637l5985j2628l417j4009m427O921k3739o5258m7545K8467R3445
30952c9678R6517M0958k8569m4540K1280R3291O3543n2328j20054p3940p18O50
30940d3588n3524q8307o9300p236O0840P4748J3576m4371j5024N4022N3520l969
30928f8613j2766L3628M5268J9844L5305N8224k5020j61495j52079K3658J43737
30917f0309R0452J5696M5233O8258j9157r4827l2909N3517Q995r0068p9796J0185
$$ plain form
30998 -19688 190270 316436 308928 197851 41486 -62030 -24943 100209 145761 50951 -54695
30987 -54695 -62228 -43840 -99871 -177155 -173686 -114549 -78961 -45418 39517 117177 96694 15723
30975 15723 -27890 -43463 -91708 -121486 -37553 102468 137995 47519 -25445 555 48134
30964 48134 38497 2512 -10116 -13533 -27542 -31969 -25048 -48787 -114045 -161590 -133123 -39678
30952 -39678 56839 97797 69228 24688 45968 139259 202802 150474 30420 -43520 -44238 -43588
30940 -43588 -97112 -185419 -254719 -261955 -201115 -126367 -112791 -157162 -172186 -118164 -64644 -68613
30928 -68613 -81379 -47751 -2483 17361 52666 110890 85870 -75625 -227704 -204046 -60309
30917 -60309 30143 45839 91072 159330 140173 45346 12437 65954 74949 -15119 -94915 -84730
30905h4730M3556L0362O7751J17255O3675o3113j26329r5497m5712j330M7965
30894d6147M2730n1117j08060j066J60255J60048R752p0149L882P4265J7113q4488
30882A07018j08539o6159k6409q30K1429K3714O105j407l599l4601o8630l3583
30870a85491O0234J04824M5757m1302o5745l1344J1422M5214O8748O3378K7485
30859A03180j633p31L418j7394m5849m9651k5697J0976N0236P5384N9886L679
30847A65804m9894n9925l5409j4458j0972r382m336r876k1351p195L2574L7722
30835A3302k6498q3008k9713Q8658J08695j2734j10724m7292Q2584J04240K3765
30824A11275k2528n430p156l1240n346L8905o820j06591r4881M6470J32568O2859
$$ plain form
30905 -84730 -41174 -10812 56939 174194 237869 174756 48427 -47070 -92782 -94112 -46147
30894 -46147 -3417 -54534 -162594 -163660 -3405 156643 166395 96246 100128 174393 191506 107018
30882 107018 -1521 -67680 -94089 -94919 -73490 -49776 -43671 -45078 -48677 -83278 -151908 -185491
30870 -185491 -125257 -20433 25324 -15978 -81723 -113067 -101645 -56431 12317 75695 103180
30859 103180 101547 100816 104234 86840 40991 -8660 -34357 -23381 26855 102239 162125 165804
30847 165804 115910 55985 20576 6118 -4854 -14236 -18572 -28448 -49799 -56994 -24420 13302
30835 13302 -13196 -96204 -125917 -37259 71436 58702 -52022 -99314 -16730 87510 111275
30824 111275 88747 83317 76161 44921 39575 78480 71660 -34931 -129812 -83342 49226 112085
30812A12085l6565m4310k1230m6739o1384m572N0316L2981M378K0442J4800n0455
30800c0253o9463K3826J05396N5707l9895n6340m5951r4710j08403K2923J66533
30789g0630J16844n5126r7047K1165Q1680P04m6156N6862J71791J40044J3431
30778C33562o7441p5719o3496m0562J445K4804j336l8403l4325M270L9284N2225
30766A34308L5824j4132o8401p2773j5046N2689P6023N1080Q400k4226l7046l8236
30754H8464l7421k4204J2054L9592J3244m1825m5106J5671N9134M5811M1304Q5231
30742B51949J01844K6050p6799j14525j04261j02935q9223k9131K2497Q635j6914
30731a22813J2183M1944M50m5814L536Q6469O1477n2451r6902k0952O1259O3903
$$ plain form
30812 112085 75520 31210 9980 -36759 -98143 -102715 -52399 -19418 -15040 5402 20202 -30253
30800 -30253 -99716 -75890 29506 85213 45318 -11022 -56973 -151683 -260086 -237163 -70630
30789 -70630 46214 -8912 -105959 -84794 -3114 -2410 -48566 8296 180087 320131 333562
30778 333562 266121 190402 126906 86344 87789 112593 111257 72854 38529 42799 82083 134308
30766 134308 170132 156000 87599 14826 -220 52469 128492 179572 187972 163746 126700 88464
30754 88464 51043 26839 38893 78485 91729 49904 4798 20469 79603 125414 166718 251949
30742 251949 353793 379843 303044 188519 84258 -18677 -107900 -137031 -114534 -105899 -122813
30731 -122813 -110630 -68686 -68236 -114050 -110514 -24045 37432 -15019 -111921 -132873 -71614 -7711
30719g711K6603M232l621L325L2572M1283j5744q2320n8921L9135R4373N3516
30707A26722k6845q8919j18088r4487j3588N9445O2816L8935N3685O0975j9554
30696D1097j33334j51003o7300J3748O1078J16628J41876N6267p3952q3825K9854
30685d8866Q8429J2252o5914k8820N9328R2345P2599L8431k1918r7185j11525
30674a0844l8793L9398N4350L3862J4367k4582q1226r1414l1987K6767L1082K1130
30662e7890M3166O6543M6221j190l6844n9769q5801j08382j04883n4180M1714
30651c11295J20854R3741k5940q9027l856J08874Q0349n2125j10436m7926J9397
$$ plain form
30719 -7711 18892 23124 19503 22828 55400 96683 80939 -1381 -60302 -21167 73206 126722
30707 126722 99877 10958 -107130 -201617 -215205 -155760 -92944 -54009 -324 60651 41097
30696 41097 -92237 -243240 -310540 -296792 -235714 -119086 22790 79057 5105 -78720 -48866
30685 -48866 39563 51815 -14099 -42919 16409 108754 181353 219784 197866 100681 -10844
30674 -10844 -49637 -10239 44111 77973 92340 67758 -13468 -104882 -136869 -110102 -79020 -57890
30662 -57890 -14724 51819 98040 96850 60006 237 -85564 -193946 -298829 -353009 -311295
30651 -311295 -190441 -96700 -122640 -211667 -215523 -106649 -26300 -78425 -188861 -236787 -217390
$$ [...]
##END NTUPLES=NMR SPECTRUM
##END=
