##TITLE=31Pdec_LY-TMF-8.5.R.t
 D2O, 24 sc
 28.2.2020
##JCAMPDX= 6.0         $$ Bruker NMR JCAMP-DX V2.0
##DATA TYPE= NMR SPECTRUM
##DATA CLASS= NTUPLES
##ORIGIN= UXNMR, Bruker Analytische Messtechnik GmbH
##OWNER= root
$$ XWIN-NMR		Version 3.5
$$ Fri Feb 28 15:52:13 2020 Russian Standard Time (UT+4h)  she@DPX200
##.OBSERVE FREQUENCY= 81.013821
##.OBSERVE NUCLEUS= ^31P
##.ACQUISITION MODE= SIMULTANEOUS
##.ACQUISITION SCHEME= undefined
##.AVERAGES= 24
##.DIGITISER RES= 17
##SPECTROMETER/DATA SYSTEM= spect
##.PULSE SEQUENCE= zgpg30
##.SOLVENT NAME= CDCl3
##.SHIFT REFERENCE= (INTERNAL, CDCl3, 0, 182.463)
##AUDIT TRAIL= $$ (NUMBER, WHEN, WHO, WHERE, WHAT)
$$ ##TITLE= Audit trail, XWIN-NMR		Version 3.5
$$ ##JCAMPDX= 5.01
$$ ##ORIGIN= Bruker BioSpin GmbH
$$ ##OWNER= she
$$ F:/spectra/data/she/nmr/P31/1/pdata/1/auditp.txt
$$ ##AUDIT TRAIL=  $$ (NUMBER, WHEN, WHO, WHERE, WHAT)
(   1,<2020-02-28 15:51:18.48 +0400>,<she>,<DPX200>,
      <created by zg, POWCHK disabled, PULCHK disabled
       configuration hash MD5:
       00 E9 B6 7A A2 85 ED C7 34 08 36 98 17 FE 4E 26
       data hash MD5: 32K
       D6 73 DE 9A FD 4D AD 6F 42 2A B5 AB C9 50 EF CC>)
(   2,<2020-02-28 15:51:21.03 +0400>,<she>,<DPX200>,
      <Start of raw data processing
       efp BC_mod = 2 LB = 1 FT_mod = 6 PKNL = 1 PHC0 = -1613.441 PHC1 = 671.0013 SI = 64K 
       data hash MD5: 64K
       5B 83 FF A8 7B 0B 01 FD F8 FD A6 7C B2 7B 17 26>)
(   3,<2020-02-28 15:51:34.51 +0400>,<she>,<DPX200>,
      <pk PHC0 = -0.3935174 PHC1 = 0 
       data hash MD5: 64K
       47 16 6E 35 91 6F 53 0B 75 AF F0 7D 1C AA 4A 9C>)
$$ ##END=
$$ 
$$ hash MD5
$$ 51 06 FA AB 0E 1E A6 0E C7 3F 4F 61 95 AF 0A 2C
##$RELAX= 
##$RELAX= 
##$RELAX= 
##$RELAX= 
##$RELAX= 
##$RELAX= 
##$RELAX= 
##$RELAX= 
$$ Bruker specific parameters
$$ --------------------------
##$DU= <F:/spectra>
##$EXPNO= 1
##$NAME= <P31>
##$PROCNO= 1
##$TYPE= <nmr>
##$USER= <she>
##$AMP= (0..31)
100 100 100 100 100 100 100 100 100 100 100 100 100 100 100 100 100 100 
100 100 100 100 100 100 100 100 100 100 100 100 100 100 
##$AQSEQ= 0
##$AQ_mod= 1
##$AUNM= <au_zg>
##$AUTOPOS= <>
##$BF1= 81.014009
##$BF2= 200.13
##$BF3= 200.13
##$BF4= 200.13
##$BF5= 200.13
##$BF6= 200.13
##$BF7= 200.13
##$BF8= 200.13
##$BYTORDA= 1
##$CFDGTYP= 0
##$CFRGTYP= 5
##$CHEMSTR= <none>
##$CNST= (0..31)
1 1 145 1 1 1 1 1 1 1 1 1 1 1 1 1 1 1 1 1 1 1 1 1 1 1 1 1 1 1 1 1 
##$CPDPRG= <waltz16>
##$CPDPRG1= <>
##$CPDPRG2= <waltz16>
##$CPDPRG3= <>
##$CPDPRG4= <mlev>
##$CPDPRG5= <mlev>
##$CPDPRG6= <mlev>
##$CPDPRG7= <mlev>
##$CPDPRG8= <mlev>
##$CPDPRGB= <>
##$CPDPRGT= <>
##$D= (0..31)
0 1 0 0 0 0 0 0 0 0 0 0.03 2e-05 3e-06 0 0 0 0 0 0 0 0 0 0 0 0 0 0 0 0 
0 0 
##$DATE= 1582890677
##$DBL= (0..7)
120 120 120 11 120 120 24 19 
##$DBP= (0..7)
150 150 150 150 150 150 150 150 
##$DBP07= 0
##$DBPNAM0= <>
##$DBPNAM1= <>
##$DBPNAM2= <>
##$DBPNAM3= <>
##$DBPNAM4= <>
##$DBPNAM5= <>
##$DBPNAM6= <>
##$DBPNAM7= <>
##$DBPOAL= (0..7)
0.5 0.5 0.5 0.5 0.5 0.5 0.5 0.5 
##$DBPOFFS= (0..7)
$$ [...]
##$SUBNAM2= <"">
##$SUBNAM3= <"">
##$SUBNAM4= <"">
##$SUBNAM5= <"">
##$SUBNAM6= <"">
##$SUBNAM7= <"">
##$SUBNAM8= <"">
##$SUBNAM9= <"">
##$SW= 369.568048894756
##$SWIBOX= (0..15)
0 1 3 0 0 0 0 0 0 0 0 0 0 0 0 0 
##$SW_h= 29940.119760479
##$TD= 32768
##$TD0= 1
##$TE= 0
##$TE2= 300
##$TE3= 300
##$TEG= 300
##$TL= (0..7)
0 120 53 12 22 120 120 120 
##$TP= (0..7)
150 150 150 150 150 150 150 150 
##$TP07= 0
##$TPNAME0= <>
##$TPNAME1= <>
##$TPNAME2= <>
##$TPNAME3= <>
##$TPNAME4= <>
##$TPNAME5= <>
##$TPNAME6= <>
##$TPNAME7= <>
##$TPOAL= (0..7)
0.5 0.5 0.5 0.5 0.5 0.5 0.5 0.5 
##$TPOFFS= (0..7)
0 0 0 0 0 0 0 0 
##$TUNHIN= 0
##$TUNHOUT= 0
##$TUNXOUT= 0
##$USERA1= <user>
##$USERA2= <user>
##$USERA3= <user>
##$USERA4= <user>
##$USERA5= <user>
##$V9= 5
##$VALIST= <valist>
##$VCLIST= <CCCCCCCCCCCCCCC>
##$VD= 0
##$VDLIST= <DDDDDDDDDDDDDDD>
##$VPLIST= <PPPPPPPPPPPPPPP>
##$VTLIST= <TTTTTTTTTTTTTTT>
##$WBST= 1024
##$WBSW= 4
##$XGAIN= (0..3)
0 0 0 0 
##$XL= 0
##$YL= 0
##$YMAX_a= 14372
##$YMIN_a= -14917
##$ZGOPTNS= <>
##$ZL1= 120
##$ZL2= 120
##$ZL3= 120
##$ZL4= 120
##$ABSF1= 0
##$ABSF2= 0
##$ABSG= 0
##$ABSL= 0
##$ALPHA= 0
##$AQORDER= 0
##$ASSFAC= 0
##$ASSFACI= 0
##$ASSFACX= 0
##$ASSWID= 0
##$AUNMP= <proc_1d>
##$AZFE= 0.1
##$AZFW= 0.5
##$BCFW= 0
##$BC_mod= 2
##$BYTORDP= 0
##$COROFFS= 0
##$CY= -3
##$DATMOD= 1
##$DC= 0
##$DFILT= <>
##$DTYPP= 0
##$F1P= 0
##$F2P= 0
##$FCOR= 1
##$FTSIZE= 65536
##$FT_mod= 6
##$GAMMA= 0
##$GB= 0
##$INTBC= 1
##$INTSCL= 5.30512e-09
##$ISEN= 30
##$LB= 1
##$LEV0= 0
##$LPBIN= 0
##$MAXI= 10000
##$MC2= 0
##$MEAN= 0
##$ME_mod= 0
##$MI= 50
##$NCOEF= 0
##$NC_proc= -4
##$NLEV= 6
##$NOISF1= 182.463
##$NOISF2= 159.3651
##$NSP= 0
##$NTH_PI= 0
##$NZP= 0
##$OFFSET= 182.463
##$PC= 4
##$PHC0= -1613.835
##$PHC1= 671.0013
##$PH_mod= 1
##$PKNL= yes
##$PPARMOD= 0
##$PSCAL= 0
##$PSIGN= 0
##$REVERSE= no
##$SF= 81.0140089999434
##$SI= 65536
##$SIGF1= 159.3651
##$SIGF2= -187.1042
##$SINO= 113.3802
##$SIOLD= 16384
##$SREGLST= <1H.CDCl3>
##$SSB= 0
##$STSI= 65536
##$STSR= 0
##$SW_p= 29940.119760479
##$SYMM= 0
##$S_DEV= 0
##$TDeff= 32768
##$TDoff= 0
##$TI= <>
##$TILT= no
##$TM1= 0
##$TM2= 0
##$TOPLEV= 0
##$USERP1= <user>
##$USERP2= <user>
##$USERP3= <user>
##$USERP4= <user>
##$USERP5= <user>
##$WDW= 1
##$XDIM= 65536
##$YMAX_p= 309039288
##$YMIN_p= -3783934
$$ End of Bruker specific parameters
$$ ---------------------------------
##NTUPLES= NMR SPECTRUM
##VAR_NAME=  FREQUENCY,     SPECTRUM/REAL,   SPECTRUM/IMAG
##SYMBOL=    X,             R,               I
##VAR_TYPE=  INDEPENDENT,   DEPENDENT,       DEPENDENT
##VAR_FORM=  AFFN,          ASDF,            ASDF
##VAR_DIM=   65536,         65536,           65536
##UNITS=     HZ,            ARBITRARY UNITS, ARBITRARY UNITS
##FACTOR=    0.456856943014862, 1,           1
##FIRST=     14782.0589164792, 0,            0
##LAST=      -15158.0608439998, 0,           0
##MIN=       -15158.0608439998, -3783934,    0
##MAX=       14782.0589164792, 309039288,    0
$$ Real data points
##PAGE= N=1
##DATA TABLE= (X++(R..R)), XYDATA
$$ [...]
##PAGE= N=2
##DATA TABLE= (X++(I..I)), XYDATA
39087 524847 794028 1043892 1032028 895930 849665 681682 108542 -565043 -758645 -497758
39077 -497758 -348771 -473362 -404722 102183 626539 753210 656139 671631 730850 620243
39067 620243 475326 573291 831402 930082 837333 824028 960303 936174 493506 -171927
39057 -171927 -578921 -463345 -40699 222205 85706 -227795 -324182 -143217 -47900 -348579
39047 -348579 -859718 -1068763 -709269 -37189 482919 661689 675822 725302 744943 561545
39037 561545 266433 231512 662358 1262009 1484402 1088478 352174 -212340 -266706 158532
39027 158532 735239 1100672 1131573 967004 768420 566239 380608 316031 391958 416058
39017 416058 207656 -140359 -386504 -438753 -368394 -236791 -98251 -68276 -171769 -213893
39007 -213893 -28039 234051 296154 153211 26830 31701 163576 484774 959991 1220824
38997 1220824 950219 474820 473532 1025402 1454742 1281076 823401 616059 704046 862482
38987 862482 1090942 1440827 1647350 1411043 892385 522445 432297 427011 415628 491709
38977 491709 634734 678702 584799 469987 369304 216238 45250 -19056 37118 127490
38967 127490 231109 342325 337540 149150 8024 212596 666624 951145 892361 755057
38957 755057 775845 788713 503678 -12811 -339784 -159502 372826 723446 471837 -243179
38947 -243179 -827875 -852766 -463373 -74424 162384 357351 513625 517095 460502 600872
38937 600872 915192 1034814 769417 412841 340499 533549 714471 774430 832061 975289
38927 975289 1157917 1296208 1297025 1045494 549490 90277 49828 503980 1067437 1233968
38917 1233968 878937 384088 235200 524615 912107 1046308 886131 582398 249631
38908 249631 -102 12465 323415 650501 680229 459549 256743 131028 -41581 -190063
38898 -190063 -103639 118196 109715 -152097 -212577 187235 693399 843655 631857 297697
38888 297697 -79345 -436271 -530533 -311111 -185499 -436108 -631504 -192725 622750 958694
38878 958694 568718 126545 189665 473459 446027 127272 -100869 -113622 -55834 23791
38868 23791 154462 200384 -9733 -368634 -577047 -502137 -242705 85768 407853 586767
38858 586767 498265 215696 -35385 -103132 16236 261193 516429 604406 435279 144592
38848 144592 -53141 -115120 -148007 -190744 -182003 -124245 -122476 -241185 -428126 -577787 -591666
38837 -591666 -425302 -178280 -69016 -182265 -303141 -168093 158516 341381 200679 -98633
38827 -98633 -304054 -348254 -305502 -211081 -12482 340289 770699 1030629 873409 357992
38817 357992 -136079 -330898 -348236 -402897 -386257 -76624 365332 531386 368426 190480
38807 190480 46960 -384796 -1079244 -1389189 -897630 -119234 150386 -108546 -275570 -83663
38797 -83663 126425 103726 44288 135620 248086 282445 417971 769913 1113236 1194943 1083106
38786 1083106 988329 950992 914453 914248 977589 989117 851733 647514 482283 328893 174305
38775 174305 122842 172528 118878 -80876 -98070 275267 638670 435198 -202831 -541645
38765 -541645 -208462 389809 713436 705149 564363 341114 80241 34965 335075 649113
38755 649113 579381 269978 223479 569031 911844 928421 730509 560185 487532 544803
38745 544803 807997 1137044 1152311 748539 372965 461840 800236 823418 428900 62744
38735 62744 27575 157079 268838 491611 896456 1155649 926353 391231 73783 180364
38725 180364 407451 390132 107507 -181952 -229782 8305 340091 493332 402613 294113
38715 294113 368120 491772 408166 184097 173322 504777 886371 1030768 1018012 1032381
38705 1032381 943754 467346 -289391 -744234 -456517 320912 893392 901998 666702 680885
38695 680885 949838 1073765 928056 908198 1328281 1862173 1911504 1395938 816266 560547
38685 560547 526527 504635 538034 672178 661934 277974 -250356 -457462 -276983 -120397
38675 -120397 -240394 -311567 130447 982123 1589459 1513836 1060095 872714 1123599 1350513
38665 1350513 1121565 596276 268480 354411 673195 997434 1222755 1236302 943425 492023
38655 492023 201590 162051 124169 -98396 -329171 -283523 27887 296445 227376 -216619
38645 -216619 -767088 -1003647 -717422 -182332 96798 -43820 -281559 -256884 65295 522779
38635 522779 949788 1141054 930303 465198 125499 20522 -110223 -337123 -311980 94422
38625 94422 362714 13718 -593579 -721286 -321310 -40494 -212127 -451841 -366595 -131397
38615 -131397 -112477 -286833 -326746 -79546 254214 373519 235634 158564 459458 942195
38605 942195 1006853 473365 -24371 144675 672260 730189 167594 -337977 -310380 930
38595 930 257085 550144 991859 1300337 1178609 765675 397608 199336 158385 307852
38585 307852 586780 788562 866886 1017539 1268474 1322400 1040320 739005 729226 884145
38575 884145 967847 1062342 1306995 1501702 1369199 996537 645299 335192 21 -151125
38565 -151125 124947 620028 853476 686123 400470 232369 175261 204322 345237 517303
38555 517303 592800 598493 621287 595924 455130 376232 542989 748073 614932 194541 -44922
38544 -44922 132879 447507 547175 420709 251138 130773 59559 25056 -30311 -164745
38534 -164745 -288138 -209547 107416 466668 649613 588246 338875 22930 -214083 -319859
38524 -319859 -401128 -562813 -730265 -746102 -568696 -259616 108847 398096 416136 173903
38514 173903 -31091 11736 162430 274950 549032 1174949 1834846 2003570 1634158 1115006
38504 1115006 657946 214332 -76210 79637 587307 974447 1047963 1063820 1144365 1053039
38494 1053039 725736 498597 537153 514603 183612 -156506 -140213 69535 72438 -149498
38484 -149498 -302400 -280479 -225927 -212343 -175850 -69549 143001 522643 979326 1221083
38474 1221083 1088572 777488 529406 298432 -46529 -396025 -555546 -562060 -562118 -506681 -247182
38463 -247182 160444 498766 658078 663978 552309 413250 413579 555500 567890 277667 -71605
38452 -71605 -145036 -12982 -19626 -266965 -537559 -649375 -587570 -354243 5272 272041
38442 272041 249142 61275 -16832 16365 -59579 -250661 -305626 -132032 75043 178883
38432 178883 256921 316990 172674 -227539 -583459 -548447 -116330 418837 760049 774679
38422 774679 513149 175665 -38048 -118866 -196241 -278562 -207953 63976 330773 382137
38412 382137 272526 208834 258844 296549 182198 -107640 -482963 -770565 -771207 -398776 206192
38401 206192 747431 972613 798098 303355 -284967 -604476 -335471 448294 1165044 1205936
38391 1205936 619320 115550 242744 748396 980231 737401 382888 204456 87324
38382 87324 -119801 -310914 -359218 -331226 -279110 -87336 289175 673980 916542 1038127
38372 1038127 991959 605101 -30196 -449180 -387184 -160322 -169307 -320970 -283096 -17534
38362 -17534 323338 731198 1126726 1104859 449531 -294494 -357387 240739 765596 781704
38352 781704 511659 232844 -40021 -203434 -28273 354571 485099 281029 190314 429338
38342 429338 600178 353045 -50588 -174017 108 250547 531324 846294 1004738 854195
38332 854195 545925 305778 172992 182557 493501 1044344 1376291 1150254 625948 300112
38322 300112 250377 150974 -206637 -693550 -1032590 -1001159 -592297 -141670 -90570 -451005
38312 -451005 -748259 -660015 -390400 -193326 70550 539298 884703 723674 246257 -45565
38302 -45565 -33787 44733 125097 286103 337227 11192 -468323 -572781 -253707 -3469
38292 -3469 -57103 -83553 161336 401552 335181 124193 53936 36258 -183684 -540655 -708957
38281 -708957 -534406 -152481 222886 415284 308200 -6137 -164988 136998 747377 1165228
38271 1165228 1087563 712623 456274 486235 622878 626558 452298 204066 -36607 -227625
38261 -227625 -281869 -125120 154852 365736 450390 522931 631736 672040 608118 574091 627475
38250 627475 610879 433132 293059 405597 664965 809759 782599 694659 580717 449508
38240 449508 434422 595618 688204 448766 26696 -197178 -141528 -18474 127713 442868
38230 442868 810635 836782 423695 -25579 -161697 -119712 -184262 -305195 -210076 161919
38220 161919 560569 685993 435571 -26874 -391178 -486555 -452632 -504239 -587304 -481263
38210 -481263 -187806 74618 263020 569060 1016375 1307331 1192622 762298 304239 99788
38200 99788 338999 907450 1269611 992185 426479 364245 890045 1161237 608226 -237691
38190 -237691 -561191 -390250 -316835 -461113 -389405 88897 644923 919940 832028 459021
38180 459021 43666 15282 538702 1112944 1099391 597784 287852 422253 544590 283938
38170 283938 -141394 -390023 -443539 -348611 1213 515712 757637 502435 119086 32697
38160 32697 96263 -108343 -566228 -852230 -747132 -445032 -177922 41744 287428 576382
38150 576382 888572 1159091 1268716 1180251 1020493 891802 719621 460206 306778 436715
38140 436715 679928 745893 694252 816252 1061627 991280 417224 -269269 -606379 -613445
38130 -613445 -602810 -675476 -685655 -562734 -382669 -175259 98421 387650 558959 555908
38120 555908 405314 102962 -336975 -744892 -893440 -745568 -457736 -152782 133946 300153
38110 300153 208249 -63388 -221035 -123908 28266 7394 -108606 -79342 144171 387078
38100 387078 492741 434796 248173 4482 -181468 -252697 -278934 -316616 -280188 -98281
38090 -98281 87453 80340 -51095 -28030 237635 483577 400512 -32896 -558915 -878181
38080 -878181 -868107 -677514 -599886 -735363 -813991 -517143 56726 459257 439082 198358
38070 198358 49451 42208 41098 -13763 -52496 41574 364149 857815 1206916 1077278 550088
38059 550088 98402 23278 156486 260450 413873 721404 896073 537257 -248927 -868320
38049 -868320 -910123 -541880 -205201 -143327 -279393 -383745 -306175 -147867 -184238 -505546
38039 -505546 -819709 -798155 -538301 -431728 -604470 -781469 -755286 -692044 -820280 -1040608
38029 -1040608 -1052009 -753905 -347643 -89555 -69336 -197561 -303651 -249530 -25985 229607
38019 229607 326147 161003 -182042 -466971 -508402 -378020 -317690 -387056 -334155 41279
38009 41279 515052 641882 286196 -254138 -627155 -713040 -545661 -214524 84183 141464
37999 141464 12122 17254 339288 770011 994578 972727 870388 742441 509110 215470
37989 215470 96204 296349 631758 734090 445223 22319 -106900 189718 592872 702874
37979 702874 495621 292778 327351 507712 631382 664014 715697 839231 944272 885371
37969 885371 616077 286880 150585 290862 496050 512920 359177 233683 200281 186174
37959 186174 237612 477864 788345 852179 617025 417371 499220 713026 838809 894836
37949 894836 891752 619997 45245 -345766 -47430 736031 1289622 1251311 855735 363414
37939 363414 -229430 -788145 -865559 -274753 481375 734672 453147 187886 307547 628340
37929 628340 839502 981299 1293569 1721352 1822152 1261857 302419 -366069 -326693 144445
37919 144445 453552 377949 210662 273043 515362 661969 565009 302992 51282 -50951
37909 -50951 -3900 26778 -84281 -157967 126511 699663 1014189 733968 254176 156371
37899 156371 329119 154806 -441426 -740785 -273946 423560 551280 159482 -47042 183800
37889 183800 385241 219432 -37117 -58171 9411 -92767 -264509 -318095 -392606 -663516
37879 -663516 -871689 -618893 -17396 420569 510375 567872 820380 1071427 1069405 851677
37869 851677 583398 365463 330977 615261 1067705 1284895 1100589 769678 523454 283575
37859 283575 22211 18005 410204 815184 803325 529372 450331 589489 564061 268145
37849 268145 42453 136090 415808 662291 779403 670843 309948 -170 135164 574245
37839 574245 679393 180851 -416634 -548152 -301500 -75162 91253 378270 658490 662674
37829 662674 554725 777885 1296976 1514981 1099194 447088 92600 20853 -101986 -286916
37819 -286916 -217397 199488 644722 805917 728138 650915 681899 759113 814016 817107 701995
37808 701995 396358 -20293 -285860 -193201 144733 369945 281736 89710 153602 505607
37798 505607 792661 741224 517397 491429 754313 1049031 1136333 1035564 896645 829253
37788 829253 910265 1163091 1424962 1413106 1067006 671954 483276 396624 214517 72645
37778 72645 257578 658392 795432 486075 135985 186053 537803 746980 589424 216431
37768 216431 -94638 -132422 171581 649844 986444 1062158 1069963 1130187 1027983 614198
37758 614198 240454 378814 910040 1229678 1053880 689446 459041 317777 189543 238787
37748 238787 531844 764946 646216 321428 140862 197055 355140 550946 770622 880092
37738 880092 757613 491709 216185 -104466 -474579 -641521 -410951 -42228 65786 -7586
37728 -7586 156981 585015 804942 583034 286582 292181 445560 422814 299720 374713 624993
37717 624993 731884 571052 342787 227869 190251 140517 69081 -17971 -117972 -158848
37707 -158848 -52860 161203 347033 425466 384927 193440 -134661 -413461 -400469 -43285
37697 -43285 504626 1051312 1401380 1350604 916048 498615 480428 667166 510520 -53828
37687 -53828 -426136 -187942 295265 423711 152255 -157004 -356848 -501279 -425602 84863
37677 84863 750520 970442 617268 189136 63740 65234 -62836 -213665 -199771 -81369
37667 -81369 75980 403131 851018 962428 451201 -242457 -439619 -103706 228043 279825
37657 279825 292528 440322 502827 281269 -40940 -158942 -12300 260396 510064 604938
37647 604938 497477 376753 523599 894360 1092740 905030 611531 561202 671056 625931
37637 625931 409253 302866 408186 488857 356902 166144 178728 389662 558036 565619
37627 565619 570840 741160 959064 959469 736041 600673 741944 918011 787154 413266
37617 413266 189757 318197 619833 841637 879322 697671 336733 50292 117161 405943
37607 405943 442804 57578 -362827 -458046 -386283 -450113 -548581 -382005 23623 401010
37597 401010 682680 937628 999510 638233 70796 -182469 -9346 180754 157952 214260
37587 214260 591018 996400 1025208 751742 551157 543242 551337 453234 247319 -89321 -459153
37576 -459153 -474439 153811 1057994 1460329 1091521 514750 373705 643378 862570 824462
37566 824462 700043 643269 640020 700401 863352 990261 871130 613473 619652 1024487 1423106
37555 1423106 1377795 988177 693117 649330 614011 403034 168812 160308 412495 748177
37545 748177 949086 887362 620330 385549 383557 555497 690633 724167 765333 850483 867847
37534 867847 744030 511702 177182 -259418 -619982 -641790 -356258 -147598 -300426 -664730
37524 -664730 -877685 -744931 -314142 233796 667585 868069 981638 1205795 1400724 1221982
37514 1221982 686373 201158 -83922 -453936 -926084 -953961 -289655 389482 362244 -22917
37504 -22917 119133 807581 1187317 888509 522475 635743 950504 985889 789271 632534
37494 632534 499116 319912 308358 608134 922818 924743 778492 850943 1111341 1218112
37484 1218112 1045741 754124 452941 145414 -68940 -40372 218430 570791 907821 1088690
37474 1088690 928027 500500 260366 532064 1025635 1188939 911817 532017 274384
37465 274384 105722 76927 328867 698740 764553 429712 95360 87256 259658 367928
37455 367928 479642 708756 828881 565500 144994 124836 641683 1180042 1213087 793855
37445 793855 330448 15831 -236229 -428515 -421484 -271732 -289078 -586463 -833363 -688998
37435 -688998 -274867 60946 269531 532078 780942 728593 386297 123493 124135 199751
37425 199751 255680 469368 793046 782860 282951 -167201 -64553 302515 360561 171257
37415 171257 197143 385013 243482 -215765 -392988 -81713 195363 84979 -45409 161370
37405 161370 382760 200627 -128258 -107094 118117 -10701 -480940 -630403 -130713 510525
37395 510525 651973 327430 79714 221439 520526 535277 107061 -446405 -588958 -104356
37385 -104356 608213 909336 619536 189719 124524 425480 721452 764866 597401 342206
37375 342206 78224 -104078 -148349 -150606 -212365 -141428 419003 1408469 2162747 2096407 1419871
37364 1419871 858797 750714 789907 656283 455659 374740 288900 5301 -362603 -567834
37354 -567834 -599994 -606206 -598236 -506997 -371848 -198067 188089 797513 1177388 905238 281818
37343 281818 17713 238233 366962 116923 -8954 465535 1176949 1413467 1119225 891742
37333 891742 1086844 1384242 1284359 714226 48889 -280675 -144991 198284 358327 215521
37323 215521 22726 50726 262424 453219 565500 671714 742011 652828 411710 185411
37313 185411 67475 -58252 -366456 -843618 -1218763 -1174209 -680946 -79295 282591 418455
37303 418455 520317 499787 81477 -596692 -916568 -554375 38874 249689 87113 -21475
37293 -21475 50699 83882 20349 19251 57924 -48733 -224633 -177487 89570 254351 243076
37282 243076 365685 736043 1003912 895103 621098 473031 370941 157082 27881 259398
37272 259398 693591 907855 796820 616818 519672 419471 319143 390870 633646 763954
37262 763954 608368 382704 409144 705876 1012168 1108737 966432 662862 312504 52799
37252 52799 -39080 -33368 -58809 -109907 -29207 281532 706461 1031900 1166139 1168895 1097997
37241 1097997 933412 668732 378467 142773 -22467 -111818 -86447 52388 230749 420604
37231 420604 685530 988182 1073123 752691 256797 49342 266397 568626 621358 483636
37221 483636 390458 377873 338110 283546 299453 325501 256109 228892 517296 1064707 1396421
37210 1396421 1165621 594052 154765 -43147 -263966 -576214 -630118 -179317 435856 644904
37200 644904 405087 269566 634039 1204822 1387929 999257 372969 -87783 -216006 -22018
37190 -22018 383201 769457 900796 737604 418136 65165 -236331 -328793 -96847 290006
37180 290006 496148 441159 374548 474979 643923 797440 1055312 1437933 1645995 1423980
37170 1423980 962729 657039 594605 565003 467309 403239 411682 399007 331149 249833 110306
37159 110306 -146587 -365484 -286604 86858 488744 792440 1129620 1526672 1728568 1568380
37149 1568380 1275844 1185438 1280336 1251047 938919 532824 332326 425583 600104 540108
37139 540108 166136 -221453 -260608 -3077 113489 -159284 -545413 -632062 -396321 -129867
37129 -129867 15126 138798 315707 469090 539516 566826 562262 474767 338614 303864 445007
37118 445007 640933 708191 590460 387162 247374 238471 277767 234041 146248 236179 579696
37107 579696 882966 801297 419519 161305 231842 432010 562380 685995 854541 892027
37097 892027 691907 482674 512344 658563 664879 604486 730601 953434 905324 561982
37087 561982 349422 460366 476987 -5949 -677930 -851136 -384899 141787 215054 -14807
37077 -14807 -74390 155895 360674 286454 62477 -40081 -10410 -100604 -436333 -778275
37067 -778275 -793952 -498809 -237560 -189681 -107049 282892 766208 822148 313580 -285168
37057 -285168 -471718 -297183 -160017 -189188 -142087 101361 271283 95630 -262917 -402287
37047 -402287 -219216 7977 75182 119868 313629 516554 470239 220777 85982 211798
37037 211798 407198 476556 486597 579357 711821 759544 744442 756942 738713 570989 356376
37026 356376 376080 700699 1026389 1011748 672408 340201 293643 507635 727113 725527
37016 725527 506458 270236 160780 79711 -153596 -468719 -528513 -130932 498003 950260
37006 950260 1100665 1156602 1260687 1257656 980084 616167 549491 812875 943754 563393
36996 563393 -53633 -275177 46580 370357 239688 -72887 -12953 390936 558278 213923
36986 213923 -246720 -371488 -216937 -59562 107657 427231 743152 731706 408527 135129
36976 135129 91479 67714 -128151 -341224 -307576 -17639 329270 588864 725248 718679
36966 718679 606424 549594 670742 837356 777922 439662 82624 -30004 105063 348102
36956 348102 638720 951474 1149510 1112997 996044 1114407 1505171 1812856 1740328 1415274
36946 1415274 1126268 880175 494956 24521 -230282 -132144 157821 480431 820944 1089664
36936 1089664 1076125 771277 471394 388122 386187 281347 157618 175487 285947 372084
36926 372084 475592 638352 716101 607736 465837 405979 251804 -86771 -250283 84130
36916 84130 557882 536856 62611 -204161 25722 377855 584060 845359 1203359 1247385
36906 1247385 842413 534909 726258 963039 645975 24218 -190913 91749 361337
36897 361337 430558 594962 887442 909625 557696 283760 392872 606067 591906 455741
36887 455741 374712 169136 -344817 -861367 -881088 -369573 231215 568671 649444 588330
36877 588330 390342 56719 -269491 -368047 -134382 285421 566978 505911 249471 109796
36867 109796 155926 181077 87493 35778 116045 162305 77709 69848 309338 598432 690476
36856 690476 724873 958159 1216334 1084330 615114 361829 588078 884727 792773 442622
36846 442622 275591 404941 609361 795150 1076322 1417384 1542968 1308000 938702 783681
36836 783681 950860 1275456 1542896 1654457 1633485 1541262 1377644 1076909 663386 370551
36826 370551 443388 773798 908513 565885 23714 -201276 10035 302324 399362 437413
36816 437413 613572 779034 665805 363870 226785 326844 354829 145428 -36858 62676
36806 62676 244013 148542 -170919 -319516 -137467 136825 309979 504324 850659 1187026
36796 1187026 1278963 1163138 1044066 957804 772073 477487 250781 198530 219952 188773
36786 188773 129474 130651 199258 310362 521974 897828 1320411 1510676 1308625 887799
36776 887799 622639 740583 1133586 1496548 1598437 1411900 1053427 675898 405986 297166
36766 297166 284950 215860 -14959 -328092 -492021 -342121 19385 291164 285413 127153
36756 127153 56501 72438 -57655 -380040 -540466 -178696 557997 1121513 1175881 900724
36746 900724 665553 629471 749482 960070 1170099 1236798 1141774 1091482 1239742 1382779
36736 1382779 1162622 568727 14822 -137095 56323 304988 461175 573015 679303
36727 679303 729913 706956 700282 806116 987076 1076795 944094 648623 394307 302086 281770
36716 281770 194816 90801 157480 430263 682897 677303 443306 234426 246648 439105
36706 439105 604410 561895 286687 -108701 -478807 -701033 -662683 -317665 175289 496428
36696 496428 495930 392824 454497 559922 363300 -115484 -414789 -265073 46753 170947
36686 170947 220996 451806 676271 492511 -7935 -285195 -155104 -38054 -227588 -399483
36676 -399483 -181651 185462 214671 -56356 -173057 -29995 15401 -159599 -160306 293854
36666 293854 881471 1141908 1113951 1137911 1232190 1095505 655962 199998 -82048 -299845
36656 -299845 -502444 -471377 -91972 338789 448979 268381 107240 87909 82495 46312
36646 46312 104361 279901 406519 400191 414494 612013 915870 1079917 922928 476533
36636 476533 18697 -56644 403928 1056168 1360662 1192538 923657 832391 732642 375485
36626 375485 -61446 -188590 54744 377782 563048 632161 649802 635995 643902 679834 591296
36615 591296 298313 81978 310636 864236 1184338 995066 648819 602952 847532 1052414
36605 1052414 1027145 793081 403363 -28105 -242545 -65572 309119 489987 355754 193762
36595 193762 344910 813045 1251636 1302814 970536 657399 753494 1197503 1574853 1631390
36585 1631390 1471504 1227965 857521 423866 258887 538962 922915 954183 674924 487919
36575 487919 520720 526182 383638 284706 348817 416914 351804 236239 133135 -67656 -388143
36564 -388143 -579818 -393405 118103 681317 1026622 974769 551113 118233 108028 459235
36554 459235 618751 309471 -41317 47482 371396 415948 222994 285888 654069 793399
36544 793399 476580 207646 437802 841898 817810 377034 46029 66837 195144 228804
36534 228804 242896 239005 18511 -414417 -694579 -583046 -316516 -188165 -37419 463847
36524 463847 1160608 1492411 1251850 864665 752123 744657 409877 -240240 -717476 -697946
36514 -697946 -383595 -139519 -21664 145205 366673 416952 194548 -80666 -158951 -116202
36504 -116202 -222472 -490483 -580703 -244470 315383 685266 728610 643467 598571 539915
36494 539915 378611 162169 -14556 -101008 -17450 332362 850746 1195423 1096901 646827
36484 646827 167217 -93310 -29680 367547 908425 1182647 940180 477903 365247 727310
36474 727310 1056925 862917 292413 -77579 65019 493314 817262 917816 930322 937704
36464 937704 849563 600334 331817 261114 415597 633806 818026 1013064 1186183 1132349
36454 1132349 755471 307619 155978 368053 669036 744509 468019 -49731 -467423 -395833
36444 -395833 197971 850768 1084316 930996 752066 687424 631161 636886 893654 1293683
36434 1293683 1485296 1437744 1491232 1708590 1674209 1189934 702231 680251 955614 1074638
36424 1074638 969812 849927 718428 483089 319687 430342 614703 581950 523573 810053
36414 810053 1233379 1209534 760921 622335 1182756 1922385 2178622 1946651 1593539 1266589
36404 1266589 1001421 1008353 1352084 1612800 1358499 793336 482333 544696 581283 373420
36394 373420 203538 392131 860685 1274187 1371221 1080145 555141 183867 320251 876694
36384 876694 1352742 1383635 1118446 960062 1076828 1287681 1316128 1038983 558468 120527
36374 120527 -92444 -133631 -176856 -213240 -24229 455197 928979 1085065 1028330 1123501
36364 1123501 1441616 1635663 1441509 1055933 838958 810733 696440 422803 304967 644742
36354 644742 1309084 1844366 1934294 1631422 1182963 756844 369542 12361 -219273 -165697
36344 -165697 197481 640611 870541 862080 868319 1025851 1105665 839208 397588 284723
36334 284723 708060 1273803 1435770 1108122 681330 506915 536653 492093 265868 52889
36324 52889 86724 327669 508848 499971 497329 737574 1109715 1245597 1008576 696777 657447
36313 657447 836869 861260 508984 -29649 -363140 -282973 76593 407134 523326 495590
36303 495590 502394 600192 694908 712000 699398 735541 802832 792668 614007 301309 37770
36292 37770 17622 217416 372669 296652 154751 253871 602089 894534 943373 874471 827033
36281 827033 720402 483711 306481 432472 811109 1150983 1261153 1190107 1088029 1068600
36271 1068600 1152636 1226196 1102265 721679 241132 -137858 -333093 -330240 -134705 121785
36261 121785 205105 63410 -59255 60122 347205 601493 737694 705628 450694 189148
36251 189148 391651 1119151 1682378 1463091 830220 623520 883849 849097 234785 -305733
36241 -305733 -256477 1982 -40967 -174115 11075 270862 109578 -305450 -383864 -98527
36231 -98527 10868 -207929 -277442 87043 558262 809960 978665 1229408 1367249 1251886
36221 1251886 1185553 1447216 1734481 1549343 987040 672500 922296 1358767 1431416 1028258
36211 1028258 465447 95438 55809 259329 499676 621911 649438 697465 758023 678086
36201 678086 400831 122338 96582 322368 540254 559901 483185 522771 682317 770741
36191 770741 723918 711802 831358 894320 730772 558501 741686 1214570 1488351 1316422
36181 1316422 1028019 1026573 1252519 1405310 1449994 1542278 1584860 1267874 577605 -69589
36171 -69589 -298592 -135791 182096 511840 788064 919741 888959 836878 897973 1014644
36161 1014644 1012927 791061 373522 -106771 -399580 -253496 304511 877598 1035879 736049
36151 736049 327557 176733 350850 623430 716168 565422 388715 438474 682484 838786
36141 838786 757426 610786 615715 726815 753674 658539 560445 518569 481447 416157 358660
36130 358660 367894 503155 750847 904753 706389 252630 36951 328827 722185 659702
36120 659702 248171 89143 342230 486803 148631 -320002 -352164 107673 685691 1090967
36110 1090967 1225157 1018921 517798 1062 -289732 -436250 -594895 -614874 -250839 329022
36100 329022 643087 543097 407398 568282 850514 887521 686194 599457 789211 976698
36090 976698 831420 448526 230818 315239 377645 158150 -71585 91089 451230 382052
36080 382052 -211647 -619837 -294947 355172 563139 259010 29726 229587 664445 1071719
36070 1071719 1385543 1511299 1323354 968726 757365 684867 487930 240115 393986 1047367
36060 1047367 1645329 1700924 1416618 1260771 1270104 1161864 892633 693279 664647 676778
36050 676778 610149 449803 219450 25410 46269 277541 443879 398137 424154 829588
36040 829588 1379603 1516915 1109687 609887 422991 464107 466029 434050 570402 899312
36030 899312 1193915 1261423 1160145 1095651 1174706 1327848 1452899 1531172 1552951 1455575 1274489
36019 1274489 1235403 1466530 1704635 1598134 1265236 1152688 1298665 1227559 764278 420223
36009 420223 592202 855722 599439 16780 -174693 184867 551523 549636 346320 119639
35999 119639 -206101 -529809 -457975 105475 693423 863837 695086 489219 361142 342418
35989 342418 505772 730560 713352 473430 454562 819212 1071101 796506 374244 397427
35979 397427 697159 605936 61573 -247154 91368 656615 888014 834412 893719 1149176
35969 1149176 1327213 1253794 1051972 923378 919275 934354 851670 698191 635334 720666 745909
35958 745909 486604 78933 -90675 99065 363989 482010 611439 934951 1228950 1112542
35948 1112542 635090 293467 425029 827167 1067611 982548 737727 529413 403895 352623
35938 352623 430631 693655 1060718 1330444 1381697 1322189 1359405 1513693 1558016 1317159
35928 1317159 942818 754334 836566 962920 943044 857041 842339 839453 756654 754215 1063578
35917 1063578 1526534 1631812 1150317 496343 253910 501818 831188 926236 868901 878675
35907 878675 991705 1088744 1105979 1115668 1222641 1403576 1463009 1233225 850960 689170
35897 689170 902191 1197371 1239085 1121235 1172515 1409067 1522497 1381903 1180463 1030963
35887 1030963 787187 408185 162787 258623 529177 706263 775156 842075 877020 846756
35877 846756 909561 1189785 1503054 1596605 1547448 1611438 1749312 1643951 1218705 841103
35867 841103 891219 1299470 1617567 1471667 918605 409178 362474 710949 954174 762178
35857 762178 399562 375030 757620 1056417 779924 -30233 -823557 -1018669 -520477 165118
35847 165118 436350 268950 189405 491656 801768 668135 256274 51248 115950 150420
35837 150420 142228 376728 804245 986847 809692 710560 976987 1281479 1195288 767343
35827 767343 294803 -115065 -411137 -351473 196866 905439 1299090 1286564 1077759 755022
35817 755022 295039 -104731 -131098 201464 525346 570383 395651 170410 -18607 -104592
35807 -104592 -20809 183016 378350 559153 827508 1114719 1112104 647554 43938 -104760
35797 -104760 401080 1036035 1065074 412146 -198273 -117298 431438 736537 606908 506069
35787 506069 682255 762608 472347 216792 481831 1032773 1258725 1086836 981270 1134237
35777 1134237 1234395 1074066 865266 815609 817434 737543 676054 750282 878823 930423 874964
35766 874964 696141 383259 82850 13197 154172 262552 238848 203829 188615 101829
35756 101829 59755 318078 734533 779099 343027 59319 418673 993707 1073807 746071
35746 746071 695653 1086863 1345169 1100245 682858 464740 287254 -75622 -330014 -40385
35736 -40385 625645 1024184 868635 525957 420037 494602 448143 258956 216218 497923
35726 497923 929896 1191632 1125756 800538 392077 110341 165361 638131 1330554 1844552
35716 1844552 1912097 1636267 1351668 1259801 1260828 1148744 901468 711118 731782 862093
35706 862093 836346 525103 90334 -178294 -132753 159538 547614 911037 1144186 1121389
35696 1121389 766995 188359 -299784 -384563 -72916 251792 220664 -91077 -288893 -208906
35686 -208906 -90755 -110872 -46847 350444 899566 1236448 1334918 1388315 1317811 901367
35676 901367 368945 299084 765743 1114346 864971 373514 223644 366927 351427 123373
35666 123373 47473 237500 390956 322888 231816 324363 499537 537731 384829 157888
35656 157888 33171 164801 553194 972321 1162678 1082259 850823 534446 160480 -143114
35646 -143114 -228566 -88064 213306 609349 859192 574812 -232022 -882239 -782528 -257015
35636 -257015 -63899 -228667 -76840 565771 1033231 918538 699338 815962 868936 397160
35626 397160 -130944 71085 840079 1244127 902785 352597 98395 31994 -76415 -158724
35616 -158724 -146010 -152131 -123177 215607 802546 1089982 784103 340737 339307 684038 862809
35605 862809 767552 764087 1020063 1228174 1079615 677661 351930 286383 448209 715503
35595 715503 954857 1080035 1132676 1242623 1455871 1672331 1795601 1854771 1906658 1898136
35585 1898136 1739017 1480540 1293117 1235297 1153937 893811 533381 302117 292609 372294
35575 372294 387120 338011 321831 398674 559415 731078 781074 631099 414523 391324 637742
35564 637742 946802 1097123 1060600 877707 554070 214887 105373 227053 239204 4775
35554 4775 -61839 384569 916132 845881 322721 193213 680923 965124 422746 -384383
35544 -384383 -521818 7911 432764 391112 236174 260832 304845 229143 210971 366327
35534 366327 510988 504432 466184 441104 203063 -329780 -769891 -682377 -158097 343974
35524 343974 600184 745954 865706 825355 595486 443205 609911 958253 1131026 980975
35514 980975 665084 350582 30688 -313395 -546052 -518384 -291787 -74390 32383 95165
35504 95165 183613 286396 382653 444847 374396 123580 -94825 41822 501962 822077
35494 822077 672602 307020 226517 559741 1035719 1442256 1787786 2046192 2074916 1860287
35484 1860287 1592175 1401546 1218582 963028 679840 400296 61990 -310259 -503360
35475 -503360 -345027 58336 428664 590744 554400 407208 240543 152482 225231 456641
35465 456641 710882 764196 492584 71016 -121743 78768 391998 446376 284051 292125
35455 292125 663062 1162653 1447844 1388177 1054402 637447 421196 567229 843812 832601
35445 832601 505606 317113 583738 1062703 1337159 1338882 1238605 1067267 754592 376304
35435 376304 71834 -154596 -301233 -207715 179136 544697 562711 390897 432016 687379
35425 687379 773133 557032 318346 209875 38614 -240659 -270431 165052 706668 920124
35415 920124 965107 1308541 1898986 2128500 1686141 1022506 756265 924744 1102178 1053674
35405 1053674 914682 787864 567340 299657 376355 1051430 1931590 2302235 1948639 1350518
35395 1350518 1034221 1051007 1189640 1355791 1509309 1493210 1222642 887928 710656 635306
35385 635306 508210 403171 473932 620178 641744 634087 855407 1224440 1333140 1020558
35375 1020558 613455 512385 792944 1255388 1611258 1608636 1250920 889179 804012 753185
35365 753185 326173 -308497 -540513 -251034 -1819 -106828 -153699 208469 623663 666868
35355 666868 585804 788508 1029962 828187 383650 300844 557915 569658 260559 241779
35345 241779 744048 1137170 854160 188715 -218299 -195775 55898 446250 911080 1156608
35335 1156608 964776 584131 415152 426988 247344 -242290 -723671 -837772 -532770 -37963
35325 -37963 348499 497843 576368 812252 1082926 1008311 602885 462406 960353 1582873
35315 1582873 1559102 962085 608634 893396 1304752 1237954 779178 417700 362575 462760
35305 462760 558294 606855 590503 516528 431039 324982 163736 72511 260169 647226 846130
35294 846130 691367 500914 561980 652036 424493 24099 -130655 -30121 -40239 -232721
35284 -232721 -275973 -66389 64357 -22085 68408 626666 1255135 1354821 945508 550329
35274 550329 424776 379474 311292 401818 684453 860495 775206 746527 1127638 1744861
35264 1744861 2063794 1814892 1205787 583889 156811 49727 351915 944037 1432574
35255 1432574 1462680 1093342 732511 675136 813481 854364 699662 478889 292391 144179
35245 144179 141436 491524 1139374 1619353 1525135 1018265 606966 497167 477436 429055
35235 429055 557535 966553 1333485 1276674 854507 448709 284526 303323 405136 564522
35225 564522 749756 945135 1221349 1577659 1750842 1429993 701856 67384 -72507 202416
35215 202416 534182 724591 871301 1160340 1619020 2042580 2138785 1804966 1283181 969068
35205 969068 1030258 1262193 1339774 1159684 909371 827776 918581 924683 645402 264067 211456
35194 211456 626768 1117646 1219582 959776 739607 754338 828134 823102 884999 1146885
35184 1146885 1435703 1484181 1318385 1249994 1500833 1927995 2130527 1840729 1253700 901151
35174 901151 1076142 1461736 1530218 1244766 1068612 1266207 1553127 1575463 1394651 1257513
35164 1257513 1166369 980053 739241 575299 448107 293729 297022 653532 1145883 1361137
35154 1361137 1316942 1441608 1857823 2139708 1989226 1732540 1787065 1945310 1662803 935211
35144 935211 394555 462594 824295 936943 743119 594760 668584 782285 723927 477392
35134 477392 137330 -128098 -34152 566581 1300403 1505784 1062528 654737 897072 1508297
35124 1508297 1789551 1670560 1678774 1954308 2001200 1583696 1207626 1340046 1679247 1675952
35114 1675952 1378213 1226240 1295804 1310179 1230136 1273176 1428890 1482385 1482764 1671839 1951251
35103 1951251 1955805 1706930 1635049 1820323 1778005 1244032 656626 522909 741807 926555
35093 926555 1017543 1156511 1266677 1217221 1183349 1387678 1636901 1559651 1207563 986168
35083 986168 1028776 1052292 846791 525202 231247 -53042 -310030 -381673 -171498 252601
35073 252601 793169 1335439 1622484 1420182 891195 530401 606422 896473 1079739 1137914
35063 1137914 1204235 1247624 1140837 925656 812276 949368 1282609 1579360 1573333 1229550
35053 1229550 898913 1003614 1481013 1768465 1494490 968913 770896 1023461 1336991
35044 1336991 1369074 1174461 1030373 1134783 1470644 1796061 1798102 1423272 1006167 890152
35034 890152 996503 1008843 915341 1027149 1415330 1695819 1558019 1208851 1026412 997898
35024 997898 841259 567479 529546 862097 1211108 1198112 928774 815359 1020033 1319741
35014 1319741 1490996 1576321 1684221 1725195 1533297 1173255 927039 937302 1004713 830084
35004 830084 386750 -41067 -166722 30238 347217 606419 820372 1121024 1552993 1973268
34994 1973268 2182780 2130860 1930531 1683273 1384910 1039910 762634 667779 723642 825747
34984 825747 974525 1240082 1547764 1660877 1470620 1198156 1164662 1377331 1483511 1200861
34974 1200861 693534 387821 440536 570207 496078 357524 479982 837668 1074920 1081091
34964 1081091 1167427 1491497 1669666 1319138 730377 526314 755941 853345 558105 347764
34954 347764 708227 1396222 1784566 1666311 1350166 1140562 1090357 1169915 1333640 1441697
34944 1441697 1397265 1341901 1459101 1617473 1491817 1045091 614060 480869 626064 956371
34934 956371 1476864 2086107 2439098 2245294 1634737 1094406 1048175 1493757 1972574 1941321
34924 1941321 1326775 683021 613371 1071617 1474610 1475739 1294611 1230125 1236233 1167980 1100487
34913 1100487 1124284 1093893 892149 729639 845175 1077146 1095192 940809 948460 1180873
34903 1180873 1348140 1315960 1290997 1383128 1361323 1069262 788576 882858 1238631 1371729
34893 1371729 1060463 615463 461499 636016 823088 793484 664692 706930 1001085 1374991
34883 1374991 1620495 1651072 1462727 1112083 804874 838179 1283571 1797604 1914944 1531147
34873 1531147 988882 693456 732643 871371 851059 687652 680205 1067971 1686792 2099496
34863 2099496 2096977 1887004 1711095 1514904 1179636 851802 758471 835425 843205 774709 844668
34852 844668 1100327 1322145 1319697 1099091 760973 464039 444507 810018 1342005 1745977
34842 1745977 2018936 2276937 2346060 1961632 1339419 1049716 1241890 1479163 1482229 1524829
34832 1524829 1841146 2127470 2004798 1603961 1295979 1139900 1005958 1005560 1358007 1950453
34822 1950453 2401887 2496548 2281414 1859013 1372254 1074263 1107571 1277442 1282555 1089445
34812 1089445 889999 831817 980923 1349163 1736022 1795178 1537503 1476984 1907447 2336948
34802 2336948 2140383 1538937 1324649 1715567 2127966 2116843 1903142 1790352 1636520 1232735
34792 1232735 802615 765143 1203477 1800900 2157741 2062273 1636378 1293409 1360175 1706483
34782 1706483 1952366 1993972 2017061 2041612 1881281 1599910 1546048 1791257 1971552 1883135
34772 1883135 1818410 2062026 2431847 2599612 2531924 2333009 1976899 1503370 1182151 1162141
34762 1162141 1222241 1168173 1178511 1411922 1575685 1320974 847046 657221 856398 1120710
34752 1120710 1250304 1315678 1322189 1163967 913851 789792 834263 957253 1234166 1750014
34742 1750014 2175732 1997288 1285304 776734 965512 1490783 1707479 1538616 1389479
34733 1389479 1423463 1368634 1044317 695617 638127 811054 916190 879658 896469 1013496
34723 1013496 985994 727453 627919 1077679 1811852 2152881 1905746 1571572 1566690 1688305
34713 1688305 1588708 1351853 1244897 1228921 1114053 954551 906612 914174 907142 1060697 1435410
34702 1435410 1634518 1354851 1050625 1402223 2241756 2715005 2514945 2205261 2174449 2046997
34692 2046997 1495716 963029 1034052 1543571 1853663 1732721 1474617 1352272 1393667 1558067
34682 1558067 1751278 1774329 1576031 1427807 1544435 1688318 1494742 1056329 805066 895445
34672 895445 1097876 1276921 1557756 1937643 2114175 1898661 1550429 1479610 1746643 2039931
34662 2039931 2095560 1993033 2013154 2270110 2539615 2478704 1995062 1337786 830457 613289
34652 613289 657266 872443 1102999 1145667 929108 634103 531619 727058 1109955 1480100
34642 1480100 1669399 1640033 1538144 1554786 1665700 1629887 1339361 1046079 1112499 1611182
34632 1611182 2263440 2697269 2709344 2394862 2094993 2091410 2289102 2346734 2151438 1922623
34622 1922623 1760891 1420316 763992 166750 125466 623319 1195523 1512531 1601081 1599544
34612 1599544 1625958 1828410 2236508 2573242 2507997 2096227 1703776 1522357 1450931 1433017
34602 1433017 1568566 1840842 2052779 2125957 2179327 2215805 2017938 1502725 949630 721874
34592 721874 925432 1426505 1997175 2349376 2268102 1878851 1604491 1701290 1988809 2162346
34582 2162346 2181952 2180404 2171517 2100048 2083888 2331337 2786609 3062328 2834400 2214656 1627746
34571 1627746 1346247 1262523 1162714 1081633 1192476 1410309 1413614 1145190 967255 1116715
34561 1116715 1327113 1300150 1236853 1455079 1742595 1680214 1467940 1733485 2475959 2912813
34551 2912813 2592810 1998681 1710498 1593537 1289446 982676 1077426 1460702 1686726 1679723
34541 1679723 1711332 1845000 1925829 2001157 2232787 2454019 2312392 1849999 1495979 1465657
34531 1465657 1568489 1614792 1611318 1541627 1353390 1191226 1254565 1407475 1337370 1119003
34521 1119003 1164550 1552113 1896316 2012002 2182811 2540397 2697936 2376045 1970924 2026074
34511 2026074 2404504 2473164 1992055 1379749 1099504 1146447 1231489 1214819 1199740 1291524
34501 1291524 1401546 1361634 1218931 1262179 1604757 1883658 1665897 1099546 792600 1001433
34491 1001433 1339702 1426583 1402237 1545915 1763526 1810804 1743559 1760008 1790954 1625592
34481 1625592 1318585 1133065 1175114 1374660 1706184 2130301 2445238 2508665 2480411 2528902
34471 2528902 2458865 2021829 1462368 1295359 1593415 1962002 2210848 2543390 2999516 3222381
34461 3222381 2987621 2558702 2293837 2243935 2342968 2636881 3053182 3243947 2966672 2430119
34451 2430119 2026463 1903370 1986160 2184442 2349466 2264051 1943471 1744582 1901275 2139408
34441 2139408 2047462 1660762 1355847 1299714 1353663 1445616 1674750 2035375 2341265 2472266
34431 2472266 2468979 2374233 2206092 2082421 2122311 2200275 2048608 1666436 1402209 1536338
34421 1536338 1956365 2332518 2469760 2407007 2291256 2239048 2262699 2304676 2370856 2551364
34411 2551364 2818577 2933949 2744736 2468149 2433909 2620602 2744774 2767605 2943035 3306448
34401 3306448 3503103 3298076 2930576 2736877 2699050 2630537 2571204 2681189 2898537 3027277
34391 3027277 3081394 3229140 3421619 3375479 2979322 2494019 2267339 2381292 2614032 2645891
34381 2645891 2322880 1839263 1614322 1838366 2204861 2294666 2166238 2276583 2788147 3275291
34371 3275291 3274306 2863818 2472371 2298613 2197737 2044574 1913601 1886166 1930331 2050779
34361 2050779 2353614 2827033 3200326 3207168 2952323 2841756 3090379 3420312 3378176 2921513
34351 2921513 2523983 2605647 2997496 3190893 3079268 3125715 3628604 4129741 3944724 3158894
34341 3158894 2612765 2808112 3291763 3382101 3097536 2943485 3067070 3162549 3094424 3031763
34331 3031763 2930057 2480108 1783673 1527982 2106975 2981131 3351928 3159776 2936466
34322 2936466 2925605 2922112 2862665 2955213 3161688 3113851 2726688 2423342 2503539 2696631 2656237
34311 2656237 2558629 2799482 3282349 3445901 3017016 2418160 2291718 2763187 3315164 3392118
34301 3392118 3033126 2770825 2899563 3092651 2943122 2633082 2660197 3021959 3195757 2976417
34291 2976417 2777598 2897913 3035066 2895617 2810719 3227047 3898099 4148915 3804571 3346932
34281 3346932 3203375 3326120 3462485 3443035 3193535 2810943 2620198 2822078 3120610 3065024
34271 3065024 2727325 2620715 2922264 3220003 3139307 2812101 2570156 2541740 2729765 3138728
34261 3138728 3598682 3761981 3527640 3246876 3286072 3578852 3805205 3819987 3701595 3548132
34251 3548132 3431619 3426110 3511480 3560875 3540172 3574362 3713865 3818305 3787117 3695961 3568402
34240 3568402 3255258 2743996 2368462 2453132 2891322 3303956 3488291 3498878 3429798 3367876
34230 3367876 3462923 3797452 4233204 4565352 4745350 4787667 4603726 4171880 3757911 3677495
34220 3677495 3875930 4002103 3891886 3745975 3819985 4141212 4539367 4778914 4678747 4293783
34210 4293783 3962016 3971225 4192541 4252755 4047028 3825129 3756353 3711095 3583590 3550354
34200 3550354 3800749 4192968 4401843 4309172 4052105 3762382 3479286 3310438 3444461 3893568
34190 3893568 4365359 4540654 4429118 4318285 4389037 4534135 4597452 4625492 4743106 4890494
34180 4890494 4880483 4693555 4527862 4531389 4656148 4827415 5081516 5429619 5714837 5736242
34170 5736242 5464662 5068891 4781661 4759814 4972803 5187717 5170177 4943125 4742326 4692013
34160 4692013 4663614 4499261 4227485 3994715 3916066 4041267 4321037 4562908 4583492 4453448
34150 4453448 4426106 4595236 4820082 5004559 5197496 5378639 5440829 5451880 5602150 5795650
34140 5795650 5679160 5240409 4961367 5133919 5439069 5513319 5503356 5650706 5736055 5473334
34130 5473334 5157711 5327121 5937467 6424643 6490793 6327283 6148061 6009108 6029706 6284244
34120 6284244 6495278 6317330 5914170 5781803 6007710 6181839 6041289 5729821 5436117
34111 5436117 5279600 5520980 6291020 7079227 7143185 6558800 6214859 6560400 7022960 6981780
34101 6981780 6658849 6572696 6659250 6531471 6260737 6294772 6741380 7216413 7367273 7215523
34091 7215523 7002591 6917103 6950626 6929175 6780238 6758287 7156942 7784200 8086344 7903633
34081 7903633 7720147 7974189 8475582 8740972 8606500 8281260 8053098 8125480 8494818 8861806
34071 8861806 8933800 8857513 8979709 9176555 8964146 8364293 8006916 8155273 8336838 8279784
34061 8279784 8441886 9066187 9456025 8958133 8098560 7876042 8320411 8639299 8529631
34052 8529631 8426144 8553983 8629593 8562155 8664294 9018886 9307709 9429714 9674246 10096710
34042 10096710 10312304 10168092 10101342 10494610 11061630 11232237 10908249 10512861 10398306
34033 10398306 10471984 10450798 10350715 10553674 11273850 12097248 12383131 12124091 11963008 12211061
34023 12211061 12372616 11982203 11411591 11340257 11805299 12322742 12635438 12770759 12644404
34014 12644404 12237286 11956101 12186833 12657218 12865409 12959664 13482361 14339998 14793770
34005 14793770 14536310 14097346 14046116 14374205 14816265 15263049 15671468 15948270 16056533
33996 16056533 16000057 15768677 15561462 15837929 16756584 17812488 18467766 18825209 19178642
33987 19178642 19330980 19064215 18886225 19437938 20427064 21056415 21297304 21782670 22599947
33978 22599947 23210045 23493751 23857310 24325960 24566812 24810939 25671416 26972714 27839083
33969 27839083 28071733 28397226 29234848 30262917 31300894 32543111 33829727 34776824 35668039
33960 35668039 37093219 38777026 40024936 41161660 43040546 45314021 46942157 48290908
33952 48290908 50721100 54123658 57119375 59789071 63662888 68760955 73489437 77875777
33944 77875777 83693004 90797609 97083058 102901401 111047266 121109660 129455355 136646730
33936 136646730 146384048 150992294 127039154 58754920 -35757063 -114243102 -149337037
33929 -149337037 -149387655 -138999201 -130610868 -121961931 -111268511 -102279766 -96625129 -91247386
33921 -91247386 -84614025 -79000520 -75525368 -72114043 -67621353 -63712541 -61382633 -59193461
33913 -59193461 -56211466 -53585917 -51974686 -50140305 -47342088 -44719520 -43100341 -41594171
33905 -41594171 -39535879 -37840654 -37209600 -36745056 -35559694 -34207883 -33353146 -32446958 -30932525
33896 -30932525 -29511791 -29009271 -28995390 -28626253 -27947495 -27380224 -26775621 -25940216 -25314699
33887 -25314699 -25207853 -25065590 -24358684 -23499505 -23030032 -22597074 -21657430 -20600291 -20191923
33878 -20191923 -20329897 -20266078 -19767834 -19236371 -18902121 -18643287 -18431766 -18311338 -18075289
33869 -18075289 -17520596 -16873023 -16475536 -16237544 -15853771 -15365957 -15035192 -14829946 -14499865
33860 -14499865 -14037700 -13676637 -13537619 -13591862 -13818994 -14114180 -14223771 -14052843 -13841166
33851 -13841166 -13789043 -13754389 -13564481 -13321127 -13106781 -12730233 -12133201 -11723062 -11850821 -12202658
33841 -12202658 -12178529 -11707984 -11243125 -11067012 -11052578 -11042651 -11041052 -11004019 -10793136 -10416402
33831 -10416402 -10093113 -10025706 -10229580 -10557356 -10788665 -10775165 -10588151 -10422932 -10323240 -10185618
33821 -10185618 -10053457 -10100860 -10238573 -10110007 -9659268 -9307378 -9288922 -9202943 -8610539 -7772692
33811 -7772692 -7353462 -7583070 -8110323 -8514513 -8581069 -8239134 -7650347 -7264809 -7391439 -7761346
33801 -7761346 -7859376 -7622669 -7462982 -7645542 -7995993 -8216519 -8180687 -7910911 -7541404 -7306731
33791 -7306731 -7325070 -7414385 -7346328 -7210347 -7258153 -7454620 -7497536 -7277901 -7024714 -6956674
33781 -6956674 -7040305 -7136010 -7171125 -7127342 -7021607 -6907501 -6769656 -6491239 -6091674 -5876665
33771 -5876665 -6106063 -6597433 -6929646 -6976714 -6945106 -6920178 -6714967 -6226108 -5653071 -5269753
33761 -5269753 -5190084 -5402695 -5793081 -6061273 -5883370 -5321438 -4902507 -5109818 -5858467 -6580853
33751 -6580853 -6785566 -6465053 -5999799 -5745672 -5745609 -5815267 -5809089 -5702161 -5490617 -5220457 -5111401
33740 -5111401 -5382697 -5862778 -6045875 -5706123 -5210074 -5021484 -5143966 -5292612 -5357061 -5376815
33730 -5376815 -5279446 -5019628 -4826014 -4925694 -5128771 -5068182 -4774240 -4620063 -4737090 -4878779
33720 -4878779 -4872825 -4839457 -4916290 -5083312 -5295933 -5512992 -5599680 -5479791 -5330763 -5324330 -5283540
33709 -5283540 -4988927 -4704287 -4877143 -5350319 -5468567 -5059722 -4696296 -4771001 -4912297 -4663245
33699 -4663245 -4218424 -4041019 -4148964 -4263111 -4371521 -4645490 -4959480 -4966475 -4625278 -4310696
33689 -4310696 -4382817 -4847229 -5397084 -5646476 -5422931 -4952844 -4627460 -4521213 -4375630 -4119725
33679 -4119725 -4020369 -4129089 -4030978 -3505110 -3031338 -3154136 -3655495 -3917460 -3869704 -3935259
33669 -3935259 -4154110 -4072932 -3577415 -3162399 -3152266 -3232766 -3071502 -2903267 -3086210 -3448809
33659 -3448809 -3542484 -3323159 -3144653 -3192198 -3317408 -3389181 -3451951 -3520408 -3526512 -3530239 -3718796
33648 -3718796 -4094150 -4362293 -4252667 -3820079 -3349216 -3076574 -3070441 -3256802 -3475031 -3606730
33638 -3606730 -3719432 -3973980 -4327126 -4483992 -4271018 -3896956 -3649662 -3469442 -3102139
33629 -3102139 -2620099 -2449953 -2788531 -3274552 -3420488 -3186825 -2957232 -3089122 -3643789
33620 -3643789 -4408966 -4997330 -5044480 -4529932 -3859433 -3479881 -3474743 -3646037 -3843474 -4025084
33610 -4025084 -4132557 -4142937 -4151809 -4193021 -4093040 -3732185 -3296970 -2994039 -2703888 -2305215
33600 -2305215 -2157893 -2708141 -3647242 -4085471 -3716559 -3235477 -3328684 -3772029 -3918601 -3656073
33590 -3656073 -3402767 -3425142 -3627119 -3863131 -4050590 -4063783 -3863428 -3660134 -3650666 -3673718
33580 -3673718 -3420353 -2920780 -2544306 -2556173 -2900039 -3343554 -3613798 -3495124 -3061858 -2735936
33570 -2735936 -2840711 -3157938 -3201368 -2878314 -2580068 -2613807 -2835309 -2919183 -2778407 -2615697
33560 -2615697 -2662606 -2909312 -3066291 -2872914 -2480713 -2341546 -2601328 -2852937 -2712198 -2393129
33550 -2393129 -2386316 -2744234 -3056961 -3043322 -2819380 -2643101 -2705275 -3087889 -3604291 -3785405
33540 -3785405 -3392673 -2847162 -2742936 -3028382 -3142940 -2901894 -2680314 -2680236 -2631062 -2401506
33530 -2401506 -2314401 -2531978 -2644594 -2299876 -1845235 -1852476 -2252553 -2445116 -2179280 -1887389
33520 -1887389 -2096182 -2800495 -3507925 -3748310 -3483762 -3082626 -2908438 -2963548 -3015489 -3000320
33510 -3000320 -3080544 -3298623 -3441192 -3344585 -3106765 -2878519 -2646602 -2347261 -2025253 -1780736
33500 -1780736 -1701701 -1874718 -2265719 -2589510 -2557045 -2266011 -2060172 -2014903 -1929241 -1817937
33490 -1817937 -1923448 -2160079 -2107769 -1758143 -1681764 -2132361 -2557387 -2434589 -2062225 -1979974
33480 -1979974 -2082032 -1953683 -1720103 -1837577 -2253587 -2474767 -2366327 -2250523 -2281311 -2318977
33470 -2318977 -2364277 -2524025 -2598558 -2314213 -1933071 -1989919 -2414043 -2579395 -2285974 -1998826
33460 -1998826 -1996639 -2014001 -1940595 -2124330 -2629285 -2892616 -2587980 -2231692 -2400568 -2850811
33450 -2850811 -2983359 -2773700 -2644007 -2718305 -2791089 -2823776 -2927733 -3000267 -2859772 -2617502
33440 -2617502 -2491178 -2410287 -2237596 -2190274 -2536001 -3013216 -3099740 -2789478 -2555078 -2560972
33430 -2560972 -2492491 -2235832 -2139943 -2399678 -2691354 -2712996 -2674436 -2908720 -3301598 -3471485
33420 -3471485 -3329939 -3121675 -2994714 -2831185 -2517230 -2163837 -1972151 -1963155 -1927698 -1683835
33410 -1683835 -1357412 -1286704 -1586734 -1964978 -2120211 -2154517 -2334224 -2580311 -2556347 -2222864
33400 -2222864 -1904444 -1746062 -1503464 -1023744 -560057 -383107 -405334 -459880 -649506 -1068853
33390 -1068853 -1419080 -1335818 -1007511 -1031942 -1610657 -2251795 -2411637 -2149659 -1936359 -1980551
33380 -1980551 -2009294 -1726538 -1295891 -1206397 -1665240 -2273349 -2431430 -2002803 -1406574 -1074192
33370 -1074192 -1032611 -1082009 -1141505 -1245025 -1361162 -1421550 -1441027 -1453048 -1420274 -1357391 -1424153
33359 -1424153 -1711557 -2038911 -2170473 -2150197 -2196111 -2323628 -2326772 -2135097 -1964559 -2071781
33349 -2071781 -2508990 -3113007 -3586014 -3638228 -3247458 -2744673 -2454068 -2318315 -2108643 -1896891
33339 -1896891 -1971400 -2318800 -2587356 -2612357 -2568953 -2503496 -2167956 -1540097 -1081439 -1155228
33329 -1155228 -1531251 -1809957 -2003899 -2280495 -2427431 -2116189 -1558722 -1361501 -1731024
33320 -1731024 -2281327 -2643035 -2806503 -2798753 -2495456 -1942878 -1489575 -1366240 -1402627 -1350021
33310 -1350021 -1237012 -1217802 -1289918 -1361350 -1430863 -1534777 -1650179 -1766721 -1915365 -2059036
33300 -2059036 -2130632 -2214821 -2450030 -2708091 -2686234 -2408603 -2268517 -2406510 -2441905 -2080309
33290 -2080309 -1604352 -1428119 -1525444 -1692405 -2007826 -2515279 -2754840 -2259030 -1374715 -942868
33280 -942868 -1192267 -1573725 -1697348 -1748778 -1850883 -1732588 -1346673 -1188579 -1566407 -2048051
33270 -2048051 -2091763 -1802109 -1574231 -1378577 -978601 -578763 -616774 -1023832 -1276781 -1167526
33260 -1167526 -1006012 -1051106 -1234595 -1488094 -1841980 -2099593 -1910594 -1354752 -1008851 -1196672
33250 -1196672 -1563993 -1657837 -1546903 -1536798 -1607699 -1556853 -1474683 -1616955 -1885989 -1867819
33240 -1867819 -1426239 -930542 -799280 -1038606 -1313091 -1326774 -1092940 -920818 -1100802 -1514077
33230 -1514077 -1689299 -1421159 -1147873 -1392970 -1963741 -2157591 -1776929 -1426822 -1609267
33221 -1609267 -2008440 -2055025 -1826300 -1858710 -2242029 -2468992 -2217846 -1778573 -1531344 -1434393
33211 -1434393 -1324822 -1393052 -1920438 -2657341 -2907275 -2352676 -1507201 -1135755 -1370793 -1639929
33201 -1639929 -1446153 -974705 -789310 -1080515 -1464300 -1535048 -1364052 -1291067 -1399733 -1452255
33191 -1452255 -1284695 -1004488 -771378 -632525 -654440 -958776 -1449493 -1718577 -1490454 -1054491
33181 -1054491 -972508 -1373171 -1814116 -1906839 -1804240 -1879736 -2114176 -2102408 -1665757 -1176738
33171 -1176738 -1109383 -1428726 -1669317 -1575557 -1375903 -1330787 -1307959 -1068545 -758707 -728403
33161 -728403 -941534 -1015926 -908330 -1076125 -1723803 -2322646 -2267488 -1706275 -1274429 -1215067
33151 -1215067 -1246783 -1183806 -1159618 -1224251 -1217290 -1142617 -1228485 -1482909 -1617977 -1588027 -1757775
33140 -1757775 -2264225 -2621700 -2345541 -1678972 -1289127 -1422795 -1750341 -1920075 -1877608 -1682516
33130 -1682516 -1375255 -1077221 -961720 -1060272 -1251849 -1433539 -1562208 -1595642 -1563736 -1618185
33120 -1618185 -1822937 -1986224 -1912449 -1720772 -1660165 -1695522 -1581229 -1312864 -1184611 -1361143
33110 -1361143 -1675302 -1902484 -1967643 -1826111 -1438698 -991378 -867053 -1196963 -1611500 -1631507
33100 -1631507 -1218366 -795598 -779235 -1175096 -1602063 -1678212 -1420347 -1231476 -1425005 -1853403
33090 -1853403 -2151993 -2234744 -2301071 -2420918 -2433047 -2275942 -2095644 -1938918 -1648967 -1203136
33080 -1203136 -870885 -856584 -1018131 -1117127 -1133776 -1152861 -1141780 -1041675 -916497 -842973
33070 -842973 -812569 -868073 -1109839 -1406622 -1377127 -907685 -436577 -419825 -730270 -928474
33060 -928474 -936054 -1028375 -1280222 -1481592 -1600680 -1878493 -2349082 -2643688 -2460151 -1958924
33050 -1958924 -1511626 -1270425 -1171028 -1187923 -1359668 -1614601 -1748149 -1616419 -1304733 -1078924
33040 -1078924 -1143783 -1430513 -1665886 -1673456 -1524523 -1366344 -1261461 -1291836 -1613764 -2190872
33030 -2190872 -2628842 -2565215 -2156751 -1896725 -1976444 -2117818 -2054225 -1876856 -1804555 -1848013
33020 -1848013 -1845849 -1702078 -1486261 -1356653 -1392129 -1456902 -1336834 -1108315 -1169237 -1674726
33010 -1674726 -2163641 -2116081 -1711695 -1551553 -1715323 -1683940 -1254433 -886666 -893065 -885911
33000 -885911 -452070 94157 152373 -267855 -601993 -516261 -202951 -7553 -136212 -614603
32990 -614603 -1170212 -1268174 -653369 196045 503243 43592 -729622 -1303246 -1495362 -1331961
32980 -1331961 -973697 -776293 -1010194 -1440562 -1536037 -1173013 -796369 -793998 -1053771 -1269753
32970 -1269753 -1362033 -1406519 -1403616 -1315444 -1171183 -1014260 -891319 -927163 -1189208 -1448596
32960 -1448596 -1363523 -970695 -681005 -690099 -756379 -722188 -832384 -1225559 -1489875 -1187181
32950 -1187181 -595869 -424141 -835374 -1216124 -984803 -272481 325515 408641 42178 -435824
32940 -435824 -726265 -779949 -794839 -976921 -1311693 -1628533 -1823379 -1892149 -1805902 -1534017
32930 -1534017 -1185267 -953563 -898122 -914881 -928766 -961349 -1005096 -1008926 -1012898 -1100429 -1163146
32919 -1163146 -937467 -402629 58312 85758 -209203 -438163 -474400 -542594 -795154 -1075833
32909 -1075833 -1195077 -1223440 -1357455 -1627947 -1894998 -2038897 -2007219 -1761215 -1364317 -1074395
32899 -1074395 -1122199 -1370217 -1400557 -1018772 -493118 -205913 -245604 -452131 -669573 -791711
32889 -791711 -745424 -642494 -782551 -1250258 -1654439 -1571965 -1138966 -846826 -822160 -730510
32879 -730510 -414060 -172383 -273263 -592311 -925419 -1271256 -1569596 -1546436 -1141564 -766666
32869 -766666 -782569 -995847 -1039755 -976110 -1085849 -1300602 -1338275 -1233848 -1209267 -1137889 -724790
32858 -724790 -190520 -152018 -722232 -1311094 -1490882 -1492588 -1606169 -1666531 -1508083 -1420973
32848 -1420973 -1672952 -1965685 -1890362 -1631423 -1654819 -1885227 -1792023 -1255782 -787186 -788961
32838 -788961 -1065077 -1223418 -1185843 -1091971 -987523 -848701 -751518 -820859 -1080545 -1433212
32828 -1433212 -1696739 -1645932 -1193648 -595457 -293835 -446316 -748313 -836833 -733175 -730417
32818 -730417 -931111 -1088406 -932393 -530981 -239613 -306925 -595437 -750912 -632720 -480641
32808 -480641 -611114 -1042758 -1502062 -1707133 -1541600 -1059277 -492855 -190307 -330568 -704235
32798 -704235 -957307 -1036768 -1175995 -1431548 -1514732 -1201334 -672644 -275187 -120501 -112248
32788 -112248 -211974 -432270 -644427 -650684 -467869 -343717 -440661 -652729 -793456 -831029
32778 -831029 -847559 -867280 -857176 -872901 -1068675 -1488208 -1906327 -1991430 -1656699 -1171032
32768 -1171032 -862322 -780455 -741559 -631882 -513991 -451598 -409332 -370546 -391630 -467400 -498315
32757 -498315 -483495 -582272 -854499 -1107983 -1189485 -1272976 -1599091 -2023323 -2139809 -1856093
32747 -1856093 -1518095 -1367855 -1195396 -743395 -208860 -23914 -235969 -425228 -269711
32738 -269711 63166 187584 -28609 -401502 -713050 -884078 -908994 -785898 -564928 -378066
32728 -378066 -349095 -489557 -711211 -921333 -1078096 -1168464 -1177531 -1104652 -991164 -892929 -809731
32717 -809731 -670362 -426668 -155357 -12876 -59775 -170373 -171860 -60245 -14216 -174815
32707 -174815 -465218 -675926 -702549 -644305 -662861 -789075 -899349 -867633 -712518 -589123
32697 -589123 -648863 -908156 -1232814 -1436204 -1420124 -1263595 -1164118 -1233565 -1349095 -1287145
32687 -1287145 -1029410 -817208 -818258 -878314 -785026 -668565 -839335 -1215025 -1274662 -788956
32677 -788956 -296525 -490866 -1269593 -1800303 -1556400 -911975 -560621 -662426 -834458 -789894
32667 -789894 -649465 -637486 -755987 -872989 -969182 -1148465 -1455628 -1799218 -2056888 -2170649
32657 -2170649 -2109146 -1822192 -1325983 -794018 -429850 -221138 43492 428772 654785 399268
32647 399268 -270945 -936987 -1270393 -1284671 -1169367 -1062387 -1024937 -1078427 -1186132 -1284810
32637 -1284810 -1357081 -1390278 -1308618 -1098023 -943909 -1011575 -1102668 -835821 -257538 39225
32627 39225 -393320 -1272878 -1905743 -1917400 -1476713 -978162 -730761 -822344 -1068413 -1193092
32617 -1193092 -1203144 -1389441 -1782542 -1901267 -1383156 -626112 -354924 -676902 -1040570 -1077461
32607 -1077461 -973780 -954730 -916664 -762985 -687288 -877058 -1233390 -1565119 -1765373 -1657753
32597 -1657753 -1053194 -195991 227702 -132199 -789730 -1045008 -847682 -661937 -703778 -771394
32587 -771394 -714584 -608088 -469541 -219034 34414 32306 -222818 -411214 -348854 -214317
32577 -214317 -214843 -298942 -354242 -454720 -704393 -980750 -1042615 -851277 -643490 -675097 -949228
32566 -949228 -1217000 -1262498 -1171454 -1208195 -1389717 -1388196 -1032696 -689597 -805015 -1190785
32556 -1190785 -1203462 -649754 -46490 167532 205450 412093 583369 288263 -351911 -745209
32546 -745209 -673326 -569430 -822555 -1203528 -1238884 -903309 -632662 -736418 -1066855 -1299416
32536 -1299416 -1337563 -1323142 -1344581 -1286157 -993188 -499977 -32857 175845 35203 -376760
32526 -376760 -838280 -1080314 -994170 -756200 -630785 -645743 -610057 -466624 -411323 -555983
32516 -555983 -689627 -576842 -334817 -257134 -357366 -386784 -294346 -346043 -681606 -1036872
32506 -1036872 -1110930 -1009118 -1062336 -1315678 -1487996 -1434412 -1351923 -1408566 -1420762 -1130862
32496 -1130862 -656878 -377270 -409287 -511542 -553521 -733118 -1131617 -1378865 -1125147 -647560
32486 -647560 -541844 -877039 -1130703 -1005532 -801250 -797104 -778098 -521460 -316685 -520608
32476 -520608 -903595 -986760 -841458 -957421 -1365956 -1500591 -1038601 -357494 27965 30215
32466 30215 -216404 -679193 -1236439 -1512864 -1264395 -723232 -291586 -91675 -46746 -156664
32456 -156664 -399097 -569044 -538553 -521219 -773242 -1166127 -1360306 -1293247 -1199340 -1235310
32446 -1235310 -1364242 -1523138 -1638696 -1574497 -1322781 -1119242 -1086299 -937087 -398516 236207
32436 236207 432729 192313 -8058 -27390 -247934 -853321 -1478847 -1807709 -2028523 -2392746
32426 -2392746 -2708792 -2618930 -2101762 -1411085 -764046 -340916 -328222 -680590 -1051837 -1198076
32416 -1198076 -1234451 -1312410 -1347338 -1292150 -1323055 -1447009 -1297992 -724431 -227958 -326039
32406 -326039 -775817 -995052 -1008216 -1302632 -1855789 -2033543 -1540321 -829480 -394218 -209295
32396 -209295 -85561 -50746 -100210 -28894 171960 137338 -329596 -872455 -1061379 -960289
32386 -960289 -890593 -907136 -865951 -787746 -784025 -780364 -650515 -490453 -447457 -421969 -269454
32375 -269454 -160734 -370861 -799492 -1085203 -1147034 -1208924 -1291058 -1129962 -718125 -483513
32365 -483513 -683625 -968789 -878990 -529812 -409239 -611512 -715492 -484728 -274476 -493923
32355 -493923 -951250 -1110958 -894679 -798227 -1122740 -1482743 -1347523 -803476 -420935 -496009
32345 -496009 -795167 -1013382 -1113981 -1164981 -1176314 -1200568 -1302813 -1331066 -1013889 -398656
32335 -398656 121800 350722 501453 693320 650991 221822 -194125 -171087 73924 33919
32325 33919 -274996 -400218 -241557 -166848 -319908 -391312 -231347 -171934 -474670 -872162
32315 -872162 -977422 -846090 -805093 -940086 -1073822 -1111864 -1108103 -1058873 -894320 -655206
32305 -655206 -476013 -401208 -378942 -411078 -540420 -701534 -771816 -803372 -1004851 -1376635
32295 -1376635 -1537467 -1143837 -427115 -35667 -256555 -655927 -693365 -449683 -392718 -578188
32285 -578188 -583931 -265156 -21145 -83782 -65555 375096 845595 743064 195048 -118592
32275 -118592 46355 278477 248548 88179 -36990 -193204 -374856 -411663 -350828 -496722
32265 -496722 -882756 -1117391 -963048 -672886 -527888 -431882 -231884 -71811 -120729 -264316
32255 -264316 -366803 -534673 -800731 -846268 -424250 152773 329691 -12334 -503773 -797113
32245 -797113 -859690 -864420 -1008735 -1326286 -1533209 -1272002 -660149 -292153 -469187 -771829
32235 -771829 -710592 -439161 -395112 -545659 -510135 -226103 34269 172823 271222 197635
32225 197635 -243669 -805785 -982968 -729411 -491385 -481143 -443881 -254526 -215321 -534030
32215 -534030 -939205 -1082220 -997756 -924543 -936400 -969633 -997414 -986252 -852026 -604479 -399165
32204 -399165 -366686 -508819 -746340 -910395 -789770 -443597 -327064 -729883 -1213775 -1104711
32194 -1104711 -485380 -96198 -202381 -255206 95086 369213 88668 -375566 -396659 -113239
32184 -113239 -184530 -749801 -1278749 -1399757 -1320114 -1375618 -1604652 -1863850 -2036312 -2027705
32174 -2027705 -1788535 -1408959 -1044454 -754303 -528795 -389062 -325038 -266321 -266392 -529959
32164 -529959 -1050296 -1427115 -1321165 -907536 -573906 -358395 -61575 239333 243924 -48793
32154 -48793 -311770 -405332 -504304 -647705 -581673 -204360 179862 232446 -62440 -548259
32144 -548259 -1105561 -1530956 -1497498 -909989 -143090 299530 267140 -32454 -355070 -576950
32134 -576950 -662276 -660021 -655057 -602091 -340962 81617 288397 16951 -437092 -539768 -261216
32123 -261216 -164047 -649686 -1407797 -1813894 -1660500 -1236752 -828507 -477293 -226085 -243399
32113 -243399 -533578 -778260 -712191 -511976 -552958 -855027 -1043254 -868960 -525391 -374522
32103 -374522 -541544 -852356 -1027737 -885556 -485990 -114005 11598 10993 162276 469626
32093 469626 635596 459867 -1848 -678202 -1520291 -2214746 -2283054 -1708703 -1111747 -1001999
32083 -1001999 -1167818 -1136490 -929185 -913729 -1112751 -1150180 -831114 -367512 -42391 16194
32073 16194 -228801 -680463 -1042101 -1107325 -1049350 -1106353 -1107723 -732758 -149211 112332 -62551
32062 -62551 -226944 -101768 41960 -102519 -435321 -742425 -1025761 -1287975 -1341981 -1106192
32052 -1106192 -794172 -569977 -316004 7155 92073 -297717 -890030 -1222732 -1223299 -1168246
32042 -1168246 -1221383 -1304076 -1299268 -1122651 -711482 -183689 123033 14151 -287603 -465103
32032 -465103 -550744 -774614 -1112148 -1311391 -1303451 -1265798 -1280168 -1203143 -914524 -494179 -132139
32021 -132139 -4262 -183594 -506826 -609087 -304727 123339 235505 -4228 -203103 -50827
32011 -50827 360395 710905 741125 390772 -119525 -354907 -60981 477927 702060 432967
32001 432967 33921 -132638 -133849 -218842 -393956 -485821 -498372 -637205 -955361 -1170744
31991 -1170744 -963624 -400055 70602 93481 -202901 -413311 -397605 -408116 -630487 -851674
31981 -851674 -783528 -532795 -461343 -645516 -764215 -549037 -101497 298433 487729 442223
31971 442223 199460 -113909 -319040 -383408 -486938 -763507 -1045315 -1004214 -541962 66924
31961 66924 453006 504618 391653 283376 154310 -78432 -332861 -432997 -376275 -343921
31951 -343921 -406419 -425298 -355860 -423516 -770478 -1078171 -855970 -107775 560712 597015
31941 597015 88126 -410636 -499632 -260007 -27108 7884 -83005 -172197 -281032 -506372
31931 -506372 -806754 -990402 -930043 -690383 -433838 -302659 -379721 -620046 -830055 -891263
31921 -891263 -979386 -1307433 -1659557 -1550667 -960690 -499919 -595681 -893003 -818499 -425236
31911 -425236 -242495 -500932 -954314 -1324757 -1487489 -1330143 -884168 -532236 -640356 -1014989
31901 -1014989 -1148587 -961815 -844559 -975566 -1092713 -986884 -752329 -477154 -148413
31892 -148413 66416 -63439 -340729 -288928 77613 191150 -172589 -526527 -479558 -313511
31882 -313511 -371351 -444960 -269120 -114819 -291891 -467184 -150270 410606 513403 62795
31872 62795 -309873 -191365 123064 172425 -105715 -477207 -717480 -710053 -516341 -397969
31862 -397969 -528403 -697198 -568172 -199540 -5362 -197083 -548178 -731819 -638102 -346824
31852 -346824 -24239 140152 86144 -52695 -179369 -384161 -665570 -737667 -461071 -243563
31842 -243563 -532265 -1038125 -1027499 -384019 196870 191030 -130139 -288069 -310835 -507393
31832 -507393 -881789 -1152402 -1158569 -953569 -643968 -373036 -321264 -502856 -670001 -599809
31822 -599809 -378349 -251231 -293536 -369399 -339436 -191339 -21490 39875 -66279 -278127
31812 -278127 -522008 -814176 -1140443 -1338342 -1304509 -1224862 -1319188 -1420700 -1158409 -565187
31802 -565187 -130238 -159871 -428654 -577241 -526383 -364024 -142972 50898 109041 101162
31792 101162 182359 239436 12559 -346563 -327792 131075 413108 109869 -365223 -456203
31782 -456203 -269793 -188292 -122904 195505 495753 271232 -325700 -598148 -308987 68318
31772 68318 162123 153071 263206 348318 235246 27527 -163248 -423636 -748166 -871116
31762 -871116 -633670 -265635 -83494 -116796 -218754 -352902 -578655 -876277 -1118559 -1141913
31752 -1141913 -843037 -358434 -104466 -379308 -915400 -1112881 -765657 -272935 -78436
31743 -78436 -208254 -442119 -613881 -617078 -421361 -225531 -311540 -632652 -855822 -908089
31733 -908089 -1086258 -1462574 -1629808 -1321904 -880006 -744913 -843265 -872208 -856240 -948189
31723 -948189 -945467 -543277 70334 379669 237971 -45634 -254066 -454138 -675047 -833196
31713 -833196 -980903 -1227979 -1425828 -1338956 -1112061 -1120704 -1359212 -1461059 -1349673 -1324113
31703 -1324113 -1416029 -1271145 -867212 -719638 -1040968 -1296872 -1055399 -731704 -901497 -1318455
31693 -1318455 -1311319 -861773 -531576 -457413 -205879 321004 584497 251469 -267603 -448701
31683 -448701 -354600 -354370 -510598 -622305 -630276 -631733 -647376 -652492 -714035 -871764 -1009092 -1031801
31671 -1031801 -1026261 -1055200 -974125 -671386 -319121 -131536 -21371 224139 538111 635367
31661 635367 406632 -21577 -545642 -1098087 -1442501 -1297042 -728908 -166517 52295 -52825
31651 -52825 -292852 -516123 -597699 -485920 -340241 -409383 -711191 -1026783 -1218721 -1309884
31641 -1309884 -1256247 -973050 -636715 -589368 -822881 -931938 -740726 -571671 -657913 -715428
31631 -715428 -447736 -92726 -33155 -181011 -234631 -275062 -548101 -851752 -767179 -415556
31621 -415556 -340696 -621273 -749639 -511363 -336902 -538311 -796976 -755692 -596476 -607699
31611 -607699 -614104 -324169 74124 164363 -53146 -221282 -198406 -169508 -280197 -503974
31601 -503974 -782334 -999808 -950863 -631725 -400602 -517282 -714809 -622969 -422689 -582409
31591 -582409 -1063401 -1347252 -1244397 -1113662 -1199949 -1303103 -1261867 -1237665 -1277158 -1079110
31581 -1079110 -517222 8878 97181 -113493 -278795 -428149 -801293 -1307001 -1554768 -1351645
31571 -1351645 -874870 -430716 -264926 -472649 -856917 -1020732 -830988 -623047 -717609 -964338
31561 -964338 -1048746 -977718 -874775 -577940 20779 441474 106914 -648030 -783352 34291
31551 34291 892831 865686 210176 -165717 -6916 134840 -152890 -655336 -995228 -1082312
31541 -1082312 -972085 -658526 -211265 117735 135220 -45774 -139771 -30628 99984 -18038
31531 -18038 -421680 -813726 -842708 -505818 -167566 -111146 -214258 -213548 -141638 -239414 -483125
31520 -483125 -514050 -145708 300577 357568 -18319 -430829 -547049 -439320 -402964 -572188
31510 -572188 -802329 -874367 -724885 -469074 -267467 -215791 -320664 -502870 -623928 -590484
31500 -590484 -462750 -388270 -387722 -286505 67551 580735 996445 1158630 1099375 902945
31490 902945 609308 266983 -33205 -241760 -411810 -618252 -835394 -941657 -864369 -707900
31480 -707900 -693387 -919588 -1201587 -1231973 -925471 -524362 -328149 -399034 -565495 -615468
31470 -615468 -453310 -206630 -226147 -768541 -1546197 -1832396 -1270926 -397216 -33972 -314336
31460 -314336 -704843 -898875 -1141178 -1562825 -1763167 -1403646 -817720 -593066 -783523 -961545
31450 -961545 -901661 -777369 -734928 -688261 -575645 -470971 -370565 -173390 52033 80566
31440 80566 -82935 -119844 142053 438913 440393 206544 50428 82602 119845 -21254 -330063
31429 -330063 -670098 -902378 -969587 -954520 -1003137 -1118959 -1139681 -1011374 -929943 -1035761
31419 -1035761 -1114873 -870478 -423290 -225442 -428504 -637486 -451112 -17828 177045 -49052
31409 -49052 -409277 -605465 -700774 -914892 -1206256 -1266421 -930914 -419266 -66418 60366
31399 60366 104983 56623 -281052 -866702 -1246480 -1066057 -605109 -472737 -800011 -1076997
31389 -1076997 -871534 -383038 -96603 -157776 -354410 -519436 -621816 -555004 -200337 254709
31379 254709 368200 -51965 -694385 -1118343 -1217637 -1183147 -1156145 -1107584 -1012611 -986106 -1198096
31368 -1198096 -1668269 -2123342 -2111712 -1422402 -426889 187514 141475 -152931 -186279 -25591
31358 -25591 -113771 -534050 -881532 -918769 -956063 -1337677 -1830403 -1877349 -1359913 -754121
31348 -754121 -483138 -421589 -219019 95996 117833 -361397 -1039642 -1471190 -1561249 -1519275
31338 -1519275 -1444204 -1230312 -903037 -750887 -928261 -1114499 -840189 -97893 623510 920752
31328 920752 851040 665436 416051 6538 -504329 -856365 -852479 -585101 -387590 -544585
31318 -544585 -979810 -1261660 -1062135 -600023 -416453 -665699 -897938 -691261 -220975 59388
31308 59388 67989 56736 58441 -181455 -683784 -1054035 -988427 -664629 -434279 -363274 -303554
31297 -303554 -249091 -360564 -690071 -1073007 -1283201 -1185464 -784536 -238377 215731 445680
31287 445680 499831 439026 192615 -294867 -847809 -1154664 -1088575 -832215 -676802 -762797
31277 -762797 -997578 -1155604 -1077276 -828205 -630318 -584214 -528070 -262818 146539 426301
31267 426301 436298 333375 365561 580243 763064 632992 116490 -529767 -908180 -851591
31257 -851591 -572158 -399530 -447062 -598809 -703414 -643786 -331999 144600 419119 143083
31247 143083 -555195 -1110076 -1100097 -644879 -177252 -2459 -159640 -519558 -871299 -1048385
31237 -1048385 -1098938 -1203318 -1323792 -1145335 -560512 -1372 33550 -331021 -507313 -279509
31227 -279509 -57135 -170378 -341776 -179155 122269 38002 -442479 -742669 -570715 -402864
31217 -402864 -791991 -1504023 -1776611 -1342090 -752675 -600472 -797930 -871074 -686560 -529756
31207 -529756 -570186 -625508 -504649 -273631 -54458 178932 421459 476557 225762 -95481
31197 -95481 -183527 -137325 -303694 -650728 -672810 -76638 739850 1130826 920863 447756
31187 447756 82129 -1899 265329 776716 1106441 839320 140050 -351568 -337353 -224698
31177 -224698 -447235 -776294 -706355 -292880 -88709 -273072 -368485 -10456 421788 286892
31167 286892 -431891 -1093081 -1201391 -926825 -738687 -751732 -636285 -142069 464140 622670
31157 622670 135805 -551177 -840017 -646647 -388034 -360004 -411774 -315725 -172876 -231606
31147 -231606 -484095 -696801 -749889 -709805 -616562 -432337 -198107 -41161 -16220 -106563
31137 -106563 -359351 -811134 -1282755 -1495904 -1453042 -1462994 -1683945 -1867213 -1714936 -1307047
31127 -1307047 -972427 -857044 -825290 -725739 -563386 -418196 -336752 -313094 -286499 -175005
31117 -175005 15967 161133 166683 95437 62219 88990 167076 351859 624619 745400 477550
31106 477550 -40805 -373405 -291217 -9517 158326 190734 260071 391205 410414 194693
31096 194693 -172548 -493072 -614036 -519210 -342540 -266180 -326110 -352005 -195254 13160
31086 13160 -35107 -437151 -907174 -1066974 -845697 -521448 -403922 -544844 -749073 -802782
31076 -802782 -658294 -414120 -152209 152968 521030 796664 711339 188460 -479505 -870437
31066 -870437 -846656 -646309 -569593 -684344 -863794 -977490 -952584 -757567 -468731 -297118
31056 -297118 -396393 -654852 -814724 -789142 -703037 -612635 -393090 1654 357410 441983
31046 441983 304049 159600 79028 -24565 -169516 -280629 -356388 -447862 -486591 -369316
31036 -369316 -229414 -355404 -756178 -1069911 -1043711 -859204 -804944 -868661 -891131 -897153 -965654
31025 -965654 -954691 -720957 -476082 -498730 -577913 -264974 285321 321305 -426945 -1237184
31015 -1237184 -1365775 -1052441 -1007261 -1253496 -1181860 -627587 -163056 -209449 -481505 -549667
31005 -549667 -437888 -362866 -307616 -197684 -157397 -241081 -207530 76986 288604 99392
30995 99392 -264554 -371380 -289401 -418287 -717309 -678421 -120152 512779 774656 686918
30985 686918 431402 38338 -390584 -575718 -479338 -477165 -789586 -1067673 -906871 -476730
30975 -476730 -223146 -195843 -151320 -134690 -395516 -780510 -798633 -391606 -106315 -296159
30965 -296159 -625188 -659252 -533007 -620749 -835183 -738901 -251770 195018 242687 -330
30955 -330 -221957 -280706 -207044 -67409 25412 -67596 -340034 -613217 -791608 -988596 -1239940
30944 -1239940 -1265271 -804649 -140280 61901 -444307 -1109778 -1239902 -839475 -522804 -669075
30934 -669075 -1018626 -1176779 -1173427 -1270466 -1426063 -1304960 -814695 -329496 -256731 -569835
30924 -569835 -923026 -1100061 -1160031 -1191078 -1134367 -916905 -606416 -321432 -89458 67414
30914 67414 -8849 -444591 -1005600 -1186235 -784701 -207314 25723 -48797 42754 456163
30904 456163 750503 491707 -154038 -651820 -733295 -556463 -353053 -190548 -74324 -57396
30894 -57396 -170321 -342549 -436595 -340410 -82022 111803 -7630 -391509 -702168 -767198
30884 -767198 -825905 -1094742 -1283395 -913688 -52243 675415 845042 633754 370298 93214
30874 93214 -224087 -375977 -208879 16115 -78547 -421718 -564956 -290848 154412 449994
30864 449994 529385 450809 220610 -84053 -208507 38901 496646 774904 678263 391376
30854 391376 233052 335098 609515 920943 1158023 1168838 811744 176846 -356540 -445984
30844 -445984 -142586 214912 430470 586975 737765 712713 393469 3756 -119726 8490
30834 8490 23595 -288790 -688583 -779926 -480088 -52269 255260 429012 534329 521718
30824 521718 333016 105995 60808 162273 111184 -211952 -488352 -349927 109940 476308
30814 476308 587094 653155 796397 822397 598107 352010 355479 509155 512608 315566 123445
30803 123445 11623 -184325 -543104 -829761 -715681 -164585 467888 735398 530459 204411
30793 204411 180808 458797 640916 465931 100975 -180415 -358824 -519887 -576747 -427027
30783 -427027 -240431 -274163 -469917 -535773 -394612 -245926 -183776 -80342 84687 100256
30773 100256 -120287 -319030 -229624 40615 169587 62455 -49801 72905 389636 617103
30763 617103 517475 158336 -124788 -82602 148955 193238 -126829 -585637 -795612 -575889
30753 -575889 -105205 210150 73708 -389684 -732363 -718273 -633993 -857526 -1251509 -1320745
30743 -1320745 -932462 -485306 -286459 -162351 110890 341297 203345 -220425 -503917
30734 -503917 -409104 -118491 22284 -167730 -577040 -872733 -771960 -350600 2071 8223
30724 8223 -249216 -554411 -809398 -925965 -729925 -223293 251757 394954 351063 436900
30714 436900 590469 445704 -77972 -611647 -815214 -726722 -548828 -346253 -92870 161145
30704 161145 313355 311257 160582 -82890 -293111 -338329 -203504 6002 165571 181824
30694 181824 29368 -148141 -84373 277166 592257 499562 133278 -39005 119588 249592
30684 249592 70823 -220066 -311287 -246680 -280388 -467402 -676785 -867612 -1048462 -1040297
30674 -1040297 -617838 66951 499990 391371 39097 -83885 39195 10468 -341531 -669343
30664 -669343 -613560 -372406 -453444 -915751 -1219799 -957324 -418851 -171226 -282907 -321220
30654 -321220 -37023 331315 496977 528073 640093 820934 874850 713343 423215 119967
30644 119967 -124085 -261807 -308463 -370346 -539879 -767703 -890005 -775653 -445483 -90338
30634 -90338 51740 -70885 -228442 -175462 -1146 -31967 -349083 -628628 -591596 -402720
30624 -402720 -398373 -554126 -517806 -177461 80481 -164662 -785153 -1188236 -1001557 -532661
30614 -532661 -428973 -928970 -1602429 -1868907 -1615988 -1196504 -969991 -1043078 -1351639 -1723866
30604 -1723866 -1864009 -1537173 -852444 -195713 144093 119137 -237880 -807093 -1210727 -1049032
30594 -1049032 -456937 -63798 -189204 -429923 -312095 19128 155902 153568 367877 723928
30584 723928 720005 190904 -419347 -664022 -575441 -400677 -217909 -22300 75042 -37526
30574 -37526 -299229 -550973 -658372 -515469 -123000 267693 302331 -83644 -597520 -966690
30564 -966690 -1151327 -1125285 -778137 -230738 51783 -230813 -769952 -1010490 -826466 -529551
30554 -529551 -305099 -18709 376537 596565 378265 -136266 -571542 -755760 -788687 -741269
30544 -741269 -529334 -153088 132235 62006 -296689 -632715 -803498 -955914 -1185244 -1297205
30534 -1297205 -1064226 -557616 -48099 286803 372859 134047 -337288 -633936 -419529 68737
30524 68737 261696 15967 -246784 -215058 -81735 -110604 -227141 -299451 -462443 -828923
30514 -828923 -1159958 -1179501 -1001592 -895750 -825602 -604730 -356868 -395326 -703180 -927979
30504 -927979 -890503 -756135 -705428 -773484 -1022930 -1520684 -2083648 -2370825 -2302211 -2089064
30494 -2089064 -1799660 -1253343 -472568 118597 182203 -97797 -302217 -312027 -329873 -501041
30484 -501041 -737209 -870524 -831226 -677004 -496117 -263651 140700 648923 855681 439071
30474 439071 -297957 -660023 -400407 31643 197617 202490 284618 298165 8251 -394210
30464 -394210 -531799 -419999 -364933 -399621 -273833 46071 319907 487394 737431 1061757
30454 1061757 1184584 1069922 1058119 1273984 1313427 856234 260529 111389 359883 379924
30444 379924 -129540 -718355 -794224 -365651 25198 -32431 -398555 -586653 -278501 357090
30434 357090 804984 667947 17651 -707818 -1121296 -1158680 -987707 -785103 -663946 -712664
30424 -712664 -958545 -1274096 -1408948 -1171471 -567957 222706 942096 1313956 1149509 537491
30414 537491 -100342 -308270 -30716 329190 348243 18013 -316058 -371278 -178682 44141
30404 44141 148464 155587 179558 292113 440984 495788 393886 217747 88280 17812 -52211
30393 -52211 -84899 55739 371959 583148 353327 -295615 -888701 -903293 -251878 695483
30383 695483 1516433 2025819 2170294 1880276 1225308 580624 358509 559109 799794 804434
30373 804434 629146 367989 -55427 -626312 -1022140 -928980 -458234 -20745 148055 165469
30363 165469 281550 628610 1089405 1286633 873981 24671 -567487 -441885 49237 229699
30353 229699 -10183 -227331 -205846 -194744 -335041 -391362 -245887 -194391 -461471 -776069
30343 -776069 -743427 -375889 35645 347852 575139 675156 617255 515171 441458 272211
30333 272211 -39482 -231718 -79142 193403 180521 -133980 -417283 -506972 -519275 -476426
30323 -476426 -227954 186270 449525 392378 240274 276520 451663 489827 262029 -78196
30313 -78196 -266343 -161601 136876 375257 387176 235367 69154 -78442 -247538 -392429
30303 -392429 -422523 -357977 -298586 -271649 -237640 -199315 -191646 -237397 -406065 -764263 -1133138
30292 -1133138 -1126866 -685234 -338482 -581077 -1161745 -1432152 -1270771 -1134874 -1230246 -1228531
30282 -1228531 -933602 -649256 -624946 -634103 -429447 -185059 -109973 1717 399996 844734
30272 844734 902870 599616 344430 324113 360411 289829 119881 -141033 -470025 -672747
30262 -672747 -549480 -215929 -4658 -70784 -314662 -609830 -844994 -837954 -528889 -209021
30252 -209021 -233386 -529593 -705109 -608693 -435192 -292150 -80312 127378 29555 -388369
30242 -388369 -662479 -456131 -87981 -146094 -732555 -1371194 -1582645 -1311019 -810965 -323862
30232 -323862 72140 385216 565889 502801 207822 -75059 -89382 131314 329826 361252
30222 361252 275531 96486 -220422 -563504 -664340 -443951 -158142 -88178 -271481 -618364
30212 -618364 -1057600 -1436650 -1523051 -1298243 -1057036 -1022235 -1036913 -837890 -464786 -175991
30202 -175991 -96121 -161057 -285367 -374363 -300615 -87348 17227 -120803 -253786 -97786
30192 -97786 190132 207244 -110146 -458233 -694138 -1006618 -1486057 -1866105 -1845160 -1438371
30182 -1438371 -900934 -488602 -342204 -389363 -321464 82039 568078 644932 269888 -43699
30172 -43699 57498 308055 293991 19944 -286375 -585182 -841688 -736120 -83839 615513
30162 615513 624452 -40604 -606777 -620738 -485458 -711665 -1150773 -1352765 -1302717 -1320192
30152 -1320192 -1430912 -1327529 -917096 -492475 -300834 -264163 -217103 -154937 -125454 -78473
30142 -78473 48678 230145 414382 553426 519358 173212 -380503 -775574 -763138 -491213
30132 -491213 -281597 -256222 -329928 -430745 -508076 -416063 -64730 310557 307048 -121029 -525107
30121 -525107 -504071 -202698 -68166 -245939 -488086 -620887 -786080 -1102224 -1350785 -1242839
30111 -1242839 -867642 -608098 -638548 -760842 -768461 -706830 -660492 -542370 -310491 -194591
30101 -194591 -411747 -755253 -785714 -431022 -99692 -130980 -392900 -539404 -455744 -318053
30091 -318053 -363401 -692181 -1155244 -1397717 -1208267 -843136 -726846 -797913 -558127 68596
30081 68596 413370 -26575 -767559 -961332 -557157 -230305 -301779 -406931 -261058 -86515
30071 -86515 -95108 -128079 -76541 -150348 -411063 -495943 -182578 168017 150709 -42900 8045
30060 8045 218720 163033 -177817 -372592 -228423 -38584 -74800 -247177 -391505 -535904
30050 -535904 -696013 -677712 -319885 200855 510203 453840 248792 184285 234675 85425
30040 85425 -387739 -810040 -720019 -226502 104990 63043 32973 241806 284934 -178013
30030 -178013 -715811 -715033 -360728 -328519 -668569 -762803 -390665 -59151 -106724 -203183 -29537
30019 -29537 191513 208713 208780 352460 363844 49999 -236951 -171083 -60206 -303234 -613138
30008 -613138 -458731 -32917 -45256 -627147 -1143825 -1148589 -897225 -783139 -822472 -893974
29998 -893974 -1000412 -1050509 -787610 -193647 355090 554750 503336 375615 97578 -399462
29988 -399462 -886970 -1109627 -1151475 -1235532 -1296934 -1053220 -454371 171748 440881 262779
29978 262779 -107854 -303418 -178304 62793 156589 157695 313902 578667 576965 180342
29968 180342 -214741 -210530 76377 305839 449780 651096 739280 376767 -310818 -699029
29958 -699029 -412439 198376 502499 290429 -149755 -491345 -677961 -806084 -888073 -841365
29948 -841365 -678567 -575689 -641623 -703859 -537630 -294177 -384471 -815219 -1000886 -529109
29938 -529109 197514 500684 368113 325535 498750 443041 -30511 -502109 -647642 -708490
29928 -708490 -899187 -877404 -318148 372693 525637 188294 42797 391706 763553 598779
29918 598779 -95791 -869183 -1256342 -1020843 -311096 331437 421778 75755 -169127 -106639
29908 -106639 -74302 -321124 -571856 -450034 -9081 428686 707306 838006 783073 531234
29898 531234 233009 -2861 -300515 -740526 -1047088 -879445 -366622 -32719 -178828 -586509
29888 -586509 -848978 -783955 -506505 -280223 -302854 -485448 -483297 -115527 320870 379882
29878 379882 47955 -268006 -302208 -180101 -93216 -50471 -41882 -136903 -265987 -176047 201899
29867 201899 562152 607439 433923 316427 280254 146311 -108351 -312803 -394545 -463616
29857 -463616 -579713 -634648 -528463 -324506 -162205 -94760 -53483 71401 312975 545721
29847 545721 552106 237270 -245978 -640344 -809014 -765146 -568159 -316205 -182067 -280643
29837 -280643 -475273 -460360 -107580 358528 591204 452919 55540 -438406 -913701 -1213373
29827 -1213373 -1134357 -664869 -163963 -99581 -529172 -989555 -1029297 -722818 -476255 -438527
29817 -438527 -388003 -188011 -21916 -48226 -104019 33115 284155 404705 345535 244354
29807 244354 159053 42248 -91852 -204758 -378046 -688036 -992830 -1101767 -1113815 -1284915
29797 -1284915 -1556474 -1559387 -1172801 -737688 -555258 -500964 -371580 -301417 -481772 -697984
29787 -697984 -593850 -304814 -339239 -760186 -959814 -495910 214403 406454 -34288 -489077
29777 -489077 -448017 -31367 378793 631548 733457 595513 174766 -276689 -413718 -209938
29767 -209938 74451 289226 487457 637907 567583 280041 34300 -45261 -168962 -493462
29757 -493462 -790381 -780543 -597731 -582760 -744878 -804464 -718350 -745372 -928003 -927323 -573833
29746 -573833 -239334 -361004 -819252 -1121756 -1089421 -1020843 -1186555 -1473170 -1618009 -1551773
29736 -1551773 -1361272 -1085893 -738706 -442229 -350983 -443934 -547887 -590832 -677985 -838071
29726 -838071 -840948 -443029 228303 715124 697371 298454 -123567 -364493 -469468 -549572
29716 -549572 -639120 -707566 -713829 -646675 -553006 -492991 -435548 -270926 14415 259765 310752
29705 310752 191577 -9374 -323835 -795516 -1236021 -1313763 -958052 -519578 -411788 -662220
29695 -662220 -921615 -896466 -676494 -583364 -743258 -924066 -850786 -566345 -322853 -180593
29685 -180593 51871 455421 832271 1004492 1048616 1087334 1068500 929605 768219 646473
29675 646473 448361 166850 87538 380068 738762 796384 678310 710059 772209 489669
29665 489669 -40008 -307209 -188913 -92239 -221141 -308621 -241269 -331911 -699072 -949416
29655 -949416 -822153 -626691 -653548 -648459 -318205 98618 260272 301595 448458 450418 22652
29644 22652 -465790 -436481 -31080 94335 -218116 -503581 -492882 -357917 -147352 289522
29634 289522 714098 569173 -123292 -593617 -366134 117988 272369 193313 255408 355469
29624 355469 122400 -408303 -854810 -1044811 -1054924 -844074 -313375 320274 627439 474501
29614 474501 130456 -127109 -233638 -195289 -48439 -1559 -311217 -902348 -1348508 -1365120
29604 -1365120 -1135307 -1001105 -1001449 -926044 -733185 -649972 -809961 -1020853 -1051083 -979486 -1003377
29593 -1003377 -983268 -549977 234488 710064 423015 -170351 -231010 350304 837865 675970
29583 675970 162905 -84903 37518 132481 -75107 -425063 -580467 -408387 -101449 15878
29573 15878 -169129 -426696 -484210 -374645 -298442 -228110 46088 490225 791198 802171
29563 802171 685455 546767 313398 82634 141796 433046 455790 9245 -404275 -311948
29553 -311948 -63 -16419 -282708 -302178 -46043 13204 -289405 -565839 -503885 -229959
29543 -229959 59978 366003 633709 653444 398715 131980 4372 -145076 -430448 -660970
29533 -660970 -635914 -444099 -273028 -134171 26938 123425 23705 -251352 -552310 -727392
29523 -727392 -678020 -441947 -260804 -371206 -673514 -817676 -675380 -486588 -462480 -518760
29513 -518760 -520508 -493691 -415459 -94648 481642 936553 948860 726510 715012 970256 1157366
29502 1157366 1083677 871272 611771 213302 -316564 -731675 -840135 -730856 -571811 -364576
29492 -364576 -65779 185952 172920 -108983 -429747 -605401 -654634 -632677 -455375 -30113
29482 -30113 492819 772174 630752 238056 -131000 -392112 -588696 -669848 -552334 -353331
29472 -353331 -307247 -415953 -424719 -233216 -86237 -194202 -375730 -307885 5874 264319
29462 264319 281211 121267 -121197 -395223 -534501 -336954 76625 256874 -15553 -378514
29452 -378514 -364406 -70635 3056 -263152 -429136 -230221 -46296 -281356 -617226 -434925
29442 -434925 156067 357182 -141744 -663680 -557854 -148027 -128274 -429053 -390490 123121
29432 123121 537450 527369 446774 600750 732046 566623 325841 271484 186308 -202714
29422 -202714 -626870 -638779 -349996 -267354 -516105 -745414 -754922 -700231 -646050 -419116 -38841
29411 -38841 150882 -6178 -190264 -79792 164121 170823 -64978 -176814 62807 457578
29401 457578 639823 478161 187524 72214 192164 331001 320153 284149 419402 600926
29391 600926 442459 -194996 -937609 -1253652 -979248 -413974 28076 184953 202368 284883
29381 284883 433927 490300 412475 339499 298307 68619 -453685 -949889 -1037589 -809528
29371 -809528 -661465 -666734 -550652 -291107 -253571 -571910 -848020 -736281 -455954 -402445
29361 -402445 -552260 -609186 -505818 -388762 -279655 -121278 -33791 -158867 -335256 -284594
29351 -284594 -58817 47746 -19080 -54312 -38458 -188128 -498337 -639763 -463809 -262426
29341 -262426 -333873 -590332 -813642 -1025654 -1324722 -1547683 -1408287 -914134 -416533 -254196
29331 -254196 -472718 -839717 -1028128 -867316 -526492 -364187 -496282 -629876 -449163 -39381
29321 -39381 234176 169818 -114507 -386123 -488771 -388250 -182309 -22840 74004 234942
29311 234942 432329 364765 -133692 -712912 -842151 -467040 -38565 78617 -73623 -291713
29301 -291713 -428659 -337420 37730 412186 348491 -167033 -656026 -793510 -760549 -771169
29291 -771169 -669113 -314715 9911 11551 -92697 57478 306527 223355 -152458 -390863
29281 -390863 -444131 -710282 -1235998 -1473943 -1082361 -461319 -183855 -295265 -481209 -564462
29271 -564462 -510298 -279784 -38626 -201530 -852538 -1365925 -1064372 -120434 621098 637599
29261 637599 156039 -348070 -669430 -854038 -981810 -1043614 -879238 -328550 371293 574031
29251 574031 -21395 -794385 -859187 -192506 425640 547148 502577 622794 690325 467463
29241 467463 195289 150977 159077 -9712 -135895 56647 306693 154148 -315631 -601450
29231 -601450 -562947 -550829 -778657 -1054685 -1202567 -1308546 -1419320 -1358748 -1015478 -554309
29221 -554309 -212802 -93176 -208087 -486303 -685854 -584377 -331886 -319756 -599135 -752536
29211 -752536 -508880 -168960 -173720 -503810 -785544 -799034 -604099 -333974 -168399 -371354
29201 -371354 -1002739 -1647444 -1777454 -1397911 -1024132 -990296 -1116083 -1144985 -1148061 -1274966
29191 -1274966 -1401374 -1330681 -1157480 -1103673 -1108936 -933093 -620252 -483471 -580486 -594257
29181 -594257 -391599 -323002 -678502 -1150069 -1226085 -924070 -687547 -658312 -553066 -283739
29171 -283739 -167057 -339794 -456164 -260699 -31054 -68154 -128182 143895 506087 435991
29161 435991 4865 -194379 21445 202562 88454 26113 304614 631973 655417 542844
29151 542844 594241 641753 353207 -116854 -321990 -242241 -288387 -620403 -936956 -977995
29141 -977995 -815773 -587492 -331815 -163653 -218614 -322863 -121001 320558 456708 39208
29131 39208 -454875 -500093 -280523 -339032 -700969 -845504 -493431 29489 281237 196327
29121 196327 -25823 -239728 -403589 -497128 -532320 -544650 -514405 -409703 -320832 -381682 -520212
29110 -520212 -487177 -222073 440 -79850 -374874 -614481 -701133 -717144 -697568 -620881 -570343
29099 -570343 -668417 -835361 -827282 -584587 -367866 -442483 -758930 -1063504 -1215926 -1242420
29089 -1242420 -1141475 -843839 -411950 -102576 -85896 -185392 -74088 270721 499305 370996
29079 370996 131766 202969 573430 774561 513554 72430 -91226 45691 94624 -200615
29069 -200615 -678934 -1008625 -1015912 -747423 -387627 -164621 -190178 -335231 -371524 -252722
29059 -252722 -127957 -82743 -47003 17294 48221 62708 170817 307887 205901 -193588
29049 -193588 -543134 -552669 -437516 -588465 -948634 -1096373 -891496 -644542 -599519 -617282
29039 -617282 -498533 -305579 -184826 -118335 -44219 -27357 -122754 -231338 -263685 -292236 -371894
29028 -371894 -373692 -195004 15949 72655 60716 180619 368586 355121 78874 -221986
29018 -221986 -348174 -324607 -211457 12563 269002 296998 -71916 -656526 -1079886 -1137756
29008 -1137756 -943889 -765155 -772891 -912973 -976428 -818092 -497172 -165690 117136 348804
28998 348804 423317 197203 -263490 -682058 -876786 -907136 -849699 -619523 -156091 362231
28988 362231 682977 796507 913980 1134515 1275895 1086554 566507 32300 -156736 44381
28978 44381 321621 379556 299568 372492 619666 728934 526487 246384 175972 271358 340003
28967 340003 387731 496441 524595 281519 -81505 -222114 -137146 -169649 -432271 -600947
28957 -600947 -424298 -98372 66278 54679 -9329 -152333 -387129 -491010 -309032 -124969
28947 -124969 -327430 -769664 -892353 -537467 -220815 -410442 -878574 -1054231 -792466 -467620
28937 -467620 -407906 -558866 -713696 -798206 -828974 -782840 -644632 -484554 -383365 -345773
28927 -345773 -351287 -394313 -391912 -183513 209782 424862 112221 -540660 -920148 -730350
28917 -730350 -352701 -251828 -292862 -37178 424324 459629 -162931 -791421 -668185 115009
28907 115009 820520 1033329 992282 1005321 991958 757168 389901 149064 119873 183732
28897 183732 234889 265392 292864 340539 465578 701974 967667 1082613 899051 440226
28887 440226 -43797 -200514 122397 678421 1032714 991251 705775 353912 -78081 -586146
28877 -586146 -915654 -764020 -175192 435392 660916 422669 -49596 -438168 -545858 -397446
28867 -397446 -179985 -52506 -8930 69164 266834 557395 811783 869811 673201 344966
28857 344966 66224 -102708 -159306 17350 521525 1081944 1214535 875403 617400 822922
28847 822922 1116723 951904 495151 355227 558292 466674 -183547 -813553 -863807 -582283
28837 -582283 -528422 -705444 -702982 -449190 -274461 -311328 -323504 -161691 18095 74479 85229
28826 85229 125667 117222 12543 -88630 -105103 -60733 58735 312020 584528 613374 369072
28815 369072 181396 298733 520642 491376 193985 -111711 -325249 -566498 -830548 -910831
28805 -910831 -752093 -603356 -665374 -804498 -812024 -765773 -870115 -1042262 -977632 -644106
28795 -644106 -402265 -513347 -790953 -927564 -933618 -984470 -1009750 -790959 -401994 -170621
28785 -170621 -163352 -86037 181777 333978 151230 -70306 57307 398643 488306 198206
28775 198206 -179120 -438729 -651064 -838516 -857171 -685365 -495861 -338588 -59800 350114
28765 350114 629707 599835 361748 28775 -406932 -787899 -763836 -319153 32903 -76746
28755 -76746 -339104 -308118 -142510 -276573 -616914 -730653 -690340 -933058 -1202859 -514590
$$ [...]
##END NTUPLES=NMR SPECTRUM
##END=
