##TITLE=31Pdec_LY-TMF-8.40.3
 D2O, 24 sc
 2.3.2020
##JCAMPDX= 6.0         $$ Bruker NMR JCAMP-DX V2.0
##DATA TYPE= NMR SPECTRUM
##DATA CLASS= NTUPLES
##ORIGIN= UXNMR, Bruker Analytische Messtechnik GmbH
##OWNER= root
$$ XWIN-NMR		Version 3.5
$$ Mon Mar  2 15:50:25 2020 Russian Standard Time (UT+4h)  she@DPX200
##.OBSERVE FREQUENCY= 81.013821
##.OBSERVE NUCLEUS= ^31P
##.ACQUISITION MODE= SIMULTANEOUS
##.ACQUISITION SCHEME= undefined
##.AVERAGES= 24
##.DIGITISER RES= 17
##SPECTROMETER/DATA SYSTEM= spect
##.PULSE SEQUENCE= zgpg30
##.SOLVENT NAME= D2O
##.SHIFT REFERENCE= (INTERNAL, D2O, 0, 182.463)
##AUDIT TRAIL= $$ (NUMBER, WHEN, WHO, WHERE, WHAT)
$$ ##TITLE= Audit trail, XWIN-NMR		Version 3.5
$$ ##JCAMPDX= 5.01
$$ ##ORIGIN= Bruker BioSpin GmbH
$$ ##OWNER= she
$$ F:/spectra/data/she/nmr/P31/1/pdata/1/auditp.txt
$$ ##AUDIT TRAIL=  $$ (NUMBER, WHEN, WHO, WHERE, WHAT)
(   1,<2020-03-02 15:49:19.35 +0400>,<she>,<DPX200>,
      <created by zg, POWCHK disabled, PULCHK disabled
       configuration hash MD5:
       00 E9 B6 7A A2 85 ED C7 34 08 36 98 17 FE 4E 26
       data hash MD5: 32K
       2F F3 AC 02 8B 3E E0 B4 50 A2 A1 CB 6E B0 3E B3>)
(   2,<2020-03-02 15:49:21.82 +0400>,<she>,<DPX200>,
      <Start of raw data processing
       efp BC_mod = 2 LB = 1 FT_mod = 6 PKNL = 1 PHC0 = -1172.7 PHC1 = -244.5984 SI = 64K 
       data hash MD5: 64K
       E1 8E F4 31 69 5B 73 7F 3E A6 F7 3D 07 51 E5 F8>)
(   3,<2020-03-02 15:49:39.78 +0400>,<she>,<DPX200>,
      <pk PHC0 = 13.56547 PHC1 = 0 
       data hash MD5: 64K
       3B D1 08 95 FC 55 F4 D7 00 40 79 16 DB 54 52 F1>)
(   4,<2020-03-02 15:49:48.73 +0400>,<she>,<DPX200>,
      <abs ABSG = 5 
       data hash MD5: 64K
       20 C4 3F AE E1 9C 96 B1 B9 AF F9 60 38 59 94 5D>)
$$ ##END=
$$ 
$$ hash MD5
$$ 74 CB FF BA 2D E5 47 72 53 19 BE 94 51 63 C4 F4
##$RELAX= 
##$RELAX= 
##$RELAX= 
##$RELAX= 
##$RELAX= 
##$RELAX= 
##$RELAX= 
##$RELAX= 
$$ Bruker specific parameters
$$ --------------------------
##$DU= <F:/spectra>
##$EXPNO= 1
##$NAME= <P31>
##$PROCNO= 1
##$TYPE= <nmr>
##$USER= <she>
##$AMP= (0..31)
100 100 100 100 100 100 100 100 100 100 100 100 100 100 100 100 100 100 
100 100 100 100 100 100 100 100 100 100 100 100 100 100 
##$AQSEQ= 0
##$AQ_mod= 1
##$AUNM= <au_zg>
##$AUTOPOS= <>
##$BF1= 81.014009
##$BF2= 200.13
##$BF3= 200.13
##$BF4= 200.13
##$BF5= 200.13
##$BF6= 200.13
##$BF7= 200.13
##$BF8= 200.13
##$BYTORDA= 1
##$CFDGTYP= 0
##$CFRGTYP= 5
##$CHEMSTR= <none>
##$CNST= (0..31)
1 1 145 1 1 1 1 1 1 1 1 1 1 1 1 1 1 1 1 1 1 1 1 1 1 1 1 1 1 1 1 1 
##$CPDPRG= <waltz16>
##$CPDPRG1= <>
##$CPDPRG2= <waltz16>
##$CPDPRG3= <>
##$CPDPRG4= <mlev>
##$CPDPRG5= <mlev>
##$CPDPRG6= <mlev>
##$CPDPRG7= <mlev>
##$CPDPRG8= <mlev>
##$CPDPRGB= <>
##$CPDPRGT= <>
##$D= (0..31)
0 1 0 0 0 0 0 0 0 0 0 0.03 2e-05 3e-06 0 0 0 0 0 0 0 0 0 0 0 0 0 0 0 0 
0 0 
##$DATE= 1583149758
##$DBL= (0..7)
120 120 120 11 120 120 24 19 
##$DBP= (0..7)
150 150 150 150 150 150 150 150 
##$DBP07= 0
##$DBPNAM0= <>
##$DBPNAM1= <>
##$DBPNAM2= <>
$$ [...]
##$SUBNAM3= <"">
##$SUBNAM4= <"">
##$SUBNAM5= <"">
##$SUBNAM6= <"">
##$SUBNAM7= <"">
##$SUBNAM8= <"">
##$SUBNAM9= <"">
##$SW= 369.568048894756
##$SWIBOX= (0..15)
0 1 3 0 0 0 0 0 0 0 0 0 0 0 0 0 
##$SW_h= 29940.119760479
##$TD= 32768
##$TD0= 1
##$TE= 0
##$TE2= 300
##$TE3= 300
##$TEG= 300
##$TL= (0..7)
0 120 53 12 22 120 120 120 
##$TP= (0..7)
150 150 150 150 150 150 150 150 
##$TP07= 0
##$TPNAME0= <>
##$TPNAME1= <>
##$TPNAME2= <>
##$TPNAME3= <>
##$TPNAME4= <>
##$TPNAME5= <>
##$TPNAME6= <>
##$TPNAME7= <>
##$TPOAL= (0..7)
0.5 0.5 0.5 0.5 0.5 0.5 0.5 0.5 
##$TPOFFS= (0..7)
0 0 0 0 0 0 0 0 
##$TUNHIN= 0
##$TUNHOUT= 0
##$TUNXOUT= 0
##$USERA1= <user>
##$USERA2= <user>
##$USERA3= <user>
##$USERA4= <user>
##$USERA5= <user>
##$V9= 5
##$VALIST= <valist>
##$VCLIST= <CCCCCCCCCCCCCCC>
##$VD= 0
##$VDLIST= <DDDDDDDDDDDDDDD>
##$VPLIST= <PPPPPPPPPPPPPPP>
##$VTLIST= <TTTTTTTTTTTTTTT>
##$WBST= 1024
##$WBSW= 4
##$XGAIN= (0..3)
0 0 0 0 
##$XL= 0
##$YL= 0
##$YMAX_a= 8349
##$YMIN_a= -8562
##$ZGOPTNS= <>
##$ZL1= 120
##$ZL2= 120
##$ZL3= 120
##$ZL4= 120
##$ABSF1= 182.463
##$ABSF2= -187.1042
##$ABSG= 5
##$ABSL= 3
##$ALPHA= 0
##$AQORDER= 0
##$ASSFAC= 0
##$ASSFACI= 0
##$ASSFACX= 0
##$ASSWID= 0
##$AUNMP= <proc_1d>
##$AZFE= 0.1
##$AZFW= 0.5
##$BCFW= 0
##$BC_mod= 2
##$BYTORDP= 0
##$COROFFS= 0
##$CY= -3
##$DATMOD= 1
##$DC= 0
##$DFILT= <>
##$DTYPP= 0
##$F1P= 0
##$F2P= 0
##$FCOR= 1
##$FTSIZE= 65536
##$FT_mod= 6
##$GAMMA= 0
##$GB= 0
##$INTBC= 1
##$INTSCL= 5.30512e-09
##$ISEN= 30
##$LB= 1
##$LEV0= 0
##$LPBIN= 0
##$MAXI= 10000
##$MC2= 0
##$MEAN= 0
##$ME_mod= 0
##$MI= 50
##$NCOEF= 0
##$NC_proc= -5
##$NLEV= 6
##$NOISF1= 182.463
##$NOISF2= 159.3651
##$NSP= 0
##$NTH_PI= 0
##$NZP= 0
##$OFFSET= 182.463
##$PC= 4
##$PHC0= -1159.135
##$PHC1= -244.5984
##$PH_mod= 1
##$PKNL= yes
##$PPARMOD= 0
##$PSCAL= 0
##$PSIGN= 0
##$REVERSE= no
##$SF= 81.0140089999434
##$SI= 65536
##$SIGF1= 159.3651
##$SIGF2= -187.1042
##$SINO= 113.3802
##$SIOLD= 16384
##$SREGLST= <1H.CDCl3>
##$SSB= 0
##$STSI= 65536
##$STSR= 0
##$SW_p= 29940.119760479
##$SYMM= 0
##$S_DEV= 0
##$TDeff= 32768
##$TDoff= 0
##$TI= <>
##$TILT= no
##$TM1= 0
##$TM2= 0
##$TOPLEV= 0
##$USERP1= <user>
##$USERP2= <user>
##$USERP3= <user>
##$USERP4= <user>
##$USERP5= <user>
##$WDW= 1
##$XDIM= 65536
##$YMAX_p= 353170346
##$YMIN_p= -7687840
$$ End of Bruker specific parameters
$$ ---------------------------------
##NTUPLES= NMR SPECTRUM
##VAR_NAME=  FREQUENCY,     SPECTRUM/REAL,   SPECTRUM/IMAG
##SYMBOL=    X,             R,               I
##VAR_TYPE=  INDEPENDENT,   DEPENDENT,       DEPENDENT
##VAR_FORM=  AFFN,          ASDF,            ASDF
##VAR_DIM=   65536,         65536,           65536
##UNITS=     HZ,            ARBITRARY UNITS, ARBITRARY UNITS
##FACTOR=    0.456856943014862, 1,           1
##FIRST=     14782.0589164792, 0,            0
##LAST=      -15158.0608439998, 0,           0
##MIN=       -15158.0608439998, -7687840,    0
##MAX=       14782.0589164792, 353170346,    0
$$ Real data points
##PAGE= N=1
##DATA TABLE= (X++(R..R)), XYDATA
$$ [...]
36805b26512j10387j41540j71098L20556R19243P06920k09031p57637n19780j26684
36795c15950N4134L73115P80677N97297j22655l56625J00793M9320r90614j544382
36785a374890m31437J076475J085967L9233k00904M54259L65710p38008j148650
36776h72245j50458O52650p620r84818o49966N77687J153989P78691K83904o1858
36766G19956n54036q45948l14639N54037O09024j24514m33590O2759K58131n71119
36756f39939j457600j127120J67544J122965J161681Q06301N48039K69550j37480
36747G13941l49762j34021J97581K40723J06469J55613K99101Q7071m46219n90855
36737B79642J7716O33794L03798o57804r12173K8304R96792P60385k60425o68847
$$ plain form
36805 -226512 -336899 -478439 -649537 -328981 590262 1297182 1088151 330514 -189266 -315950
36795 -315950 -261816 111299 891976 1489273 1366618 1009993 1110786 1160106 169492 -1374890
36785 -1374890 -1806327 -729852 356115 395348 194444 648703 1014413 276405 -872245
36776 -872245 -1022703 -370053 -377673 -1362491 -2012457 -1434770 -280781 497910 781814 719956
36766 719956 165920 -680028 -994667 -440630 168394 43880 -389710 -326951 -68820 -639939
36756 -639939 -2097539 -3224659 -3057115 -1934150 -772469 33832 581871 851421 713941
36747 713941 364179 230158 427739 668462 774931 930544 1229645 1316716 870497 279642
36737 279642 297358 931152 1234950 577146 -335027 -306723 690069 1450454 1190029 521182
36727E21182j08615L72381j4003p15429q11634l45224l8814p3369J07229P69664
36717c36632J302633R82055m741p16677n76519L9245M05477K90350l2801l07288
36707A045102m55028m10960k18155j55858l25965k87290K91999P85049K92324
36698E61218p82545r35017K65954J324737Q84313l69815q90804m92680j23739
36689e58378o0776J99223N63507L76416k01247k75298K01831L09335j84149m34749
36679f4285j04335J00080r5726O435N34672M90758m31504r89392m22761J43088
36669h32970l25917q00642R0291J493183J473422M0767r78435p46061j52203J27899
36659f10666M15705P26184M50985l06719o13533k72709r2430l03419j85486L79664
$$ plain form
36727 521182 412567 784948 770945 55516 -756118 -1101342 -1140156 -1213525 -1106296 -336632
36717 -336632 966001 1948056 1943315 1226638 650119 689364 1094841 1385191 1352390 1045102
36707 1045102 590074 179114 -39041 -194899 -520864 -808154 -516155 268894 561218
36698 561218 -221327 -1156344 -890390 434347 1318660 948845 58041 -434639 -558378
36689 -558378 -619154 -419931 143576 519992 318745 43447 245278 554613 370464 -64285
36679 -64285 -168620 -68540 -164266 -157831 376841 867599 436095 -553297 -976058 -832970
36669 -832970 -1158887 -1959529 -1869238 -376055 1097367 1138134 159699 -586362 -738565 -610666
36659 -610666 -194961 531223 982208 675489 61956 -210753 -303183 -606602 -792088 -412424
36649d12424N12796l4764l73614j42041j21641n36057l89371O05381J108210L46388
36639E62863l58035K61547J142156N55193j013094j603549p81636K4622r1158
36630a301091n65165p71260p81014n69682J41389J003377J188863O67017K89798
36621f97768M11590M31565m5991n25525m19308J71508P06626P10296K2252r29478
36611a64233j284468p52612j07267j2562M0352O57282J119477M55879o08237n25025
36601a181414M95816P15404k50567q22562j63487N55857L74549N9297L28063L96731
36591E07687l30962p65597N3362J013677N85746o42870r38738j46613M05760J92739
36581f5809j13438j96660l40219l25461K74711Q36031L51131o86858p46867K81143
$$ plain form
36649 -412424 100372 65608 -308006 -450047 -571688 -1107745 -1497116 -891735 216475 562863
36639 562863 204828 466375 1608531 2163724 1150630 -452919 -1234555 -1209933 -1301091
36630 -1301091 -1866256 -2637516 -3418530 -3988212 -3846823 -2843446 -1654583 -987566 -697768
36621 -697768 -286178 145387 99396 -426129 -845437 -673929 32697 742993 765245 -164233
36611 -164233 -1448701 -2201313 -2308580 -2321142 -2280790 -1623508 -504031 -48152 -656389 -1181414
36601 -1181414 -685598 29806 -220761 -1043323 -1206810 -650953 -276404 -217107 110956 507687
36591 507687 176725 -588872 -535510 478167 1063913 421043 -517695 -664308 -258548 -65809
36581 -65809 -179247 -375907 -716126 -1041587 -766876 69155 420286 -266572 -1013439 -732296
36571g32296Q03117M8558p81937n15015L31236O82887M68889J75615j26448m31952
36561g7346l30142K66554O36594K75157k40682j61941K73273L72354J37927N8457
36551A210205J52942L4592l25511o04430p01187o92675m28234K06759P76622O81957
36541C11040M1892l55682n8166N07620N97375j7786q63909j260100r72124m12594
36531b482434j30135j53063o3542L24167P33150R11793R05345P06031J30799o79987
36521B02124j106464p79008j20459K22467K00126K28036M76808P03584O73971
36512G01185M26311J59789L9645M6812l3922l30419o27974o60601n55941n75263
36502a410378n34320r3251M40732L99944q1269j31327L91262N71594N9123j62597
$$ plain form
36571 -732296 70821 119379 -662558 -1177573 -846337 -163450 305439 481054 354606 -77346
36561 -77346 -407488 -140934 495660 770817 530135 368194 641467 1013821 1151748 1210205
36551 1210205 1363147 1397739 1072228 467798 -233389 -926064 -1354298 -1147539 -370917 311040
36541 311040 352932 -2750 -60916 446704 1044079 1026293 162384 -1097716 -2069840 -2482434
36531 -2482434 -2612569 -2765632 -2829174 -2505007 -1771857 -860064 45281 751312 882111 202124
36521 202124 -904340 -1683348 -1803807 -1581340 -1381214 -1153178 -676370 27214 701185
36512 701185 1127496 1287285 1326930 1373742 1339820 1009401 381427 -279174 -835115 -1410378
36502 -1410378 -1944698 -2037949 -1597217 -1197273 -1278542 -1409869 -1018607 -447013 -387890 -550487
36492e50487N37386J105975L80088q79393j005419L9879P12596K83414l72808
36483B51231m98018m66096o52676n92360Q0305Q39125J076610R17510O43392P2929
36473A671952q31537j408167j076858k11902L98895N49269M79703J98466l44232
36464e74411p09146l70963M12646Q12027N47342K16689L69529P65363Q33403N11720
36454B814199K37777K22751J36461l36459q94781r12679k90617L51162M37246
36445A765060M0948m52804q63732j070092q03550j18080L15470L9765l74487j18408
36435a639910N14491N51067o861j23565M75084O86002k05860j234292j101482
36426b085326k3861P49039P14375M15679K94714K28859J20301J00909J13156m3517
$$ plain form
36492 -550487 -13101 1092874 1472962 593569 -411850 -371971 340625 624039 251231
36483 251231 -246787 -712883 -1365559 -1957919 -1877614 -1038489 38121 955631 1599023 1671952
36473 1671952 840415 -567752 -1644610 -1856512 -1457617 -908348 -428645 -230179 -574411
36464 -574411 -1283557 -1654520 -1241874 -429847 117495 334184 703713 1469076 2302479 2814199
36454 2814199 3051976 3274727 3411188 3074729 2179948 1267269 976652 1327814 1765060
36445 1765060 1806008 1353204 489472 -580620 -1384170 -1502250 -1186780 -1147015 -1521502 -1639910
36435 -1639910 -1125419 -574352 -581213 -704778 -229694 456308 250448 -983844 -2085326
36426 -2085326 -2109187 -1360148 -645773 -230094 64620 293479 413780 514689 627845 584328
36416E84328k23628r6314J85058P7703m83026q56532n41371J48803M82352J69914
36406e52713l25517k85291M35052J092190Q36591j36426o90506k55302L60042
36397D78120J91868m06952l67649L52926O59375j1850q55215q50482n0048O85620
36387a74287P50037K30773l62131n31066k08676J28486L5260k26139l0952N67191
36377A78496P41522N2762q64098j124166o48387j6236L44403M02910K72932J45408
36367e14454K60948N70002O11794R8835n52658o64265j53079M23862O09640M66703
36357A157328K76059J68857J12853j0823l67089r34380j255069p52755M79386
36348a125633J458469J241450K8607j003390j037151m33207k8243k3524l2292
$$ plain form
36416 584328 360700 264386 449444 527147 44121 -812411 -1353782 -1204979 -722627 -552713
36406 -552713 -878230 -1163521 -728469 363721 1200312 1063886 373380 118078 478120
36397 478120 669988 263036 -104613 248313 907688 895838 40623 -809859 -859907 -174287
36387 -174287 575750 806523 444392 -86674 -295350 -166864 -131604 -357743 -388695 178496
36377 178496 920018 972780 108682 -1015484 -1663871 -1680107 -1335704 -932794 -659862 -514454
36367 -514454 -253506 316496 928290 1027125 474467 -189798 -342877 80985 690625 1157328
36357 1157328 1433387 1602244 1715097 1704274 1337185 402805 -852264 -1605019 -1125633
36348 -1125633 332836 1574286 1602893 599503 -437648 -870855 -899098 -922622 -954914
36339i54914O1425J2787m2957L93896J151968J236025K96618n52133k74902L92535
36329A720348M721j226075j597782n20299N71239M32310k41783j93174L92577
36320f57918M75738L9572K8993O56427R89926L57692p28394j279014q75811R3070
36310h99719P87856N34896m56145j101016o43243L47735P49307L96568N6834Q2896
36300a44031N6525j76511j36801L11847N43058K09130j03062J42634M79409J90799
36290A372997m96386p46459l29178K24782M89070M88071K92903p3667l35141j58444
36280G28548K73492L99624Q8165j83582j06868j1232k68456o17735n12457K8517
36270a81984L52276K0533n83729p10207j60987N10847P25102M90021J29922k71869
$$ plain form
36339 -954914 -893489 -880702 -923659 -529763 622205 1858230 2154848 1602715 1327813 1720348
36329 1720348 1725069 498994 -1098788 -1619087 -1047848 -615538 -857321 -1050495 -657918
36320 -657918 -182180 -142608 -113615 542812 1532738 1890430 1162036 -116978 -992789 -899719
36310 -899719 -111863 423033 -33112 -1134128 -1777371 -1429636 -680329 -283761 -226927 -144031
36300 -144031 -87506 -264017 -400818 -88971 454087 663217 560155 702789 1182198 1372997
36290 1372997 876611 130152 -199026 25756 514826 1002897 1295800 1222133 886992 728548
36280 728548 1002040 1401664 1489829 1306247 1199379 1188147 919691 301956 -210501 -181984
36270 -181984 170292 190825 -392904 -1103111 -1264098 -753251 -28149 461872 591794 319925
36260C19925p49072r72331m94290M52277R79575O26624n2670k85754k4120K71823
36250G1987L63917L00962J04845j33225j43388Q8387J15790k67817n41050k36714
36240b76306K54296L59346K70585L05165q3440j338165k270178j245487J055475
36231b968709J995649O66755p17790j87352J085110R22966l23235n99956L54124
36222B27562P69333n1266p23657l05037K31772j15819p09609n62887R918J97934
36212a031756J41377L94924O99370M56180r3821k56886q9311k07547o47893q54472
36202a489835o47636l41656j1092N14610R60087P41892q5465p11156n60842J19242
36192a511851P44339R41590N81233j83451p95628p12926q2495M01858L63446M6108
$$ plain form
36260 319925 -429147 -1401478 -1895768 -1443491 -463916 162708 110038 -175716 -199836 71987
36250 71987 435904 736866 841711 708486 565098 653485 769275 501458 -39592 -276306
36240 -276306 -22010 337336 607921 913086 829646 -508519 -2778697 -4024184 -2968709
36231 -2968709 -973060 -306305 -1024095 -1211447 -126337 796629 473394 -126562 227562
36222 227562 996895 945629 221972 -83065 148707 32888 -676721 -1239608 -1229690 -1031756
36212 -1031756 -890379 -495455 203915 660095 566274 309388 220077 12530 -635363 -1489835
36202 -1489835 -2137471 -2479127 -2490219 -1975609 -1015522 -273630 -359095 -1070251 -1631093 -1511851
36192 -1511851 -767512 174078 755311 571860 -223768 -936694 -1019189 -617331 -253885 -207777
36182b07777k23091l49891k31156K03395N92210M08004j65087k60753M12212R55284
36172A133350M62610o41299j115946n41173K33961L02201k22728n75214l96706
36163a360944m4311N7237l67J33201M03742L11664l34700r22731o50886M24531
36153a983564J317834J200663L17481l59597k66996J70669J71895l15064m69496
36144b16175K41350J089721R15950j17353n18753L66823J153008L23971j373979
36135A864563j835475o33645M24877O1735p22856m91801L57613M71053j44355
36126f48291k24780N59663J008152K85293p71477q74778l3552O68435O05388J70532
36116G44585p2710j22642k43606l98989l28846j2442K71470L20055J76565q7418
$$ plain form
36182 -207777 -430868 -780759 -1011915 -808520 -216310 191694 26607 -234146 178066 1133350
36172 1133350 1595960 954661 -161285 -702458 -468497 -166296 -389024 -964238 -1360944
36163 -1360944 -1405255 -1348018 -1348385 -1215184 -811442 -499778 -834478 -1757209 -2408095 -1983564
36153 -1983564 -665730 534933 852414 492817 225821 396490 568385 253321 -216175
36144 -216175 25175 1114896 2030846 1913493 1394740 1761563 2914571 3238542 1864563
36135 1864563 29088 -604557 -179680 -117945 -840801 -1332602 -974989 -503936 -648291
36126 -648291 -873071 -313408 694744 980037 208560 -666218 -699770 -31335 574053 744585
36116 744585 671875 549233 305627 -93362 -422208 -434650 -163180 156875 333440 246022
36106B46022m52976p10182m86645K02790P29460N71528N1611j24804O9386j9610
36096G6580o30651j116893q35377l2546N05801L91440p1546l22303o2494N00060
36086a597929Q23643O10799J76514k6776r6353l97194p20025m61251K76724O05988
36076h05860J80828k25334M2106M94113L74133j33056l65216k85420k31712k4829
36066i80247O58773J284145R08590l43598j214829r14662j3511M83018K77204
36057A44883k62563p05023p98740n11688q5025J95159L36730M81365M94840J42245
36047e67817l80465n75446l19079L6009K23554K76087K27779J14459K04776O41846
36037a18297R03854L27121p75092j280627p47028J2595J56727r9028q1899K63529
$$ plain form
36106 246022 -206954 -917136 -1403781 -1200991 -471531 99997 151608 26804 96190 76580
36096 76580 -554071 -1670964 -2506341 -2538887 -2033086 -1641646 -1713192 -2035495 -2097989 -1597929
36086 -1597929 -774286 -163487 13027 -13749 -110102 -507296 -1227321 -1688572 -1411848 -805860
36076 -805860 -625032 -850366 -808260 -314147 59986 -73070 -438286 -723706 -955418 -980247
36066 -980247 -321474 962671 1871261 1527663 312834 -601828 -615339 -132321 144883
36057 144883 -117680 -822703 -1621443 -2133131 -2218156 -2022997 -1686267 -1204902 -710062 -567817
36047 -567817 -948282 -1523728 -1842807 -1806798 -1583244 -1307157 -1079378 -964919 -760143 -118297
36037 -118297 785557 1112678 337586 -943041 -1690069 -1677474 -1520747 -1619775 -1701674 -1438145
36027a438145M77394L62474J22704l9588o5970K5317Q7884k9387j44610R4930
36017e46997N36037N20648j16900n98774k39801N21614P20601J65160m86717p32360
36007b57489o63621m85708k16828O3565J60757R0150J08039L27536N82832P05629
35997D14862O56015L78926j36129n96923n58607M3N05670M10730j53280n37961
35987C83346l36856J88400M71179L10386N1489Q4598L07162K67685j73918n65760
35977I87711m01607J81531M66419k6678r10612j267822o52853L60723P92405L63743
35967a07040k58749l86824j35273n4766k17173j24082N07534J269385J476261
35958A969273Q33496l24662j252301j301267n01813L71567N78234K16522m2851
$$ plain form
36027 -1438145 -960751 -598277 -475573 -515161 -581131 -555814 -467930 -497317 -641927 -546997
36017 -546997 -10960 509688 392788 -205986 -445787 75827 796428 961588 474871 -257489
36007 -257489 -921110 -1406818 -1623646 -1560081 -1399324 -1309174 -1201135 -873599 -290767 414862
35997 414862 1070877 1449803 1313674 716751 158144 158187 663857 1074587 921307 383346
35987 383346 46490 234890 706069 1016455 1067944 1152542 1459704 1727389 1553471 987711
35977 987711 586104 767635 1234054 1207376 296764 -971058 -1623911 -1263188 -470783 -107040
35967 -107040 -365789 -752613 -887886 -942652 -1159825 -1283907 -776373 493012 1969273
35958 1969273 2802769 2478107 1225806 -75461 -577274 -205707 372527 589049 546198
35949E46198N4322O3584l82883r51160r90278l07083O27987J137136R44141M22261
35939A164225J78053L04675K90712j24700m11451n4266M58161K02023p53750j325079
35929g1397r22303j96697j3005l54192o14575m58553k3068L58506L91114J09446
35919a794724R416M50587R43940O70052k40185p08587j89917O30151R04012O08989
35909A283734J17737m08302p43748n03689J41287L79560p3155m57900j87145K33636
35899b17985J86188J7315K71034N65591K33955m44610o34419j74779M40482R04364
35889A147136J092902O98258k37132q79237o25504j08715k17140o36069m86575
35880b52076O7420J47770k30153k48962J76410L31356J20722J78673N09805M07164
$$ plain form
35949 546198 600520 664104 281221 -669939 -1660217 -1967300 -1339313 -202177 741964 1164225
35939 1164225 1342278 1646953 1937665 1812965 1401514 1347248 1805409 2007432 1253682 -71397
35929 -71397 -993700 -1190397 -1203402 -1557594 -2172169 -2630722 -2653790 -2295284 -1904170 -1794724
35919 -1794724 -1785308 -1334721 -390781 279271 39086 -669501 -859418 -229267 674745 1283734
35909 1283734 1401471 993169 249421 -254268 -112981 266579 193424 -264476 -451621 -217985
35899 -217985 -31797 -14482 256552 822143 1056098 611488 -22931 -197710 242772 1147136
35889 1147136 2240038 2938296 2701164 1821927 1196423 1087708 870568 234499 -252076
35880 -252076 -184656 -36886 -267039 -516001 -339591 -8235 112487 291160 800965 1208129
35870A208129j22033k47826J19211R4242m67685n11191L43616R05178K85932n73891
35860A033682l53366O39716J076043N62611j32433m22521m71730n69694o81097
35851F81211n97540j61275M93960P74220J67640q44535j072778j65402Q12193
35842H7694P87227j8443p06821r13891p66771k93429L64323O51011K62762k63739
35832h10077k69104J17801L90503N20313P06579P00408J60507n92660q98456o33751
35822f07937j79714K15834M57396L11796k42400o51484m19500J48681M30089L72601
35812a64638K62115K2824m49019o45087j11750N02033J56951q73202j150513j21070
35802b571356J051441J117448L09824k83742k29807K6002L9015j41150k34666
$$ plain form
35870 1208129 1086096 838270 957481 1051723 584038 72847 416463 1321641 1607573 1033682
35860 1033682 680316 1320032 2396075 2958686 2826253 2403732 1932002 1362308 681211
35851 681211 83671 -77604 416356 1190576 1358216 513681 -559097 -724499 87694
35842 87694 874921 856478 149657 -764234 -1531005 -1824434 -1460111 -809100 -546338 -810077
35832 -810077 -1079181 -961380 -570877 -50564 656015 1356423 1516930 924270 25814 -607937
35822 -607937 -787651 -571817 -114421 197375 -45025 -696509 -1116009 -967328 -537239 -164638
35812 -164638 97477 120301 -328718 -973805 -1085555 -583522 -426571 -1299773 -2450286 -2571356
35802 -2571356 -1519915 -402467 -92643 -376385 -606192 -580190 -541175 -682325 -916991
35793i16991j06026J16833J82973M9883P586K49126M54518J99232l13124m40288
35783e16278m0962L22120K33592n9448j75953j29453o8952L4455J37199L021l13525
35772e74184k86606L32272R32301P39996j09942p36356o46647j84038J48344K58027
35762a26833K18447k1224l62184l91483P7712N56325M54415l7127j92026J44189
35752C20211L40745N9729j55537J57304M63940N1981o52399n72902L12089Q12098
35742A137259K96572l98953l77599r9507n29379j421601j491389k29905J300119
35733a814383J710686Q16604l36445o85302j66792L93403K81917l18877o62456
35724g81645m23457R02J77070J51542J09838j22j92289k04325Q5679L35255K05851
$$ plain form
35793 -916991 -1023017 -906184 -723211 -673328 -665742 -416616 37902 237134 -75990 -516278
35783 -516278 -557240 -235120 -1528 -60976 -236929 -366382 -435334 -400879 -263680 -260659 -574184
35772 -574184 -860790 -528518 403783 1143779 1033837 297481 -349166 -533204 -384860 -126833
35762 -126833 91614 70390 -291794 -683277 -605565 -49240 405175 368048 176022 320211
35752 320211 660956 720685 565148 722452 1186392 1238373 585974 13072 325161 1137259
35742 1137259 1433831 1034878 657279 557772 28393 -1393208 -2884597 -3114502 -1814383
35733 -1814383 -103697 712907 376462 -308840 -475632 -82229 199688 -119189 -781645
35724 -781645 -1205102 -1204200 -1027130 -875588 -765750 -765872 -958161 -1162486 -1076807 -741552 -535701
35713e35701j22885k33335J9273N34690J113957J298104N92970p05360j462866
35704D98847j071147l30892k59605n44556j56618Q22258J155205L01702p58152
35695c42958r11817k93859K12107K44989J77575L79933P58776R44395O61896l8595
35685A792442p68736j044698o45400J78774P80391N41332m49145j175396o52073
35676a442509P54417J524650Q16771m73382r24126k92260N72787R86451Q68271
35667B391070L21846m24722q72085p32907l81706k64976j92181J69908N20499
35658E34746L97104K0399j51640k87024o80169q51152k51177N14686M28046k38433
35648e64614l20345K72466M75040P372j62905L93712Q19339N03485o885k00864
$$ plain form
35713 -535701 -658586 -891921 -872648 -337958 775999 2074103 2667073 1961713 498847
35704 498847 -572300 -903192 -1162797 -1707353 -1863971 -1041713 113492 415194 -342958
35695 -342958 -1254775 -1548634 -1336527 -1091538 -913963 -534030 224746 1169141 1831037 1792442
35685 1792442 1023706 -20992 -666392 -487618 292773 834105 384960 -790436 -1442509
35676 -1442509 -688092 836558 1653329 1179947 255821 -36439 536348 1522799 2391070
35667 2391070 2712916 2288194 1416109 683202 301496 36520 -155661 14247 534746
35658 534746 931850 952249 800609 513585 -166584 -1017736 -1268913 -754227 -326181 -564614
35648 -564614 -884959 -612493 -137453 -130081 -292986 100726 920065 1423550 1416665 1215801
35638A215801l86958o46347l17181O97730J338230R64904L73402L18059J93990
35629C751630o94925j601778j372263k59839N51970O61286N07041K30618l33914
35620A439826q76526q96218n30993k36707K782L14432K96482k80320o41132j6110
35610a424484R13845Q24844k19152q25670l40275L88622M78573J15632j34052
35601b22117j60772n8535K10689N09900M63082J0391m28860n34117l98323j82869
35591g91531P6458K51587J73309l8837j16007r4390j83515k47668M0617N31064
35581c98913O40735J69968l89976m82550p4819M17765N06285j0056p66375j053765
35571a441701o12910K4848L04743L72728N60637O01849Q6162o07510o66798l5365
$$ plain form
35638 1215801 828843 182496 -134685 563045 1901275 2866179 3239581 3557640 3751630
35629 3751630 3056705 1454927 82664 -177175 374795 1036081 1543122 1773740 1439826
35620 1439826 563300 -332918 -863911 -1100618 -1097836 -783404 -486922 -767242 -1408374 -1424484
35610 -1424484 -510639 314205 95053 -730617 -1070892 -682270 -203697 -88065 -222117
35601 -222117 -382889 -441424 -230735 279165 742247 752638 323778 -210339 -608662 -791531
35591 -791531 -715073 -463486 -290177 -329014 -445021 -539411 -722926 -970594 -929977 -398913
35581 -398913 241822 411790 21814 -460736 -535555 -117790 388495 378439 -387936 -1441701
35571 -1441701 -2054611 -2029763 -1725020 -1352292 -791655 -189806 -103644 -711154 -1377952 -1413317
35561a413317N09966M49544K1140l35349l98318p7320M84593P92779N54332J81735
35551G69785J52117J76595k28398p03619n78399j63287l17383q29889n79483N39694
35541a762267J236540P84739N5030k8698J60907l8716l13607j13891J95803l88
35531A75452l92300k99667P2041P178m14015m78250j66054k09542p05577p07003
35521c117737L56642J607318J707858N58772o04750p40759r8320L89787L80360
35512D39171K91822L50504J73910l97817p12061k13695M86029L28545n71042r88060
35502h12694l63035M49770N30219J09739o8314J17175K84995K82710K09178Q5821
35492H25564k3706O0563K02017q7653q13473j161939n76701L13305N25581J08064
$$ plain form
35561 -1413317 -903351 -453807 -432667 -768016 -1166334 -1243654 -759061 33718 588050 769785
35551 769785 921902 1098497 870099 166480 -411919 -575206 -892589 -1722478 -2301961 -1762267
35541 -1762267 -525727 259012 314042 285344 446251 407535 93928 -19963 175840 175452
35531 175452 -216848 -516515 -444474 -437296 -851311 -1329561 -1495615 -1705157 -2410734 -3117737
35521 -3117737 -2761095 -1153777 554081 1112853 508103 -232656 -330976 58811 439171
35512 439171 730993 1081497 1255407 857590 145529 -68166 417863 746408 175366 -812694
35502 -812694 -1175729 -725959 -195740 -86001 -154315 -37140 247855 530565 739743 825564
35492 825564 801858 862421 1064438 976785 163312 -998627 -1575328 -1262023 -736442 -628378
35482f28378n9485L83705Q87356Q83570M07777j89161n89234n39713m3146M37246
35472I50537M09964L2120p3743K82271N97984M38737K5623j79596j71720l55374
35462A956803q86867j343972j186161m63029J47916J43949j42498O616O72558
35453a094685J174671J043154O06913L37383R3223m80243j101718j037089j48586
35444f06977P47081P88880O7344n41669m47534J7552J62344p2916j07119K49070
35434B56056L38920k99472r40020n38972O05887J041863J34087j084499j378351
35425a864501p60758J1789N71959Q64221O12069k48887r85495p77799J29672O94342
35415a753388M23849j42176k72643J45754O69565Q06618M61440P4611J64104N78143
$$ plain form
35482 -628378 -687863 -304158 583198 1466768 1874545 1685384 1096150 556437 513291 950537
35472 950537 1360501 1392621 1318878 1601149 2199133 2637870 2663493 2483897 2312177 1956803
35462 1956803 1069936 -274036 -1460197 -1923226 -1775310 -1631361 -1773859 -1767243 -1094685
35453 -1094685 79986 1123140 1730053 2067436 2160659 1680416 578698 -458391 -606977
35444 -606977 140104 928984 996328 454659 7125 24677 187021 114105 6986 256056
35434 256056 594976 295504 -644516 -1183488 -577601 464262 598349 -486150 -1864501
35425 -1864501 -2625259 -2613470 -2041511 -1177290 -565221 -814108 -1799603 -2577402 -2447730 -1753388
35415 -1753388 -1329539 -1471715 -1744358 -1598604 -929039 -122421 339019 413630 577734 1155877
35405A155877N61548j70478q73491p08848J63366Q97969R95321N29780k42740
35396B308304r25513r97462m18773Q8450l3701l34637j05424M30828N09397R3406
35386F14875j73186r8068p2316j53078J3273L31687K88138o0767r0735K31236
35376H31059J92238l70508o37514j44960L96619K61479j46031q8162K34713J16812
35366F45745l79891n26272j26873K49977K68034K67415M92409N28496n0555q59730
35356E08755j056780m32151L29732N89245N10224N43549N21891q9103j109276
35347C16086j570740r85101k7441M46381M54721M54956M75172L66829L70353O06820
35337I08036M96313l55967j118926p24123L79360P40895Q9468l91546r2673K01482
$$ plain form
35405 1155877 1717425 1546947 673456 -35392 127974 1025943 2021264 2551044 2308304
35396 2308304 1382791 385329 -33444 55006 21305 -313332 -418756 12072 521469 614875
35386 614875 441689 343621 271305 118227 131500 463187 751325 690558 599823 831059
35376 831059 1023297 652789 15275 -129685 266934 528413 382382 294220 528933 645745
35366 645745 265854 -260418 -387291 -137314 130720 398135 890544 1419040 1368485 508755
35356 508755 -548025 -980176 -650444 -61199 449025 992574 1514465 1425362 316086
35347 316086 -1254654 -2239755 -2267196 -1820815 -1366094 -911138 -435966 -69137 301216 908036
35337 908036 1404349 1048382 -70544 -794667 -415307 325588 415056 23510 -69163 132319
35327A32319p0532k89632k5500J2514o36003j047918l51081O86373Q14106K87358
35317d87996K78482Q20497Q49597J17362l96836j06483M13421N51863M52900L13661
35307B806468j12882q10868j122761o65350j523J78039L6919J53167M76328L96056
35297A333593k62512q85515q13439r9460O06420P61481M14720M3833k7976K181
35287A073326k96040r52713j396417j014480R4537J059385J081765L49572j17161
35278a18226L08371J039306J033805J77529o43473q02087n63453l07285P6467
35269B00954N66583N62686j89219q08837l50600O97024R88927K36785n15666n65280
35259H23357l89935n17662o16828l04323l267k31740o37099n34723j2352K67022
$$ plain form
35327 132319 61787 -227845 -253345 -240831 -876834 -1924752 -2275833 -1589460 -775354 -487996
35317 -487996 -209514 610983 1460580 1577942 1181106 1074623 1488044 2039907 2492807 2806468
35307 2806468 2693586 1882718 759957 94607 93084 271123 308042 461209 937537 1333593
35297 1333593 1071081 185566 -627873 -727333 -120913 640568 1055288 1099121 1071145 1073326
35287 1073326 777286 -175427 -1571844 -2586324 -2491787 -1432402 -350637 -1065 -118226
35278 -118226 190145 1229451 2263256 2440785 1797312 995225 431772 124487 200954
35269 200954 767537 1330223 1141004 332167 -18433 678591 1667518 1904303 1388637 823357
35259 823357 433422 -84240 -701068 -1005391 -1008658 -1240398 -1877497 -2412220 -2424572 -2157550
35249b157550J02889j30054k41418l81867m88982k48763L22368Q13393R98345
35240a411639R69294O86075K1426o32559n07374M51586J227728R30166q9663p91795
35230H53245p42954l35149j2264J19959M8256k21362m95712n57597m38049k04852
35220a986479K74915Q98540R98497J92085o77603m26450O55473R97253M0522q46077
35210A20676l94584P10457R95699L62863j33514j32211k38881o24201o62698j42444
35200a38838K67712R1163k96819m21607l55113k69350m7077K93385M06777K19555
35190b50212J59072M40368O59787M48097L1116j99053k08848j14698R0915L18148
35180A374692L27181J29735j5975j51043n59909j022736q84681j54548K86844
$$ plain form
35249 -2157550 -2054661 -2184715 -2426133 -2808000 -3296982 -3545745 -3223377 -2409984 -1411639
35240 -1411639 -442345 243730 265156 -367403 -874777 -423191 804537 1734703 1645040 853245
35230 853245 110291 -224858 -237122 -117163 -68907 -290269 -785981 -1343578 -1781627 -1986479
35220 -1986479 -1711564 -813024 185473 377558 -300045 -726495 -71022 926231 966753 120676
35210 120676 -273908 436549 1432248 1795111 1661597 1529386 1290505 666304 3606 -138838
35200 -138838 128874 220037 -76782 -498389 -853502 -1122852 -1169929 -876544 -469767 -250212
35190 -250212 -91140 349228 1009015 1457112 1488228 1289175 1080327 965629 1056544 1374692
35180 1374692 1701873 1831608 1815633 1664590 1104681 81945 -802736 -957284 -670440
35171f70440j0580l91303k40424O0201j1678j51540O4038K74407P0522o6239L95803
35160f77233Q71141M95975l31847m96223N1728L20552m5176l67214k23939M8129
35150c54107K39210N15578O40207R4228p66413q02818K60329J284540J247963
35141B358717M11363m50592j034037j231417q12080j2039L46680l5546m03167
35132h62118j04544M36151N34731L12232K22341J77073n6468j61005J79923N16032
35122A194348K89777j41874o4231L25517J93758n13446r13947n35548M4064J41847
35112B0265j30824k33765N737K73915K09481j94536n12395k77897L89313P77675
35102C26969M72086o4527k00968p1353k05905n23838m66667k2326K19828J00523
$$ plain form
35171 -670440 -681020 -1072323 -1312747 -1252546 -1264224 -1415764 -1351726 -1077319 -1006797 -1073036 -677233
35160 -677233 193908 689883 358036 -138187 -86459 234093 188917 -178297 -402236 -354107
35150 -354107 -114897 400681 1040888 1135116 368703 -434115 -173786 1110754 2358717
35141 2358717 2770080 2319488 1285451 54034 -758046 -770085 -423405 -458951 -862118
35132 -862118 -966662 -530511 4220 316452 538793 715866 659398 498393 678316 1194348
35122 1194348 1484125 1342251 1278020 1603537 1797295 1283849 369902 -165646 -121582 20265
35112 20265 -110559 -344324 -338587 -64672 144809 -49727 -562122 -840019 -450706 326969
35102 326969 799055 734528 533560 462207 256302 -267536 -734203 -756529 -536701 -436178
35092d36178J32022M72470M90276j84222q69870p38718l5561L12420M8639j67398
35082i76120J58469O76172P87156M47156O6059j07595j50148j30555J8335K30004
35072A018933K15165j35631m55658l23124R6269J97952k25699p01165p92306o69697
35062a774961o20783m01184L41758J200147J272407M11083m11719l02897M34274
35053A48125Q02158M52508K7752J73549O41619O23007j75173j069403j145160
35044D78982l43239M45780M37300j54480m99113k12552L26575O29858O12479L70082
35034B091672r9769o74927r45163o60833j76183n4545k93921l44119N4698M57909
35024f45181L59501p6647k94448j70223q6974j84873q7811L51161N39459n1558
$$ plain form
35092 -436178 -304156 168314 658590 474368 -395502 -1134220 -1169781 -857361 -808722 -976120
35082 -976120 -817651 -141479 645677 1092833 1158892 1051297 901149 770594 788929 1018933
35072 1018933 1234098 1098467 642809 319685 415954 613906 388207 -312958 -1105264 -1774961
35062 -1774961 -2395744 -2796928 -2455170 -1255023 17384 428467 16748 -286149 148125
35053 148125 950283 1402791 1430543 1604092 2245711 2868718 2693545 1624142 478982
35044 478982 135743 581523 1018823 864343 365230 152678 479253 1109111 1721590 2091672
35034 2091672 1991903 1316976 371813 -289020 -465203 -519748 -813669 -1157788 -1103090 -645181
35024 -645181 -285680 -362327 -656775 -826998 -913972 -1098845 -1186656 -835495 -296036 -347594
35014c47594q61222p71722L08420J159049Q46714o9312m33626m3781L71396L51438
35004E09760J11927q9801k45279k63503l2704J59897n3411l57867r4743N30216
34994A74492N08425l69478r65995m73243L03375K50933k63806j27945N22818N01787
34984F1363l29892o72412J36641J006910P75881q3208l74242N689K39276P1938
34974H37944q581J23890L3676l09064l26057J36284L82974r8063p93317q55046
34964h75360k35975L63449M67591L05780L58561P12688R40213N85396k07933o93361
34954A721049l85497K12258J82358n30439r91501n84133J72202M75195L37929
34945F09421K73577L19806Q6535m27290p63684p18768n17915k69111J50680N75606
$$ plain form
35014 -347594 -1208816 -1980538 -1672118 -513069 333645 264333 -169293 -213074 158322 509760
35004 509760 621687 531886 286607 23104 -9600 150297 96886 -260981 -355724 174492
34994 174492 682917 313439 -652556 -1125799 -822424 -571491 -835297 -963242 -440424 61363
34984 61363 -268529 -940941 -804300 202610 978491 895283 521041 526730 766006 837944
34974 837944 829363 953253 986929 677865 351808 488092 871066 773003 -20314 -875360
34964 -875360 -1111335 -747886 -280295 25485 384046 1096734 2036947 2622343 2414410 1721049
34954 1721049 1335552 1547810 1730168 1199729 208228 -375905 -203703 271492 609421
34945 609421 882998 1202804 1289339 862049 98365 -620403 -1138318 -1407429 -1256749 -681143
34935f81143N42193L8104k87914j0567M19992L34043j71398l93503l1662M43034
34925B01179M77403J24362j51766j51981j38136l15153l72205J54045J069108
34916H96856J454571O78421p55278j691796j526484o15244L36197Q58190P89408
34907D24841K84087j83739k47115j26228k63812n17109l23959K44485L58711k91294
34897f41132q18529l36988P12922J166850P21997J49162N8392K03193J01502k47727
34887A069642m89399m01501r0504J26269K2601k28627k12818Q4873J20880l69546
34877c68130p58458l50807M40239N26411k76053r17140n75500K76017O55578L55094
34867i92749n3676j27927L9696J79694K14169K39019L03271K60016o5172m59362
$$ plain form
34935 -681143 -138950 -100846 -388760 -399327 20665 354708 183310 -210193 -241855 201179
34925 201179 678582 802944 651178 499197 361061 45908 -326297 -172252 896856
34916 896856 2351427 3029848 2274570 582774 -943710 -1558954 -1222757 -364567 424841
34907 424841 708928 525189 278074 151846 -111966 -629075 -953034 -708549 -349838 -641132
34897 -641132 -1459661 -1796649 -1083727 83123 805120 954282 1012674 1215867 1317369 1069642
34887 1069642 580243 178742 88238 214507 237108 8481 -204337 -119464 1416 -368130
34877 -368130 -1126588 -1477395 -1037156 -510745 -786798 -1703938 -2279438 -2003421 -1347843 -992749
34867 -992749 -1046425 -1174352 -1134656 -954962 -740793 -501774 -198503 61513 -3659 -463021
34857d63021l50239L73099Q47427K19321r63996j223942j82269Q09658N31497
34848d02465m90112r33924n16529M2966L67972O76759R16621O90022Q6464k90823
34838A46951k54069k17731l24828j66898L76808P38316M58116j71480n79949n61489
34828e56253k16060K38455L98937J3442m08482l4290R49701J290364M68604l80442
34818A763976j65046M19126K2876j095665j406483n20566K50864r960n79354n11166
34808a831398q6116j122p0635K37595O28154M36858j03723j38359L97653O65084
34798A33991K94432r6025l6549K9130l56684p10380l07641N49906Q03841J26356
34788D30377o31458o94416l87209m11396o03288j97138P98204J356890Q51480
$$ plain form
34857 -463021 -813260 -440161 407266 626587 -337409 -1561351 -1743620 -933962 -402465
34848 -402465 -892577 -1826501 -2343030 -2300064 -1932092 -1255333 -338712 351310 437774 146951
34838 146951 -107118 -324849 -649677 -816575 -439767 298549 756665 585185 5236 -556253
34828 -556253 -772313 -533858 -134921 -121479 -529961 -564251 385450 1675814 2144418 1763976
34818 1763976 1598930 2018056 2040932 945267 -461216 -981782 -730918 -740878 -1320232 -1831398
34808 -1831398 -1917514 -1918636 -1989271 -1751676 -1123522 -686664 -790387 -928746 -531093 133991
34798 133991 428423 332398 295849 324979 -31705 -742085 -1049726 -499820 304021 430377
34788 430377 -201081 -895497 -1282706 -1694102 -2297390 -2494528 -1696324 -339434 512046
34779E12046k5197k82730J6333J49964K1286J05378L22152M0631o88820r60512
34769g89469m02825K32999L28897K74621M77333M88061k6274l51170J47623P35097
34759A114893M16088l01331k40139K89606p6175j235106j444901j16378J044331
34750e49112N89103n46611p06784n1609O8683n34923p54106p3093Q14221J234267
34740e09964J196547P65106j43586j105678j271981m92452L23051L52665j34836
34731a021128k85974J90256P31316O36845j14056p61647n57606K93909P63081
34722a25004K55573o27897r45970o09083j72167J72445O24623R98725P82757L0436
34712C84438n58622n83184l01879M1835N11062R04208O93727q5702o03960l71411
$$ plain form
34779 512046 486849 204119 220452 370416 391702 497080 819232 859863 171043 -789469
34769 -789469 -1192294 -959295 -630398 -355777 121556 609617 583343 232173 379796 1114893
34759 1114893 1530981 1229650 989511 1279117 1202942 -32164 -1477065 -1593443 -549112
34750 -549112 39991 -506620 -1213404 -1265013 -1196330 -1731253 -2485359 -2558452 -1744231 -509964
34740 -509964 686583 1451689 1308103 202425 -1069556 -1562008 -1238957 -886292 -1021128
34731 -1021128 -1307102 -1116846 -385530 251315 137259 -624388 -1181994 -888085 -125004
34722 -125004 130569 -497328 -1443298 -2052381 -2224548 -2052103 -1427480 -428755 354002 384438
34712 384438 -174184 -757368 -1059247 -1017412 -506350 397858 1091585 1005883 401923 30512
34702C0512L9301j8882j75486K69860R81676Q73099k64999j282786j112798r9627
34692g60130N25432J61732o07108q78547m64825P1189K11199O3430R8409M64397
34682a114822P55359M91348k70882q87004p25527J39216Q96850Q41734K29990
34673C56262k8204L48047N09087l02761j435377j499542k73959R24339J011132
34664c90976M55860L03784N72619M66097j69217n72867l10817P8233L1616j16712
34654C47620K52677R06753R33485J7839j045085j296102o61480J81908O54890
34645B92505O57291L37321q8005l20558j65219K01528M03181L26395J51430n4420
34635A741449l92081p21414o57723k00627N9948k78213p77759p20964r9549M28501
$$ plain form
34702 30512 69813 50931 -124555 145305 1126981 2000080 1735081 452295 -660503 -760130
34692 -760130 -234698 -72966 -680074 -1558621 -2023446 -1952257 -1741058 -1677628 -1579219 -1114822
34682 -1114822 -359463 131885 -138997 -1026001 -1751528 -1612312 -715462 126272 356262
34673 356262 328058 676105 1185192 882431 -552946 -2052488 -2326447 -1402108 -390976
34664 -390976 64884 368668 941287 1407384 1238167 665300 354483 432716 464332 347620
34654 347620 600297 1507050 2440535 2458374 1413289 117187 -544293 -362385 292505
34645 292505 949796 1287117 1199112 878554 713335 914863 1318044 1644439 1795869 1741449
34635 1741449 1349368 627954 -29769 -230396 -170448 -448661 -1226420 -1947384 -2046933 -1618432
34625a618432M78857L63165N04143Q03536P87656K25028n48012r17780o02227
34616e24066N9857M95067M82205J82887k48878o94221q00124k66289N04911O76638
34606a32013J20759l61646k68919r7405l29324n22812j44430M01760M80157L55481
34596d98392N90993Q30991L78625l63635l59299K85984L95342l32177q25859m33595
34586c31022R7091j1423l60004k47978J69555L49851K63228J36327q7121l96685
34576d18181l79607J66736P51209Q22289M56526L2732k92010m50506l57844k31010
34566A00334m11311o41438k86249M72760O20952j03053o61579l47083J53626J14259
34556i88782M7555N55051R31936K72377p82572q51631R5076Q36540P84438M30691
$$ plain form
34625 -1618432 -1139575 -776410 -272267 531269 1318925 1543953 995941 78161 -524066
34616 -524066 -464209 30858 513063 695950 447072 -247149 -1047273 -1313562 -808651 -132013
34606 -132013 -11254 -372900 -641819 -739224 -1068548 -1591360 -1735790 -1334030 -853873 -498392
34596 -498392 92601 923592 1302217 938582 579283 865267 1260609 928432 102573 -331022
34586 -331022 -233931 -245354 -605358 -853336 -683781 -333930 -70702 65625 -21496 -418181
34576 -418181 -797788 -631052 120157 942446 1398972 1431704 1139694 689188 331344 100334
34566 100334 -310977 -952415 -1238664 -765904 -144952 -248005 -909584 -1256667 -1103041 -988782
34556 -988782 -941227 -386176 545760 818137 35565 -816066 -720990 115550 899988 1330679
34546A330679J12603l40611p58671o50004j41166J56447K15039M80994P56256
34537A161566L58670n26898q43523k46888L71576K34516m03733r41561j106633
34528a942908p32006J78772R19657O16314m00054p58867M8145R57909R70845M43063
34518C00870J60787J39227R3260K23599O77546R07785M02653m66044j016182j129593
34508B93908r25713k43174P66274J190255M74746n04106n14784K50241N58271
34499A345918O5432l41177j72675r2756o24707j108117o61040M19421R83281N27681
34489C41261k64696n03485j27709K42906K14030J6890o303N0871p7699k58045
34479c71979j35296J67144J25032k64065k91474L50598R01536N97270j12633k36984
$$ plain form
34546 1330679 1443282 1102671 344000 -306004 -447170 -290723 -75684 405310 1161566
34537 1161566 1520236 993338 149815 -97073 274503 509019 105286 -836275 -1942908
34528 -1942908 -2674914 -2496142 -1576485 -960171 -1360225 -2119092 -2070947 -1113038 -142193 300870
34518 300870 461657 600884 694144 917743 1595289 2503074 2905727 2439683 1423501 293908
34508 293908 -631805 -874979 -108705 1081550 1556296 1052190 537406 787647 1345918
34499 1345918 1411350 1070173 897498 804742 180035 -928082 -1589122 -1169701 -186420 341261
34489 341261 76565 -426920 -554629 -311723 -97693 -80803 -87106 -36235 -113934 -371979
34479 -371979 -507275 -340131 -215099 -479164 -770638 -420040 481496 1078766 966133 729149
34469G29149J99990K69775k57947n25724r2800K33827k65763r25830o91350J52525
34459a174148M06415r4467k29770M85669R81251L19667p13117p51384Q9312N37274
34449a43298K23991M7887M24729N78245M5890l92515r7414K10708l07937r96051
34439d05765o29573N29096R95256K53194o11159n95681L6773N20080N28942M8679
34429F69842p87308j379697j031147o54O16079L97293J03150K87408M30877Q9707
34419f04450j30147L30083P95204M08418k95772j78653N36179N08589n31574j240316
34409d02439o55631M53638Q45002M78228J69130K24707K82662J79099J58634K70955
34399B003985K13011j31564m87484o56503p74293r12789q09224k97225K73145
$$ plain form
34469 729149 929139 1198914 940967 415243 322443 556270 290507 -635323 -1326673 -1174148
34459 -1174148 -767733 -862200 -1091970 -606301 374950 694617 -18500 -769884 -680572 -143298
34449 -143298 80693 128580 553309 1131554 1177444 784929 687515 898223 590286 -405765
34439 -405765 -1035338 -506242 489014 742208 131049 -464632 -427859 92221 621163 669842
34429 669842 -117466 -1497163 -2528310 -2528964 -1912885 -1515592 -1412442 -1125034 -694157 -604450
34419 -604450 -734597 -404514 390690 799108 503336 324683 860862 1369451 837877 -402439
34409 -402439 -1058070 -604432 240570 718798 887928 1112635 1395297 1574396 1733030 2003985
34399 2003985 2216996 2085432 1597948 941445 167152 -745637 -1554861 -1852086 -1578941
34390a578941M37536K80957K59904M21025L27000j16926l29706R0605O47676O14607
34380A053737R4447k22636j70284k35461n81331p26586m20509r6702m6695J81312
34370a170708R33369J524220J007483l23089j085311n98461K55533L53145j31860
34361G64321j96021L36431N26064j85810j034181j010894k81356K30359K68454
34352e82633L05943L61336p1238p36886n51697N85119J158193K13445r38912n87399
34342h44729O68978Q34964k76689p67142K42394J207860O45926o28320r19417
34333A63825j34481M57284K40509j99715k21316J53696N20923M54990j96633r21145
34323C17937q34878J51045R54184O76848j82899n46755k75603n4728j35513j16851
$$ plain form
34390 -1578941 -1141405 -860448 -600544 -179519 147481 30555 -299151 -208546 439130 1053737
34380 1053737 1148184 925548 755264 519803 -61528 -788114 -1208623 -1305325 -1352020 -1170708
34370 -1170708 -237339 1286881 2294364 1971275 885964 287503 543036 896181 764321
34361 764321 568300 904731 1430795 1244985 210804 -800090 -1081446 -851087 -582633
34352 -582633 -276690 84646 13408 -723478 -1275175 -690056 468137 681582 -257330 -844729
34342 -844729 -175751 659213 382524 -384618 -142224 1065636 1711562 1083242 163825
34333 163825 29344 486628 727137 527422 306106 459802 980725 1435715 1239082 317937
34323 317937 -516941 -365896 588288 1265136 1082237 535482 259879 205151 69638 -47213
34313d7213J34887J95905j83681o67208p87921m37656J27838M90959L59514j03592
34303i18168l86873k55457n224R0331J84990M40146O50094O25657M92132K71146
34293A188774k58809q63513p23999L26458J106371N27177p59461j170351l58496
34284i85849M84839M20738j77054n06704l85592q0649K40792M96334N33605L03381
34274C43841k9568k84016l96695l52901j79775J5794J52877K35241K23719O9254
34264b02229m6293J42357M57839L63205j94705n44441k38439K70014L20735m8681
34254B79362l25985k27133J86844O22410N09956m90011j622337j542471j67860
34245b777225R53546P83451K05177L70020P87354L96241m14005m75044Q5543J35523
$$ plain form
34313 -47213 87674 283579 99898 -567310 -1355231 -1792887 -1665049 -1174090 -814576 -918168
34303 -918168 -1305041 -1560498 -1565722 -1475391 -1290401 -850255 -200161 425496 917628 1188774
34293 1188774 929965 66452 -657547 -331089 775282 1302459 542998 -627353 -985849
34284 -985849 -501010 -80272 -257326 -764030 -1149622 -1230271 -989479 -493145 40460 343841
34274 343841 314273 30257 -366438 -719339 -899114 -883320 -730443 -495202 -271483 -202229
34264 -202229 -248522 -106165 351674 714879 520174 -24267 -262706 7308 328043 279362
34254 279362 -46623 -273756 -86912 535498 1045454 555443 -1066894 -2609365 -2777225
34245 -2777225 -1823679 -1040228 -835051 -465031 322323 718564 304559 -170485 -84942 50581
34235E0581m17905n45718J5097L60749K7156l84135l63817p7464L09602P54440
34225b71414P90810M6511p49492n43731L30310N91265Q9969j01127K84992L16927
34215G85020k37757m04894J11513L03595j96366l09501M30608P29821l25854j481260
34205e95075j107117M00097J470256J608303J301736N70135p19628j654064j119202
34196A55441K98384P97968j33664j047525o72767M20668Q61896L62044j71820
34187H70625n8218L02450J23812n93116j015507o46557l3918R2672o4806J61084
34177h61479O38615O13175Q0679j04387L26476N94466K16081k56106l28926l57649
34167E60945o00273n01927K44872Q17183M17595l76958m42938K19120O54274M54935
$$ plain form
34235 50581 -367324 -913042 -897945 -537196 -510040 -894175 -1257992 -1335456 -1025854 -271414
34225 -271414 519396 565907 -183585 -727316 -397006 194259 284228 183101 468093 785020
34215 785020 547263 142369 253882 557477 361111 51610 482218 1212039 886185 -595075
34205 -595075 -1702192 -1302095 168161 1776464 3078200 3648335 2928707 1274643 155441
34196 155441 453825 1251793 1118129 70604 -602163 -181495 680401 1042445 870625
34187 870625 812407 1114857 1238669 645553 -369954 -1016511 -1050429 -957757 -1022563 -861479
34177 -861479 -222864 390311 470990 366603 693079 1287545 1503626 1247520 918594 560945
34167 560945 -39328 -541255 -296383 520800 938395 561437 118499 337619 991893 1446828
34157A446828J11578M825q5815m16954q24906r05891l55773P08258J525899J185746
34147B393795k48562j477462j335874j57371P09511N30134j50963l72079J31710
34138B2839P44434P38950J43151l08949j66603J62229J47068m6761r2382l14319
34128A029657r98726j326025l01881J375007J820552N31356r36480j188469n34371
34119e29380J22207N28491N90417K323q24219p05416N39823J398988P29198n10560
34109A341872o44905M23657J322342R97944l95695j823256k033901o28438J118160
34100c22220J415721K83399m78015k4438L79624l15059j153787q91235R43M27943
34090f77124M93873P70806Q72157K70431m02913l39673l802k20792o29237l91704
$$ plain form
34157 1446828 1558406 1563231 1477416 1060462 235556 -670335 -1026108 -317850 1208049 2393795
34147 2393795 2145233 667771 -668103 -825474 -115963 414171 263208 -108871 22839
34138 22839 767273 1506223 1649374 1340425 1173822 1336051 1483119 1436358 1343976 1029657
34128 1029657 30931 -1295094 -1596975 -221968 1598584 2129940 1193460 4991 -529380
34119 -529380 -407173 121318 711735 714058 -110161 -815577 -275754 1123234 1852432 1341872
34109 1341872 696967 1120624 2442966 3440910 3045215 1221959 -811942 -1440380 -322220
34100 -322220 1093501 1376900 898885 874447 1254071 939012 -214775 -1106010 -1105067 -677124
34090 -677124 -183251 587555 1459712 1730143 1327230 987557 983755 762963 133726 -257978
34080b57978K96204O62887N91768L04054l00967r53701p59918K62386O70956j56766
34070C58925p36487J17736J198751R85071K09896K50306M64448m04291j432199
34061A012156q65395O04034P23715o39119j417440p42047J29244K67007J12362
34052h15483k1335l77956o19580j48402N20608M86864K15894O81476J279454P23703
34042A925243m72641p10295q9666r1112p98012r07250k81541k326o4855M58757
34032a033698J148295P44936k30815r2921Q99040Q98299j11067k88754N55112
34023B488427O02671m70539q62126j06247L3484j032640j518652m84659O20601
34014g29680O68391L80518K55919k77566q21999j6771J554341J483544m75068
$$ plain form
34080 -257978 38226 701113 1292881 1596935 1295968 342267 -417651 -155265 515691 358925
34070 358925 -377562 -259826 938925 1923996 2133892 2384198 2848646 2444355 1012156
34061 1012156 146761 750795 1474510 835391 -582049 -1324096 -1194852 -927845 -815483
34052 -815483 -836818 -1214774 -1834354 -1982756 -1462148 -975284 -759390 -77914 1201540 1925243
34042 1925243 1452602 742307 652641 561529 -236483 -1143733 -1425274 -1427600 -1492455 -1033698
34032 -1033698 114597 859533 628718 535797 1434837 2333136 2222069 1933315 2488427
34023 2488427 3091098 2620559 1758433 1652186 1685670 653030 -865622 -1350281 -729680
34014 -729680 -61289 319229 575148 297582 -524417 -541188 1013153 2496697 2021629
34005B021629j645792p17613M12225K76010O729M49032M18705m95728o07954O18935
33995G36178J136608m9331r28568r2923Q17657L09554l76314J4650M03595j37343
33985A833763m58691R2042J49182o96004o09129Q31130J170400n55867j643617
33976A13209l12899J258984J071928N86824J096827Q93013q30035j400889N50127
33967C027089J909629L63578j379825n83218O77371o9763r05829K22800J018096
33958D279928m38943j168621J147208K972596J095042j121982J36J419945l00578
33949G884731j497194J607115M486270K240295k96826K946843P262469O140883
33941C0774586N239471J2141010J9649187J9326012K5165609N5684723R1128992
$$ plain form
34005 2021629 375837 -341776 70449 346459 353188 802220 1220925 725197 117243 736178
33995 736178 1872786 1823455 894887 801964 1619621 1929175 1552861 1567511 1971106 1833763
33985 1833763 1375072 1467114 1616296 920292 311163 1142293 2312693 1756826 113209
33976 113209 -199690 1059294 2131222 2718046 3814873 4707886 3877851 2476962 3027089
33967 3027089 4936718 5300296 3920471 3337253 4014624 3944861 3039032 3261832 4279928
33958 4279928 3840985 2672364 3819572 6792168 7887210 6765228 6765364 8185309 7884731
33949 7884731 6387537 7994652 12480922 14721217 14424391 17371234 24633703 30774586
33941 30774586 36014057 48155067 67804254 87130266 112295875 167980598 259109590
33934B59109590Q1551293J2509463o4509418q9523747o2320528k9275462j8420895
33927H9120296j7966649j2234266o036000p199309r854606o756617k281810k674669
33919B4116370m802101l525448j170925j726796k969111j457510O57167P8665
33911I200311j477154j068931M133n54386j355277l92525Q06762K07057q35835
33902D534155m29919J79708p20673j845541j381354k72942o2788l4768P13023
33893F78901R63017j24881q01404K49845J201656J79673j345072j126626J17666
33884g225M45013J46869N41071J071300N15270l99491l43706m437o89927j551665
33874b76928q86648P55792J359770O32424K8689J17839J05663l53523p42034q20731
$$ plain form
33934 259109590 340660883 353170346 288660928 199137181 136816653 107541191 89120296
33927 89120296 71153647 58919381 52883381 45684072 35829466 29072849 26791039 24116370
33919 24116370 19314269 15788821 14617896 12891100 9921989 8464479 9121646 9200311
33911 9200311 7723157 6654226 6658359 6103973 4748696 4356171 5162933 5369990 4534155
33902 4534155 4104236 4283944 3563271 1717730 336376 63434 646 -34122 678901
33893 678901 1641918 1517037 715633 965478 2167134 2346807 1001735 -124891 -7225
33884 -7225 437788 584657 1125728 2197028 2712298 2312807 1969101 1964664 1274737 -276928
33874 -276928 -1163576 -407784 951986 1584410 1613099 1730938 1836601 1483078 741044 -79687
33864g9687p02428j96908O52710R99883L60229m06995m18723j39145k70178l74947
33854e76189P4874M24350O7220j80500M73426J074042M00388p82644q37689J05686
33844B42964N26437K4472l94879k65901j61452l26739l15270p232K36379L95584
33834d5637P16573R50453O16659j52945q20779j162469j101944m17761O15887
33825h01963J020187M29425j69729L0421L15597j87166p60222k07545R91537J262388
33815A922930K79778p70902j046813q00896m35803k9441K82982M32799O97665
33806E32299J048413P66973l48814j155566p27454M4929j53282q25917n20506
33797a338925O45630J190612P18922K76242L13688J55566l67930n37997k68846
$$ plain form
33864 -79687 -782115 -979023 -326313 673570 1033799 626804 208081 68936 -201242 -576189
33854 -576189 -501315 -76965 -9745 -190245 283181 1357223 1757611 974967 137278 242964
33844 242964 769401 793873 398994 133093 -28359 -355098 -670368 -677600 -441221 -45637
33834 -45637 670936 1621389 2238048 2085103 1264324 101855 -1000089 -1417850 -801963
33825 -801963 218224 647649 477920 508341 823938 636772 -123450 -330995 660542 1922930
33815 1922930 2202708 1431806 384993 -415903 -851706 -881147 -598165 -165366 532299
33806 532299 1580712 2347685 1998871 843305 115851 160780 7498 -818419 -1338925
33797 -1338925 -693295 497317 1216239 1492481 1806169 1961735 1593805 1055808 786962
33788G86962l27313o88982l36019Q28300J462514Q10030k01347n40664m08058
33779A385423l15788j56504N0761k60417j025095j109593j041J094115Q59997
33770E21858k76479r27500o66380j41822J76573L51576L98807K12812p6089k24564
33760f51208j48089K33010R50444J499829J106796n3983p08714k12926L91699
33751B406858o3262j017577j061085j63715L35173j38454o14231k30680M63484
33742h3489M63431k03951o56136m26975P9630L09549K45616K50810M66322N94046
33732A038853L27498j60791m12488l40809l24019n04206m47801J13548O06812
33723a03403K98281n44510q79356l04885M46875O31371M27655L57333L64024Q7595
$$ plain form
33788 786962 459649 -229333 -565352 262948 1725462 2535492 2334145 1793481 1385423
33779 1385423 1069635 913131 963892 703475 -321620 -1431213 -1432254 -338139 521858
33770 521858 245379 -682121 -1348501 -1490323 -1313750 -962174 -563367 -350555 -426644 -651208
33760 -651208 -799297 -566287 384157 1883986 2990782 2936799 2228085 2015159 2406858
33751 2406858 2343596 1326019 264934 101219 436392 297938 -316293 -546973 -83489
33742 -83489 379942 175991 -480145 -907120 -827490 -517941 -272325 -21515 444807 1038853
33732 1038853 1366351 1205560 793072 452263 128244 -375962 -823763 -710215 -103403
33723 -103403 194878 -349632 -1228988 -1533873 -1086998 -455627 -27972 329361 693385 780980
33713G80980l21289l70117o6716Q5994n4972p0906K35313M71287L14082l2407
33703I71249l51764p97428j305306j213181j63290J029326J235951N34606K6150
33694c3687K09344M59114K56005k899J62131M33005K35561l26598o41307m12865
33684C37804Q7194L77719J30457n54579j083307r36005l93766k03507m39770l95683
33674c073443J86803O19745M24934J29008K89718N45728M07020K26363M57726
33665B13602O27211J11371o11983o49056j80763k8645r2990L77137J124115J011673
33655A901672o2362q55571p07403l66494m27726l61218J92693M95896K4004m50732
33645f17241j67902K50524l1103m19204J10966J006385Q11950l59020p84047J67381
$$ plain form
33713 780980 459691 89574 22858 108852 53880 -17026 218287 689574 1003656 971249
33703 971249 619485 -177943 -1483249 -2696430 -2859720 -1830394 -594443 -59837 -33687
33694 -33687 175657 634771 890776 887877 1050008 1483013 1718574 1391976 750669 337804
33684 337804 424998 802717 933174 378595 -704712 -1640717 -2034483 -2237990 -2677760 -3073443
33674 -3073443 -2886640 -2266895 -1841961 -1712953 -1423235 -877507 -470487 -244124 213602
33665 213602 840813 952184 340201 -308855 -489618 -518263 -611253 -234116 889999 1901672
33655 1901672 1839310 983739 276336 -90158 -517884 -879102 -686409 -190513 -166509 -617241
33645 -617241 -785143 -534619 -565722 -984926 -873960 132425 944375 585355 -198692 -31311
33635c1311R32451J04588j436241j836573q33414K40421N57877N88124P72021
33626i42057O57573j03311p78530m09315P57967J492044J129699K17979m34388
33617A587661o74836p57608p75676p15477o34808m22735J74725Q87678Q23000
33608e08076l17910j379775j008595M44022J276816P48848k5266J34305P82484
33599A46853P11427j66034p59299m08326L30941O19696L72616M3563j69221m29398
33589B92818p10855o24729K024O75210P41762K62265o8734O5183J96463o7006
33579G64401l50623j92503Q4119q7708m40867k26548M73482P33558J91276m27869
33569E20718m51775j11391R5140J37267J51541R7416J16171N30322J057689Q15409
$$ plain form
33635 -31311 901140 1005728 -430513 -2267086 -3100500 -2860079 -2302202 -1714078 -942057
33626 -942057 -284484 -387795 -1166325 -1575640 -817673 674371 1804070 2022049 1587661
33617 1587661 912825 155217 -620459 -1335936 -1970744 -2393479 -2218754 -1331076 -508076
33608 -508076 -825986 -2205761 -3214356 -2770334 -1493518 -744670 -769936 -635631 146853
33599 146853 858280 692246 -67053 -475379 -144438 475258 847874 891437 722216 292818
33589 292818 -418037 -1042766 -1040742 -365532 376230 638495 569761 634944 831407 764401
33579 764401 413778 221275 305394 217686 -223181 -449729 23753 757311 948587 520718
33569 520718 68943 -42448 52692 189959 341500 438916 555087 1085409 2143098 2958507
33559B958507l15230j133081o97071K60312M31629j56035m22167k2883L27661
33550A231642J88863r8580k93720n83041q39439n45940K20052O14143K44274k24794
33540h6540j48578J44899M7755l03042l65167j19080L3911M3416K22069N74085
33530D3728O76826K90991k99470o44047n84954l12374j08115n9552o847J52281
33520h51533J87689j48300n57132m08668L25838Q69474P02102L26883M55457Q44492
33510A746302O63641j64611p77996o01773o5923J56359N7700N6083K25928K20748
33500A516458j60747o63402q52642n63910n5860K69450K91717J97673M3802l83853
33490c61314j004453j136603l54391O03742O04319k17257n01351L75071J358357
$$ plain form
33559 2958507 2643277 1510196 813125 1073437 1505066 1349031 926864 903981 1231642
33550 1231642 1420505 1321925 1028205 445164 -394275 -940215 -720163 -106020 138254 -86540
33540 -86540 -235118 -90219 -42464 -345506 -710673 -829753 -795842 -752426 -530357 43728
33530 43728 720554 1011545 712075 68028 -516926 -829300 -937415 -996967 -1003814 -851533
33520 -851533 -663844 -812144 -1369276 -1777944 -1452106 -582632 119470 446353 901810 1746302
33510 1746302 2409943 2245332 1467336 865563 799640 955999 1013699 1069782 1295710 1516458
33500 1516458 1355711 692309 -160333 -724243 -780103 -510653 -218936 -21263 22539 -361314
33490 -361314 -1365767 -2502370 -2856761 -2253019 -1648700 -1865957 -2367308 -1992237 -633880
33481f33880J282568M63712q1600k40236n59080r11031o28843J88769O64290M85581
33471C0250K14431J38246j09327n23590m32624K77851O51946O9362o74032n11150
33461h68637L05716O30542K0078r08504j426048j259476m45585O63672J380446
33452a907796J292124P95952N10442L65284j16502q20665j051515n48550J33165
33443a348061L62846Q6620l16695m39382j11574L75043L98464k51218r12038q02833
33433b958828q6663L70979K13530n5267M0510L12855L36120O0118k04004j51155
33423b121805K41026O35444O25530K56582m883j0960j59462n32505m80148K78545
33413a272636Q38425L62670m51672l96643K25551J18693o81649p53045K44099
$$ plain form
33481 -633880 648688 1112400 1030800 790564 231484 -679547 -1308390 -1119621 -455331 30250
33471 30250 244681 382927 273600 -249990 -682614 -404763 247183 316545 -357487 -868637
33461 -868637 -562921 67621 87699 -820805 -2246853 -3506329 -3951914 -3288242 -1907796
33452 -1907796 -615672 180280 690722 1056006 939504 118839 -932676 -1481226 -1348061
33443 -1348061 -985215 -898595 -1215290 -1654672 -1766246 -1391203 -992739 -1243957 -2155995 -2958828
33433 -2958828 -3045491 -2674512 -2460982 -2516249 -2475739 -2162884 -1826764 -1766646 -1970650 -2121805
33423 -2121805 -1880779 -1245335 -619805 -363223 -368106 -379066 -538528 -1071033 -1551181 -1272636
33413 -1272636 -434211 -71541 -523213 -919856 -694305 -575612 -1257261 -2010306 -1766207
33404a766207Q53376K02867n99294m07183J50551M1078k90144J00300P69698O24263
33394c20695p4063r0757O61412R61414K71425n18030n91737k68043j52561j88198
33384c09833l2054K88584N07847M58153O2579n84339j037745q72033k89070J15257
33374a692654J98202L42968O62080P46213L64075j36430l44940k68109j03581
33365b32176P5283K30117K80414K59065K82215L07568J85722n2826k31344k78207
33355H25831j70100J87204O41487O22812j44134r65713r17646j57408K71006n7214
33345A36125m70936l61295M0957L20416M86867N50142K60186k73623m43052j24806
33335A20981m2339n39581q04449j50212O67916M92474m21580q61750o04462n41375
$$ plain form
33404 -1766207 -912831 -709964 -1309258 -1716441 -1565890 -1524812 -1814956 -1714656 -944958 -320695
33394 -320695 -394758 -485515 175897 1137311 1408736 890706 298969 30926 -121635 -309833
33384 -309833 -341887 -53303 454544 912697 975276 390937 -646808 -1518841 -1807911 -1692654
33374 -1692654 -1494452 -1151484 -489404 256809 620884 484454 139514 -128595 -232176
33365 -232176 -156893 73224 353638 612703 894918 1202486 1388208 1335382 1104038 825831
33355 825831 655731 842935 1484422 2107234 1963100 997387 79741 -77667 193339 136125
33345 136125 -334811 -696106 -655149 -334733 152134 702276 962462 688839 245787 120981
33335 120981 78642 -460939 -1265388 -1415600 -747684 -255210 -676790 -1538540 -2143002 -2684377
33325b684377q97992p76947J71842R75048Q82406N23081O69722Q75965M23568
33316A62316k03340r3494L76343L7920j046405j516619q12361M1522J46298n0827
33306b958647J29991M23031L76626L06419N38517N47516q3420n77017o0092Q18459
33296e38617P32078j99985n80485O2868P02057N88299J95857L8736j11413l07492
33286E81903M41P91063J032113K23791o61959o66387k75267l56139n97891k37745
33276a66077L77827L23908k47753l38401K19768N99577M42818K58051K57631j4746
33266A712603o08646q05011l04217J23124k25681q73695q63203j45205M07444
33257a582487K47727j58878o1957M81438O27517n0147p55934l88744Q46884J490189
$$ plain form
33325 -2684377 -3582369 -4359316 -4187474 -3212426 -2330020 -1806939 -1137217 -261252 162316
33316 162316 -41024 -134518 241825 279745 -766660 -2283279 -3095640 -3054118 -2907820 -2958647
33306 -2958647 -2828656 -2405625 -2028999 -1722580 -1184063 -636547 -719967 -1296984 -1357076 -538617
33296 -538617 193461 -6524 -587009 -524141 177916 766215 962072 1000808 889395 581903
33286 581903 582344 1373407 2405520 2629311 1967352 1300965 1025698 669559 71668 -166077
33276 -166077 211750 535658 287905 -50496 169272 768849 1211667 1469718 1727349 1712603
33266 1712603 1103957 298946 -5271 117853 -107828 -981523 -1844726 -1989931 -1582487
33257 -1582487 -1334760 -1493638 -1555595 -1074157 -446640 -496787 -1252721 -1641465 -794581 695608
33247F95608P22853n40846r68795n13457n8927N7662K10041M58679L59678j76872
33237B45624o18199n30383n2794L68196L44028j84095o72762l54183O33533J030913
33227B09878Q0907j193302j279589k73285M47310L12988M7569J49664K10139o5881
33217a353602l13132k82108j95789r2822K78184P29580P18050L09762J27216K23378
33207A48717L5037m08807l68385K62613O36051L23132q4951j17634p0607j23946
33197B31220O4726M54415M27572n9211k74168o6928j63145o64609o90674r3688
33187h34490N7408n00962m41368P96189J592643O15175q59757r10381M3773K69294
33177a72476k73273j99337N97868P76894n4853q03300q27784o21118m13034K10135
$$ plain form
33247 695608 1418461 877615 -91180 -604637 -663564 -605902 -395861 62818 422496 245624
33237 245624 -372575 -902958 -955752 -587556 -243528 -427623 -1100385 -1454568 -821035 209878
33227 209878 290785 -902517 -2182106 -2455391 -2008081 -1695093 -1647524 -1497860 -1287721 -1353602
33217 -1353602 -1666734 -1948842 -2144631 -2237453 -1959269 -1229689 -511639 -201877 -74661 148717
33207 148717 183754 -225053 -593438 -330825 305226 628358 543407 425773 355166 231220
33197 231220 295946 750361 1177933 1118722 844554 777626 614481 -50128 -740802 -834490
33187 -834490 -777082 -1278044 -1719412 -923223 669420 1284595 424838 -485543 -441770 -172476
33177 -172476 -445749 -645086 -47218 729676 674823 -128477 -956261 -1577379 -1990413 -1780278
33167a780278J051042J221686O05723K0541k38003n85510p94478r2428J101634
33158E09929J266157J52448o07588m1252O38709J11700q86285q45979J05009N46636
33148I49484n5510q35221r34873l84900L02892O26807L01643l92777o31544L1078
33138a022921R40118J061703K62940o06063p84984l39128J19994J52973o4493
33129b79861L7739O24118J010583M71226n92909r91737l82365K31439q96n70155
33119d42818n12669J13606M31790N6235n38162p82570n44308Q282N73492Q03612
33109h33510N82954J38436l21995p93082j062655o07282O02481J602731J410309
33100G18387K87433n96617o07016r3684M56374Q95470R58639K14128j077681j725488
$$ plain form
33167 -1780278 -729236 492450 1098173 1118714 880711 295201 -499277 -591705 509929
33158 509929 1776086 1928534 1320946 1279694 1918403 2030103 1143818 297839 402848 949484
33148 949484 893974 58753 -876120 -1261020 -958128 -331321 -29678 -422455 -1053999 -1022921
33138 -1022921 -82803 978900 1241840 635777 -149207 -488335 -368341 -215368 -279861
33129 -279861 -242122 381996 1392579 1863805 1270896 279159 -103206 128233 127337 -442818
33119 -442818 -955487 -841881 -410091 -353856 -892018 -1674588 -2218896 -2210614 -1637122 -833510
33109 -833510 -250556 -112120 -434115 -1227197 -2289852 -2897134 -2294653 -691922 718387
33100 718387 1005820 409203 -197813 -291497 164877 1060347 2018986 2233114 1155433 -570055
33090e70055r05698O30859J326659O89292k51745m37480n8667N1078k20380k15054
33080C8809L04160O67671K75720m83680p46963l00742K74862M42752K43071O818
33070G22478r2508j12333j69245k46747j28443L33912Q18225P17852l9641p11074
33060A092476o42864j37115M6526k28479m36768k28008K56720P39160R28536N08658
33050A898842l73102q46537l14990M90001L68081n40043q88509j77688N19320
33041A35375K92521k77292k26646K89118M81844K50926R3334J07049m5355l79064
33031G21810n26826l69983j80864j66851k53421k62291p2370K57235M21306K17705
33021b14550o065K38214O62267M35117m28978q14001j40731O46776M95662j78398
$$ plain form
33090 -570055 -1475753 -844894 481765 1171057 919312 481832 423165 474243 253863 38809
33080 38809 342969 1010640 1286360 802680 55717 -245025 29837 472589 715660 722478
33070 722478 629970 517637 348392 101645 -26798 307114 1125339 1843191 1803550 1092476
33060 1092476 449612 312497 359023 130544 -306224 -534232 -277512 461648 1390184 1898842
33050 1898842 1525740 679203 364213 854214 1222295 682252 -206257 -383945 135375
33041 135375 427896 150604 -76042 213076 694920 945846 1039180 1146229 1100874 721810
33031 721810 194984 -174999 -355863 -522714 -776135 -1038426 -1110796 -853561 -432255 -214550
33021 -214550 -220615 17599 679866 1114983 686005 -127996 -268727 378049 873711 695313
33011F95313l03429J34136L24978J13589J8176M5814k61113o77433m46068L16548
33001c9489N70407k0029n36607k87523K27365L63974L42894N02118M22436k99483
32991A246063j040457q97153q1272L71417J18939j50708Q2133M52692M16419K8941
32981E47014l11215m51493m57190k87623J28126O03137P68849M56222j24873n79773
32971B91181o54719m26968k00389j32690P404N08296J109226J057811L5021j222033
32961C72140j614363r03796J40940P42670P80309M58412o2369m69571l27005K91140
32951e91493O80213M66569J84821L40016M52991j38124r64953r76460k20630J74362
32941e92688k12571m92306m303O29349N89865J07223j10714j3573j3260j38188
$$ plain form
33011 695313 391884 526020 850998 964587 982763 1028577 767464 90031 -356037 -39489
33001 -39489 530918 510889 -25718 -313241 -85876 278098 620992 1123110 1545546 1246063
32991 1246063 205606 -691547 -772819 -401402 -282463 -433171 -351038 101654 518073 547014
32981 547014 235799 -215694 -672884 -960507 -832381 -229244 539605 995827 870954 291181
32971 291181 -363538 -790506 -990895 -1123585 -1116181 -607885 501341 1559152 1594173 372140
32961 372140 -1242223 -2146019 -2005079 -1262409 -482100 -23688 -86057 -555628 -882633 -591493
32951 -591493 88720 555289 740110 1080126 1533117 1394993 430040 -546420 -767050 -592688
32941 -592688 -805259 -1297565 -1301868 -672519 -82654 24569 -86145 -99718 -112978 -251166
32931b51166q9116J76080M47431N59737L47356k34555o51534j48361R89973J361812
32921B507657L12752r48056r85802j21503L33954J62917J85806N00538K93292
32912B241555n61068j109373q35511l80914l41772l88185q7747K84898L38269
32903h39848K54833L27407L74572J48583j33575j57661n6334j60086m62802o60827
32893a365738n30140p4834M93656Q30934P38040L74180k4388m61026q69187q15433
32883a703936j20435N33790M40530O0417L32519R47528O63691m88261q78721J86111
32873b6767J127879M48630q50609p81245N16173R91046j89309j494340j344932
32864a603474j14030Q38800J014480Q17223N13181O4287l66216n16528m73916
$$ plain form
32931 -251166 -340282 -164202 283229 842966 1190322 955767 304233 155872 1145845 2507657
32921 2507657 2820409 1872353 886551 765048 1099002 1261919 1447725 1948263 2241555
32912 2241555 1680487 571114 -264397 -645311 -987083 -1375268 -1463015 -1178117 -839848
32903 -839848 -585015 -257608 116964 265547 131972 -25689 -82023 -242109 -704911 -1365738
32893 -1365738 -1895878 -1970712 -1477056 -646122 91918 466098 441710 -19316 -888503 -1703936
32883 -1703936 -1824371 -1290581 -850051 -789634 -457115 490413 1154104 665843 -212878 -26767
32873 -26767 1101112 1549742 699133 -82112 434061 1425107 1235798 -258542 -1603474
32864 -1603474 -1717504 -878704 135776 952999 1466180 1530467 1164251 647723 173807
32855A73807m35741k10608M09279R06465M65809o94370j219739l48363Q95940
32846e7521R94951K395o58720l36986P9835j52039l84298J53313P86828L39822
32836G67580q55516j258939l83529N39198M31473k41374m74041j61447J67335
32827a469260L65652O39081Q83768P50664K34713k56716l48391P439M94042N77299
32817A878291J2923o87939p21879n6215M68369K85168k03314l53876j53018j73
32807D68337r8140l98367p17013o66079k391P51742P35055O5001j35804N30630
32797E32971R76159L18678o49889p14341j22137L7514k71923j91568K87879K30491
32787D33834n47555j049882o62776N914K34117J35871P6346J8051p0534R7569
$$ plain form
32855 173807 -261934 -472542 -63263 843202 1309011 614641 -605098 -953461 -57521
32846 -57521 937430 939825 281105 -55881 23954 -128085 -512383 -359070 427758 767580
32836 767580 -87936 -1346875 -1730404 -1191206 -759733 -1001107 -1475148 -1636595 -1469260
32827 -1469260 -1103608 -464527 419241 1169905 1404618 1147902 799511 806950 1300992 1878291
32817 1878291 1891214 1203275 481396 425181 893550 1178718 975404 621528 468510 468337
32807 468337 370197 -28170 -745183 -1411262 -1413653 -661911 73144 138145 2341 532971
32797 532971 1509130 1827808 1177919 463578 341441 378955 107032 -84536 203343 433834
32787 433834 -113721 -1163603 -1826379 -1820465 -1586348 -1450477 -1374131 -1356080 -1426614 -1329045
32777a329045N39739P14393K67414m27072p99042o75220j39492N99211R89746
32768b59368M93340n30699r92386m74501K54184M85739M55801M50856L9983r03717
32758i80768j317515l36895J028410J054638j15869o21928K58393J027432L95683
32749C91581o87866o17838L00490M08660o07398j181390k34701J260585J707539
32740G39662R24588j8478l76409l00930j72390j53829l08680n25989l92826K87475
32730b97806R40605Q17349J00481k97010r6373j1611m92776r29927o21670J22927
32720g65811M98754L51531J31916K9371j49063l91239m11226j51915J29591K59788
32710d68303K40231K7650l64578o17689l81869K08103O35245O08308K99635L9213
$$ plain form
32777 -1329045 -789306 -74913 192501 -234571 -1033613 -1708833 -1848325 -1249114 -259368
32768 -259368 233972 -296727 -1289113 -1763614 -1509430 -1023691 -567890 -117034 -77051 -980768
32758 -980768 -2298283 -2635178 -1606768 -552130 -667999 -1289927 -1031534 -4102 391581
32749 391581 -296285 -914123 -613633 -204973 -812371 -1993761 -2228462 -967877 739662
32740 739662 1664250 1645772 1269363 968433 796043 642214 333534 -192455 -585281 -297806
32730 -297806 642799 1460148 1560629 1263619 1167246 1155635 662859 -267068 -888738 -765811
32720 -765811 -267057 84474 216390 245761 96698 -294541 -705767 -857682 -728091 -468303
32710 -468303 -228072 -200422 -565000 -1182689 -1564558 -1356455 -721210 -112902 186733 225946
32700B25946Q669J40758J39811k20849o89596p52506m13812k53000m23375k60049
32690b498003N86793J315949J047888J53194l97638m91745o20326o24044Q477
32681a519455Q09753P22428j22395m22604K39665P51327L40608k53760j79253
32672C66314J81858J32554j00382j4756J23505j18716l85567j68148J73827J0579
32662B01068m02535l45048J45284M05996K48709N1073m4486j99393l04330j04946
32652c48608K18497K80803J48148J22274R0580k15402n38331m23399n5484q098
32642g29020k85600l65671r3621J95869L38314L90155J66571m77329j032534q51066
32632b743932j75864K24960L22690O89588J158312Q70984j07057m97778L33079
$$ plain form
32700 225946 234615 375373 515184 294335 -395261 -1147767 -1561579 -1814579 -2237954 -2498003
32690 -2498003 -1911210 -595261 452627 605821 208183 -283562 -903888 -1527932 -1519455
32681 -1519455 -709702 12726 -109669 -532273 -292608 458719 799327 545567 366314
32672 366314 548172 680726 580344 565588 689093 570377 184810 16662 190489 201068
32662 201068 -201467 -546515 -401231 4765 253474 304547 260061 60668 -243662 -348608
32652 -348608 -130111 150692 298840 421114 511694 296292 -242039 -665438 -720922 -729020
32642 -729020 -1014620 -1380291 -1473912 -1278043 -939729 -549574 -383003 -860332 -1892866 -2743932
32632 -2743932 -2919796 -2694836 -2372146 -1682558 -524246 346738 239681 -258097 74982
32623G4982J335229J274883L51863m23466o69922o59585n59308m40719n24963
32614b41006p18122m35774M28660R67043M83957l37251m37066j1191k0383m62556
32604g83689m46923J07718K43516l09510n05797L00942J129079P52440m62417
32595B5359j114266p15976n9598K07553L51519P00691Q85182M44545l05794o19774
32585b00559l56207j19750l11781n11988j03544P51063J190776P30112j22998
32576I45124n29167l31233p1464j21032k30833o8833J81098R6948k83509m46342
32566h59243j21826L19002L72763Q3876m4012K70432P43485Q78480M78283k15896
32556A905344p34091p07333j76689L60383L74024j50336p17242q99942p25760
$$ plain form
32623 74982 1410211 2685094 3036957 2613491 1943569 1283984 724676 283957 -241006
32614 -241006 -959128 -1394902 -966242 801 484758 147507 -289559 -300750 -321133 -783689
32604 -783689 -1230612 -1122894 -879378 -1188888 -1694685 -1393743 -264664 487776 25359
32595 25359 -1088907 -1804883 -1864481 -1656928 -1305409 -604718 280464 725009 419215 -200559
32585 -200559 -556766 -676516 -988297 -1500285 -1603829 -852766 338010 1068122 945124
32576 945124 415957 84724 13260 -107772 -338605 -407438 -226340 -129392 -412901 -859243
32566 -859243 -981069 -662067 -289304 -205428 -249440 20992 764477 1642957 2121240 1905344
32556 1905344 1171253 463920 287231 647614 1021638 871302 154060 -745882 -1471642
32547a471642m46920j85004O5457K94856M83005N79988M45105P7349j00304L29386
32537G1276R54892Q03092k23651r09288l54355O45780P55982N8622l17934j58528
32527A325888l16640r19266r62452j21335M87914R9402m34774j37510M59240L56179
32517a63354j62500j77540J54964K6559l30378K4488Q26618O71404p05885j695044
32507a530668r98474N93508J381648Q69568o7139n08487k59135L12780O04540
32498C98141K01322o16428j033259o37110J14993N70212O03450M33562J81278
32489B16161o2645j11598N8601K20468K47667K19106R7039k20553m65215k35222
32479c6191K26812K38055j68503j84650L58985N46284r4674o71712l63815K12585
$$ plain form
32547 -1471642 -1918562 -2103566 -2038109 -1743253 -1260248 -680260 -235155 -157806 -258110 71276
32537 71276 1026168 1829260 1605609 696321 341966 987746 1743728 1802350 1484416 1325888
32527 1325888 1009248 89982 -872470 -993805 -505891 -406489 -841263 -978773 -519533 -163354
32517 -163354 -325854 -503394 -348430 -321871 -652249 -627761 198857 870261 164376 -1530668
32507 -1530668 -2529142 -1935634 -553986 315582 248443 -260044 -519179 -206399 398141
32498 398141 599463 -16965 -1050224 -1687334 -1572341 -1002129 -398679 34883 216161
32489 216161 153516 41918 100519 320987 568654 787760 884799 664246 199031 -36191
32479 -36191 190621 428676 260173 75523 434508 980792 886118 214406 -149409 63176
32469F3176J25433k63200p8025L91426K59388j88426Q9038Q81481Q13105l98200
32459A695196j361201j126362m23872j60590l3605M77069Q67277M45515l63428
32450A5999o20694k82231n1314j64625k00239P6917M01297M70108K20582k28857
32440c63057n47149l47141K84497P49131P57632P16165Q71545O79908k89348j343936
32430A168247j441900o55781N0754L07386N86672R74069P92428j64183r43400
32421F74292o49722K18862L87027m70876j294055j006057J61614J016270Q70864
32412i1781K66219J02297M01488M09476j57044o15652l62616J64734J49723l37081
32402g0237m57554R2242O17599M27546k71453p75594p59569m06495M7039M83626
$$ plain form
32469 63176 188609 -74591 -152616 238810 498198 309772 398810 1280291 2093396 1695196
32459 1695196 333995 -792367 -1216239 -1376829 -1410434 -933365 -66088 379427 15999
32450 15999 -604695 -886926 -938240 -1102865 -1303104 -1226187 -824890 -354782 -134200 -363057
32440 -363057 -910206 -1257347 -972850 -223719 533913 1250078 2121623 2801531 2512183 1168247
32430 1168247 -273653 -929434 -878680 -571294 15378 989447 1781875 1617692 674292
32421 674292 24570 243432 630459 159583 -1134472 -2140529 -1978915 -962645 -91781
32412 -91781 174438 276735 678223 1087699 930655 315003 -47613 117121 266844 -70237
32402 -70237 -527791 -435549 182050 609596 338143 -437451 -1197020 -1603515 -1556476 -1072850
32392a072850P19465N49269J03005j15316J77922N23278J88717p25458j127906
32383g79874l19389Q46646R27040j09853p62620r7982R51018R51625j17208j096280
32373C93123j266829q66366k70700M35134J047707J127327N07864m24204j044832
32364c61776r57279l24734J48752l8926l45024K39471J492962J823502N04203
32355B181151r94569j006164o5673J55535m22838m58153K56954M40353k98320
32346b11724o93213k5184O73232M47710r0573q7100J05252j19572l82552j48073
32336e31797K19042K81570M14265P88960N57523o70483j562441q06214O92614
32327f16961J023048R5712m93167p7494M19050L94283L48448M91683K18358n20076
$$ plain form
32392 -1072850 -353385 195884 298889 183573 361495 884773 1073490 348032 -779874
32383 -779874 -1099263 -252617 674423 564570 -198050 -296032 654986 1606611 1489403 393123
32373 393123 -873706 -1740072 -2010772 -1575638 -527931 599396 1107260 683056 -361776
32364 -361776 -1319055 -1643789 -1495037 -1533963 -1878987 -1639516 -146554 1676948 2181151
32355 2181151 1186582 180418 114745 270280 -152558 -610711 -353757 86596 -211724
32346 -211724 -904937 -930121 -256889 190821 100248 13148 118400 -1172 -383724 -531797
32336 -531797 -312755 -31185 383080 1172040 1729563 1059080 -503361 -1309575 -616961
32327 -616961 406087 501799 8632 -68862 350188 744471 1092919 1584602 1802960 1282884
32317A282884p50676m1168O73403N18365r6300l76272l33088l15067j63552L06396
32307G04925N83633R9813p42571r43010j81058Q10495J085590L78773p22431j298710
32297b24551r54142k28025Q8630k3701M1809L90098L82219k55372q43896p30682
32287b357613k07479J06978K28523M70091O06139K06530m13048m29589K52919
32278a536549P57312M62019j22981j09732N21752R23692N20279k95284p22533
32269C97975n05707o7147J53182J41755O5746o4458k76387m14121l01257q967
32259h79386K38740L16757K13263k9587k40640k19033o2870q3706k25216l9322
32249a011000M61399N36495j52489p59738m03509M17268N62981M6408j07599L39260
$$ plain form
32317 1282884 532208 491040 1164443 1682808 1586508 1210236 877148 562081 398529 704925
32307 704925 1288558 1388371 645800 -297210 -478268 332227 1417817 1796590 1074159 -224551
32297 -224551 -1178693 -1406718 -1318088 -1341789 -1299980 -909882 -527663 -783035 -1626931 -2357613
32287 -2357613 -2565092 -2458114 -2229591 -1759500 -1153361 -946831 -1359879 -1789468 -1536549
32278 -1536549 -779237 -317218 -440199 -549931 -28179 895513 1415792 1120508 397975
32269 397975 -107732 -174879 -21697 120058 185804 121346 -155041 -569162 -870419 -879386
32259 -879386 -640646 -323889 -110626 -140213 -380853 -599886 -662756 -746462 -971678 -1011000
32249 -1011000 -549601 -13106 -165595 -925333 -1328842 -911574 -348593 -302185 -409784 -70524
32239g0524M92949m8036m96378k34887K43740K94662L6150k40114o13684r05549
32229a541671n01245M90156R00376J81169n54887j97866N87547N12617k05920
32220c29724l68936P5822Q7644m58859n12761K21193O90510L17564l9375L22427
32210E505O88371K45752l77564j13539O84853P12517k16371q49594l84970M26317
32200H21277N11231l5684l69737k70262k68071n42868n39042M0672N27911J77711
32190E3138n98424o64194J96589Q80372N23842k74823m15905P3639K44114j95762
32180a77414n03581k29778M3807k35892n70121j88089O24788Q55810K87431j82312
32170b75351Q4712N50631M09803j85821m69257k72516j18700j97544q3444L50561
$$ plain form
32239 -70524 422425 374389 -121989 -356876 -113136 181526 217676 -22438 -636122 -1541671
32229 -1541671 -2042916 -1552760 -652384 -471215 -1026102 -1223968 -636421 -123804 -329724
32220 -329724 -698660 -622838 -535194 -994053 -1506814 -1285621 -595111 -277547 -316922 5505
32210 5505 693876 939628 562064 448525 1133378 1845895 1629524 779930 394960 821277
32200 821277 1332508 1296824 927087 656825 388754 -154114 -693156 -652484 -124573 53138
32190 53138 -545286 -1209480 -1012891 -132519 391323 116500 -299405 -225766 18348 -177414
32180 -177414 -680995 -910773 -866966 -1102858 -1672979 -1861068 -1236280 -380470 -93039 -275351
32170 -275351 -190639 359992 769795 583974 114717 -157799 -276499 -474043 -557487 -206926
32160b06926N51192K39386Q441L22836N54396q7219j079215j115283j5379R54409
32150A26638Q14777l1920o78921p65000l31678M36447R11344M06822o19016p47677
32140d78184L36283J046692J46906j225917j146812K33224J015215L89002n31332
32131b14923p34066n49011m73817k05685M68251R33135O83360J89255J20555L52859
32121E69913L79047J50323p1670k13175k36998K5485M30866M16918j87310p43442
32111E19957o76424k60706l7288J4876J43796J88252l6017j60283J77156N52892
32101D26211L35270k28175l45062M0271J73901k62093o55081m29408J58541M94229
32091b91396L89180J02355q0201n5539P7631Q7300j30765l68355l72158j77852
$$ plain form
32160 -206926 344266 583652 592093 914929 1469325 1382106 302891 -812392 -827771 126638
32150 126638 941415 909495 230574 -534426 -866104 -429657 481687 888509 269493 -478184
32140 -478184 -141901 904791 1051697 -174220 -1321032 -1087808 -72593 316409 -214923
32131 -214923 -948989 -1498000 -1971817 -2177502 -1709251 -776116 -92756 96499 217054 569913
32121 569913 948960 1099283 1027613 814438 577440 602925 1033791 1450709 1263399 519957
32111 519957 -156467 -417173 -454461 -439585 -295789 -107537 -143554 -303837 -126681 426211
32101 426211 761481 533306 188244 228515 402416 140323 -514758 -944166 -785625 -291396
32091 -291396 97784 200139 119938 64399 142030 229330 98565 -269790 -641948 -819800
32081h19800O0903L34452N09254J56917p35434j213670m13567R54648J258079
32072I1782K27245n88338j25599O38980L48173n54472o25774J91429N01409k93368
32062a88533j092238p85770L00026J156140J357551J003184K06031o62703q71255
32053D22433k27176L97106J63734n27745o91744k17670J92082K55774K88194K55512
32043C10500k49108r28663p69747M33307J450475J148986k4266p56438n24285
32034I0761J45114O26571O81517K89982k94419n05302j03837L29262J54578l17485
32024A096742l26178K8418q3336p43923r68746k16062P04872Q27109L76954J76940
32014H72790K76410J09606k86341k47486K77745M46700j57191p41861m50950L19996
$$ plain form
32081 -819800 -758897 -424445 84809 241726 -493708 -1707378 -2120945 -1166297 91782
32072 91782 319027 -269311 -394910 244070 592243 37771 -588003 -396574 104835 -188533
32062 -188533 -1280771 -2066541 -1766515 -610375 747176 1750360 1956391 1293688 422433
32053 422433 195257 592363 756097 228352 -463392 -681062 -488980 -233206 54988 310500
32043 310500 61392 -867271 -1637018 -1203711 246764 1395750 1371484 615046 90761
32034 90761 235875 862446 1543963 1833945 1539526 1034224 930387 1259649 1414227 1096742
32024 1096742 770564 798982 715646 -28277 -997023 -1213085 -508213 318896 695850 872790
32014 872790 1149200 1258806 972465 724979 1002724 1449424 1292233 550372 99422 419418
32004D19418N48519J59541J1419L47026L18644n33731j273377q51644K21824N37624
31994i4737j40246n91542n1465O88277N87728j06859l85523J8210M49721M14254
31984G87818J16219m7916M107R8272L2972k64364o12176o96355m53711j45408
31974a180542M5975J76234K16784O1808l544M71886J108053P76540p15292j892025
31964i34123j465227j54627M73846L17216M50908R64620P98394k04202p78573
31955e31768k49032M28903L26552p1285o699J70407j72749o18554l49429M22761
31945f50893P69940M60517Q3040m6042j96395m77780n50395k12788K34080L60575
31935b26141R4971j88730L343O93396J163952O88652m17560j067528q71134n80387
$$ plain form
32004 419418 967937 1127478 1138897 1485923 1804567 1270836 -2541 -854185 -632361 -94737
31994 -94737 -234983 -826525 -877990 -189713 398015 291156 -94367 -76157 373564 787818
31984 787818 904037 856121 860228 958500 991472 727108 114932 -581423 -1035134 -1180542
31974 -1180542 -1134567 -958333 -741549 -679741 -683285 -211399 896654 1673194 957902 -934123
31964 -934123 -2399350 -2553977 -2080131 -1762915 -1312007 -347387 451007 246805 -531768
31955 -531768 -780800 -351897 -25345 -96630 -103329 67078 -105671 -724225 -1073654 -650893
31945 -650893 119047 579564 662604 616562 420167 -57613 -608008 -820796 -586716 -226141
31935 -226141 -131170 -319900 -316557 376839 1540791 2229443 1811883 744355 -126779 -707166
31925g07166p41027p94171j67412N71903N78365J27700J10451N34283O25801K12638
31915C51365j01435j09073k58019n85380m46067L06183P76385K67805n79684n84157
31905i62077L76845J196047R09036k11996j019246p13876L75581J153191Q52510
31896A956015k14334j006227q32859l3574M54575J71373l68477m02653J3649J30261
31886a32251k50148l47903K92392Q00733K22784p45657n68201P11033J328804
31877A311586L89934q56794r88476l28096L5625k994N4843Q5492k62126n75778
31867a136784k58749L83307O74234O70865P22656N39225j58708o57566k09886
31858E68594N31194M09030l34338n15847l0094J60584j39434j63132K13797K90058
$$ plain form
31925 -707166 -1448193 -2242364 -2409776 -1837873 -1259508 -1131808 -1021357 -487074 138727 351365
31915 351365 249930 140857 -117162 -702542 -1148609 -842426 -66041 201764 -377920 -962077
31905 -962077 -585232 610815 1519851 1307855 288609 -425267 -49686 1103505 1956015
31896 1956015 1741681 735454 -97405 -130979 323596 494969 126492 -276161 -262512 -132251
31886 -132251 -382399 -730302 -437910 362823 585607 -160050 -728251 -17218 1311586
31877 1311586 1701520 844726 -143750 -471846 -436221 -439215 -384372 -298880 -561006 -1136784
31867 -1136784 -1395533 -1012226 -337992 332873 1055529 1594754 1436046 778480 568594
31858 568594 1099788 1508818 1174480 658633 628539 789123 649689 486557 700354 990412
31848I90412K6726J03634L77568k6233q83593r25130n7859L55363o6380m5205
31838a50697Q13064R60863l67797j441890p18507N65775N00622l12680k7517J068459
31828H89695J037171k97976r94635j81081P07381M21383l61552n97021n05136
31819A18229o33474o16820j0232N89786L96678k13415k54792L33345O68295K96222
31809F73822k52865l46582m5035J79608R8307j26837k32176j26012L3387j0666
31799a55049k77264l92915m669N98961O19042k19004j057387q57638J57726P10554
31789h77643K32689l83672k22195L02389K94792j09324j25991K43732L46303J87352
31779a11568L45881O65591L85731l28883m20829K00879L14508n74637j317346
$$ plain form
31848 990412 1017138 1120772 1498340 1472107 588514 -336616 -394475 -39112 -105492 -150697
31838 -150697 662367 1623230 1255433 -186457 -904964 -339189 161433 -151247 -178764 889695
31828 889695 1926866 1628890 634255 453174 1160555 1581938 1220386 623365 118229
31819 118229 -515245 -1132065 -1142297 -552511 -155833 -369248 -624040 -290695 377600 673822
31809 673822 420957 74375 29340 208948 307255 180418 -51758 -177770 -144383 -155049
31799 -155049 -432313 -825228 -829897 -230936 388106 169102 -888285 -1745923 -1588197 -877643
31789 -877643 -644954 -1028626 -1250821 -948432 -653640 -762964 -888955 -645223 -298920 -111568
31779 -111568 234313 899904 1285635 956752 535923 736802 1051310 476673 -840673
31770h40673r87610k51721M6451K77916Q67096J059777K56754n39084j74502O56289
31760C70693N19313l69646o13204r689L19199m6406l77312l33399l59665m77490
31750a377606j57790M80843P25900O06193P92576J103323O00392o33254j324166
31741H16411r39232l37376j38662P3787M78473M64831l9680j59123L23182L92374
31731I34985l80581r10782m27093K05256R8630j01105M08903R08861L83065n82063
31721E38076p43694k63024j79722m44361j75954N16000O73640K71842K12144N71579
31711I76526M78734j41559l20589J30662J36727p23387j290344o68305K60591
31702a160944K23607m98959o83210o9906N26351O76900P54794R13917O77210j63720
$$ plain form
31770 -840673 -1828283 -2080004 -2033553 -1755637 -888541 171236 427990 -111094 -285596 370693
31760 370693 890006 520360 -92844 -102533 216666 170260 -207052 -540451 -900116 -1377606
31750 -1377606 -1535396 -1054553 -328653 277540 1070116 2173439 2773831 2140577 816411
31741 816411 -122821 -460197 -598859 -525072 -46599 418232 378552 219429 542611 934985
31731 934985 554404 -356378 -783471 -578215 -479585 -580690 -171787 737074 1120139 538076
31721 538076 -205618 -468642 -648364 -1092725 -1268679 -752679 -79039 192803 404947 976526
31711 976526 1455260 1313701 993112 1123774 1260501 537114 -753230 -1421535 -1160944
31702 -1160944 -937337 -1436296 -2119506 -2189412 -1663061 -986161 -231367 682550 1359760 1196040
31692A196040r63969r71897k62582M44508O60320M77947J82764j05332l24767
31683C33032l30870j24272m0094l44362o93918m62966K68898N84121m3742q45432
31673a699605o75230M30364J302466J173890M54905j07761l27105l54765k17188
31664b0029k4920j43617o29296q73656l90207L33605M24594r8788l72640k5627
31654a820581L26855J97806O1803M79844R66521N82914n41538j160241n27107
31645a433724O55525J218883Q86343K46810j66870k68187j71383m6483p8405k16520
31635F25989j51157J56447K42965j41366m76391k43166J07919k01162q67153p70117
31625a717192K51640R53319M34489n77087q24165j93948M35049N13111K29373
$$ plain form
31692 1196040 232071 -739826 -1002408 -557900 102420 580367 763131 657799 333032
31683 333032 2162 -122110 -162204 -506566 -1200484 -1663450 -1394552 -810431 -854173 -1699605
31673 -1699605 -2374835 -1944471 -642005 531885 986790 879029 551924 197159 -20029
31664 -20029 -44949 -188566 -817862 -1691518 -2081725 -1748120 -1323526 -1422314 -1794954 -1820581
31654 -1820581 -1493726 -1295920 -1234117 -754273 212248 795162 253624 -906617 -1433724
31645 -1433724 -778199 440684 1327027 1573837 1406967 1138780 967397 920914 842509 625989
31635 625989 474832 631279 874244 732878 256487 13321 121240 -79922 -947075 -1717192
31625 -1717192 -1465552 -512233 -77744 -654831 -1478996 -1672944 -1237895 -724784 -495411
31616d95411r4078l16773l16164m7037L02851N43367O70450N86533N8537o75258
31606B17017p98978j6306P35152M28364n66851j002750n01365J70736M67992O64156
31596b02833R42337Q84366K68594l90246n50585l19930n9626J36496K23732J9576
31586I51881l80913n12450k40953m3301j98560k81455K9270K33822j91818p50827
31576a385304n27492M07183J042252Q16336J71401l18382n98793p44528o22822
31567a760149k49138P3254K43703M75464O75685L47935m76781q56689j40353R28737
31557g38332J100999L25518l10004k49014j10870m59398q48612o28853k2368K88730
31547a652204K14105J86928L11495L16132K55938M95252Q74551O31108m73550
$$ plain form
31616 -495411 -589489 -906262 -1222426 -1269463 -966612 -423245 247205 833738 892275 217017
31606 217017 -581961 -598267 136885 565249 -1602 -1004352 -1505717 -1334981 -866989 -202833
31596 -202833 739504 1623870 1892464 1502218 951633 631703 572077 708573 932305 951881
31586 951881 570968 58518 -182435 -225736 -424296 -705751 -676481 -442659 -634477 -1385304
31576 -1385304 -1912796 -1505613 -463361 352975 524376 205994 -392799 -1137327 -1760149
31567 -1760149 -2009287 -1936033 -1692330 -1216866 -541181 -193246 -670027 -1526716 -1667069 -738332
31557 -738332 362667 688185 378181 129167 18297 -441101 -1289713 -1918566 -1940934 -1652204
31547 -1652204 -1438099 -1251171 -939676 -623544 -367606 127646 1002197 1633305 1159755
31538A159755j498720j343004j50587Q33490P45652m3344o45478p55277o64663
31529b362176m44410K63639J414982K044185J231301n04897j498093q78789L85819
31520c48439Q45716L89546r123L9055o8969o47357j024421n47118M14995R93636
31510C7521Q91400M50581K7486k06356j11198K61604M88890J93804m06412p22505
31500I04815n31983j86782p8888j73432j60593Q6296L24985K29485j71414m53185
31490b10696k79907K01492N92448O75398M02550k42141r65064j076616l12689
31481a215225N06268M30620j86152k10118L89877M73388k18658m43004L95725
31472g7279R65111R6948j104458q78610L51236O57976k93210q56602j98153N05804
$$ plain form
31538 1159755 -338965 -1681969 -1832556 -999066 -253414 -296758 -942236 -1697513 -2362176
31529 -2362176 -2806586 -2542947 -1127965 916220 2147521 1642624 144531 -734258 -348439
31520 -348439 497277 886823 877700 916755 847786 200429 -823992 -1371110 -956115 37521
31510 37521 928921 1379502 1406988 1200632 1089434 1351038 1839928 2033732 1627320 904815
31500 904815 372832 186050 107162 -66270 -226863 -140567 184418 413903 242489 -210696
31490 -210696 -490603 -289111 303337 978735 1381285 1139144 174080 -902536 -1215225
31481 -1215225 -708957 -278337 -464489 -674607 -284730 188658 -30000 -473004 -77279
31472 -77279 887832 984780 -119678 -998288 -647052 10924 -282286 -1138888 -1337041 -831237
31462h31237K44453k08955J53883P92459O23634j35251m34505j43082o0084l97027
31452c95712m34830J76824P51169N89858R654j85708J05783K23867j67471n23255
31442A50179k57357L06172M21131J30248J50400N01656L11062n58378q48883J41606
31432D47836J004733J30757j527534j529880L52000J620410P37229p03437n89547
31423e7433O19192R73350L8172r08140j040078p05295k51980L70809Q40442N75244
31413D54283k08101n83928k24000K74967M42103L88625J34121n01265j093779
31404i16974p45554N21062J416993J040304J00697k11427Q9646J04181l85131
31395A013797o57186k97002J90746K30879j7820o1685J55944K84535J51607m4549
$$ plain form
31462 -831237 -586784 -795739 -641856 150603 774237 638986 204481 61399 1315 -395712
31452 -395712 -830542 -653718 97451 687309 696963 511255 617038 840905 673434 150179
31442 150179 -107178 198994 620125 750373 900773 1402429 1713491 1155113 306230 447836
31432 447836 1452569 1583326 55792 -1474088 -1122088 498322 1235551 532114 -57433
31423 -57433 561759 1535109 1573281 665141 -374937 -1080232 -1332212 -961403 -120961 454283
31413 454283 246182 -337746 -561746 -286779 155324 543949 678070 176805 -916974
31404 -916974 -1662528 -1141466 275527 1315831 1416528 1205101 1294747 1398928 1013797
31395 1013797 356611 59609 250355 481234 463414 401729 557673 842208 993815 949266
31385I49266p6678K9357O9716j22585n23071q67065q22291l63326J04929K19846
31375a401902J85720M81522J020010J067722K65895o91158q53416k19001L86284
31366B41676M71182L19602K81097K48987L3582k49578m22786n04177n11232l51282
31356d42929r2131Q994p4496n3999J60750K63205P9367j15658o0038J22838K67288
31345F3191M29376N21079K06505m28904o51498q9195N15884K77489m71671o16023
31335b43767J16026Q38992Q65442N09601K55422j00969q99681j683948j557969
31326a900851m59569N17427L83555m62865o74538L11325J475707J485099L65346
31317A040636o66646q32250n06189k83374j63784K5611J37825J04684K18796N20459
$$ plain form
31385 949266 872588 901945 971661 849076 326005 -541060 -1363351 -1726677 -1621748 -1401902
31375 -1401902 -1216182 -734660 285350 1353072 1618967 927809 74393 -144608 241676
31366 241676 712858 1032460 1313557 1562544 1596126 1346548 923762 419585 -91647 -442929
31356 -442929 -535060 -526066 -600562 -654561 -493811 -230606 -151239 -266897 -326935 -204097 63191
31345 63191 492567 1013646 1220151 791247 139749 50554 566438 843927 372256 -243767
31335 -243767 -127741 711251 1576693 2086294 2341716 2240747 1341066 -342882 -1900851
31326 -1900851 -2360420 -1842993 -1459438 -1922303 -2596841 -2285516 -809809 675290 1040636
31317 1040636 373990 -458260 -964449 -1247823 -1411607 -1385996 -1248171 -1143487 -924691 -404232
31307d04232M88568r7372n70642l27372J66473J03483l63069m14514J33278P06289
31297e79110R53772R82452P42126P7296o21911o85907j67267J89013M6710j99864
31287G37310k65665l35969m46470k96184Q8432K29718O698q2973K44628N81266
31277D60791M80126N4035l27607m55601k54224J35418J99155l67953r08652m82195
31267a466707O03072R81653K77034k16468M31737J204542O63578p67697j367542
31258C43202n78075M10688N35283J29390r484J21013J951m15918o42160m18190
31248e22300o5510J7928j13067j50341q3699j82621m11137l35695J30534M00198
31238a315710J18441j07856L47004Q76287M06723p56931j128708k35934P12781
$$ plain form
31307 -404232 84336 -13036 -583678 -911050 -744577 -641094 -1004163 -1418677 -1285399 -579110
31297 -579110 374662 1357114 2099240 2176536 1554625 868718 701451 890464 937174 737310
31287 737310 471645 135676 -310794 -606978 -518546 -288828 -282130 -365103 -120475 460791
31277 460791 940917 994952 667345 211744 -42480 92938 292093 -75860 -984512 -1466707
31267 -1466707 -863635 118018 395052 178584 610321 1814863 2478441 1710744 343202
31258 343202 -234873 175815 711098 840488 831004 952017 953968 538050 -104110 -522300
31248 -522300 -587810 -569882 -682949 -833290 -916989 -1099610 -1510747 -1846442 -1715908 -1315710
31238 -1315710 -1197269 -1305125 -958121 -81834 324889 -432042 -1560750 -1796684 -1083903
31229a083903P80546N47434O53369M68890n80161j468844q80112O12620J243293
31220B93132O00080o6926k288J27810k84685p60878p02849l09464L6118M02861
31210f67089P80530P09893N5535n11364m20776m2692j2252k19731j50543J51967
31200c26522K01890m7543j46945N1357J72388Q809j02814J62200N68188O33222
31190A174230K67226k00305m92186n64570l75876J26871O61516O39334j12772
31181A123468q96643q52539l7124O56971O41863K10419p9973o4828J44189L98835
31171A244638M09345o1499o32173n28801K67119P61656L33657l35331m08341k50751
31161G99519o58274j281911j051030M6547Q45422P07267K04000o0115j77688j85619
$$ plain form
31229 -1083903 -303357 244077 897446 1366336 786175 -682669 -1562781 -950161 293132
31220 293132 893212 826286 823998 951808 667123 -93755 -796604 -1106068 -1069950 -667089
31210 -667089 113441 823334 878869 367505 -53271 -95963 -108215 -327946 -478489 -326522
31200 -326522 -124632 -172175 -319120 -267763 -95375 -86566 -189380 -27180 541008 1174230
31190 1174230 1441456 1241151 748965 184395 -191481 -64610 596906 1236240 1123468
31181 1123468 226825 -625714 -662838 -5867 635996 846415 766442 701614 845803 1244638
31171 1244638 1653983 1592484 960311 431510 698629 1460285 1793942 1458611 1050270 799519
31161 799519 141245 -1140666 -2191696 -2145149 -1299727 -592460 -388460 -448575 -626263 -811882
31151h11882K83145J058208J155289J72502q36194o94707K82746Q29954M42183
31142A881244k67843o52586o59864m41678k9084M57123O94078M26378k81872j035637
31132I0259j303528q42277l1968M76418N27345N08304N66051L44701k48619o53654
31122e66968m85592j80220k35715l30487Q6690P27118P98357J92751m38910o64064
31112a097040n61566j65464N38348J078210Q68273K46316K10462Q37238R45883
31103B900660j05984j221708j050746l309L58301l28629p21062J49648J363515
31094A340686J365039R7996r69010p95192K8154K44523m33332j115586r78997
31085a215719k34119L04513L04505K04790M26926O81524L93222l19904n83782
$$ plain form
31151 -811882 -528737 529471 1684760 1857262 1021068 326361 609107 1439061 1881244
31142 1881244 1613401 960815 300951 -140727 -169811 287312 981390 1407768 1125896 90259
31132 90259 -1213269 -2055546 -2087514 -1611096 -1083751 -575447 -9396 335305 86686 -566968
31122 -566968 -1052560 -1232780 -1468495 -1798982 -1712292 -985174 -186817 5934 -432976 -1097040
31112 -1097040 -1658606 -1824070 -1285722 -207512 660761 907077 1117539 1954777 2900660
31103 2900660 2794676 1572968 522222 518913 877214 548585 -172477 -22829 1340686
31094 1340686 2705725 2803721 1834711 1039519 1067673 1312196 878864 -236722 -1215719
31085 -1215719 -1449838 -1145325 -840820 -636030 -209104 472420 865642 545738 -38044
31076c8044P8009R07484P51656l62074j133451p01806J63764J58285o81504j030298
$$ plain form
31076 -38044 39965 947449 1699105 1337031 203580 -498226 -334462 -176177 -857681 -1887979
$$ [...]
##END NTUPLES=NMR SPECTRUM
##END=
