##TITLE=31Pdec_LY-TMF-8.24.R.t
 D2O, 24 sc
 2.3.2020
##JCAMPDX= 6.0         $$ Bruker NMR JCAMP-DX V2.0
##DATA TYPE= NMR SPECTRUM
##DATA CLASS= NTUPLES
##ORIGIN= UXNMR, Bruker Analytische Messtechnik GmbH
##OWNER= root
$$ XWIN-NMR		Version 3.5
$$ Mon Mar  2 14:50:31 2020 Russian Standard Time (UT+4h)  she@DPX200
##.OBSERVE FREQUENCY= 81.013821
##.OBSERVE NUCLEUS= ^31P
##.ACQUISITION MODE= SIMULTANEOUS
##.ACQUISITION SCHEME= undefined
##.AVERAGES= 24
##.DIGITISER RES= 17
##SPECTROMETER/DATA SYSTEM= spect
##.PULSE SEQUENCE= zgpg30
##.SOLVENT NAME= D2O
##.SHIFT REFERENCE= (INTERNAL, D2O, 0, 182.463)
##AUDIT TRAIL= $$ (NUMBER, WHEN, WHO, WHERE, WHAT)
$$ ##TITLE= Audit trail, XWIN-NMR		Version 3.5
$$ ##JCAMPDX= 5.01
$$ ##ORIGIN= Bruker BioSpin GmbH
$$ ##OWNER= she
$$ F:/spectra/data/she/nmr/P31/1/pdata/1/auditp.txt
$$ ##AUDIT TRAIL=  $$ (NUMBER, WHEN, WHO, WHERE, WHAT)
(   1,<2020-03-02 14:49:26.29 +0400>,<she>,<DPX200>,
      <created by zg, POWCHK disabled, PULCHK disabled
       configuration hash MD5:
       00 E9 B6 7A A2 85 ED C7 34 08 36 98 17 FE 4E 26
       data hash MD5: 32K
       E7 86 F3 C8 1D 8D DD 04 90 6F 55 D3 09 82 21 C8>)
(   2,<2020-03-02 14:49:28.54 +0400>,<she>,<DPX200>,
      <Start of raw data processing
       efp BC_mod = 2 LB = 1 FT_mod = 6 PKNL = 1 PHC0 = -1323.284 PHC1 = 69.80157 SI = 64K 
       data hash MD5: 64K
       E1 94 30 02 A3 16 46 C5 66 E3 D2 2A 87 D1 5B AC>)
(   3,<2020-03-02 14:49:48.21 +0400>,<she>,<DPX200>,
      <pk PHC0 = 32.73357 PHC1 = -62.2 
       data hash MD5: 64K
       7B B2 70 04 9E EA FA 77 01 B4 18 31 AB A5 5F 20>)
(   4,<2020-03-02 14:49:51.51 +0400>,<she>,<DPX200>,
      <abs ABSG = 5 
       data hash MD5: 64K
       87 39 1E 0C 51 15 E5 EF 0B 1D 59 D4 EF FC 77 B1>)
$$ ##END=
$$ 
$$ hash MD5
$$ BF 9A B2 44 B9 DB 43 91 D9 50 DA A0 61 5E 06 86
##$RELAX= 
##$RELAX= 
##$RELAX= 
##$RELAX= 
##$RELAX= 
##$RELAX= 
##$RELAX= 
##$RELAX= 
$$ Bruker specific parameters
$$ --------------------------
##$DU= <F:/spectra>
##$EXPNO= 1
##$NAME= <P31>
##$PROCNO= 1
##$TYPE= <nmr>
##$USER= <she>
##$AMP= (0..31)
100 100 100 100 100 100 100 100 100 100 100 100 100 100 100 100 100 100 
100 100 100 100 100 100 100 100 100 100 100 100 100 100 
##$AQSEQ= 0
##$AQ_mod= 1
##$AUNM= <au_zg>
##$AUTOPOS= <>
##$BF1= 81.014009
##$BF2= 200.13
##$BF3= 200.13
##$BF4= 200.13
##$BF5= 200.13
##$BF6= 200.13
##$BF7= 200.13
##$BF8= 200.13
##$BYTORDA= 1
##$CFDGTYP= 0
##$CFRGTYP= 5
##$CHEMSTR= <none>
##$CNST= (0..31)
1 1 145 1 1 1 1 1 1 1 1 1 1 1 1 1 1 1 1 1 1 1 1 1 1 1 1 1 1 1 1 1 
##$CPDPRG= <waltz16>
##$CPDPRG1= <>
##$CPDPRG2= <waltz16>
##$CPDPRG3= <>
##$CPDPRG4= <mlev>
##$CPDPRG5= <mlev>
##$CPDPRG6= <mlev>
##$CPDPRG7= <mlev>
##$CPDPRG8= <mlev>
##$CPDPRGB= <>
##$CPDPRGT= <>
##$D= (0..31)
0 1 0 0 0 0 0 0 0 0 0 0.03 2e-05 3e-06 0 0 0 0 0 0 0 0 0 0 0 0 0 0 0 0 
0 0 
##$DATE= 1583146165
##$DBL= (0..7)
120 120 120 11 120 120 24 19 
##$DBP= (0..7)
150 150 150 150 150 150 150 150 
##$DBP07= 0
##$DBPNAM0= <>
##$DBPNAM1= <>
##$DBPNAM2= <>
$$ [...]
##$SUBNAM3= <"">
##$SUBNAM4= <"">
##$SUBNAM5= <"">
##$SUBNAM6= <"">
##$SUBNAM7= <"">
##$SUBNAM8= <"">
##$SUBNAM9= <"">
##$SW= 369.568048894756
##$SWIBOX= (0..15)
0 1 3 0 0 0 0 0 0 0 0 0 0 0 0 0 
##$SW_h= 29940.119760479
##$TD= 32768
##$TD0= 1
##$TE= 0
##$TE2= 300
##$TE3= 300
##$TEG= 300
##$TL= (0..7)
0 120 53 12 22 120 120 120 
##$TP= (0..7)
150 150 150 150 150 150 150 150 
##$TP07= 0
##$TPNAME0= <>
##$TPNAME1= <>
##$TPNAME2= <>
##$TPNAME3= <>
##$TPNAME4= <>
##$TPNAME5= <>
##$TPNAME6= <>
##$TPNAME7= <>
##$TPOAL= (0..7)
0.5 0.5 0.5 0.5 0.5 0.5 0.5 0.5 
##$TPOFFS= (0..7)
0 0 0 0 0 0 0 0 
##$TUNHIN= 0
##$TUNHOUT= 0
##$TUNXOUT= 0
##$USERA1= <user>
##$USERA2= <user>
##$USERA3= <user>
##$USERA4= <user>
##$USERA5= <user>
##$V9= 5
##$VALIST= <valist>
##$VCLIST= <CCCCCCCCCCCCCCC>
##$VD= 0
##$VDLIST= <DDDDDDDDDDDDDDD>
##$VPLIST= <PPPPPPPPPPPPPPP>
##$VTLIST= <TTTTTTTTTTTTTTT>
##$WBST= 1024
##$WBSW= 4
##$XGAIN= (0..3)
0 0 0 0 
##$XL= 0
##$YL= 0
##$YMAX_a= 17546
##$YMIN_a= -17880
##$ZGOPTNS= <>
##$ZL1= 120
##$ZL2= 120
##$ZL3= 120
##$ZL4= 120
##$ABSF1= 182.463
##$ABSF2= -187.1042
##$ABSG= 5
##$ABSL= 3
##$ALPHA= 0
##$AQORDER= 0
##$ASSFAC= 0
##$ASSFACI= 0
##$ASSFACX= 0
##$ASSWID= 0
##$AUNMP= <proc_1d>
##$AZFE= 0.1
##$AZFW= 0.5
##$BCFW= 0
##$BC_mod= 2
##$BYTORDP= 0
##$COROFFS= 0
##$CY= -3
##$DATMOD= 1
##$DC= 0
##$DFILT= <>
##$DTYPP= 0
##$F1P= 0
##$F2P= 0
##$FCOR= 1
##$FTSIZE= 65536
##$FT_mod= 6
##$GAMMA= 0
##$GB= 0
##$INTBC= 1
##$INTSCL= 5.30512e-09
##$ISEN= 30
##$LB= 1
##$LEV0= 0
##$LPBIN= 0
##$MAXI= 10000
##$MC2= 0
##$MEAN= 0
##$ME_mod= 0
##$MI= 50
##$NCOEF= 0
##$NC_proc= -4
##$NLEV= 6
##$NOISF1= 182.463
##$NOISF2= 159.3651
##$NSP= 0
##$NTH_PI= 0
##$NZP= 0
##$OFFSET= 182.463
##$PC= 4
##$PHC0= -1290.551
##$PHC1= 7.601566
##$PH_mod= 1
##$PKNL= yes
##$PPARMOD= 0
##$PSCAL= 0
##$PSIGN= 0
##$REVERSE= no
##$SF= 81.0140089999434
##$SI= 65536
##$SIGF1= 159.3651
##$SIGF2= -187.1042
##$SINO= 113.3802
##$SIOLD= 16384
##$SREGLST= <1H.CDCl3>
##$SSB= 0
##$STSI= 65536
##$STSR= 0
##$SW_p= 29940.119760479
##$SYMM= 0
##$S_DEV= 0
##$TDeff= 32768
##$TDoff= 0
##$TI= <>
##$TILT= no
##$TM1= 0
##$TM2= 0
##$TOPLEV= 0
##$USERP1= <user>
##$USERP2= <user>
##$USERP3= <user>
##$USERP4= <user>
##$USERP5= <user>
##$WDW= 1
##$XDIM= 65536
##$YMAX_p= 386936488
##$YMIN_p= -3085099
$$ End of Bruker specific parameters
$$ ---------------------------------
##NTUPLES= NMR SPECTRUM
##VAR_NAME=  FREQUENCY,     SPECTRUM/REAL,   SPECTRUM/IMAG
##SYMBOL=    X,             R,               I
##VAR_TYPE=  INDEPENDENT,   DEPENDENT,       DEPENDENT
##VAR_FORM=  AFFN,          ASDF,            ASDF
##VAR_DIM=   65536,         65536,           65536
##UNITS=     HZ,            ARBITRARY UNITS, ARBITRARY UNITS
##FACTOR=    0.456856943014862, 1,           1
##FIRST=     14782.0589164792, 0,            0
##LAST=      -15158.0608439998, 0,           0
##MIN=       -15158.0608439998, -3085099,    0
##MAX=       14782.0589164792, 386936488,    0
$$ Real data points
##PAGE= N=1
##DATA TABLE= (X++(R..R)), XYDATA
$$ [...]
$$ plain form
36934 -99496 16483 225428 242139 129566 138938 259837 179048 -271774 -809002 -962013
36924 -962013 -593850 -70299 105471 -193573 -596776 -662917 -404805 -270568 -549366 -948028
36914 -948028 -937425 -441823 56990 131804 -106445 -256608 -172522 -65578 -152618 -405997
36904 -405997 -651650 -753678 -674236 -492701 -414610 -613924 -960573 -1034066 -589755 45539
36894 45539 266690 -86614 -528250 -566688 -317705 -234177 -395453 -437201 -178337 80820
36884 80820 43976 -122312 -71977 197313 387115 328745 104573 -156496 -335705 -260202
36874 -260202 120909 521366 560219 229051 -131252 -304278 -362471 -364380 -243716 -86535
36864 -86535 -160484 -489730 -708824 -560279 -266155 -150965 -150303 -22225 144275 30650
$$ packed form
36934i9496J15979K08945J6711j12573R372J20899q0789m50822n37228j53011
36924i62013L68163N23551J75770k99044m03203o6141K58112J34237k78798l98662
36914i48028J0603M95602M98813P4814k38249j50163Q4086J06944q7040k53379
36904d05997k45653j02028P9442J81535P8091j99314l46649p3493M44311O35294
36894D5539K21151l53304m41636l8438K48983Q3528j61276m1748K58864K59157
36884H0820l6844j66288N0335K69290J89802n8370k24172k61069j79209P5503
36874b60202L81111M00457L8853l31168l60303j73026n8193j909J20664J57181
36864h6535p3949l29246k19094J48545K94124J15190O62J28078J66500j13625
$$ plain form
36854 30650 -359873 -635389 -558598 -346980 -309331 -425690 -467815 -391886 -405312 -656255 -1002772
36843 -1002772 -1160892 -1030533 -784837 -618488 -510916 -336435 -114835 35857 157438
36834 157438 406296 700934 703788 319414 -44835 32958 422595 642993 497184 197567
36824 197567 -61552 -307215 -539046 -594670 -381189 -35567 242207 365624 327933 160304
36814 160304 -26119 -107989 -95842 -78766 -43620 66174 151098 75401 -26670 98882 316282
36803 316282 154196 -433493 -776456 -328126 503020 825574 407296 -142276 -278577 -95286
36793 -95286 98249 267690 457874 493422 238589 -74884 -136158 -21775 -24199 -129423
36783 -129423 -73308 105179 27584 -374571 -605356 -282689 259572 420919 166592 -10437
$$ packed form
36854C0650l90523k75516P6791K11618L7649j16359m2125P5929j3426k50943l46517
36843a002772j58120J30359K45696J66349J07572J74481K21600J50692J21581
36834A57438K48858K94638K854l84374l64249P7793L89637K20398j45809k99617
36824A97567k59119k45663k31831n5624K13481L45622K77774J23417l7691j67629
36814A60304j86423q1870J2147J7076L5146J09794Q4924p5697j02071J25552K17400
36803C16282j62086n87689l42963M48330Q31146L22554m18278n49572j36301J83291
36793i5286J93535J69441J90184L5548k54833l13473o1274J14383k424j05224
36783a29423N6115J78487p7595m02155k30785L22667N42261J61347k54327j77029
$$ plain form
36773 -10437 156129 445631 640190 803068 938499 806250 323625 -177234 -367872 -329173
36763 -329173 -268621 -119276 225283 519101 441428 120742 -64655 -115599 -355871 -768807
36753 -768807 -918341 -629820 -238978 19445 360549 886183 1149623 742722 292 -384608
36743 -384608 -269318 -95963 -114769 -92713 145091 349281 223915 -138166 -414886 -452963
36733 -452963 -320081 -104131 155669 405424 579003 635252 531230 230560 -184716 -491123
36723 -491123 -537767 -464453 -581797 -986673 -1382042 -1370715 -899474 -307952 67860 204729
36713 204729 248333 240689 174445 189256 438458 785728 916902 783672 643851 590907 375107
36702 375107 -145520 -690060 -922881 -873223 -740777 -547729 -280432 -126996 -220509 -350974
$$ packed form
36773a0437J66566K89502J94559J62878J35431j32249m82625n00859j90638L8699
36763c29173O0552J49345L44559K93818p7673l20686j85397n0944k40272m12936
36753g68807j49534K88521L90842K58423L41104N25634K63440m06901p42430l84900
36743c84608J15290J73355j8806K2056K37804K04190j25366l62081k76720l8077
36733d52963J32882K15950K59800K49755J73579N6249j04022l00670m15276l06407
36723d91123m6644P3314j17344m04876l95369J1327M71241N91522L75812J36869
36713B04729M3604p644o6244J4811K49202L47270J31174j33230j39821n2944k15800
36702C75107n20627n44540k32821M9658J32446J93048K67297J53436r3513j30465
$$ plain form
36692 -350974 -298142 -239327 -406482 -557853 -333828 332 -190116 -896496 -1358416 -1120638
36682 -1120638 -595095 -322310 -231528 17414 419803 743933 906308 882118 578654 126549
36672 126549 -60615 128853 236406 -49256 -308723 -35017 508016 689377 490045 379577
36662 379577 399565 156797 -290273 -354127 95906 407886 120300 -366296 -476107 -276944
36652 -276944 -159519 -142814 -18121 123048 35808 -174809 -171881 82282 320468 430777
36642 430777 535578 633320 532486 191804 -175199 -405798 -555515 -692389 -734551 -579819
36632 -579819 -255709 109585 356818 346044 85520 -183276 -171718 168248 645185 1069781
36622 1069781 1338934 1332906 970166 414948 22717 -25793 99701 143187 56420 -69503
$$ packed form
36692c50974N2832N8815j67155j51371K24025L34160j90448p06380m61920K37778
36682a120638N25543K72785R0782K48942M02389L24130J62375k4190l03464m52105
36672A26549j87164J89468J07553k85662k59467K73706N43033J81361j99332j10468
36662C79577J9988k42768m47070o3854M50033L11980k87586m86596j09811J99163
36652b76944J17425J6705J24693J41169q7240k10617K928K54163K38186J10309
36642D30777J04801R7742j00834l40682l67003k30599j49717j36874m2162J54732
36632e79819L24110L65294K47233j0774k60524k68796J1558L39966M76937M24596
36622A069781K69153o028l62740n55218l92231m8510J25494M3486q6767j25923
$$ plain form
36612 -69503 -223799 -459611 -704579 -742912 -437669 82581 505990 617315 483428 330220
36602 330220 250362 128352 -103041 -268126 -160002 131919 304701 243615 136363 140362
36592 140362 146441 1460 -196331 -212530 -19973 151402 116234 -44226 -104602 39107
36582 39107 279413 437647 443416 365823 298739 263236 234701 205965 163737 44269 -197556
36571 -197556 -481332 -647959 -618321 -428017 -118676 278905 626717 697781 427778 64614
36561 64614 -60407 114903 357663 451936 433812 480708 634489 714467 531404 146407
36551 146407 -166055 -235677 -169125 -115153 10204 341562 671990 583268 77412 -261927
36541 -261927 -11421 454338 470890 87538 48194 695061 1401851 1402622 809815 363764
$$ packed form
36612f9503j54296k35812k44968l8333L05243N20250M23409J11325j33887j53208
36602C30220p9858j22010k31393j65085J08124K91921J72782o1086j07252L999
36592A40362O079j44981j97791j6199J92557J71375l5168j60460o0376J43709
36582C9107K40306J58234N769p7593o7084l5503k8535k8736m2228j19468k41825
36571a97556k83776j66627K9638J90304L09341L97581L47812P1064k70003l63164
36561F4614j25021J75310K42760R4273j8124M6896J53781P9978j83063l84997
36551A46407l12462o9622O6552N3972J25357L31358L30428q8722n05856l39339
36541b61927K50506M65759J6552l83352l9344O46867P06790P71n92807m46051
$$ plain form
36531 363764 366336 380109 7835 -519742 -760193 -703732 -650447 -635725 -388485 132706 535458
36520 535458 502153 258806 281362 643655 929890 806218 429323 175063 161413 237666
36510 237666 321777 475802 642618 589151 253673 -60541 -60157 94093 -15234 -453836
36500 -453836 -810289 -748817 -428125 -219191 -219999 -263164 -249127 -207416 -95875 193585 619118
36489 619118 996188 1233065 1344804 1229245 716434 -56885 -604885 -631114 -409500 -395680
36479 -395680 -613285 -703039 -500573 -254624 -219671 -271853 -65591 525099 1208825 1497601
36469 1497601 1140806 402988 -121272 -53117 430422 851955 935398 739428 406854 6418
36459 6418 -379490 -615464 -635310 -499423 -307798 -140966 -56431 -28178 64903 257583 378197
$$ packed form
36531C63764K572J3773l72274n27577k40451N6461N3285J4722K47240N21191M02752
36520E35458l3305k43347K2556L62293K86235j23672l76895k54260j3650P6253
36510B37666Q4111J54025J66816n3467l35478l14214L84J54250j09327m38602
36500d53836l56453O1472L20692K08934q08m3165J4037M1711J11541K89460M25533
36489F19118L77070K36877J11739j15559n12811p73319n48000k6229K21614J3820
36479c95680k17605q9754K02466K45949L4953n2182K06262N90690O83726K88776
36469A497601l56795p37818n24260O8155M83539M21533Q3443j95970l32574m00436
36459F418l85908k35974j9846J35887J91625J66832Q4535K8253R3081J92680J20614
$$ plain form
36448 378197 282171 113398 99222 178369 147663 112566 367604 783028 789707 176630 -528087
36437 -528087 -762696 -630969 -535884 -480681 -231839 61458 -13349 -445462 -750709 -661558
36427 -661558 -430791 -356205 -394986 -382010 -294623 -156625 31954 147586 17795 -233410
36417 -233410 -226706 122996 408155 286998 -52308 -228348 -182672 -64028 133796 438064
36407 438064 604351 406664 117258 205688 542076 419992 -428911 -1296842 -1342267 -685253
36397 -685253 -221346 -446680 -921474 -989981 -640718 -376413 -449957 -588337 -463001 -119063
36387 -119063 190740 370438 474893 484275 342256 177154 217364 431223 487360 194182
36377 194182 -217014 -412474 -397341 -415528 -505277 -425333 -53378 369277 510312 335796
$$ packed form
36448C78197r6026j68773j4176P9147l0706l5097K55038M15424O679o13077p04717
36437e28087k34609J31727R5085N5203K48842K93297p4807m32113l05247Q9151
36427f61558K30767P4586l8781J2976Q7387J37998J88579J15632j29791k51205
36417b33410O704L49702K85159j21157l39306j76040M5676J18644J97824L04268
36407D38064J66287j97687k89406Q8430L36388j22084q48903q67931m5425O57014
36397f85253M63907k25334m74794o8507L49263K64305p3544j38380J25336L43938
36387a19063L09803J79698J04455R382j42019j65102M0210K13859N6137k93178
36377A94182m11196j95460J5133j8187q9749P9944L71955M22655J41035j74516
$$ plain form
36367 335796 98149 -8647 -57981 -234360 -544975 -763591 -678028 -337764 15451 243976
36357 243976 435341 695731 938845 979403 773135 466101 247114 233152 441390 763319
36347 763319 1005399 1065422 1028159 972254 759261 216260 -488656 -902615 -811735 -507446
36337 -507446 -394416 -501682 -560393 -435583 -251151 -131791 -49223 37532 65929 -28034
36327 -28034 -201871 -366172 -475472 -518888 -494333 -421456 -305000 -77596 303661 674058
36317 674058 733320 408763 18264 -81302 77130 164091 17231 -198193 -299855 -334855
36307 -334855 -412495 -460075 -307888 54257 441910 670221 687440 547301 352733 222171
36297 222171 218779 286174 301986 207922 60808 -30978 13527 209256 488184 713860 751517
$$ packed form
36367C35796k37647j06796m9334j76379l10615k18616Q5563L40264L53215K28525
36357B43976J91365K60390K43114M0558k06268l07034k18987j3962K08238L21929
36347G63319K42080O0023l7263n5905k12993n43001p04916m13959R0880L04289
36337e07446J13030j07266n8711J24810J84432J19360Q2568Q6755K8397r3963
36327b8034j73837j64301j09300m3416K4555P2877J16456K27404L81257L70397
36317F74058N9262l24557l90499r9566J58432Q6961j46860k15424j01662l5000
36307c34855p7640m7580J52187L62145L87653K28311J7219j40139j94568j30562
36297B22171l392O7395J5812r4064j47114r1786M4505J95729K78928K25676L7657
$$ plain form
36286 751517 556734 223067 -42236 -45137 202588 440405 432259 278953 282364 458534 430823
36275 430823 -26234 -565975 -679215 -384602 -162274 -248429 -389063 -360669 -324490 -446188
36265 -446188 -513022 -276984 38104 -20835 -449804 -730175 -515032 -45911 248111 287764
36255 287764 263945 220425 9352 -385008 -740926 -868689 -794370 -605705 -302110 72680
36245 72680 315521 293070 195306 306959 536797 455643 -100259 -717694 -880888 -574185
36235 -574185 -202502 -57631 -110666 -240613 -390825 -504598 -538757 -560658 -643358 -674291
36225 -674291 -474505 -103867 168479 201977 82359 -91168 -258517 -272852 -58705 96558
36215 96558 -179586 -682093 -706397 -15744 716044 776960 347577 119780 291526 471054
$$ packed form
36286G51517j94783l33667k65303k901K47725K37817q146j53306L411J76170k7711
36275D30823m57057n39741j13240K94613K22328q6155j40634K8394L6179j21698
36265d46188o6834K36038L15088n8939m28969k80371K15143M69121K94022L9653
36255B87764k3819m3520k11073l94360l55918j27763P4319J88665L03595L74790
36245G2680K42841k2451r7764J11653K29838q1154n55902o17435j63194L06703
36235e74185L71683J44871n3035j29947j50212j13773l4159k1901q2700l0933
36225f74291J99786L70638K72346L3498j19618j73527j67349j4335K14147J55263
36215I6558k76144n02507k4304O90653P31788O0916m29383k27797J71746J79528
$$ plain form
36205 471054 412548 293060 277813 296531 306426 371900 424474 317472 172227 286955 627289
36194 627289 804095 669566 522816 553224 508883 194954 -84044 43697 425370 637096
36184 637096 635396 712655 900975 891406 592873 351507 457126 760901 992188 1186428
36174 1186428 1514640 1852286 1847473 1402586 817540 411020 235381 234692 410497 645910
36164 645910 609758 146940 -366304 -412464 -40758 193423 32642 -169730 -104260 -29426
36154 -29426 -306186 -762334 -972356 -952611 -1078947 -1393945 -1491635 -1142398 -610627 -231364
36144 -231364 -14008 182509 347052 353915 153058 -153292 -324624 -137733 300923 538584
36134 538584 338742 74320 162260 308743 -79233 -809983 -994116 -362432 283539 289601
$$ packed form
36205D71054n8506j19488j5247J8718R895O5474N2574j07002j45245J14728L40334
36194F27289J76806j34529j46750L0408m4341l13929k78998J27741L81673K11726
36184F37096j700P7259J88320r569k98533k41366J05619L03775K31287J94240
36174A186428L28212L37646m813m44887n85046m06520j75639o89J75805K35413
36164F45910l6152m62818n13244m6160L71706K34181j60781k02372O5470P4834
36154b9426k76760m56148k10022J9745j26336l14998r7690L49237N31771L79263
36144b31364K17356J96517J64543O863k00857l06350j71332J86891M38656K37661
36134E38584j99842k64422Q7940J46483l87976p30750j84133O31684O45971O062
$$ plain form
36124 289601 71771 272793 646180 522825 -53013 -462281 -530019 -601276 -713870 -502091
36114 -502091 20147 319329 165466 -37082 25253 89608 -145006 -491879 -655157 -737417
36104 -737417 -964883 -1188541 -1068613 -597314 -87163 268844 530717 760202 891526 852940
36094 852940 647628 323670 -20550 -245739 -298832 -289438 -353412 -497628 -652838 -796354
36084 -796354 -931444 -1027319 -1081901 -1172063 -1331962 -1437582 -1330354 -1038800 -784409 -756590
36074 -756590 -922583 -1055846 -944103 -605735 -303626 -285593 -504655 -672071 -596402 -368342
36064 -368342 -178391 -76423 272 65316 92216 147395 355656 679559 849506 637578
36054 637578 169459 -177760 -227261 -198332 -330825 -476805 -328424 18999 94333 -270458
$$ packed form
36124B89601k17830K01022L73387j23355n75838m09268o7738p1257j12594K11779
36114e02091N22238K99182j53863k02548O2335O4355k34614l46873j63278q2260
36104g37417k27466k23658J19928M71299N10151L56007K61873K29485J31324l8586
36094H52940k05312l23958l44220k25189n3093R394o3974j44216j55210j43516
36084g96354j35090r5875n4582r0162j59899j05620J07228K91554K54391K7819
36074g56590j65993j33263J11743L38368L02109J8033k19062j67416P5669K28060
36064c68342J89951J01968P6695O5044K6900N5179K08261L23903J69947k11928
36054F37578m68119l47219m9501K8929j32493j45980J48381L47423P5334l64791
$$ plain form
36044 -270458 -644674 -593028 -250944 -8388 99922 277914 431720 249279 -213251 -502681
36034 -502681 -407196 -207721 -169864 -181320 -78125 31101 13097 -13343 83649 175582 117107
36023 117107 59393 223136 515709 686292 749703 911763 1105737 973388 424642 -75626
36013 -75626 -14729 506144 866931 685237 242810 32183 89309 75907 -61271 43454
36003 43454 509606 869772 751753 511214 650384 901953 615569 -47801 -162593 548046
35993 548046 1185692 980074 375565 208434 411632 323040 -109334 -293379 -18990 287183
35983 287183 351288 376272 460634 354815 25481 -96768 261932 766439 926165 672330
35973 672330 248951 -150299 -391464 -341320 -69604 108717 18012 -152705 -190048 -179979
$$ packed form
36044b70458l74216N1646L42084K42556J08310J77992J53806j82441m62530k89430
36034e02681R5485J99475L7857j1456J03195J09226j8004k6440R6992R1933n8475
36023A17107n7714J63743K92573J70583O3411J62060J93974j32349n48746n00268
36013g5626O0897N20873L60787j81694m42427k10627N7126j3402j37178J04725
36003D3454M66152L60166j18019k40539J39170K51569k86384o63370j14792P10639
35993E48046O37646k05618o04509j67131K03198q8592m32374j84045K74389L06173
35983B87183O4105K4984Q4362j05819l29334j22249L58700N04507J59726k53835
35973F72330m23379l99250k41165N0144K71716J78321r0705j70717l7343J0069
$$ plain form
35963 -179979 -281417 -423734 -485857 -557389 -730555 -812119 -571684 -176533 -56830 -354497
35953 -354497 -759796 -894474 -650965 -169053 312233 565654 522877 350924 269385 306781
35943 306781 349679 364462 389761 350001 103885 -284979 -532458 -482833 -322272 -330197 -513548
35932 -513548 -597537 -337682 225289 786940 1022358 865612 583253 504924 640029 644805
35922 644805 244954 -389125 -813416 -817748 -603040 -428818 -277401 -20517 215843 121094
35912 121094 -336248 -761672 -799571 -573022 -457546 -530983 -510054 -218133 159240 379090
35902 379090 473683 605433 727390 591691 71943 -661665 -1296928 -1628466 -1659238 -1527707
35892 -1527707 -1362114 -1208294 -1103873 -1138602 -1295884 -1268128 -688286 326390 1090011 1049584
$$ packed form
35963a79979j01438j42317o2123p1532j73166q1564K40435L95151J19703k97667
35953c54497m05299j34678K43509M81912M81286K53421m2777j71953q1539L7396
35943C06781M2898J4783K5299l9760k46116l88864k47479M9625J60561p925j83351
35932e13548q3989K59855N62971N61651K35418j56746k82359p8329J35105M776
35922F44805l99851o34079m24291m332K14708J74222J51417K56884K36360r4749
35912A21094m57342m25424l7899K26549J15476p3437K0929K91921L77373K19850
35902C79090R4593J31750J21957j35699n19748p33608o35263l31538l0772J31531
35892a527707J65593J53820J04421l4729j57282K7756N79842J014676P63621m0427
$$ plain form
35882 1049584 435774 -60267 -169680 -260469 -650037 -1085175 -1111156 -698277 -235749 -40180
35872 -40180 -107778 -258544 -290053 -49811 400521 716579 619990 334392 408832 1024745
35862 1024745 1729229 1993253 1803711 1507709 1273274 985734 590192 256992 185225 416622
35852 416622 837883 1215476 1270591 912189 388408 35411 -97885 -191471 -282522 -222614
35842 -222614 -8124 145280 129304 62110 -16474 -271728 -735894 -1114466 -1135362 -875831
35832 -875831 -559574 -262404 -21883 16186 -172789 -330680 -254202 -84705 5288 147094
35822 147094 444169 584792 270972 -160439 -106944 396394 731241 653694 572959 748280
35812 748280 835014 519791 81379 -63909 18523 13969 -82050 -26848 228644 477057 504529
$$ packed form
35882A049584o13810m96041j09413r0789l89568m35138k5981M12879M62528J95569
35872d0180o7598j50766l1509K40242M50332L16058r6589k85598P4440O15913
35862A024745P04484K64024j89542k96002k34435k87540l95542l33200p1767K31397
35852D16622M21261L77593N5115l58402n23781l52997j33296r3586r1051N9908
35842b22614K14490J53404j5976o7194p8584k55254m64166l78572k0896K59531
35832h75831L16257K97170K40521L8069j88975j57891P6478J69497Q9993J41806
35822A47094K97075J40623l13820m31411N3495N03338L34847p7547q0735J75321
35812G48280Q6734l15223m38412j45288Q2432m554r6019N5202K55492K48413K7472
$$ plain form
35801 504529 202827 -382492 -944136 -1091756 -816335 -510993 -379943 -203720 89861 100340
35791 100340 -402906 -950073 -1000092 -737269 -650943 -644354 -284731 253827 314524 -173042
35781 -173042 -542066 -450901 -336823 -531363 -636580 -230276 367127 551664 272270 -82249
35771 -82249 -327551 -534871 -666619 -626888 -528541 -503693 -386243 20563 493684 639352
35761 639352 513668 542330 819647 935474 601760 62139 -291216 -399077 -438051 -488992
35751 -488992 -530139 -606653 -784035 -989455 -1060070 -940817 -744478 -618738 -597066 -579399
35741 -579399 -459420 -269525 -133482 -40006 202478 648959 990013 888953 491347 292863
35731 292863 454054 567367 264516 -230799 -424464 -238611 -49177 -89171 -130337 155947
$$ packed form
35801E04529l01702n85319n61644j47620K75421L05342J31050J76223K93581J0479
35791A00340n03246n47167n0019K62823Q6326O589L59623N38558O0697m87566
35781a73042l69024R1165J14078j94540j05217M06304N97403J84537k79394l54519
35771h2249k45302k07320j31748L9731R8347K4848J17450M06806M73121J45668
35761F39352j25684K8662K77317J15827l33714n39621l53355j07861l8974n0941
35751d88992m1147p6514j77382k05420p0615J19253J96339J25740K1672J7667
35741e79399J19979J89895J36043R3476K42484M46481L41054j01060l97606j98484
35731B92863J61191J13313l02851m95315j93665J85853J89434l9994m1166K86284
$$ plain form
35721 155947 731357 1215318 1282581 947661 504590 247078 241318 362437 526612 779735
35711 779735 1088922 1191448 867562 329283 85647 344536 765077 935839 893913 947395
35701 947395 1122775 1093488 664799 59096 -380009 -559059 -571124 -436347 -120954 254266
35691 254266 442054 337076 73649 -179377 -394158 -607485 -802482 -961023 -1127209 -1287910
35681 -1287910 -1265184 -901864 -344789 42544 106445 64955 131755 164397 -80887 -453508
35671 -453508 -503566 -136482 145562 -127549 -742229 -1070992 -878930 -522829 -348140 -254941
35661 -254941 -27883 199393 114931 -253645 -494315 -313859 120460 410671 358100 88121
35651 88121 -147845 -196247 -73096 100382 214223 235720 169355 -2927 -275389 -525589
$$ packed form
35721A55947N75410M83961O7263l34920m43071k57512n760J21119J64175K53123
35711G79735L09187J02526l23886n38279k43636K58889M20541J70762m1926N3482
35701I47395J75380k9287m28689o05703m39105j79050j2065J34777L15393L75220
35691B54266J87788j04978k63427k53026k14781k13327j94997j58541j66186j60701
35681a287910K2726L63320N57075L87333O3901m1490O6800L2642k45284l72621
35671d53508n0058L67084K82044k73111o14680l28763J92062L56101J74689R3199
35661b54941K27058K27276q4462l68576k40670J80456M34319K90211n2571k69979
35651H8121k35966m8402J23151J73478J13841K1497o6365j72282k72462k50200
$$ plain form
35641 -525589 -564070 -324605 52705 370898 544012 553455 323233 -198865 -818741 -1130494
35631 -1130494 -919725 -464239 -274507 -533267 -928220 -1057360 -847309 -519062 -318089
35622 -318089 -397102 -786234 -1268748 -1405777 -948311 -192498 318141 424765 418269 478664
35612 478664 410117 65297 -312821 -425691 -341557 -299129 -293512 -183419 -67136 -186570
35602 -186570 -505144 -724645 -730225 -701775 -744963 -728553 -584859 -485885 -572448 -725119 -745678
35591 -745678 -591027 -322567 -18408 154836 7209 -375027 -598690 -428770 -108372 927
35581 927 -73559 -47766 93551 43055 -336559 -757286 -851894 -579646 -172521 170663 396041
35570 396041 491898 435970 268138 131910 173819 377358 515321 325582 -223756 -864735
$$ packed form
35641e25589l8481K39465L77310L18193J73114R443k30222n22098o19876l11753
35631a130494K10769M55486J89732k58760l94953j29140K10051L28247K00973
35622c18089p9013l89132m82514j37029M57466P55813N10639J06624o496O0395
35612D78664o8547l44820l78118j12870Q4134M2428N617J10093J16283j19434
35602a86570l18574k19501n580K8450m3188J6410J43694R8974q6563j52671k0559
35591g45678J54651K68460L04159J73244j47627l82236k23663J69920L20398J09299
35581I27p4486K5793J41317n0496l79614m20727r4608K72248M07125L43184K25378
35570C96041R5857n5928j67832j36228M1909K03539J37963j89739n49338o40979
$$ plain form
35560 -864735 -1251617 -1238319 -945913 -627806 -489305 -545276 -591211 -392721 27353 375829
35550 375829 443605 365734 402148 571232 697284 748889 862305 1000391 875164 373178
35540 373178 -151680 -254786 21186 195263 -23823 -399936 -555894 -488812 -484899 -611218
35530 -611218 -572160 -162864 348697 505703 244563 -48778 -92268 -78638 -340276 -802791
35520 -802791 -1009452 -681135 -64625 339572 282249 -66580 -364679 -414620 -254826 -21735
35510 -21735 212471 442894 613317 594036 339989 10540 -163561 -119236 10081 89215
35500 89215 114117 148008 221308 324560 422599 442282 319267 102157 -45774 6950 246787
35489 246787 561128 833316 962591 861972 508119 -9873 -501860 -736492 -571873 -144813
$$ packed form
35560h64735l86882J3298K92406L18107J38501n5971m5935J98490M20074L48476
35550C75829O7776p7871L6414J69084J26052N1605J13416J38086j25227n01986
35540C73178n24858j03106K75972J74077k19086l76113j55958O7082L913j26319
35530f11218L9058M09296N11561J57006k61140k93341m3490J3630k61638m62515
35520h02791k06661L28317O16510M04197n7323l48829k98099m9941J59794K33091
35510b1735K34206K30423J70423j9281k54047l29449j74101M4325J29317P9134
35500H9215K4902L3891P3300J03252R8039J9683j23015k17110j47931N2724K39837
35489B46787L14341K72188J29275j00619l53853n17992m91987k34632J64619M27060
$$ plain form
35479 -144813 125225 -68777 -486674 -539646 -44516 473755 467073 123159 68304 429132
35469 429132 663355 397590 -32866 -132385 40134 79734 -76269 -105758 125772 364005
35459 364005 385159 270237 151207 -20408 -285729 -490215 -486229 -380398 -393217 -558181
35449 -558181 -704133 -660144 -358363 171486 758756 1103617 994583 529571 46805 -148549
35439 -148549 34773 455460 802914 779975 370120 -116562 -373785 -422217 -496225 -693245
35429 -693245 -900554 -1021573 -1081703 -1099656 -1031277 -887876 -758638 -653110 -466254 -198049
35419 -198049 -76379 -289248 -635727 -648047 -164732 349972 263420 -448556 -1107029 -1127236
35409 -1127236 -687395 -365409 -312827 -202524 65606 133621 -179298 -495531 -447107 -228624
$$ packed form
35479a44813K70038j94002m17897n2972M95130N18271o682l43914n4855L60828
35469D29132K34223k65765m30456r9519J72519L9600j56003k9489K31530K38233
35459C64005K1154j14922j19030j71615k65321k04486L986J05831j2819j64964
35449e58181j45952M3989L01781N29849N87270L44861j09034m65012m82766j95354
35439a48549J83322M20687L47454k2939m09855m86682k57223m8432p4008j97020
35429f93245k07309j21019o0130j7953O8379J43401J29238J05528J86856K68205
35419a98049J21670k12869l46479j2320M83315N14704q6552p11976o58473k0207
35409a127236M39841L21986N2582J10303K68130O8015l12919l16233M8424K18483
$$ plain form
35399 -228624 -189145 -209884 29783 418915 592707 585936 727433 948026 808434 270076
35389 270076 -160498 -203487 -158695 -276437 -325810 -98128 150717 143242 61418 179796 361684
35378 361684 349352 270665 406460 669308 760707 685355 670423 693353 533229 230957 66643
35367 66643 75914 -13576 -305243 -539555 -482333 -245630 -111122 -209283 -441546 -595282 -518646
35356 -518646 -274398 -76084 936 103432 278563 289038 -20441 -379646 -425068 -219288
35346 -219288 -99886 -137359 -121137 -7205 23008 -59271 -73837 18611 59431 21685 58330
35335 58330 171860 166879 3307 -105280 -14400 199633 430640 596120 523446 146290
35325 146290 -193199 -72412 334196 386778 -85545 -485649 -302820 221359 582763 711717
$$ packed form
35399b28624L9479k0739K39667L89132J73792o771J41497K20593j39592n38358
35389B70076m30574m2989M4792j17742m9373K27682K48845p475q1824J18378J81888
35378C61684j2332p8687J35795K62848R1399p5352j4932K2930j60124l02272j64314
35367F6643R271q9490k91667k34312N7222K36703J34508r8161k32263j53736P6636
35356e18646K44248J98314P7020J02496J75131J0475l09479l59205m5422K05780
35346b19288J19402l7473J6222J13932L0213q2279j4566R2448M0820l7746L6645
35335E8330J13530m981j63572j08587R0880K14033K31007J65480p2674l77156
35325A46290l39489J20787M06608N2582m72323m00104J82829N24179L61404J28954
$$ plain form
35315 711717 790171 768217 538158 318057 379061 561021 505761 254187 184389 420016
35305 420016 691818 756006 595500 237099 -265674 -661211 -674939 -420518 -320009 -538435
35295 -538435 -799494 -853394 -804189 -804524 -730062 -435818 -133531 -163109 -429264 -402615 198623
35284 198623 965491 1249045 936284 519022 394328 392431 161255 -227840 -378678 -189857
35274 -189857 -24462 -190723 -542711 -753029 -775969 -847747 -1133348 -1529531 -1773322 -1667485
35264 -1667485 -1256373 -816700 -600500 -589224 -606416 -617182 -710316 -810463 -692468 -342594
35254 -342594 -29342 77941 83471 59864 -98634 -345856 -354689 14727 418296 507653 431276
35243 431276 498939 601845 422556 71640 14302 367303 716729 719935 512198 378431
$$ packed form
35315G11717P8454k1954k30059k20101O1004J81960n5260k51574o9798K35627
35305D20016K71802O4188j60506l58401n02773l95537j3728K54421J00509k18426
35295e38435k61059n3900M9205l35P4462K94244L02287k9578k66155K6649O01238
35284A98623P66868K83554l12761m17262j24694j897k31176l89095j50838J88821
35274a89857J65395j66261l51988k10318k2940p1778k85601l96183k43791J05837
35264a667485M11112M39673K16200J1276j7192j0766r3134j00147J17995L49874
35254c42594L13252J07283N530k3607j58498k47222q833L69416M03569Q9357p6377
35243D31276O7663J02906j79289l50916n7338L53001L49426L206k07737j33767
$$ plain form
35233 378431 332108 214102 11015 -121393 -80330 53759 99974 -31631 -241642 -395509
35223 -395509 -550339 -838505 -1088891 -873349 -136331 517717 505343 22527 -265245 -129501
35213 -129501 81235 128986 193129 407370 555391 425192 129859 -113526 -248493 -260488
35203 -260488 -69060 265795 457564 317110 -4883 -255029 -375930 -410329 -308334 -58269
35193 -58269 120999 -30724 -457087 -799779 -789940 -511253 -250465 -159386 -106933 135971
35183 135971 580709 936717 884699 409628 -170208 -474626 -359369 -22329 187626 181060
35173 181060 296048 808319 1305251 1004803 -113562 -1004474 -808735 16956 403094
35164 403094 152841 -34684 153891 245103 -35723 -247920 -40311 259430 299760 317597
$$ packed form
35233C78431m6323j18006k03087j32408M1063J34089M6215j31605k10011j53867
35223c95509j54830k88166k50386K15542P37018O54048j2374m82816k87772J35744
35213a29501K10736M7751O4143K14241J48021j30199k95333k43385j34967j1995
35203b60488J91428L34855J91769j40454l21993k50146j20901l4399J01995K50065
35193e8269J79268j51723m26363l42692R839K78687K60788R1079N2453K42904
35183A35971M44738L56008n2018m75071n79836l04418J15257L37040K09955o566
35173A81060J14988N12271M96932l00448j118365q90912J95739Q25691L86138
35164D03094k50253j87525J88575R1212k80826k12197K07609K99741M0330J7837
$$ plain form
35154 317597 573484 718783 346812 -229142 -410473 -258640 -338993 -755337 -991560 -734370
35144 -734370 -300449 -127744 -251288 -403879 -342017 -12555 359627 371467 -96349 -570841
35134 -570841 -468543 144491 631426 618489 349366 142429 -69233 -437205 -771723 -723176
35124 -723176 -245670 338197 659612 574552 219967 -100131 -185965 -164509 -311417 -601327
35114 -601327 -637906 -173154 480210 769986 545511 151030 -90609 -227666 -418105 -545633
35104 -545633 -344744 153172 571552 663187 588879 553807 416944 -1802 -390374 -219896
35094 -219896 405790 715339 338651 -86469 175775 826786 924528 224391 -547902 -791308
35084 -791308 -733284 -813963 -956178 -867122 -661270 -681114 -899801 -969837 -788851 -599573
$$ packed form
35154C17597K55887J45299l71971n75954j81331J51833q0353m16344k36223K57190
35144g34370M33921J72705j23544j52591O1862L29462L72182J1840m67816m74492
35134e70841J02298O13034M86935j2937k69123k06937k11662l67972l34518M8547
35124g23176M77506N83867L21415q5060l54585l20098q5834K1456j46908k89910
35114f01327l6579M64752O53364K89776k24475l94481k41639j37057j90439j27528
35104e45633K00889M97916M18380R1635p4308l5072j36863m18746l88572J70478
35094b19896O25686L09549l76688m25120K62244O51011R7742p00137p72293k43406
35084g91308N8024q0679j42215Q9056K05852j9844k18687p0036J80986J89278
$$ plain form
35074 -599573 -528399 -411223 -151878 101576 292047 652631 1318408 1947967 2039194 1547405
35064 1547405 914411 498198 244619 -32165 -335251 -607331 -919635 -1283069 -1428746
35055 -1428746 -1094307 -487701 -144870 -266475 -483560 -404479 -124942 12912 -44734 -57649
35045 -57649 74089 165796 64178 -123810 -208474 -171703 -136356 -167296 -204821 -161566 -251
35034 -251 283332 672491 1071505 1286782 1171701 813178 480499 335995 283795 164867
35024 164867 -14604 -144628 -166118 -34283 304354 701224 764435 336229 -137691 -99882
35014 -99882 357713 666353 639412 601667 645100 436775 -19166 -132919 336751 728260
35004 728260 429669 -138942 -185317 214059 320728 -51279 -349310 -252524 -48194 33167
$$ packed form
35074e99573P1174J17176K59345K53454J90471L60584O65777O29559R1227m91789
35064A547405o32994m16213k53579k76784l03086k72080l12304l63434j45677
35055a428746L34439O06606L42831j21605k17085P9081K79537J37854n7646j2915
35045e7649J31738R1707j01618j87988q4664L6771L5347l0940l7525M3255J61315
35034b51K83583L89159L99014K15277j15081l58523l32679j44504n2200j18928
35024A64867j79471j30024k1490J31835L38637L96870O3211m28206m73920L7809
35014i9882M57595L08640k6941l7745M3433k08325m55941j13753M69670L91509
35004G28260k98591n68611m6375L99376J06669l72007k98031R6786K04330Q1361
$$ plain form
34994 33167 147705 346472 386443 235556 207339 389214 474481 374945 443389 808259 1032896
34983 1032896 801817 459772 441572 579111 453039 118935 -16483 146360 313727 268403
34973 268403 70590 -131147 -219561 -145678 -58917 -227153 -612068 -759120 -381329 197889
34963 197889 508437 577631 696399 766274 414521 -295934 -794059 -730341 -369586 -123511
34953 -123511 -34098 92218 275114 294705 -42792 -664665 -1225843 -1372728 -1081702 -657239
34943 -657239 -320186 30637 498732 869269 899563 742065 700105 684302 361097 -180270
34933 -180270 -399922 -67061 387332 487286 322387 282919 473046 689969 799554 832498
34923 832498 794822 627706 333303 -8071 -308615 -474603 -432510 -246436 -94192 -33000
$$ packed form
34994C3167J14538J98767L9971j50887k8217J81875Q5267r9536O8444L64870K24637
34983A032896k31079l42045j8200J37539j26072l34104j35418J62843J67367m5324
34973B68403j97813k01737q8414P3883Q6761j68236l84915j47052L77791N79218
34963A97889L10548O9194J18768O9875l51753p10455m98125O3718L60755K46075
34953a23511Q9413J26316J82896J9591l37497o21873n61178j46885K91026M24463
34943f57239L37053L50823M68095L70537L0294j57498m1960j5803l23205n41367
34933a80270k19652L32861M54393R9954j64899l9468J90127K16923J09585L2944
34923H32498l7676j67116k94403l41374l00544j65988M2093J86074J52244O1192
$$ plain form
34913 -33000 62568 212016 172348 -209495 -621181 -546226 101730 828077 1088920 821191
34903 821191 391737 134092 15532 -247002 -753284 -1163117 -1022756 -371763 210826 324741
34893 324741 269344 545327 1025298 1080941 530967 -36137 -76432 197348 236321 -38259
34883 -38259 -264938 -287896 -313180 -446807 -485413 -255266 129046 425115 461035 169335
34873 169335 -300527 -503457 -94346 616176 889322 499412 42057 54276 253760 63429
34863 63429 -455364 -735838 -578817 -312674 -133618 127209 482591 573978 207726 -302677
34853 -302677 -584426 -663053 -716472 -681166 -427056 -110616 -8968 -98739 -92105 138039 400026
34842 400026 459581 308921 128517 69809 104264 82792 -40081 -108951 -49 139169
$$ packed form
34913c3000R5568J49448l9668l81843m11686P4955O47956P26347K60843k67729
34903H21191m29454k57645j18560k62534n06282m09833J40361O50993N82589J13915
34893C24741n5397K75983M79971N5643n49974n67104m0295K73780L8973k74580
34883c8259k26679k2958k5284j33627l8606K30147L84312K96069L5920k91700
34873A69335m69862k02930M09111P10522K73146l89910m57355J2219J99484j90331
34863F3429n18793k80474J57021K66143J79056K60827L55382R1387l66252n10403
34853c02677k81749p8627n3419L5306K54110L16440J01648q9771O634K30144K61987
34842D00026N9555j50660j80404n8708L4455k1472j22873o8870J08902J39218
$$ plain form
34832 139169 88899 -70901 -77733 43971 5939 -179145 -90381 425665 878455 774816
34822 774816 321358 88850 211905 357508 328712 223641 42810 -383486 -982420 -1338199
34812 -1338199 -1182117 -744280 -465486 -516270 -711093 -779750 -627200 -378256 -213350 -167073
34802 -167073 -136444 -73240 -21781 55302 258661 468015 365526 -61309 -336725 -110369
34792 -110369 313648 432791 302142 375902 728585 934537 715331 262816 -123490 -333198
34782 -333198 -341099 -173716 -22889 -63770 -165283 -124204 -111254 -428052 -871050 -903142 -508803
34771 -508803 -268280 -429354 -537667 -257926 57030 4939 -210504 -225752 -140511 -187315
34761 -187315 -201568 18154 176099 -89668 -515193 -570703 -310078 -230293 -428857 -556381
$$ packed form
34832A39169n0270j59800o832J21704l8032j85084Q8764N16046M52790j03639
34822G74816m53458k32508J23055J45603k8796j05071j80831m26296n98934l55779
34812a338199J56082M37837K78794n0784j94823o8657J52550K48944J64906M6277
34802a67073L0629O3204N1459P7083K03359K09354j02489m26835k75416K26356
34792a10369M24017J19143j30649P3760L52683K05952k19206m52515l86306k09708
34782c33198p901J67383J50827m0881j01513M1079J2950l16798m42998l2092L94339
34771e08803K40523j61074j08313K79741L14956n2091k15443j5248Q5241m6804
34761a87315j4253K19722J57945k65767m25525n5510K60625P9785j98564j27524
$$ plain form
34751 -556381 -534265 -638662 -846560 -780254 -436179 -325550 -662799 -993739 -916489 -641702
34741 -641702 -492114 -336409 39895 394333 369292 131728 172493 579486 947609 979439
34731 979439 806641 698204 748383 892003 995355 898573 553062 131296 -149175 -282002
34721 -282002 -396094 -486453 -433964 -273292 -214389 -357588 -569781 -690974 -703412 -641262
34711 -641262 -478311 -189032 158814 422399 457391 206384 -201277 -481812 -439171 -136435
34701 -136435 262798 701275 1097869 1157545 639655 -201963 -783390 -855459 -698411 -596211
34691 -596211 -491218 -303373 -181966 -167356 28085 532881 919642 745723 269984 128549
34681 128549 419208 630937 450800 116753 -75319 -97473 79402 544207 1031070 968189
$$ packed form
34751e56381K2116j04397k07898O6306L44075J10629l37249l30940P7250K74787
34741f41702J49588J55705L76304L54438k5041k37564M0765M06993L68123L1830
34731I79439j72798j08437N0179J43620J03352r6782l45511m21766k80471j32827
34721b82002j14092r0359N2489J60672N8903j43199k12193j21193j2438O2150
34711f41262J62951K89279L47846K63585L4992k51007m07661k80535M2641L02736
34701a36435L99233M38477L96594N9676n17890q41618n81427p2069J57048J02200
34691e96211J04993J87845J21407J4610J95441N04796L86761j73919m75739j41435
34681A28549K90659K11729j80137l34047j92072k2154J76875M64805M86863o2881
$$ plain form
34671 968189 274380 -317744 -133552 559193 934284 639353 62386 -249675 -73407 450278
34661 450278 921616 935383 508368 128451 148347 351439 398286 402396 638551 946760
34651 946760 969777 814526 877962 1092342 989101 549750 330634 573914 823644 705378
34641 705378 517405 668582 1005351 1139744 1081138 1090497 1189552 1262293 1416990 1782463
34631 1782463 2093736 1947559 1417381 991488 888840 814138 462418 -50382 -377101 -332085
34621 -332085 13464 453765 755307 757146 474408 78986 -252910 -464839 -611580 -742533
34611 -742533 -772287 -513500 56737 618489 802785 670037 638151 866911 1018291 792088
34601 792088 391081 185575 173732 114740 5968 30802 129301 38401 -226084 -310053 -46230
$$ packed form
34671I68189o93809n92124J84192O92745L75091k94931n76967l12061J76268N23685
34661D50278M71338J3767m27015l79917J9896K03092M6847M110K36155L08209
34651I46760K3017j55251O3436K14380j03241m39351k19116K43280K49730j18266
34641G05378j87973J51177L36769J34393n8606R359R9055P2741J54697L65473
34631A782463L11273j46177n30178m25893j02648p4702l51720n12800l26719M5016
34621c32085L45549M40301L01542J839k82738l95422l31896k11929j46741j30953
34611g42533k9754K58787N70237N61752J84296j32748l1886K28760J51380k26203
34601G92088m01007k05506j1843n8992j08772K4834R8499r0900k64485q3969K63823
$$ plain form
34590 -46230 270220 281677 16765 -222308 -263207 -192600 -161661 -192597 -175733 -17170 216870
34579 216870 340433 267711 125193 72538 90214 51500 -64682 -160067 -165997 -86828 52995
34568 52995 187901 202675 78833 -14974 69014 205965 111269 -309659 -837111 -1124102
34558 -1124102 -922818 -236119 604438 1108073 1052124 680133 341989 77838 -238253 -514055
34548 -514055 -535591 -381430 -377684 -605780 -782526 -708462 -523581 -384504 -173433 260453
34538 260453 752763 929250 584767 -153409 -940798 -1401012 -1319559 -799706 -200845 145217
34528 145217 151653 -47331 -233292 -239745 -93946 -30162 -225079 -523686 -591579 -347329 -59432
34517 -59432 12777 -123209 -334893 -537982 -638454 -529116 -292949 -219397 -431706 -636747
$$ packed form
34590d6230L16450J1457k64912k39073m0899P0607L0939l0936J6864J58563K34040
34579B16870J23563p2722j42518n2655J7676l8714j16182r5385n930P9169J39823
34568E2995J34906J4774j23842r3807Q3988J36951r4696m20928n27452k86991
34558a124102K01284O86699Q40557N03635n5949l71991l38144k64151l16091k75802
34548e14055k1536J54161L746k28096j76746P4064J84881J39077K11071M33886
34538B60453M92310J76487l44483p38176p87389m60214Q1453N19853N98861L46062
34528A45217O436j98984j85961o453J45799O3784j94917k98607o7893K44250K87897
34517e9432P2209j35986k11684k03089j00472J09338K36167P3552k12309k05041
$$ plain form
34507 -636747 -448751 111642 619527 712742 419138 47664 -117749 -20321 164200 192944
34497 192944 -24854 -347285 -526391 -402673 -27828 322473 311015 -127166 -611581 -666376
34487 -666376 -303325 -53584 -292627 -732373 -804313 -411802 -3602 87840 60677 246584
34477 246584 540452 516121 61076 -396470 -414754 -98226 69682 -137945 -447782 -470569
34467 -470569 -109541 464301 1026246 1375543 1394707 1192178 1037105 994324 783030 194135
34457 194135 -509573 -871544 -819850 -688952 -721579 -845766 -941615 -1018378 -1044623 -859347
34447 -859347 -387376 203000 635680 722030 449608 43618 -113637 128653 404385 235527
34437 235527 -248834 -352981 286978 1175004 1557155 1296024 865667 655097 605119 499258
$$ packed form
34507f36747J87996N60393N07885R3215k93604l71474j65413R7428J84521K8744
34497A92944k17798l22431j79106J23718L74845L50301j1458m38181m84415n4795
34487f66376L63051K49741k39043m39746p1940L92511M08200R1442k7163J85907
34477B46584K93868k4331m55045m57546j8284L16528J67908k07627l09837k2787
34467d70569L61028N73842N61945L49297J9164k02529j55073m2781k11294n88895
34457A94135p03708l61971N1694J30898l2627j24187r5849p6763k6245J85276
34447h59347M71971N90376M32680Q6350k72422m05990j57255K42290K75732j68858
34437B35527m84361j04147O39959Q88026L82151k61131m30357k10570m9978j05861
$$ plain form
34427 499258 326840 250568 332182 400969 234415 -131182 -363786 -221353 102843 211256
34417 211256 41632 -68438 123589 476834 754772 924422 1019504 958396 711058 464466
34407 464466 400951 432465 342934 95885 -156429 -271820 -194435 49358 302973 361627
34397 361627 234030 168650 278308 333383 131815 -122211 -92316 181464 381032 441067
34387 441067 603000 902291 983829 617960 122711 -2918 272746 516180 447258 266900
34377 266900 265034 347835 198996 -206497 -553486 -656024 -655100 -643952 -449271 -40617 163455
34366 163455 -194412 -800054 -1041524 -875587 -781947 -879020 -722145 -151845 287227 143845
34356 143845 -233131 -260963 -9157 26038 -220907 -343810 -196915 -108571 -289991 -484782
$$ packed form
34427D99258j72418p6272Q1614O8787j66554l65597k32604J42433L24196J08413
34417B11256j69624j10070J92027L53245K77938J69650R5082o1108k47338k46592
34407D64466o3515L1514q9531k47049k52314j15391P7385K43793K53615N8654
34397C61627j27597o5380J09658N5075k01568k54026K9895K73780J99568O0035
34387D41067J61933K99291Q1538l65869m95249j25629K75664K43434o8922j80358
34377B66900j866Q2801j48839m05493l46989j02538R24J1148J94681M08654K04072
34366A63455l57867o05642k41470J65937R3640r7073J56875N70300M39072j43382
34356A43845l76976k7832K51806L5195k46945j22903J46895Q8344j81420j94791
$$ plain form
34346 -484782 -383450 -83531 55895 -142538 -506638 -708076 -573218 -255484 -87258 -222583
34336 -222583 -504317 -722599 -834968 -822116 -544145 30424 605093 831291 725104 576705
34326 576705 526192 480948 398086 370934 410990 369217 140252 -185458 -399733 -334050 6587
34315 6587 380745 482393 290232 121658 205722 364967 312282 97882 3962 113469
34305 113469 264793 365817 472109 576794 582002 494558 446764 514073 666236 860297
34295 860297 1030938 1064944 950621 850999 848039 751386 390927 -41008 -217383 -130700 -22975
34284 -22975 31685 144043 288716 322472 286868 341358 415578 291900 36451 -30116 172684
34273 172684 397041 525164 713749 981327 1069561 895498 760064 876158 1029112 969574
$$ packed form
34346d84782J01332K99919J39426j98433l64100k01438J34858L17734J68226j35325
34336b22583k81734k18282j12369J2852K77971N74569N74669K26198j06187j48399
34326E76705n0513m5244q2862k7152M0056m1773k28965l25710k14275O5683L40637
34315F587L74158J01648j92161j68574Q4064J59245n2685k14400r3920J09507
34305A13469J51324J01024J06292J04685N208q7444m7794O7309J52163J94061
34295H60297J70641L4006j14323r9622k960r6653l60459m31935j76375Q6683J07725
34284b2975N4660J12358J44673L3756l5604N4490P4220j23678k55449o6567K02800
34273A72684K24357J28123J88585K67578Q8234j74063j35434J16094J52954n9538
$$ plain form
34263 969574 830550 831109 817162 477514 -114917 -540907 -582791 -438892 -377656 -423726 -437031
34252 -437031 -311781 -31978 324051 570529 535294 279438 94596 178374 394524 490816
34242 490816 488755 642397 991957 1226213 1133498 922259 826361 644418 102257 -478528
34232 -478528 -441695 239881 844007 911804 797892 920770 1059252 864931 570551 590690
34222 590690 778159 706872 433925 336751 371445 150127 -324660 -622184 -560868 -378867
34212 -378867 -267612 -258974 -488829 -991533 -1316239 -989761 -306523 30260 2300 206388
34202 206388 668251 675014 42854 -393382 -28813 595556 717606 494879 535906 844185
34192 844185 967867 829829 710982 651841 489300 313075 347501 528402 658838 804422
$$ packed form
34263I69574j39024N59j3947l39648n92431m25990m1884J43899O1236m6070j3305
34252d37031J25250K79803L56029K46478l5235k55856j84842Q3778K16150R6292
34242D90816k061J53642L49560K34256r2715k11239r5898j81943n42161n80785
34232d78528L6833O81576O04126O7797j13912J22878J38482j94321k94380K0139
34222E90690J87469p1287k72947r7174L4694k21318m74787k97524O1316J82001
34212c78867J11255Q638k29855n02704l24706L26478O83238L36783k7960K04088
34202B06388M61863O763o32160m36236L64569O24369J22050k22727M1027L08279
34192H44185J23682j38038j18847n9141j62541j76225L4426J80901J30436J45584
$$ plain form
34182 804422 1084248 1274192 1105864 790683 748981 943430 968113 703134 397792 168952
34172 168952 -95658 -347934 -367397 -186759 -103356 -179831 -113409 273577 726878 883512
34162 883512 673841 304194 32860 23795 231227 374917 211202 -118198 -180292 236342
34152 236342 840231 1142073 945963 478774 104492 -18220 -3508 -21080 -92134 -136353
34142 -136353 -112468 16202 352297 879954 1268324 1153389 648564 279562 322153 485083
34132 485083 367336 -48634 -504270 -786055 -759352 -353375 248978 614908 504797 177855
34122 177855 62004 248256 486098 559203 494859 468538 603275 816755 877954 729270
34112 729270 669075 986538 1492017 1716277 1519315 1139021 694537 115140 -413534 -468232
$$ packed form
34182H04422K79826J89944j68328l15181m1702J94449K4683k64979l05342k28840
34172A68952k64610k52276j9463J80638Q3403p6475O6422L86986M53301J56634
34162H83512k09671l69647k71334r065K07432J43690j63715l29400o2094M16634
34152B36342O03889L01842j96110m67189l74282j22712J4712j7572p1054m4219
34142a36353K3885J28670L36095N27657L88370j14935n04825l69002M2591J62930
34132D85083j17747m15970m55636k81785K6703M05977O02353L65930j10111l26942
34122A77855j15851J86252K37842P3105o4344k6321J34737K13480O1199j48684
34112G29270o0195L17463N05479K24260j96962l80294m44484n79397n28674n4698
$$ plain form
34102 -468232 -5121 513714 773965 933435 1146647 1270643 1242495 1248157 1300425 1151986
34092 1151986 825089 662942 644785 317277 -289721 -420764 268015 1036433 1103923 723400
34082 723400 566160 638655 560594 418730 540841 794778 873054 936799 1234074 1425734
34072 1425734 1091928 604936 635923 1009065 942412 330573 -93669 102851 557715 836554
34062 836554 928080 898422 704802 503022 583707 874684 989666 838800 719128 765356
34052 765356 795140 740387 755029 831934 754665 508226 359435 462334 681756 813498
34042 813498 737865 446198 150471 188864 569321 856155 781032 626296 673740 699034
34032 699034 458672 243695 406445 730498 847397 900220 1188726 1528514 1592909 1526983
$$ packed form
34102d68232M63111N18835K60251J59470K13212J23996k8148N662N2268j48439
34092A151986l26897j62147j8157l27508o06998j31043O88779P68418O7490l80523
34082G23400j57240P2495p8061j41864J22111K53937P8276O3745K97275J91660
34072A425734l33806m86992L0987L73142o6653o11839m24242J96520M54864K78839
34062H36554R1526k9658j93620k01780Q0685K90977J14982j50866j19672M6228
34052G65356K9784n4753J4642P6905p7269k46439j48791J02899K19422J31742
34042H13498p5633k91667k95727L8393L80457K86834p5123j54736M7444K5294
34032F99034k40362k14977J62750L24053J16899N2823K88506L39788O4395o5926
$$ plain form
34022 1526983 1587742 1562647 1204924 837903 845622 1003326 1011228 1169058 1732318 2172592
34012 2172592 1987004 1667398 1856879 2137208 1810418 1318529 1554081 2203155 2216076 1629904
34002 1629904 1432760 1778108 1846885 1459695 1330841 1618413 1646518 1246108 1045397 1256223
33992 1256223 1438339 1578054 2092542 2660614 2429598 1565777 1227456 1760916 2257267
33983 2257267 2153647 1962536 2129324 2406737 2619749 2898888 3018410 2633683 2156023
33974 2156023 2226194 2531733 2436094 2360941 2987668 3610673 3159759 2351016 2671659 3700874
33964 3700874 3876970 3511890 4256297 5797751 6170671 5380745 5467534 6733746 7335425
33955 7335425 7006678 7549535 9062255 9564297 9099795 10035260 12373787 13357030 12896959
$$ packed form
34022A526983O0759k5095l57723l67021P719J57704P902J57830N63260M40274
34012B172592j85588l19606J89481K80329l26790m91889K35552O49074J2921n86172
34002A629904j97144L45348O8777l87190j28854K87572K8105m00410k00711K10826
33992A256223J82116J39715N14488N68072k31016q63821l38321N33460M96351
33983B257267j03620j91111J66788K77413K13012K79139J19522l84727m77660
33974B156023P0171L05539r5639p5153O26727O23005m50914q08743L20643J029215
33964C700874J76096l65080P44407J541454L72920p89926Q6789J266212O01679
33955G335425l28747N42857J512720N02042m64502R35465K338527R83243m60071
$$ plain form
33946 12896959 14347773 18340802 21447467 23002750 27098489 35248551 44032923 53239310
33938 53239310 68183865 89885457 113794130 145632315 204393542 292465109 370869485
33931 370869485 386936488 330014022 243152858 175244593 137518742 113285925 91669278
33924 91669278 75377422 65364945 56236678 46183652 39078044 35796534 32364449 27369531
33916 27369531 23733657 22373018 20569861 17468989 15462452 15183429 14217449 11756595
33908 11756595 9944495 9612513 8883105 7042107 5938961 6428674 6887009 6332303 5862768
33899 5862768 6001016 5586077 4302348 3565064 3935148 4174507 3686575 3445929 3758516
33890 3758516 3536142 2565704 2124725 2567045 2633381 1949328 1848581 2798006 3313422 2513815
$$ packed form
33946A2896959J450814L993029L106665J555283M095739Q150062Q784372R206387
33938E3239310J4944555K1701592K3908673L1838185N8761227Q8071567P8404376
33931C70869485J6067003n6922466q6861164o7908265l7725851k4232817k1616647
33924I1669278j6291856j0012477r128267j0053026p105608l281510l432085m994918
33916B7369531l635874j360639j803157l100872k006537k79023r65980k460854
33908A1756595j812100l31982p29408j840998j103146M89713M58335n54706m69535
33899E862768J38248m14939j283729p37284L70084K39359m87932k40646L12587
33890C758516k22374r70438m40979M42320O6336o84053j00747R49425N15416p99607
$$ plain form
33880 2513815 1607971 1686540 2023681 1768230 1472153 1695277 1773831 1224797 862490 1321625
33870 1321625 1858809 1752544 1571068 1940118 2303007 2019537 1565310 1566654 1662052 1315168
33860 1315168 824837 637467 548054 361433 433386 840976 957657 531191 221028 427138
33850 427138 603355 373688 250646 544656 650490 183801 -226805 -69972 155713 -27215
33840 -27215 -188656 21485 30384 -576846 -1077753 -698213 139197 589616 650818 761342
33830 761342 865626 756867 680365 794902 710703 286863 123104 524136 818534 504237
33820 504237 171375 385261 579431 123316 -369380 -10777 780513 930193 409768 48713
33810 48713 60066 -22795 -221889 -101725 277264 448080 459647 733831 1111983 1008932
$$ packed form
33880B513815r05844P8569L37141k55451k96077K23124P8554n49034l62307M59135
33870A321625N37184j06265j81476L69050L62889k83470m54227J344R5398l46884
33860A315168m90331j87370q9413j86621P1953M07590J16681m26466l10163K06110
33850D27138J76217k29667j23042K94010J05834m66689m10606J56833K25685j82928
33840b7215j61441K10141Q899o07230n00907L79540Q37410M50419O1202J10524
33830G61342J04284j08759p6502J14537q4199m23840j63759M01032K94398l14297
33820E04237l32862K13886J94170m56115m92696L58603P91290J49680n20425l61055
33810D8713J1353q2861j99094J20164L78989J70816J1567K74184L78152j03051
$$ plain form
33800 1008932 489490 281964 643311 988000 777303 174815 -288135 -259428 232491 799982
33790 799982 1021367 954511 1026846 1238021 1033321 297175 -233112 -75553 199882 -30395
33780 -30395 -365975 -159538 267104 182525 -258923 -313457 102794 454273 596591 778912
33770 778912 880451 614340 304926 515697 1057945 1280424 1165414 1190941 1283364 937874
33760 937874 291949 28197 206474 219872 -39627 -18180 365788 468848 62703 -234729
33750 -234729 -4869 350094 391322 284966 301677 358162 389137 553313 787128 754396
33740 754396 473012 380290 580810 688566 608338 741836 1154574 1294908 899418 461629
33730 461629 397249 437542 305063 301892 663250 934921 641119 101645 -68459 88869
$$ packed form
33800A008932n19442k07526L61347L44689k10697o02488m62950K8707M91919N67491
33790G99982K21385o6856P2335K11175k04700p36146n30287J57559K75435k30277
33780c0395l35580K06437M26642q4579m41448n4534M16251L51479J42318J82321
33770G78912J01539k66111l09414K10771N42248K22479j15010K5527R2423l45490
33760I37874o45925k63752J78277J3398k59499K1447L83968J03060m06145k97432
33750b34729K29860L54963M1228j06356J6711N6485L0975J64176K33815l2732
33740G54396k81384r2722K00520J07756q0228J33498M12738J40334l95490m37789
33730D61629o4380M0293j32479l171L61358K71671k93802n39474j70104J57328
$$ plain form
33720 88869 65404 -231061 -411432 -293106 -108362 -57267 -74702 -48817 30177 136798 229691
33709 229691 249481 205343 140195 -41117 -459518 -893199 -867920 -308744 242219 325876
33699 325876 163371 222653 471121 483405 144850 -178826 -169862 72604 252331 237037
33689 237037 114190 18324 -3492 27554 123568 328095 565735 621505 427145 255037
33679 255037 389998 684961 738059 481797 258635 278918 361248 316373 248046 306947 438625
33668 438625 562162 741577 981007 1079330 908149 655739 580749 656532 652193 466930
33658 466930 214463 37359 -37321 -95373 -248993 -498703 -666342 -552868 -165379 303594
33648 303594 681113 869341 772973 385081 -74769 -326211 -341883 -301117 -243343 -3597
$$ packed form
33720H8869k3465k96465j80371J18326J84744N1095j7435K5885P8994J06621R2893
33709B29691J9790m4138o5148j81312m18401m33681K5279N59176N50963Q3657
33699C25876j62505N9282K48468J2284l38555l23676Q964K42466J79727j5294
33689B37037j22847r5866k1816L1046R6014K04527K37640N5770j94360j72108
33679B55037J34961K94963N3098k56262k23162K0283Q2330m4875o8327N8901J31678
33668D38625J23537J79415K39430R8323j71181k52410p4990P5783m339j85263
33658D66930k52467j77104p4680n8052j53620k49710j67639J13474L87489M68973
33648C03594L77519J88228r6368l87892m59850k51442j5672M0766N7774K39746
$$ plain form
33638 -3597 468440 937910 1110231 903426 482985 130784 37008 120573 147608 99422 194396
33627 194396 403156 300800 -271886 -761487 -604087 -79578 129701 -1226 63164 389494
33617 389494 463376 156963 -24579 127784 147375 -227761 -539583 -415626 -216081 -343052
33607 -343052 -493355 -222220 212876 236954 -138188 -431348 -478142 -490236 -497016 -326873
33597 -326873 -67792 3859 -58572 81415 446444 631531 362521 -186584 -700151 -1027664
33587 -1027664 -1114776 -924416 -550676 -218440 -71326 -67559 -94481 -65044 80967 337239
33577 337239 593500 727631 710514 574989 376618 244751 328650 588951 781036 754704
33567 754704 625767 547213 491130 393673 323855 329137 281401 72000 -175980 -269943 -194802
$$ packed form
33638c597M72037M69470J72321k06805m20441l52201r3776Q3565K7035m8186R4974
33627A94396K08760j02356n72686m89601J57400N24509K09279j30927O4390L26330
33617C89494P3882l06413j81542J52363J9591l75136l11822J23957J99545j26971
33607c43052j50303K71135M35096K4078l75142k93160m6794j2094o780J70143
33597c26873K59081P1651o2431J39987L65029J85087k69010n49105n13567l27513
33587a027664q7112J90360L73740L32236J47114L767k6922K9437J46011K56272
33577C37239K56261J34131j7117j35525j98371j31867Q3899K60301J92085k6332
33567G54704j28937p8554n6083r7457o9818N282m7736k09401k47980r3963P5141
$$ plain form
33556 -194802 -40627 165389 380470 447748 263838 -72708 -423806 -764534 -1028698 -1014999
33546 -1014999 -668791 -278261 -142131 -183022 -131697 43955 161558 170121 195452 290571
33536 290571 383024 437367 457252 364658 93032 -212884 -291715 -77884 238283 477164
33526 477164 647396 807806 868679 652493 179134 -197127 -103868 342500 548702 139286
33516 139286 -554640 -957565 -976767 -867786 -587548 95792 873616 1002600 360208 -261635
33506 -261635 -263518 -33816 -182354 -537536 -517840 -109640 178857 109354 -132704 -404789
33496 -404789 -663822 -682614 -271151 263102 376499 3165 -412502 -545737 -433556 -165562
33486 -165562 194388 408841 275332 65635 299749 1011593 1650768 1780052 1469069 941366
$$ packed form
33556a94802J54175K06016K15081O7278j83910l36546l51098l40728k64164J3699
33546a014999L46208L90530J36130m0891N1325J75652J17603Q563K5331R5119
33536B90571R2453N4343J9885r2594k71626l05916p8831K13831L16167K38881
33526D77164J70232J60410O0873k16186m73359l76261R3259M46368K06202m09416
33516A39286o93926m02925j9202J08981K80238O83340P77824J28984o42392o21843
33506b61635j883K29702j48538l55182J9696M08200K88497o9503k42058k72085
33496d04789k59033j8792M11463N34253J13397l73334m15667j33235J12181K67994
33486a65562L59950K14453j33509k09697K34114P11844O39175J29284l10983n27703
$$ plain form
33476 941366 291039 -296926 -479568 -178566 213046 287178 84582 -82430 -85902 -57444
33466 -57444 -109063 -160350 -66068 133667 156857 -200844 -678743 -722608 -187501 395688 513310
33455 513310 368856 514458 985178 1282209 1146596 849336 666788 539734 395007 390562
33445 390562 611479 820354 753021 477266 263877 231585 277925 283283 262183 319081 479011
33434 479011 575060 389406 -56046 -477476 -652053 -582210 -282010 289634 903780 1034222
33424 1034222 505332 -115155 -184062 173574 325181 45695 -316560 -461613 -409357 -199974
33414 -199974 171910 503120 507436 237178 16705 -12765 82001 337227 761640 999308
33404 999308 665525 -20053 -478312 -598213 -713742 -792361 -382115 511158 1221904 1337765
$$ packed form
33476I41366o50327n87965j82642L01002L91612P4132k02596j67012l472K8458
33466e7444n1619n1287R4282J99735K3190l57701m77899m3865N35107N83189J17622
33455E13310j44454J45602M70720K97031j35613k97260j82548j27054j44727m445
33445C90562K20917K08875o7333k75755k13389l2292M6340N358k1100N6898J59930
33434D79011R6049j85654m45452m21430j74577O9843L00200N71644O14146J30442
33424A034222n28890o20487o8907L57636J51607k79486l62255j45053N2256K09383
33414a99974L71884L31210M316k70258k20473k9470R4766K55226M24413K37668
33404I99308l33783o85578m58259j19901j15529p8619M10246Q93273P10746J15861
$$ plain form
33394 1337765 1159816 1000994 704501 198708 -138474 -119256 -155933 -521003 -726600 -231630
33384 -231630 638944 1091347 900239 485529 166860 -104072 -371337 -523268 -512487 -402297
33374 -402297 -227000 -35278 28826 -106885 -318631 -478275 -585149 -598551 -425475 -212757
33364 -212757 -288345 -615882 -718921 -408675 -132328 -239400 -370836 -69074 405651 453216
33354 453216 43108 -348123 -500856 -556434 -507842 -209235 152864 187101 -77000 -220952
33344 -220952 -140569 -189745 -511713 -735985 -557089 -207621 -92089 -237420 -363063 -314176
33334 -314176 -207661 -239672 -489623 -870422 -1202038 -1345207 -1257789 -943421 -481372 -135465
33324 -135465 -193041 -546486 -683904 -332028 128277 195835 -21927 -19056 309202 548353
$$ packed form
33394A337765j77949j58822k96493n05793l37182J9218l6677l65070k05597M94970
33384b31630Q70574M52403j91108m14710l18669k70932k67265j51931J0781J10190
33374d02297J75297J91722O4104j35711k11746j59644j06874j3402J73076K12718
33364b12757p5588l27537j03039L10246K76347j07072j31436L01762M74725M7565
33354D53216m10108l91231j52733n5578M8592K98607L62099L4237k64101j43952
33344b20952Q0383m9176l21968k24272J78896L49468J15532j45331j25643M8887
33334c14176J06515l2011k49951l80799l31616j43169Q7418L14368M62049L45907
33324a35465n7576l53445j37418L51876M60305O7558k17762K871L28258K39151
$$ plain form
33314 548353 441614 230944 207160 292954 256827 73561 -119789 -242110 -267741 -135325
33304 -135325 167754 462742 451064 -3105 -660298 -1046315 -909561 -508041 -286219 -295401
33294 -295401 -197353 112178 240988 -126609 -704944 -976963 -883232 -798615 -945764 -1162821
33284 -1162821 -1201898 -985742 -601507 -252607 -154957 -289608 -345313 -85449 344351 645920
33274 645920 741220 714026 572497 331846 174028 245930 408269 414388 221887 -43901
33264 -43901 -250558 -233133 102119 459176 326335 -241439 -462314 125225 900568 997804
33254 997804 499500 137795 158702 259989 404104 813781 1249476 1175026 682350 419165
33244 419165 519669 461603 124261 67131 458313 629443 160596 -393997 -417559 -154549
$$ packed form
33314E48353j06739k10670k3784Q5794l6127j83266j93350j22321k5631J32416
33304a35325L03079K94988j1678m54169o57193l86017J36754M01520K21822r182
33294b95401R8048L09531J28810l67597n78335k72019R3731Q4617j47149k17057
33284a162821l9077K16156L84235L48900R7650j34651n5705K59864M29800L01569
33274F45920R5300k7194j41529k40651j57818P1902J62339O119j92501k65788
33264d3901k06657J7425L35252L57057j32841n67774k20875N87539P75343R7236
33254I97804m98304l61705K0907J01287J44115M09677M35695p4450m92676k63185
33244D19165J00504n8066l37342n7130L91182J71130m68847n54593k3562K63010
$$ plain form
33234 -154549 -93322 -58624 335862 800313 736403 238128 -4158 310277 816696 1139607
33224 1139607 1273087 1281604 1075408 595392 -26133 -515438 -548492 44097 969479 1581654
33214 1581654 1554470 1248591 1155038 1223354 1080733 696319 408507 391338 466604 409945
33204 409945 156191 -248097 -655833 -864571 -858392 -870519 -1000054 -975918 -578858 -69691
33194 -69691 165590 200633 363838 583577 446103 -86207 -507056 -467480 -263389 -397037
33184 -397037 -889145 -1255614 -1078011 -449287 147763 368529 369446 543700 917204 1056964
33174 1056964 696910 172798 -11954 185033 462266 709406 1025652 1320654 1327151 1007696
33164 1007696 584861 165060 -306982 -706785 -740380 -389972 3107 216787 376276 576516
$$ packed form
33234a54549O1227L4698L94486M64451o3910m98275k42286L14435N06419L22911
33224A139607J33480Q517k06196m80016o21525m89305l3054N92589R25382O12175
33214A581654k7184l05879r3553O8316j42621l84414k87812j7169P5266n6659
33204D09945k53754m04288m07736k08738O179j2127j29535K4136L97060N09167
33194f9691K35281L5043J63205K19739j37474n32310m20849L9576K04091j33648
33184c97037m92108l66469J77603O28724N97050K20766R17J74254L73504J39760
33174A056964l60054n24112j84752J96987K77233K47140L16246K95002O497l19455
33164A007696m22835m19801m72042l99803l3595L50408L93079K13680J59489K00240
$$ plain form
33154 576516 636889 445350 224625 170330 78750 -324521 -848583 -1005351 -677428 -273582
33144 -273582 -152978 -187408 -52902 256410 439027 326764 79962 -81176 -138142 -165960
33134 -165960 -124987 64267 316483 438601 378460 262890 204258 229358 371626 623619
33124 623619 796162 668249 319178 55801 -44487 -202341 -435706 -376279 141284 637219
33114 637219 526490 -89525 -555496 -464778 31726 605077 1024172 1094388 760836 353174
33104 353174 358115 819173 1258522 1308475 1120925 997989 911353 634106 160996 -262872
33094 -262872 -453990 -430339 -277381 -43685 214034 396604 432072 357131 291999 302391
33084 302391 296180 130569 -153524 -311163 -181965 111386 358827 531531 695321 772067
$$ packed form
33154E76516O0373j91539k20725n4295r1580m03271n24062j56768L27923M03846
33144b73582J20604l4430J34506L09312J82617j12263k46802j61138n6966k7818
33134a65960M0973J89254K52216J22118o0141j15570n8632K5100J42268K51993
33124F23619J72543j27913l49071k63377j00288j57854k33365N9427N17563M95935
33114F37219j10729o16015m65971R0718M96504N73351M19095P0216l33552m07662
33104C53174M941M61058M39349M9953j87550j22936q6636k77247m73110m23868
33094b62872j91118K3651J52958K33696K57719J82570L5468p4941o5132J0392
33084C02391o211j65611k84093j57639J29198K93351K47441J72704J63790P6746
$$ plain form
33074 772067 613288 266100 -52780 -236492 -341381 -377362 -273466 -83577 -10151 -146813
33064 -146813 -354782 -450824 -383341 -199285 16569 158681 211447 325022 585890 749122
33054 749122 491202 -38211 -271875 11508 327155 174429 -197444 -133453 447378 895489
33044 895489 722712 217354 -62032 -63103 -131879 -318478 -276963 93621 371613 229384
33034 229384 -27863 72524 399678 406778 15012 -237411 -35496 254315 232032 101611
33024 101611 252282 551603 557022 247744 51413 198977 479082 624179 564180 293152
33014 293152 -156128 -572459 -717800 -639133 -545772 -426504 -143629 150629 151569 -21252
33004 -21252 103962 570652 799722 416906 -199903 -520405 -572389 -644504 -663945 -406479
$$ packed form
33074G72067j58779l47188l18880j83712j04889l5981J03896J89889P3426j36662
33064a46813k07969r6042O7483J84056K15854J42112N2766J13575K60868J63232
33054G49122k57920n29413k33664K83383L15647j52726l71873O3991N80831M48111
33044H95489j72777n05358k79386j071o8776j86599M1515L70584K77992j42229
33034B29384k57247J00387L27154P100l91766k52423K01915K89811k2283j30421
33024A01611J50671K99321N419l09278j96331J47564K80105J45097n9999k71028
33014B93152m49280m16331j45341P8667R3361J19268K82875K94258R40j72821
33004b1252J25214M66690K29070l82816o16809l20502n1984p2115j9441K57466
$$ plain form
32994 -406479 -96154 -203325 -674546 -894060 -528135 14544 168264 -52401 -172351 36687
32984 36687 245817 2568 -677952 -1273277 -1302868 -832709 -365847 -286924 -530097 -769000
32974 -769000 -767417 -500359 -95609 237902 333383 225496 126801 188614 354704 476408
32964 476408 468607 327428 119472 -17593 -1912 46266 -44622 -182932 -79413 300540
32954 300540 595733 489896 74367 -365798 -691871 -867064 -826282 -635228 -564579 -717467
32944 -717467 -754842 -315921 399972 810471 667358 284366 53470 32885 60403 14048
32934 14048 -121408 -255850 -211207 89432 428815 479594 205632 -107158 -227594 -163554
32924 -163554 44795 420991 822364 896394 499811 -5975 -118555 225558 629282 733176
$$ packed form
32994d06479L10325j07171m71221k19514L65925N42679J53720k20665j19950K09038
32984C6687K09130k43249o80520n95325k9591M70159M66862P8923k43173k38903
32974g69000J583K67058M04750L33511R5481j07887r8695O1813J66090J21704
32964D76408p801j41179k07956j37065J5681M8178r0888j38310J03519L79953
32954C00540K95193j05837m15529m40165l26073j75193M0782J91054P0649j52888
32944g17467l7375M38921P15893M10499j43113l82992k30896k0585K7518m6355
32934A4048j35456j34442M4643L00639L39383N0779k73962l12790j20436O4040
32924a63554K08349L76196M01373P4030l96583n05786j12580L44113M03724J03894
$$ plain form
32914 733176 549930 337672 322091 539333 787073 726568 216469 -411239 -596697 -172995
32904 -172995 421229 677430 594004 515201 548314 471577 204086 -2290 23159 82059 -34227
32893 -34227 -154462 -6421 294196 401894 302563 320516 549712 673638 476887 193110
32883 193110 142579 285963 367004 308700 239959 255735 347288 475646 556779 467764 199540
32872 199540 -100473 -342498 -599585 -877173 -976414 -781975 -501084 -368181 -272306 15599
32862 15599 358137 368486 16438 -247146 -87018 289937 472152 367030 166096 -41115
32852 -41115 -336283 -700950 -949288 -1003938 -1023994 -1111468 -1055245 -604410 68636 466576
32842 466576 383628 140386 66406 53838 -109535 -253057 -95651 170004 89192 -293570
$$ packed form
32914G33176j83246k12258j5581K17242K47740o0505n10099o27708j85458M23702
32904a72995N94224K56201q3426p8803L3113p6737k67491k06376K5449N8900j16286
32893c4227j20235J48041L00617J07698r9331J7953K29196J23926j96751k83777
32883A93110n0531J43384Q1041n8304o8741J5776R1553J28358Q1133q9015k68224
32872A99540l00013k42025k57087k77588r9241J94439K80891J32903R5875K87905
32862A5599L42538J0349l52048k63584J60128L76955J82215j05122k00934k07211
32852d1115k95168l64667k48338n4650k0056q7474N6223M50835O73046L97940
32842D66576q2948k43242p3980j2568j63373j43522J57406K65655q0812l82762
$$ plain form
32832 -293570 -450342 -247268 -212811 -648130 -1005914 -612188 349147 1052250 1011359 426533
32822 426533 -263099 -736576 -812324 -521342 -144655 82027 206277 299140 207810 -111087
32812 -111087 -293387 -50379 283417 208709 -117864 -123193 233668 427287 281499 203136
32802 203136 361048 342127 -88523 -530212 -637925 -702564 -1063379 -1410854 -1225026 -581426
32792 -581426 13153 339231 498276 443664 64278 -343078 -264915 290332 714726 590368
32782 590368 165077 -119565 -223041 -385461 -650370 -794033 -665789 -401119 -278020 -441344
32772 -441344 -765105 -945417 -750008 -226247 315728 540063 358452 19774 -105906 88733
32762 88733 311796 229142 -82835 -220727 10049 375968 602618 722692 869970 954075
$$ packed form
32832b93570j56772K03074L4457m35319l57784L93726R61335P03103m0891n84826
32822D26533o89632m73477p5748K90982L76687K26682J24250R2863r1330l18897
32812a11087j82300K43008L33796p4708l26573n329L56861J93619j45788p8363
32802B03136J57912j8921m30650m41689j07713o4639l60815l47475J85828O43600
32792e81426N94579L26078J59045n4612l79386m07356P8163N55247M24394j24358
32782E90368m25291k84642j03476j62420k64909j43663J28244K64670J23099j63324
32772d41344l23761j80312J95409N23761N41975K24335j81611l38678j25680J94639
32762H8733K23063q2654l11977j37892K30776L65919K26650J20074J47278Q4105
$$ plain form
32752 954075 792218 428546 70707 -203199 -430151 -527013 -351025 -3976 180371 27840
32742 27840 -278271 -456826 -435002 -337516 -311781 -427768 -625862 -697788 -437233 108494
32732 108494 622682 818661 676899 354083 4632 -205576 -71925 433137 968917 1116120
32722 1116120 923610 913636 1367983 1830820 1635499 825326 153405 103066 313300 201606
32712 201606 -201854 -418678 -279497 -51741 92200 242952 358017 187847 -227560 -407553
32702 -407553 -50568 497701 684393 435563 126605 41635 132741 201351 90670 -213172
32692 -213172 -508461 -532496 -321513 -218680 -360284 -413410 -77414 409161 591952 417239
32682 417239 161058 -58874 -272794 -320318 -24984 354148 357155 18658 -178277 -89860
$$ packed form
32752I54075j61857l63672l57839k73906k26952r6862J75988L47049J84347j52531
32742B7840l06111j78555K1824R7486K5735j15987j98094p1926K60555N45727
32732A08494N14188J95979j41762l22816l49451k10208J33651N05062N35780J47203
32722A116120j92510r974M54347M62837j95321q10173o71921n0339K10234j11694
32712B01606m03460k16824J39181K27756J43941J50752J15065j70170m15407j79993
32702d07553L56985N48269J86692k48830l08958q4970R1106O8610j10681l03842
32692b13172k95289k4035K10983J02833j41604n3126L35996M86575J82791j74713
32682D17239k56181k19932k13920m7524K95334L79132L007l38497j96935Q8417
$$ plain form
32672 -89860 -107385 -436682 -748576 -788990 -791823 -938219 -909570 -437694 112488 236968 54796
32661 54796 18096 108902 -47399 -402118 -493965 -264628 -211738 -562502 -877872 -746743
32651 -746743 -375410 -160189 -111153 -85417 -199784 -521113 -631882 -86038 802547 1194679
32641 1194679 803231 235791 104517 247322 134720 -272783 -479861 -169231 389407
32632 389407 702273 608761 365710 274242 346412 374154 271562 227519 437788 775826
32622 775826 900871 690030 384298 250577 266778 245464 132729 46814 97669 283200
32612 283200 511842 650458 619174 502585 470607 522915 449516 156107 -120379 -91352
32602 -91352 201777 476394 587947 603784 560105 398557 160042 12215 13789 21198 -100077
$$ packed form
32672h9860j7525l29297l11894m0414k833j46396K8649M71876N50182J24480j82172
32661E4796l6700R0806j56301l54719r1847K29337N2890l50764l15370J31129
32651g46743L71333K15221M9036K5736j14367l21329j10769N45844Q88585L92132
32641A194679l91448n67440j31274J42805j12602m07503k07078L10630N58638
32632C89407L12866r3512k43051r1468P2170K7742j02592m4043K10269L38038
32622G75826J25045k10841l05732j33721J6201k1314j12735q5915N0855J85531
32612B83200K28642J38616l1284j16589l1978N2308p3399k93409k76486K9027
32602i1352K93129K74617J11553J5837m3679j61548k38515j47827J574P409j21275
$$ plain form
32591 -100077 -303993 -453485 -456562 -280023 24731 251523 153023 -249387 -560559 -367295
32581 -367295 285679 864067 859936 335722 -130435 -108336 178127 184151 -197186 -529795
32571 -529795 -531682 -467959 -618413 -750385 -525928 -131904 2857 -81969 -24422 115399
32561 115399 -85075 -571384 -723318 -321747 29124 -203298 -695727 -806602 -467039 -71308
32551 -71308 176458 315177 280914 1948 -311032 -396411 -341978 -386585 -479016 -420874 -286985
32540 -286985 -276877 -284010 -73861 212800 242565 132058 347530 879473 1072027 518660
32530 518660 -301969 -595076 -170835 482899 836567 758748 457563 232690 247768 393620
32520 393620 390023 90624 -358427 -694546 -794260 -718313 -582190 -429541 -204512 144587
$$ packed form
32591a00077k03916j49492l077J76539L04754K26792r8500m02410l11172J93264
32581c67295O52974N78388m131n24214m66157K2099K86463O024l81337l32609
32571e29795j887O3723j50454j31972K24457L94024J34761q4826N7547J39821
32561A15399k00474m86309j51934M01571L50871k32422m92429j10875L39563L95731
32551g1308K47766J38719l4263k78966l12980q5379N4433m4607r2431N8142J33889
32540b86985J0108p133K10149K86661K9765j10507K15472N31943J92554n53367
32530E18660q20629k93107M24241O53734L53668p7819l01185k24873J5078J45852
32520C93620l597k99399m49051l36119r9714P5947J36123J52649K25029L49099
$$ plain form
32510 144587 519666 712081 642393 442584 212237 -136940 -630584 -1011866 -1033527 -841182
32500 -841182 -765136 -811622 -691441 -327440 13547 134389 126123 91963 -33825 -253272
32490 -253272 -361344 -226151 -34466 -77111 -387614 -721367 -835611 -717359 -564894 -551967
32480 -551967 -600737 -488098 -234595 -190932 -553509 -987818 -1013748 -619133 -177093 101096
32470 101096 243876 167318 -271248 -858260 -1128589 -969796 -718462 -598070 -503869 -420405
32460 -420405 -537298 -769750 -674303 -122679 383420 383694 49465 -215485 -361147 -493244
32450 -493244 -460715 -119058 240643 203419 -161015 -400447 -286510 26128 333457 531173
32440 531173 510341 221420 -191906 -541446 -782288 -875298 -668491 -179614 213095 193325
$$ packed form
32510A44587L75079J92415o9688j99809k30347l49177m93644l81282k1661J92345
32500h41182P6046m6486J20181L64001L40987J20842q266l4160j25788k19447
32490b53272j08072J35193J91685m2645l10503l33753j14244J18252J52465J2927
32480e51967m8770J12639K53503M3663l62577m34309k5930L94615M42040K78189
32470A01096J42780p6558m38566n87012k70329J58793K51334J20392R4201Q3464
32460d20405j16893k32452R5447N51624N06099K74l34229k64950j45662j32097
32450d93244L2529L41657L59701l7224l64434k39432J13937L12638L07329J97716
32440E31173k0832k88921m13326l49540k40842r3010K06807M88877L92709j9770
$$ plain form
32430 193325 -44954 -110249 -15332 -80956 -347265 -498640 -368126 -157574 -111047 -233148
32420 -233148 -350390 -251284 185666 803219 1193244 1114140 756767 415717 129441 -102292
32410 -102292 -69683 261346 416633 26155 -443904 -229778 551082 975135 612461 22531
32400 22531 -225865 -293597 -471338 -504501 -74539 482060 539174 68438 -330130 -203533
32390 -203533 310274 756992 807270 469474 58467 -101754 -42946 -84216 -344070 -581085
32380 -581085 -633800 -682852 -854966 -902244 -589119 -114117 204245 405298 664089 841374
32370 841374 726445 544353 678718 972843 893205 430662 237420 661519 1177306 1110896
32360 1110896 519555 -45912 -335581 -492690 -546623 -339661 30433 163063 -79206 -298377
$$ packed form
32430A93325k38279o5295R4917o5624k66309j51375J30514K10552M6527j22101
32420b33148j17242R9106M36950O17553L90025p9104l57373l41050k86276k31733
32410a02292L2609L31029J55287l90478m70059K14126P80860M24053l62674n89930
32400B2531k48396o7732j77741l3163M29962N56599N7114m70736l98568J26597
32390b03533N13807M46718N0278l37796m11007j60221N8808m1270k59854k37015
32380e81085n2715m9052j72114m7278L13125M75002L18362K01053K58791J77285
32370H41374j14929j82092J34365K94125p9638m62543j93242M24099N15787o6410
32360A110896n91341n65467k89669j57109n3933K06962L70094J32630k42269k19171
$$ plain form
32350 -298377 -104146 297478 366885 -10039 -352257 -227575 220548 564900 689762 798824
32340 798824 928796 834290 446341 98077 60534 119844 -60831 -351113 -344192 -63203
32330 -63203 12575 -276117 -448720 -104377 444913 650425 540472 581383 885875 1078148
32320 1078148 935628 672243 493908 332579 189569 302635 701375 965171 754730
32311 754730 298797 14778 -93122 -272529 -476742 -422253 -83319 275857 486622 520847
32301 520847 265880 -300730 -788291 -746861 -340654 -153152 -290319 -257824 149089 470407
32291 470407 370733 199637 353884 605377 576029 456838 659553 1034416 1051343 633529
32281 633529 256217 241507 413337 468056 324679 99910 12356 253297 706385 931753
$$ packed form
32350b98377J94231M01624O9407l76924l42218J24682M48123L44352J24862J09062
32340G98824J29972r4506l87949l48264l7543N9310j80675k90282O921K80989
32330f3203P5778k88692j72603L44343N49290K05512j09953M0911L04492J92273
32320A078148j42520k63385j78335j61329j43010J13066L98740K63796k10441
32311G54730m55933k84019j07900j79407k04213N4489L38934L59176K10765L4225
32301E20847k54967n66610m87561M1430M06207J87502j37167L2495M06913L21318
32291D70407r9674j71096J54247K51493k9348j19191K02715L74863J6927m17814
32281F33529l77312j4710J71830N4719j43377k24769q7554K40941M53088K25368
$$ plain form
32271 931753 695837 322785 210514 246601 99080 -172344 -280423 -256884 -296206 -268042
32261 -268042 1142 154217 -263998 -913780 -1014391 -588600 -466797 -903938 -1128638 -622867
32251 -622867 35274 136552 -121572 -203689 -189987 -415754 -648753 -423062 103801 368377
32241 368377 292091 282337 466832 566270 484133 438824 489775 436481 235834 100190 150170
32230 150170 325427 609010 974630 1170537 960917 548435 349638 378340 287293 26635
32220 26635 -15651 357935 802872 886033 582565 168980 -121641 -203756 -110515 23499
32210 23499 83381 90681 68227 -107932 -487928 -800247 -744445 -443581 -247715 -168691 66182
32199 66182 441812 624755 539732 475786 526632 446316 211143 167672 373063 355642 -93957
$$ packed form
32271I31753k35916l73052j12271L6087j47521k71424j08079K3539l9322K8164
32261b68042K69184J53075m18215o49782j00611M25791J21803m37141k24700N05771
32251f22867O58141J01278k58124q2117J3702k25767k32999K25691N26863K64576
32241C68377p6286r754J84495R9438q2137m5309N0951n3294k00647j35644M9980
32230A50170J75257K83583L65620J95907k09620m12482j98797K8702r1047k60658
32220B6635m2286L73586M44937Q3161l03468m13585k90621q2115R3241J34014
32210B3499N9882P300k2454j76159l79996l12319N5802L00864J95866P9024K34873
32199F6182L75630J82943q5023o3946N0846q0316k35173m3471K05391j7421m49599
$$ plain form
32188 -93957 -427318 -139846 375685 394151 -30453 -201914 119282 462489 519569 592568
32178 592568 955055 1321452 1287755 914345 522521 193649 -170927 -486648 -561112 -456135
32168 -456135 -432193 -523439 -468838 -149567 149527 65333 -399952 -900777 -1126403 -1039729
32158 -1039729 -811410 -646379 -647678 -744417 -763694 -645224 -535884 -570834 -629277 -484114
32148 -484114 -182904 -62843 -296752 -597332 -522373 15862 676154 1068424 1099366 969384
32138 969384 910058 925368 787812 342474 -214759 -499210 -387090 -130538 17342 78758
32128 78758 155158 190619 113069 20031 9149 -21002 -175600 -306170 -194198 105859 338435
32117 338435 378783 291721 173694 144811 343718 677397 750261 356070 -130595 -227912
$$ packed form
32188i3957l33361K87472N15531J8466m24604j71461L21196L43207N7080P2999
32178E92568L62487L66397l3697l73410l91824l28872l64576l15721p4464J04977
32168d56135K3942r1246N4601L19271K99094q4194m65285n00825k25626Q6674
32158a039729K28319J65031j299r6739j9277J18470J09340l4950n8443J45163
32148d84114L01210J20061k33909l00580P4959N38235O60292L92270L0942j29982
32138I69384n9326J5310j37556m45338n57233k84451J12120K56552J47880O1416
32128G8758P6400L5461p7550r3038j0882l0151j54598j30570J11972L00057K32576
32117C38435M0348q7062j18027k8883J98907L33679P2864l94191m86665r7317
$$ plain form
32107 -227912 -49999 -82791 -375819 -497455 -276161 -13276 115812 290026 521663 504995
32097 504995 237547 205559 589230 831778 466087 -112110 -254376 -46675 -45739 -303299
32087 -303299 -357186 -95693 50041 -170817 -500932 -697366 -873533 -1136094 -1305685 -1217215
32077 -1217215 -972939 -708614 -392038 -23116 228316 251144 139806 2546 -126807 -99425
32067 -99425 287786 868309 1093111 717032 203085 113366 351818 412126 189375 59957
32057 59957 199845 320351 192116 2242 -28057 -43409 -280463 -618134 -724675 -557310
32047 -557310 -423346 -543458 -771812 -790015 -444262 119921 553464 570031 250064 39127
32037 39127 285503 812085 1126236 1020527 734309 519919 339940 93525 -134252 -225275
$$ packed form
32107b27912J77913l2792k93028j21636K21294K62885J29088J74214K31637j6668
32097E04995k67448l1988L83671K42548l65691n78197j42266K07701R36k57560
32087c03299n3887K61493J45734k20858l30115j96434j76167k62561j69591Q8470
32077a217215K44276K64325L16576L68922K51432K2828j11338j37260j29353K7382
32067i9425L87211N80523K24802l76079n13947q9719K38452O0308k22751j29418
32057E9957J39888J20506j28235j89874l0299j5352k37054l37671j06541J67365
32047e57310J33964j20112k28354j8203L45753N64183M33543J6567l19967k10937
32037C9127K46376N26582L14151j05709k86218k14390j79979k46415k27777r1023
$$ plain form
32027 -225275 -209867 -105268 219894 791988 1320833 1494240 1338378 1038490 588984 -28422
32017 -28422 -464582 -276050 381805 767898 428727 -261155 -619625 -459423 -153873 -75668
32007 -75668 -188005 -140287 331921 1059950 1506981 1305839 687534 174063 -85118 -340571
31997 -340571 -618819 -541327 21671 529714 377073 -324358 -940518 -1136558 -1118114 -1113050
31987 -1113050 -1005181 -596331 3651 401035 273735 -329651 -998410 -1271489 -977926
31978 -977926 -279926 533810 1166233 1320659 893009 214585 -185377 -178345 -124940 -248552
31968 -248552 -278873 40927 448583 535868 364611 289327 352520 316402 193539 259279 525639
31957 525639 657145 508433 351815 417349 541089 473236 283914 233039 380422 522704
$$ packed form
32027b25275J5408J04599L25162N72094N28845J73407j55862k99888m49506o17406
32017b8422m36160J88532O57855L86093l39171o89882l58470J60202L05550P8205
32007g5668j12337M7718M72208P28029M47031k01142o18305n13471k59181k55453
31997c40571k78248P7492N62998N08043j52641p01431o16160j96040J8444N064
31987a113050J07869M08850N99982L97384j27300o03386o68759k73079K93563
31978i77926O98000Q13736O32423J54426m27650o78424l99962P032N3405j23612
31968b48552l0321L19800M07656Q7285j71257p5284O3193l6118j22863O5740K66360
31957E25639J31506j48712j56618O5534J23740o7853j89322n0875J47383J42282
$$ plain form
31947 522704 461616 211016 -47047 -164902 -193103 -311152 -565676 -776350 -796193 -746113
31937 -746113 -828497 -998031 -1012472 -769634 -423657 -194325 -187082 -333717 -398022 -170476
31927 -170476 202466 273463 -114684 -517995 -471464 -157334 -85767 -282201 -311090 -58077
31917 -58077 79419 -112888 -305663 -180828 83966 157805 43245 -57456 -83719 -49278
31907 -49278 123187 403356 476331 89244 -502371 -722852 -339609 245655 440452 118926
31897 118926 -249273 -163877 290514 582080 490696 390117 568634 660558 214390 -454359
31887 -454359 -606409 -174809 156298 9507 -241007 -247156 -209550 -314330 -303014 -35611
31877 -35611 87187 -235166 -636341 -700172 -685910 -1002863 -1333569 -1014352 -102624 637996
$$ packed form
31947E22704o1088k50600k58063j17855k8201j18049k54524k10674j9843N0080
31937g46113q2384j69534j4441K42838L45977K29332P243j46635o4305K27546
31927a70476L72942P0997l88147m03311M6531L14130P1567j96434k8889K53013
31917e8077J37496j92307j92775J24835K64794P3839j14560j00701k6263L4441
31907d9278J72465K80169P2975l87087n91615k20481L83243N85264J94797l21526
31897A18926l68199Q5396M54391K91566r1384j00579J78517R1924m46168o68749
31887d54359j52050M31600L31107j46791k50514o149L7606j04780J1316K67403
31877c5611J22798l22353m01175o3831J4262l16953l30706L19217R11728P40620
$$ plain form
31867 637996 761294 530871 306263 125765 -36742 -111788 -129709 -164836 -49737 431856
31857 431856 1045135 1263636 1008814 770719 852523 931829 592052 -57530 -538398 -550042
31847 -550042 -178807 261706 477398 426817 351573 435168 505015 310957 -16238 -144767
31837 -144767 -92332 -133037 -174353 201303 932172 1298206 865807 138301 -129734 108582
31827 108582 343504 305061 121089 -125014 -483714 -826753 -877838 -605159 -264382 -9816
31817 -9816 249647 549483 704629 585339 373333 371717 616913 800522 605885 90206
31807 90206 -323536 -283233 108386 442612 494246 400623 364890 405933 467155 543110 577811
31796 577811 451924 213331 91280 95569 -143911 -848023 -1604740 -1795729 -1414973 -1057782
$$ packed form
31867F37996J23298k30423k24608j80498j62507p5046j7921l5127J15099M81593
31857D31856O13279K18501k54822k38095Q1804P9306l39777o49582m80868j1644
31847e50042L71235M40513K15692n0581p5244Q3595O9847j94058l27195j28529
31837a44767N2435m0705m1316L75656P30869L66034m32399p27506k68035K38316
31827A08582K34922l8443j83972k46103l58700l43039n1085K72679L40777K54566
31817i816K59463K99836J55146j19290k12006j616K45196J83609j94637n15679
31807I0206m13742M0303L91619L34226N1634r3623l5733M1043O1222P5955L4701
31796E77811j25887k38593j22051M289k39480p04112p56717j90989L80756L57191
$$ plain form
31786 -1057782 -1074915 -1136137 -783674 -95639 447505 564530 379626 111496 -183128 -501200
31776 -501200 -705278 -602059 -206962 179855 253677 36273 -175129 -198858 -176646 -320042
31766 -320042 -578360 -695647 -527624 -172797 153151 248833 16612 -395536 -588039 -266949
31756 -266949 367827 791524 763961 572255 577526 725980 685202 331707 -105286 -342666
31746 -342666 -313919 -145614 -548 39361 25841 73708 160751 63178 -350527 -795902 -776810
31735 -776810 -193134 464544 675928 472399 258742 209350 145266 -28967 -113512 43472
31725 43472 258522 266379 100301 27018 198003 522186 800689 845539 556047 37772
31715 37772 -417733 -609409 -613293 -582150 -495664 -284251 -55907 43431 89916 240589 430971
$$ packed form
31786a057782j7133o1222L52463O88035N43144J17025j84904k68130k94624l18072
31776e01200k04078J03219L95097L86817P3822k17404k11402k3729K2212j43396
31766c20042k58318j17287J68023L54827L25948R5682k32221m12148j92503L21090
31756b66949O34776M23697k7563j91706N271J48454m0778l53495m36993k37380
31746c42666K8747J68305J45066L9909j3520M7867Q7043r7573m13705m45375J9092
31735g76810N83676O57678K11384k03529k13657m9392o4084j74233q4545J56984
31725D3472K15050P857j66078p3283J70985L24183K78503M4850k89492n18275
31715C7772m55505j91676l884L1143Q6486K11413K28344R9338M6485J50673J90382
$$ plain form
31704 430971 506909 547808 676496 622467 -20253 -1026058 -1560402 -1205887 -507757 -187079
31694 -187079 -237707 -214804 -44805 -3936 -108164 -104947 -13889 -134700 -468482 -620684 -411706
31683 -411706 -155651 -137842 -184538 -13495 265253 302022 12469 -334928 -479701 -427698
31673 -427698 -367766 -449398 -634549 -728777 -607565 -403452 -340121 -375119 -214601 222306
31663 222306 569813 446057 -12347 -273321 -20491 559761 1088022 1375614 1437954 1312684
31653 1312684 1024897 670899 386947 206018 32503 -191882 -356204 -290307 8844 338519
31643 338519 497486 477471 431467 504419 702523 863891 766719 380733 18571 62073
31633 62073 460914 693712 376979 -258617 -691827 -740517 -607475 -445484 -235159 -48660
$$ packed form
31704D30971P5938M0899J28688n4029o42720j005805n34344L54515O98130L20678
31694a87079n0628K2903J69999M0869j04228L217R1058j20811l33782j52202K08978
31683d11706K56055J7809m6696J71043K78748L6769k89553l47397j44773N2003
31673d27698N9932q1632j85151r4228J21212K04113O3331l4998J60518M36907
31663B22306L47507j23756m58404k60974K52830N80252N28261K87592O2340j25270
31653A312684k87787l53998k83952j80929j73515k24385j64322O5897K99151L29675
31643C38519J58967k0015m6004P2952J98104J61368r7172l85986l62162M3502
31633F2073L98841K32798l16733o35596m33210m8690J33042J61991K10325J86499
$$ plain form
31623 -48660 -40612 -112130 45727 437219 634273 365725 -65733 -209528 -66011 23964
31613 23964 -101062 -312509 -467020 -501482 -352233 -61590 113435 -23667 -294180 -384137
31603 -384137 -316152 -350018 -477530 -433638 -242587 -293978 -705999 -1038814 -927945 -655157
31593 -655157 -719018 -1078792 -1234720 -933343 -403549 45766 285206 244474 -69130 -372175
31583 -372175 -308033 21464 83371 -343498 -799847 -785521 -448777 -264209 -261260 -50895
31573 -50895 455680 847699 824085 592166 483218 501998 486345 452258 501940 547797 401028
31562 401028 71972 -222427 -316505 -227145 -93682 -94799 -311959 -553005 -466512 -2937
31552 -2937 410123 388933 126996 97237 341476 447548 220301 -35915 -6668 225947
$$ packed form
31623d8660Q048p1518J57857L91492J97054k68548m31458j43795J43517Q9975
31613B3964j25026k11447j54511l4462J49249K90643J75025j37102k70513q9957
31603c84137O7985l3866j27512M3892J91051n1391m12021l32815J10869K72788
31593f55157o3861l59774j55928L01377N29794M49315K39440m0732l13604l03045
31583c72175O4142L29497O1907m26869m56349J4326L36744J84568K949K10365
31573e0895N06575L92019k3614k31919j08948J8780j5653l4087M9682M5857j46769
31562D01028l29056k94399r4078Q9360J33463j117k17160k41046Q6493M63575
31552b937M13060k1190k61937k9759K44239J06072k27247k56216K9247K32615
$$ plain form
31542 225947 438745 619228 832502 965381 850773 516844 131496 -181105 -330102 -215439
31532 -215439 145224 567080 886456 1044520 915406 344040 -448602 -819874 -427234 217639
31522 217639 340153 -71763 -305574 18821 440301 386352 -18246 -213521 -31544 126642
31512 126642 -91188 -505835 -664603 -428727 -130820 -138290 -399118 -556112 -458566 -348229
31502 -348229 -472377 -730928 -870894 -845541 -754413 -579298 -266573 22971 68346 -37506
31492 -37506 8049 226175 305634 112194 -84061 -23205 200296 375561 491115 614179
31482 614179 684548 659365 696911 969265 1390655 1700516 1732269 1494518 1112383 782189
31472 782189 630339 536825 294398 10633 61479 500248 844241 693691 250284 -79158
$$ packed form
31542B25947K12798J80483K13274J32879j14608l33929l85348l12601j48997J14663
31532b15439L60663M21856L19376J58064j29114n71366p92642l71272L92640O44873
31522B17639J22514m11916k33811L24395M21480n3949m04598j95275J81977J58186
31512A26642k17830m14647j58768K35876K97907p470k60828j56994R7546J10337
31502c48229j24148k58551j39966K5353R1128J75115L12725K89544M5375j05852
31492c7506M5555K18126P9459j93440j96255O0856K23501J75265J15554J23064
31482F14179P0369k5183L7546K72354M21390L09861L1753k37751l82135l30194
31472G82189j51850r3514k42427k83765N0846M38769L43993j50550m43407l29442
$$ plain form
31462 -79158 -263900 -426667 -357542 166131 723034 566088 -326607 -1080000 -984011 -268854
31452 -268854 390116 706199 809701 783279 572686 239067 -5178 -6147 215758 496967
31442 496967 612779 457731 210370 164238 338378 447384 319817 106173 -28973 -148269
31432 -148269 -312183 -379303 -260202 -131523 -135877 -83858 236150 621116 672824 355643
31422 355643 -3249 -204196 -308284 -301794 -26587 453747 767693 702657 501871 491448
31412 491448 616666 586873 340318 91583 -40776 -182445 -415862 -573885 -486111 -289356
31402 -289356 -257636 -356272 -248191 144268 367406 19925 -563868 -641862 -94664 321706
31392 321706 -33685 -816460 -1162601 -772052 -112096 329406 522459 579633 399575 -123561
$$ packed form
31462g9158j84742j62767O9125N23673N56903j56946q92695p53393R5989P15157
31452b68854O58970L16083J03502k6422k10593l33619k44245r69K21905K81209
31442D96967J15812j55048k47361m6132J74140J09006j27567k13644j35146j19296
31432a48269j63914o7120J19101J28679m354N2019L20008L84966N1708l17181
31422C55643l58892k00947j04088O490K75207M80334L13946o5036k00786j0423
31412D91448J25218k9793k46555k48735j32359j41669k33417j58023Q7774J96755
31402b89356L1720r8636J08081L92459K23138l47481n83793p7994N47198M16370
31392C21706l55391p82775l46141L90549O59956M41502J93053N7174j80058n23136
$$ plain form
31382 -123561 -756736 -1064461 -871695 -459847 -269101 -430506 -632285 -515056 -166569 -34409
31372 -34409 -284883 -518163 -345480 -5521 -34827 -453695 -719164 -494400 -35474 289879
31362 289879 461613 592245 609990 442805 281588 365684 630901 792619 681820 341200
31352 341200 -81790 -381298 -381121 -155931 -36250 -221428 -515291 -608900 -470326 -260774
31342 -260774 -33537 226757 393700 321381 117341 19057 28837 -62532 -298058 -472247
31332 -472247 -460557 -382416 -374055 -418907 -471744 -536981 -534586 -298871 147484 469401 324330
31321 324330 -270718 -944577 -1260589 -983688 -235520 519592 801855 571323 250001 178856
31311 178856 209912 26219 -286357 -312416 45530 336790 159361 -263218 -397694 -182009
$$ packed form
31382a23561o33175l07725J92766M11848J90746j61405k01779J17229L48487J32160
31372c4409k50474k33280J72683L39959k9306m18868k65469K24764M58926L25353
31362B89879J71734J30632J7745j67185j61217Q4096K65217J61718j10799l40620
31352C41200m22990k99508J77K25190J19681j85178k93863r3609J38574K09552
31342b60774K27237K60294J66943p2319k04040r8284R780r1369k35526j74189
31332d72247J1690P8141Q361m4852n2837o5237K395K35715M46355L21917j45071
31321C24330n95048o73859l16012K76901P48168P55112K82263k30532l21322p1145
31311A78856L1056j83693l12576k6059L57946K91260j77429m22579j34476K15685
$$ plain form
31301 -182009 -128520 -570903 -1141805 -1263079 -956100 -792752 -1058713 -1361225 -1248286 -897426
31291 -897426 -842659 -1164477 -1362160 -1081271 -599026 -379693 -414970 -322525 23346 322578
31281 322578 345114 256675 278643 300264 118169 -114554 -54768 253110 367460 112435
31271 112435 -138091 -49342 166345 165647 93669 320358 729443 806794 425815 20809 -117966
31260 -117966 -207156 -420436 -465681 -67589 488392 707253 550376 357680 265678 106352
31250 106352 -167028 -311522 -108746 355445 755025 784155 443331 135205 279656 725069
31240 725069 829907 329895 -214749 -163111 340090 681898 696508 718371 871824 893184
31230 893184 647822 300933 -50933 -432901 -666941 -515087 -191050 -182403 -478499 -552810
$$ packed form
31301a82009N3489m42383n70902j21274L06979J63348k65961l02512J12939L50860
31291h97426N4767l21818j97683K80889M82245K19333l5277R2445L45871K99232
31281C22578K2536q8439K1968K1621j82095k32723N9786L07878J14350k55025
31271A12435k50526Q8749K15687o98p1978K26689M09085P7351l80979m05006j38775
31260a17966q9190k13280m5245L98092N55981K18861j56877j92696r2002j59326
31250A06352k73380j44494K02776M64191L99580K9130l40824l08126J44451M45413
31240G25069J04838n00012n44644N1638N03201L41808J4610K1863J53453K1360
31230H93184k45362l46889l51866l81968k34040J51854L24037Q647k96096p4311
$$ plain form
31220 -552810 -243297 -13247 -105664 -116291 201197 349007 -138720 -848055 -1063147 -824838
31210 -824838 -729332 -914209 -964415 -745769 -627445 -776678 -827391 -470193 63070 349518
31200 349518 310914 181477 150366 227938 342483 422151 426800 361639 246648 97230 -43983
31189 -43983 -141859 -263913 -493226 -704788 -659181 -416181 -351120 -563008 -604330 -120723
31179 -120723 554381 869620 855675 928214 1066681 814245 98449 -550637 -742914 -684209
31169 -684209 -711973 -832055 -939130 -1091163 -1300192 -1376074 -1228196 -1046173 -976124 -909981
31159 -909981 -789575 -772966 -839258 -593355 156244 905913 986019 424546 -139507 -309319
31149 -309319 -265455 -256591 -191895 96956 467333 547125 121810 -629938 -1228785 -1256411 -749813
$$ packed form
31220e52810L09513K30050r2417j0627L17488J47810m87727p09335k15092K38309
31210h24838R5506j84877n0206K18646J18324j49233n0713L57198N33263K86448
31200C49518l8604j29437l1111P7572J14545P9668M649o5161j14991j49418j41213
31189d3983r7876j22054k29313k11562M5607K43000O5061k11888m1322M83607
31179a20723O75104L15239j3945P2539J38467k52436p15796o49086j92277N8705
31169f84209k7764j20082j07075j52033k09029p5882J47878J82023P0049O6143
31159i09981J20406J6609o6292K45903P49599P49669Q0106n61473n64053j69812
31149c09319M3864Q864O4696K88851L70377P9792m25315p51748n98847k7626N06598
$$ plain form
31138 -749813 -206319 -64564 -231321 -286851 -89315 79050 -20419 -246305 -325936 -222442
31128 -222442 -86314 -239 31932 -55943 -326063 -655099 -815533 -755400 -620487 -470605
31118 -470605 -191717 200834 399290 181139 -188568 -236668 68022 263878 52991 -312913
31108 -312913 -448253 -332880 -170725 -17928 148806 206923 83132 12851 207400 376269
31098 376269 53291 -610019 -887083 -442938 205471 411828 166521 -138555 -320098 -394117
31088 -394117 -258533 149445 530008 504431 179236 29243 209440 366565 218999 -31533
31078 -31533 -50932 124605 178478 -17800 -246068 -240177 -2228 220936 224853 70051 3180
31067 3180 169049 456583 656263 692747 624031 478388 224727 -99372 -360315 -482169
$$ packed form
31138g49813N43494J41755j66757n5530J97536J68365r9469k25886p9631J03494
31128b22442J36128Q6075L2171q7875k70120l29036j60434O0133J34913J49882
31118d70605K78888L92551J98456k18151l69707m8100L04690J95856k10887l65904
31108c12913j35340J15373J62155J52797J66734N8117j23791p0281J94549J68869
31098C76269l22978o63310k77064M44145O48409K06357k45307l05076j81543p4019
31088c94117J35584M07978L80563k5577l25195j49993J80197J57125j47566k50532
31078c1533j9399J75537N3873j96278k28268N891K37949K23164L917j54802o6871
31067C180J65869K87534J99680L6484o8716j45643k53661l24099k60943j21854
$$ plain form
31057 -482169 -538998 -615356 -627783 -403337 31662 351880 258788 -115537 -306376 -85839
31047 -85839 251126 329096 243898 392279 834309 1171419 1104865 789895 509675 297829
31037 297829 86753 -16335 132471 440114 679280 781242 836071 879204 854368 735152
31027 735152 548911 338676 187166 166633 183394 38668 -248384 -388185 -244374 -71876
31017 -71876 -117933 -237172 -197640 -131963 -293893 -530570 -447327 -39279 283832 309686 225742
31006 225742 152527 -72007 -475427 -725236 -586323 -310208 -277500 -446280 -442934 -109596
30996 -109596 276361 319830 -85864 -658634 -974093 -848093 -488257 -212615 -77278 69312
30986 69312 221913 168026 -134306 -360376 -153346 446547 990491 982254 290368 -649028
$$ packed form
31057d82169n6829p6358j2427K24446M34999L20218r3092l74325j90839K20537
31047h5839L36965P7970q5198J48381M42030L37110o6554l14970k80220k11846
31037B97829k11076j03088J48806L07643K39166J01962N4829M3133k4836j19216
31027G35152j86241k10235j51510k0533J6761j44726k87052j39801J43811J72498
31017g1876m6057j19239L9532O5677j61930k36677Q3243M08048L23111K5854q3944
31006B25742p3215k24534m03420k49809J38913K76115L2708j68780L346L33338
30996a09596L85957M3469m05694n72770l15459J26000L59836K75642J35337J46590
30986F9312J52601n3887l02332k26070K07030N99893N43944q237o91886r39396
$$ plain form
30976 -649028 -1086239 -638996 272306 875688 898905 699648 599625 511041 322764 213162
30966 213162 318878 429562 314535 103398 52634 144405 192005 145269 22690 -246454
30956 -246454 -607356 -712864 -331267 222281 422548 197709 -91044 -223219 -278698 -287858
30946 -287858 -153639 44397 60289 -122562 -244961 -197650 -155341 -194495 -136080 78433
30936 78433 198458 69521 -68313 46522 255617 214753 -64171 -198749 68872 582588
30926 582588 994157 1139853 1168141 1328878 1620739 1703309 1304108 668454 340171 450022
$$ packed form
30976f49028m37211M47243R11302O03382K3217j99257j00023q8584j88277j09602
30966B13162J05716J10684j15027k11137n0764R1771M7600m6736j22579k69144
30956b46454l60902j05508L81597N53548K00267k24839k88753j32175n5479r160
30946b87858J34219J98036J5892j82851j22399M7311M2309l9154N8415K14513
30936G8433J20025j28937j37834J14835K09095m0864k78924j34578K67621N13716
30926E82588M11569J45696K8288J60737K91861Q2570l99201o35654l28283J09851
$$ [...]
##END NTUPLES=NMR SPECTRUM
##END=
