##TITLE=31Pdec_LY-TMF-8.100
 D2O, 24 sc
 3.3.2020
##JCAMPDX= 6.0         $$ Bruker NMR JCAMP-DX V2.0
##DATA TYPE= NMR SPECTRUM
##DATA CLASS= NTUPLES
##ORIGIN= UXNMR, Bruker Analytische Messtechnik GmbH
##OWNER= root
$$ XWIN-NMR		Version 3.5
$$ Tue Mar  3 13:50:42 2020 Russian Standard Time (UT+4h)  she@DPX200
##.OBSERVE FREQUENCY= 81.013821
##.OBSERVE NUCLEUS= ^31P
##.ACQUISITION MODE= SIMULTANEOUS
##.ACQUISITION SCHEME= undefined
##.AVERAGES= 24
##.DIGITISER RES= 17
##SPECTROMETER/DATA SYSTEM= spect
##.PULSE SEQUENCE= zgpg30
##.SOLVENT NAME= CDCl3
##.SHIFT REFERENCE= (INTERNAL, CDCl3, 0, 182.463)
##AUDIT TRAIL= $$ (NUMBER, WHEN, WHO, WHERE, WHAT)
$$ ##TITLE= Audit trail, XWIN-NMR		Version 3.5
$$ ##JCAMPDX= 5.01
$$ ##ORIGIN= Bruker BioSpin GmbH
$$ ##OWNER= she
$$ F:/spectra/data/she/nmr/P31/1/pdata/1/auditp.txt
$$ ##AUDIT TRAIL=  $$ (NUMBER, WHEN, WHO, WHERE, WHAT)
(   1,<2020-03-03 13:49:34.26 +0400>,<she>,<DPX200>,
      <created by zg, POWCHK disabled, PULCHK disabled
       configuration hash MD5:
       00 E9 B6 7A A2 85 ED C7 34 08 36 98 17 FE 4E 26
       data hash MD5: 32K
       83 1D 9F 49 86 35 54 EC A1 53 07 A3 8E A1 C5 51>)
(   2,<2020-03-03 13:49:40.23 +0400>,<she>,<DPX200>,
      <Start of raw data processing
       efp BC_mod = 2 LB = 1 FT_mod = 6 PKNL = 1 PHC0 = -1464.495 PHC1 = 359.6017 SI = 64K 
       data hash MD5: 64K
       A5 29 00 32 FF 29 7E E1 D6 E3 55 90 4A 06 BF C6>)
(   3,<2020-03-03 13:49:59.78 +0400>,<she>,<DPX200>,
      <pk PHC0 = 11.09457 PHC1 = 0 
       data hash MD5: 64K
       39 9A 3A 33 BD FD DA 45 32 A9 92 A7 8C BD 01 40>)
(   4,<2020-03-03 13:50:14.17 +0400>,<she>,<DPX200>,
      <pk PHC0 = -0.5999969 PHC1 = 0 
       data hash MD5: 64K
       BD 5D 62 27 3F 28 C7 DE 49 63 42 03 0F C5 79 7A>)
$$ ##END=
$$ 
$$ hash MD5
$$ 1D FF 5D 4E 0C A8 15 6A 24 CA FB 8B C8 95 C4 2A
##$RELAX= 
##$RELAX= 
##$RELAX= 
##$RELAX= 
##$RELAX= 
##$RELAX= 
##$RELAX= 
##$RELAX= 
$$ Bruker specific parameters
$$ --------------------------
##$DU= <F:/spectra>
##$EXPNO= 1
##$NAME= <P31>
##$PROCNO= 1
##$TYPE= <nmr>
##$USER= <she>
##$AMP= (0..31)
100 100 100 100 100 100 100 100 100 100 100 100 100 100 100 100 100 100 
100 100 100 100 100 100 100 100 100 100 100 100 100 100 
##$AQSEQ= 0
##$AQ_mod= 1
##$AUNM= <au_zg>
##$AUTOPOS= <>
##$BF1= 81.014009
##$BF2= 200.13
##$BF3= 200.13
##$BF4= 200.13
##$BF5= 200.13
##$BF6= 200.13
##$BF7= 200.13
##$BF8= 200.13
##$BYTORDA= 1
##$CFDGTYP= 0
##$CFRGTYP= 5
##$CHEMSTR= <none>
##$CNST= (0..31)
1 1 145 1 1 1 1 1 1 1 1 1 1 1 1 1 1 1 1 1 1 1 1 1 1 1 1 1 1 1 1 1 
##$CPDPRG= <waltz16>
##$CPDPRG1= <>
##$CPDPRG2= <waltz16>
##$CPDPRG3= <>
##$CPDPRG4= <mlev>
##$CPDPRG5= <mlev>
##$CPDPRG6= <mlev>
##$CPDPRG7= <mlev>
##$CPDPRG8= <mlev>
##$CPDPRGB= <>
##$CPDPRGT= <>
##$D= (0..31)
0 1 0 0 0 0 0 0 0 0 0 0.03 2e-05 3e-06 0 0 0 0 0 0 0 0 0 0 0 0 0 0 0 0 
0 0 
##$DATE= 1583228973
##$DBL= (0..7)
120 120 120 11 120 120 24 19 
##$DBP= (0..7)
150 150 150 150 150 150 150 150 
##$DBP07= 0
##$DBPNAM0= <>
##$DBPNAM1= <>
$$ [...]
##$SUBNAM2= <"">
##$SUBNAM3= <"">
##$SUBNAM4= <"">
##$SUBNAM5= <"">
##$SUBNAM6= <"">
##$SUBNAM7= <"">
##$SUBNAM8= <"">
##$SUBNAM9= <"">
##$SW= 369.568048894756
##$SWIBOX= (0..15)
0 1 3 0 0 0 0 0 0 0 0 0 0 0 0 0 
##$SW_h= 29940.119760479
##$TD= 32768
##$TD0= 1
##$TE= 0
##$TE2= 300
##$TE3= 300
##$TEG= 300
##$TL= (0..7)
0 120 53 12 22 120 120 120 
##$TP= (0..7)
150 150 150 150 150 150 150 150 
##$TP07= 0
##$TPNAME0= <>
##$TPNAME1= <>
##$TPNAME2= <>
##$TPNAME3= <>
##$TPNAME4= <>
##$TPNAME5= <>
##$TPNAME6= <>
##$TPNAME7= <>
##$TPOAL= (0..7)
0.5 0.5 0.5 0.5 0.5 0.5 0.5 0.5 
##$TPOFFS= (0..7)
0 0 0 0 0 0 0 0 
##$TUNHIN= 0
##$TUNHOUT= 0
##$TUNXOUT= 0
##$USERA1= <user>
##$USERA2= <user>
##$USERA3= <user>
##$USERA4= <user>
##$USERA5= <user>
##$V9= 5
##$VALIST= <valist>
##$VCLIST= <CCCCCCCCCCCCCCC>
##$VD= 0
##$VDLIST= <DDDDDDDDDDDDDDD>
##$VPLIST= <PPPPPPPPPPPPPPP>
##$VTLIST= <TTTTTTTTTTTTTTT>
##$WBST= 1024
##$WBSW= 4
##$XGAIN= (0..3)
0 0 0 0 
##$XL= 0
##$YL= 0
##$YMAX_a= 27222
##$YMIN_a= -28409
##$ZGOPTNS= <>
##$ZL1= 120
##$ZL2= 120
##$ZL3= 120
##$ZL4= 120
##$ABSF1= 0
##$ABSF2= 0
##$ABSG= 0
##$ABSL= 0
##$ALPHA= 0
##$AQORDER= 0
##$ASSFAC= 0
##$ASSFACI= 0
##$ASSFACX= 0
##$ASSWID= 0
##$AUNMP= <proc_1d>
##$AZFE= 0.1
##$AZFW= 0.5
##$BCFW= 0
##$BC_mod= 2
##$BYTORDP= 0
##$COROFFS= 0
##$CY= -3
##$DATMOD= 1
##$DC= 0
##$DFILT= <>
##$DTYPP= 0
##$F1P= 0
##$F2P= 0
##$FCOR= 1
##$FTSIZE= 65536
##$FT_mod= 6
##$GAMMA= 0
##$GB= 0
##$INTBC= 1
##$INTSCL= 5.30512e-09
##$ISEN= 30
##$LB= 1
##$LEV0= 0
##$LPBIN= 0
##$MAXI= 10000
##$MC2= 0
##$MEAN= 0
##$ME_mod= 0
##$MI= 50
##$NCOEF= 0
##$NC_proc= -5
##$NLEV= 6
##$NOISF1= 182.463
##$NOISF2= 159.3651
##$NSP= 0
##$NTH_PI= 0
##$NZP= 0
##$OFFSET= 182.463
##$PC= 4
##$PHC0= -1454
##$PHC1= 359.6017
##$PH_mod= 1
##$PKNL= yes
##$PPARMOD= 0
##$PSCAL= 0
##$PSIGN= 0
##$REVERSE= no
##$SF= 81.0140089999434
##$SI= 65536
##$SIGF1= 159.3651
##$SIGF2= -187.1042
##$SINO= 113.3802
##$SIOLD= 16384
##$SREGLST= <1H.CDCl3>
##$SSB= 0
##$STSI= 65536
##$STSR= 0
##$SW_p= 29940.119760479
##$SYMM= 0
##$S_DEV= 0
##$TDeff= 32768
##$TDoff= 0
##$TI= <>
##$TILT= no
##$TM1= 0
##$TM2= 0
##$TOPLEV= 0
##$USERP1= <user>
##$USERP2= <user>
##$USERP3= <user>
##$USERP4= <user>
##$USERP5= <user>
##$WDW= 1
##$XDIM= 65536
##$YMAX_p= 386355239
##$YMIN_p= -15027444
$$ End of Bruker specific parameters
$$ ---------------------------------
##NTUPLES= NMR SPECTRUM
##VAR_NAME=  FREQUENCY,     SPECTRUM/REAL,   SPECTRUM/IMAG
##SYMBOL=    X,             R,               I
##VAR_TYPE=  INDEPENDENT,   DEPENDENT,       DEPENDENT
##VAR_FORM=  AFFN,          ASDF,            ASDF
##VAR_DIM=   65536,         65536,           65536
##UNITS=     HZ,            ARBITRARY UNITS, ARBITRARY UNITS
##FACTOR=    0.456856943014862, 1,           1
##FIRST=     14782.0589164792, 0,            0
##LAST=      -15158.0608439998, 0,           0
##MIN=       -15158.0608439998, -15027444,   0
##MAX=       14782.0589164792, 386355239,    0
$$ Real data points
##PAGE= N=1
##DATA TABLE= (X++(R..R)), XYDATA
$$ [...]
39069 -322708 -171858 318496 752668 441588 -611509 -1324073 -832919 205869 453242
39060 453242 -251393 -862827 -857459 -806959 -1012160 -805101 167125 1040069 1017557 719641
39050 719641 1144245 1846556 1417720 -354845 -1961752 -2001158 -688407 681577 1088710
39041 1088710 405531 -687140 -1128782 -348827 1022260 1717086 1270318 465958 229359
39032 229359 604766 1069308 1329602 1403954 1279403 930242 526243 320714 400789 664000
39022 664000 889888 789804 247040 -408625 -651214 -390118 -74771 -90194 -372872 -703709
39012 -703709 -962099 -918311 -245271 906873 1696500 1395886 274349 -659493 -729587 -175676
39002 -175676 256843 110786 -374373 -562690 -168049 362510 399103 -26609 -269355 50620
38992 50620 635758 1049033 1201162 1136830 808234 337945 106673 268873 503597 501252
38982 501252 348401 186798 -97443 -541948 -882329 -988870 -1088633 -1190855 -811356 220432
38972 220432 1175205 1290729 834744 609906 741428 751571 608376 811166 1437676 1898492
38962 1898492 1743625 1076174 147481 -775339 -1127236 -432945 844546 1585865 1386410
38953 1386410 948455 873407 873378 604274 475655 950903 1628852 1788455 1478319 1318429
38943 1318429 1441267 1362809 850815 265904 -42489 -154163 -245662 -242599 3066 427887
38933 427887 793430 892262 697080 409550 301396 385127 364725 77821 -187297 -75098
38923 -75098 288783 472112 382133 354652 565147 716245 463957 -90952 -494432 -369436
38913 -369436 319735 1230958 1760830 1424625 361189 -623680 -746882 -14347 834900
38904 834900 1170288 1093150 1113562 1365411 1435682 1014389 374742 -76632 -487092 -1312843
38894 -1312843 -2402236 -2881911 -2227953 -1021270 -233783 -74576 -33202 152909 212594
38885 212594 46779 90680 675343 1439729 1740516 1424960 887914 502819 280155 39704
38875 39704 -291462 -562623 -506027 -33734 531514 692088 342065 -83447 -143793 138232
38865 138232 487438 758578 828703 410459 -553601 -1443660 -1436437 -480038 627392 1185919
38855 1185919 1167867 755407 -110346 -1344285 -2322677 -2430813 -1871011 -1467876 -1671646
38846 -1671646 -2106912 -2169980 -1799187 -1503228 -1713645 -2219666 -2348913 -1799776 -1139371 -1134107
38836 -1134107 -1622045 -1569297 -444695 995556 1673626 1442148 854638 178259 -601611
38827 -601611 -1109411 -842264 -84134 305754 133701 84230 498773 787583 427828 -225471
38817 -225471 -608912 -741713 -795286 -527204 156061 591038 104494 -953856 -1670891 -1815975
38807 -1815975 -1878725 -2040476 -1932332 -1450083 -1052525 -1027866 -1029201 -619042 91589 575267
38797 575267 435214 -286774 -1161954 -1684557 -1647698 -1171249 -354034 772192 1794006
38788 1794006 1940126 1007847 -163254 -713016 -856301 -1262422 -1735611 -1472831 -482788
38779 -482788 304541 455680 555766 1010363 1253817 657887 -492202 -1477572 -2042182
38770 -2042182 -2294482 -2198172 -1711281 -1120721 -789297 -772298 -926108 -1097350 -1044952 -609512
38760 -609512 -145285 -258149 -871142 -1146747 -677088 -125530 -231547 -773769 -1055169 -867541
38750 -867541 -399343 271566 949968 1116659 675843 422047 965076 1661394 1542158 886314
38740 886314 753653 1192241 1178163 398891 -177358 122283 667920 680201 441625 617920
38730 617920 1093308 1284682 1109672 860480 495863 -132091 -582526 -216780 701844 1075657
38720 1075657 375763 -606051 -746958 63270 939052 1111541 628077 16080 -368378
38711 -368378 -510367 -468683 -205342 248728 586527 379195 -456728 -1424307 -1849257 -1557168
38701 -1557168 -1002909 -656743 -474557 -192612 71060 -28371 -315175 -78171 906663 1835351
38691 1835351 1847742 1176282 712502 675765 469645 -171029 -690667 -582633 -86104 274394
38681 274394 287562 -73905 -800867 -1529833 -1626640 -969597 -164999 324896 673783 968704
38671 968704 758452 -88368 -800289 -745839 -433604 -611311 -964077 -750240 -253398 -381744
38661 -381744 -1075099 -1398634 -1187851 -1289072 -1964012 -2331709 -1848611 -1217608 -1201908 -1460168
38651 -1460168 -1262482 -641174 -134775 54771 32054 -179918 -444741 -379366 74059 373917
38641 373917 137980 -292395 -512156 -741852 -1283992 -1804166 -1850228 -1687046 -1865884 -2247455
38631 -2247455 -2217976 -1698842 -1169585 -753541 -63189 942734 1664943 1699383 1427564 1434309
38621 1434309 1708348 1773790 1404446 893619 694449 1021656 1777581 2650686 3211143 3104130
38611 3104130 2403303 1749129 1813922 2475189 2833146 2323148 1473114 1108919 1137623 823609
38601 823609 116825 -189162 218951 566713 130973 -714610 -1114496 -843225 -282390 229112
38591 229112 484895 292945 -155478 -170333 591050 1457230 1488452 631366 -402606 -1122848
38581 -1122848 -1527596 -1634211 -1411154 -1087324 -946263 -858608 -521243 -83452 -13522 -363443
38571 -363443 -654442 -542751 -218565 -84363 -285453 -560480 -447613 197662 839565 796032
38561 796032 232649 29828 419762 539970 -153144 -885599 -795812 -384353 -658941 -1430971
38551 -1430971 -1704344 -1364777 -1154374 -1175289 -795543 -13615 461302 587034 1044065 1691314
38541 1691314 1439376 129387 -887145 -717022 -165464 -224341 -576592 -561693 -478574 -801799
38531 -801799 -1077882 -808112 -582954 -1047012 -1470996 -788879 479088 875873 294346
38522 294346 42654 631267 1041302 510353 -334814 -667357 -622745 -613333 -446583 98917
38512 98917 545793 393487 66311 424736 1557665 2663736 3020196 2634803 2042252
38503 2042252 1791321 2023201 2297915 1976659 979457 -35638 -436697 -275753 68228
38494 68228 535392 1213622 1781696 1743289 1209772 865865 996624 1085510 700218 292718
38484 292718 549391 1199738 1195900 175385 -926326 -1103702 -598975 -392290 -681898 -653799
38474 -653799 174584 1108681 1138662 173409 -1000191 -1662747 -1644888 -1119181 -408705 58898
38464 58898 25596 -316934 -570686 -615071 -596808 -545461 -374122 -242779 -482380 -1015882
38454 -1015882 -1242421 -772624 -20089 268251 -56106 -406397 -229084 402867 1029455
38445 1029455 1335790 1277127 948639 625394 722046 1294322 1696782 1289155 506839 515693
38435 515693 1508805 2145715 1372874 116009 91581 1308475 2073668 1531144 775015
38426 775015 896597 1242472 655887 -485006 -794209 -9262 731000 723593 607012 1071332
38416 1071332 1608821 1212829 -134612 -1291038 -1203316 8324 1253022 1591305 1047963
38407 1047963 333442 -9933 81613 536705 1228507 1662236 1269727 298624 -281874 -168810
38397 -168810 -226155 -958593 -1366740 -403361 1103355 1399133 394831 -226671 393409
38388 393409 1115240 735834 -257112 -707924 -529408 -421849 -559368 -563002 -398372 -432160
38378 -432160 -766618 -1133478 -1277845 -1023632 -295730 474908 418480 -696257 -1833422
38369 -1833422 -1819354 -818429 9295 89873 -82915 58577 455655 798422 958196 895980
38359 895980 641574 472472 656624 943505 785324 161726 -298711 -172021 246750 487693
38349 487693 528944 577599 569580 264128 -311674 -820845 -1005354 -956277 -982375 -1245966 -1523619
38338 -1523619 -1409151 -847326 -326117 -325771 -684592 -787119 -317881 463217 1125404 1390833
38328 1390833 1100749 303432 -556935 -974484 -1025005 -1238730 -1694857 -1787183 -1194860 -526534
38318 -526534 -475355 -770121 -637306 -35498 337720 203085 71286 312904 598533 590550
38308 590550 539592 721949 824865 481033 10476 -30522 241099 292172 165925 414230
38298 414230 1032588 1296038 861969 256837 -63705 -366814 -862570 -1019605 -396365 402077
38288 402077 458839 -117428 -483423 -480633 -811090 -1786938 -2805041 -3242059 -3094490 -2522350
38278 -2522350 -1519912 -337955 469836 774434 1015088 1303377 1103745 247010 -471705
38269 -471705 -328676 304872 656507 728335 1010868 1467869 1660711 1591282 1564015 1404645
38259 1404645 696897 -275164 -683817 -293117 351049 895510 1487060 1984403 1806681
38250 1806681 932988 216505 206537 386386 161229 -85357 296459 940014 812210 -285006
38240 -285006 -1360419 -1459248 -652116 299091 756973 569108 86256 9107 798305 1974992
38230 1974992 2356971 1340615 -268967 -1075440 -633842 190382 384143 -106097 -590767
38221 -590767 -591431 -218151 219380 531395 553338 147276 -498558 -850356 -557227 162195
38211 162195 837558 1236478 1313769 949791 171300 -481140 -326452 574516 1301377 1104189
38201 1104189 324347 -9551 569562 1414042 1569953 954716 439801 698066 1303070
38192 1303070 1341308 716374 223289 249387 147482 -643910 -1507111 -1437690 -546819 107615
38182 107615 45227 -179970 -64468 244554 655805 1485695 2598431 2995467 1976396
38173 1976396 200868 -1064840 -1352193 -1030717 -406137 411486 1013573 976557 654401
38164 654401 892719 1785561 2392701 1959751 873749 105567 149880 819985 1677206 2284035
38154 2284035 2344135 2004534 1830039 2110680 2361440 1921767 954666 354093 564005 964200
38144 964200 737782 -4268 -464414 -397486 -477196 -1182904 -1868511 -1536726 -316131 541692
38134 541692 227609 -724167 -1384479 -1623789 -1802963 -1814139 -1287487 -527594 -263098 -350552
38124 -350552 278734 1901978 3105557 2447888 508115 -715055 -299803 674444 819122
38115 819122 106166 -606831 -948788 -1187265 -1409133 -1329698 -853770 -229873 365628 885988
38105 885988 1040935 445786 -663333 -1369936 -1073034 -219391 271301 44997 -542157
38096 -542157 -1066523 -1390969 -1444772 -1062547 -194861 877400 1644822 1705077 1098060 362035
38086 362035 109969 427531 792129 664772 23079 -743757 -1245592 -1297335 -982967 -683352
38076 -683352 -787153 -1185706 -1310359 -854512 -154210 348091 625466 774233 680664 431148
38066 431148 581135 1370519 2024662 1600614 340950 -600265 -709204 -586810 -814073
38057 -814073 -1136041 -1015213 -363742 545502 1397625 1847329 1646689 938643 104166 -651111
38047 -651111 -1162190 -983607 98888 1349519 1705732 1151540 651064 691452 823403
38038 823403 730537 693865 777447 663100 586325 1218000 2213422 2263595 1230615 732760
38028 732760 1621577 2379378 1426372 -283602 -708219 207911 809816 483378 175473
38019 175473 407232 630046 592056 674325 745721 239650 -484872 -387844 472468 939969
38009 939969 730205 756398 1191884 1005019 -2649 -524549 9158 273685 -693182 -1672049
37999 -1672049 -1158457 227901 836532 468145 95710 -98618 -627231 -1109840 -595340
37990 -595340 582213 882003 -272482 -1689261 -2067250 -1390478 -391965 390049 661358
37981 661358 292716 -399978 -835237 -838700 -672699 -413250 56223 436779 203510 -417441
37971 -417441 -447821 512110 1601924 1784513 1110449 450563 354935 665074 1036084 1353759
37961 1353759 1621564 1768258 1726399 1598426 1588718 1719458 1751422 1564898 1482545 1851555
37951 1851555 2352584 2246362 1428875 657285 467923 508420 350708 260349 506799 563605
37941 563605 -113405 -985354 -1118502 -676202 -643145 -1182935 -1405980 -879717 -281112 -241063
37931 -241063 -492545 -565387 -491727 -381835 -56455 420282 527048 108679 -209675 43319
37921 43319 415586 261099 -286003 -683907 -880044 -1153483 -1365395 -1052938 -162015 831629
37911 831629 1452205 1511313 1068929 501939 379448 824089 1201703 906241 248214 38021
37901 38021 440767 840993 807981 573903 432120 238138 -188167 -564192 -428686 238242
37891 238242 953153 1224172 951086 410385 -590 -23783 327768 827297 1201722 1241423
37881 1241423 827539 3554 -913996 -1412061 -1160177 -382904 269082 359784 112146 39426
37871 39426 217323 254880 26558 -25839 398594 878053 888088 707452 1065138 1986635
37861 1986635 2675960 2628127 2212572 1951773 1838328 1687857 1605522 1664657 1583358 1220477
37851 1220477 1017410 1379759 1889599 1772439 1055743 628483 1043839 1790757 2000628
37842 2000628 1504294 861313 535564 402957 110377 -349256 -641181 -593340 -423198 -347386
37832 -347386 -205441 267761 939123 1373160 1390257 1227801 1171769 1334070 1744364 2280969
37822 2280969 2530142 2160451 1478415 1141023 1252226 1285696 1022306 915204 1235023 1499551
37812 1499551 1214589 650923 374573 466997 739602 1252182 1973323 2318843 1782319 809232
37802 809232 323320 506135 729843 623635 506168 725497 1205909 1741348 2178545 2222344
37792 2222344 1612095 632685 -30717 -78963 182807 458265 774637 1075296 1045180 568176
37782 568176 -93429 -778739 -1615299 -2473082 -2727576 -1999677 -830445 -187968 -423690
37773 -423690 -1007696 -1199487 -766045 -124334 76517 -400638 -1088159 -1306312 -957088 -562764
37763 -562764 -458198 -323065 236059 956324 1183526 771634 323631 437412 988942 1382503
37753 1382503 1367725 1262695 1266398 930746 -229940 -1753011 -2489294 -2021788 -1216483 -999096
37743 -999096 -1183721 -1095890 -807307 -888631 -1240391 -1157432 -536688 -82615 -164411 -344245
37733 -344245 -282145 -244627 -352959 -171943 450813 921745 896495 1008664 1834295 2753153
37723 2753153 2781275 2120722 1852003 2258530 2489200 1953037 1094078 519559 200919 -39483
37713 -39483 28038 508722 804953 297391 -589625 -688879 457960 1939614 2459778 1669699
37703 1669699 345639 -476184 -301907 629283 1581152 1832410 1322763 792129 933428
37694 933428 1436955 1383153 671171 360551 1174824 2335236 2610561 2013860 1489235 1220626
37684 1220626 470910 -808129 -1481335 -885297 74044 266438 -35256 173071 883046
37675 883046 1083290 348854 -529218 -612077 151476 1072238 1405634 836418 -269958 -1046034
37665 -1046034 -927819 -295924 8290 -277632 -665393 -687879 -382082 -11182 252282 314542
37655 314542 207670 191729 473166 809645 741369 235073 -233645 -252332 182560 841679
37645 841679 1397826 1401620 579927 -702991 -1615425 -1638287 -981703 -228810 177437 139874
37635 139874 -56701 94582 798106 1573035 1701048 1042387 96177 -664541 -1095310 -1090553
37625 -1090553 -565796 138067 344318 -206405 -1031577 -1524584 -1586808 -1489166 -1426383 -1409929
37615 -1409929 -1385477 -1328532 -1366375 -1735553 -2357787 -2643601 -2196252 -1558782 -1586752 -2104833
37605 -2104833 -2025746 -1014461 -144090 -396880 -1277661 -1611578 -1146754 -572439 -321611
37596 -321611 -200597 -83689 -204332 -636688 -995996 -813789 10711 1082682 1671873
37587 1671873 1261648 216691 -415661 -126755 397840 281888 -332525 -723296 -826943
37578 -826943 -1171755 -1778913 -2077296 -1906825 -1672238 -1402059 -661988 304777 405959 -720242
37568 -720242 -1833468 -1613449 -416559 374300 297021 128208 458313 947849 1131118
37559 1131118 1151300 1362977 1706589 1788659 1319976 360314 -621580 -954476 -385480 518576
37549 518576 966128 880384 782327 822987 604974 58659 -265347 -98176 66801 -136065
37539 -136065 -257088 112590 398264 -172223 -1220466 -1629828 -1152705 -600327 -376778
37530 -376778 124247 1289027 2373116 2474858 1831380 1466810 1875915 2618385 2996209
37521 2996209 2658230 1712482 666250 129563 241223 529347 592880 643693 1019690 1472345
37511 1472345 1464980 1022716 728597 861653 1012983 685249 -43323 -585135 -415611 430486
37501 430486 1305705 1466175 791409 -82691 -414537 29014 997631 1989145 2345661 1688289
37491 1688289 601696 326060 1265869 2327590 2345828 1630930 1309948 1608380 1789344
37482 1789344 1518765 1187480 926898 384556 -396295 -850859 -826006 -747416 -728189 -466484
37472 -466484 -163139 -437099 -1046377 -880073 282724 1174835 877341 147023 63245 372889
37462 372889 229126 -252729 -345656 -43723 90991 36515 233144 654601 844262 652155
37452 652155 225605 -354228 -739318 -215994 1167910 2020955 1283913 -66506 -292166
37443 -292166 578656 1001222 440562 -39373 195742 445583 254217 317546 1067465 1684345
37433 1684345 1424844 845232 744237 806186 343345 -299008 -161309 892860 2071262
37424 2071262 2729271 2790622 2329720 1492087 774537 779740 1591719 2639886 3116339 2484051
37414 2484051 953237 -412489 -596364 115968 391981 -292344 -802986 16394 1547053
37405 1547053 2159294 1395202 401743 253230 732472 973476 656931 229663 250269 749331
37395 749331 1168235 960100 303079 -15884 417347 1092006 1251750 789312 146135 -322848
37385 -322848 -490211 -323502 -94176 -388014 -1335725 -2093982 -1741712 -556977 263459
37376 263459 149208 -223936 -12410 628138 775283 -81010 -1338874 -1827441 -1103959
37367 -1103959 -95753 -99706 -1162025 -2041384 -1935928 -1438567 -1309365 -1215742 -600680 -32803
37357 -32803 -418828 -1307799 -1408065 -667979 -339073 -806579 -941933 -171791 348342 -361776
37347 -361776 -1293468 -890657 530500 1284731 810547 161031 58346 -67637 -701820
37338 -701820 -1153572 -622211 453680 993572 796434 620923 893623 1132774 797356
37329 797356 69480 -534792 -861011 -978228 -696858 149332 1041641 1107584 317256 -277372
37319 -277372 110967 968560 1344462 1266698 1509902 2220507 2693600 2528994 2127130 1861206
37309 1861206 1599424 1331293 1412316 1761720 1681555 1072171 959082 1952295 2951251 2530748
37299 2530748 1105061 377801 824049 1149552 447600 -504702 -680498 -324993 -181775
37290 -181775 -155007 177056 369969 -328900 -1497318 -1840410 -1067727 -368332 -636508 -1152899
37280 -1152899 -682657 741362 1927810 2151966 1897332 1910364 2154629 2073741 1571678
37271 1571678 1243440 1567728 2217794 2465744 2131107 1730502 1624871 1480319 898741
37262 898741 187713 -52980 110434 95678 -111150 184248 1185844 2029304 1915402 1222306
37252 1222306 836466 822849 523331 -272843 -1040523 -1332097 -1184407 -730850 -82724 378595
37242 378595 285588 -42141 107473 744611 1116530 944170 891778 1400043 1866353 1619864
37232 1619864 1041033 922425 1179410 1048465 336874 -326275 -446791 -222933 -101192
37223 -101192 -247874 -480694 -389575 369042 1578075 2455633 2470973 1872445 1066702 -19000
37213 -19000 -1369819 -2236076 -1961408 -1111835 -772153 -940651 -746540 -156738 -135643 -899249
37203 -899249 -1383895 -994017 -602749 -1010395 -1544590 -1235023 -450148 -154248 -249842 -18476
37193 -18476 259745 -343757 -1502503 -1602162 -5424 1881398 2414600 1639462 742710
37184 742710 371704 308839 286387 260984 103683 -253356 -445067 -55130 662071 991540
37174 991540 709776 306976 187454 180245 33355 -108997 -53776 13593 -125762 -210556
37164 -210556 206847 1064953 1802650 2007683 1685988 978219 92430 -475297 -220587 658584
37154 658584 1296019 1165382 645448 331729 294712 434589 1041649 2307813 3569226
37145 3569226 3814856 2936629 1826252 1181272 844630 478841 266175 544958 1100870
37136 1100870 1230189 490875 -709791 -1295667 -509732 1068331 1823955 904697 -559666
37127 -559666 -716017 679016 2028516 2054327 1236752 735986 773835 776588 517052 301234
37117 301234 288007 334978 462270 909183 1644918 2178423 2005626 1161874 298573 141102
37107 141102 742592 1398250 1524220 1389149 1558030 1896597 1815205 1313681 897603 517787
37097 517787 -319761 -1248119 -1114385 162223 1089275 749778 245856 911892 2142386
37088 2142386 2376646 1503504 794893 881912 1263381 1591410 1992123 2145980 1452012 251002
37078 251002 -400512 -383641 -674708 -1527503 -1788704 -632393 1103974 2063235 2021328 1645692
37068 1645692 1259278 660947 -164638 -841061 -1030670 -739219 -293597 -125529 -363533
37059 -363533 -625188 -480884 -14558 430547 817324 1198753 1257521 808335 458777 822913
37049 822913 1325401 959459 107575 183979 1312484 1924594 1183518 269716 413959 1062164
37039 1062164 1113649 788363 942215 1417123 1424071 930550 417320 -179626 -1056626 -1619174
37029 -1619174 -1275403 -689086 -853560 -1289739 -719457 614315 987176 -200886 -1435886
37020 -1435886 -1271017 -152675 677109 955589 1141286 1239784 945548 501991 475449 839030
37010 839030 1000472 674460 168569 -167317 -305801 -337257 -298468 -306204 -574165 -1124580
37000 -1124580 -1604037 -1548974 -868248 7848 549032 681303 788220 1127739 1448012 1328753
36990 1328753 751197 140225 -87763 103252 374219 344264 56020 80353 869070 1999170
36980 1999170 2483054 1938542 976562 272457 -144906 -385958 -207098 393652 717212
36971 717212 282651 -245390 86306 1034333 1445154 889899 99783 -245524 -280851 -323179
36961 -323179 -246748 170488 776735 1201769 1204115 829601 499399 759614 1522957 1831639
36951 1831639 964252 -488945 -1357725 -1405936 -1232033 -922568 22609 1394076 2149678
36942 2149678 1924866 1544873 1565735 1391637 504400 -405002 -397480 315444 775972 577862
36932 577862 17955 -596335 -1066371 -1101442 -684519 -348017 -497948 -772741 -619679 -138440
36922 -138440 249396 588663 1141089 1641292 1585163 1148631 1087547 1688346 2409868 2634554
36912 2634554 2281854 1607350 839371 152269 -299628 -450818 -322384 -18777 171318
36903 171318 -104314 -806444 -1365932 -1262892 -604056 60178 301200 56111 -398838 -547841
36893 -547841 -63768 657027 799848 224486 -218330 199075 1138767 1776232 1819066 1461272
36883 1461272 839698 155539 -99043 281339 741032 693050 351565 174543 -70989 -816874
36873 -816874 -1606745 -1512823 -536812 354032 590680 512335 481762 402806 260569 278204
36863 278204 330600 16414 -461402 -320609 580217 1350641 1306040 857186 686223 721425
36853 721425 526488 164274 9099 31567 -131967 -565149 -966251 -1033781 -664096 66523
36843 66523 874756 1402191 1556765 1542110 1478348 1296098 1074008 1072182 1282288 1360443 1185885
36832 1185885 1059362 1144109 1156974 862306 437813 88168 -260437 -592871 -590092 -122226
36822 -122226 460626 858954 1205537 1567839 1563309 950593 196867 -66331 144948 351169
36812 351169 299089 29955 -419544 -926499 -1190727 -1150834 -1136170 -1200169 -813100 203804
36802 203804 995261 746930 12494 -23952 638394 847323 128115 -670468 -842156 -855017
36792 -855017 -1330334 -1822311 -1404734 -46793 1285936 1739712 1331579 740243 662251
36783 662251 1233453 1858648 1790854 1044429 468000 709456 1414285 1737810 1390024 824395
36773 824395 555211 641424 810063 825803 690388 574720 568225 549435 436110 461579 900948
36762 900948 1559253 1928504 1888401 1788747 1758713 1535561 1199161 1339180 1977466 2040398
36752 2040398 749305 -958849 -1439659 -544136 315154 311571 161082 532920 749674
36743 749674 -32293 -1260823 -1772654 -1615020 -1806678 -2436040 -2336571 -978190 479041
36734 479041 718473 45035 -225701 329261 883722 779230 412444 469576 896187 1055927
36724 1055927 637162 11294 -283784 -170194 -31429 -163559 -396634 -391562 -190203 -167973
36714 -167973 -420685 -583276 -437906 -303431 -485073 -700500 -539305 -228601 -341632 -850202
36704 -850202 -1079343 -625477 235999 1085935 1705569 1820651 1206598 297736 18538 616234
36694 616234 1240974 1130928 664994 695160 1305181 1850066 1864154 1306339 236695 -1039318
36684 -1039318 -1723152 -1186172 126771 1061406 1015927 341329 -367157 -735581 -484317
36675 -484317 371521 1109603 855221 -210847 -848349 -239315 1094747 2118270 2445960
36666 2445960 2361582 2220754 2235242 2436510 2524016 2139956 1522797 1367601 1761607 1894869
36656 1894869 1267810 550450 646719 1461476 2266927 2763737 2991588 2688571 1740453 949094
36646 949094 1219551 2054116 2026873 919711 203140 937509 2272071 2746669 2210821
36637 2210821 1554464 1184069 819515 471951 536349 897084 882054 331203 -63016 182493
36627 182493 608294 619687 486323 866582 1608667 1788783 1024444 91709 -106778 293825
36617 293825 504827 325155 279304 513183 385732 -390163 -906419 -215132 1024243 1124088
36607 1124088 -307032 -1679525 -1542402 -444356 143851 21284 197111 964031 1364854
36598 1364854 793786 -41275 -317323 -328055 -733636 -1248869 -1041281 -135246 520861 391158
36588 391158 -25964 -69099 230218 428089 347680 200298 303235 803127 1394210 1308532
36578 1308532 64017 -1651856 -2383115 -1483298 156599 1255821 1507325 1378012 1129890
36569 1129890 766604 575604 833655 1081603 593076 -345232 -527875 480429 1579914
36560 1579914 1555500 534788 -595547 -1527937 -2379874 -2695216 -1786175 -65752 1060502
36551 1060502 955950 511407 688272 1124964 901978 97010 -312542 141089 921278
36542 921278 1363044 1324369 898204 170026 -514227 -640943 -230655 21012 -328068 -801800
36532 -801800 -693150 -78178 359718 302391 57177 -69797 -129619 -207290 -203156 -89642
36522 -89642 -50470 -209502 -461639 -653751 -686741 -412382 234422 918862 1092201 649098
36512 649098 49737 -370066 -780817 -1289646 -1476635 -990632 -254243 35341 -84733 4197
36502 4197 389324 397960 -307799 -1052396 -1002616 -299088 162538 -96909 -625077 -680744 -86386
36491 -86386 609185 648277 -263946 -1658164 -2628933 -2529951 -1408176 118505 1248033
36482 1248033 1367470 442528 -795036 -1377825 -1116491 -855839 -1390801 -2342092 -2583580
36473 -2583580 -1725026 -620164 -225175 -428697 -405134 134109 529392 59279 -1078914
36464 -1078914 -1857776 -1415972 111353 1726365 2482310 2233675 1483080 639131 -306011
36455 -306011 -1330304 -1994370 -1860391 -1139535 -489951 -157727 234086 883284 1268390
36446 1268390 819087 -179428 -895409 -1067561 -1232508 -1728569 -2040996 -1499061 -244989
36437 -244989 943550 1591424 1827993 1855599 1640726 1246493 1011771 1089514 1078080 496331
36427 496331 -440138 -881544 -318208 728297 1215669 720567 -158809 -572428 -332185
36418 -332185 129577 478673 760800 1005391 1016872 761437 594423 790340 1098537 1092463
36408 1092463 743924 287511 -266201 -983397 -1473625 -1093400 185752 1581286 2358233
36399 2358233 2482865 2234939 1643425 703980 -174270 -464007 -202303 36916 -84003
36390 -84003 -228382 135370 1003459 1789983 1999477 1783159 1694598 1967016 2276158 2276405
36380 2276405 2054179 1819931 1487113 1002318 845286 1552138 2749113 3321351 2711559
36371 2711559 1469590 334937 -538599 -1104032 -933387 104808 1197788 1417356 931793
36362 931793 652388 857035 951570 567772 96197 -63265 -110625 -384984 -779921 -968995
36352 -968995 -905650 -805209 -818650 -925178 -1033040 -1107133 -1284462 -1765732 -2385219 -2482437
36342 -2482437 -1625056 -359450 292530 117064 -75477 341087 985363 1181708 969103
36333 969103 883116 1034540 959605 348060 -471078 -838012 -376160 686370 1682287 2051459
36323 2051459 1830718 1534841 1501740 1505945 1126812 353885 -341512 -504387 -167234 205958
36313 205958 259052 164425 320696 653629 640981 243996 260839 1187935 2205220 2169470
36303 2169470 1352449 1088802 1666586 1823947 786787 -399973 -404835 500210 1139511
36294 1139511 1290521 1582461 1941545 1513545 211095 -838023 -753703 28729 530344
36285 530344 396071 -87234 -571115 -805900 -601258 -31756 503870 661237 452061 110150
36275 110150 -118173 -37608 336925 633733 433651 -211963 -817578 -1005654 -747736 -148352
36265 -148352 648617 1377500 1830343 2063525 2103048 1658677 638466 -274111 -271449 421162
36255 421162 805920 530998 191170 117774 -123392 -682989 -896227 -402208 93800 -81693
36245 -81693 -491705 -456250 -282041 -592314 -985704 -582604 346901 559020 -298686 -1139874
36235 -1139874 -1037996 -382638 -276 47415 198434 524018 775579 954421 1233149 1440513
36225 1440513 1137706 289954 -453937 -370343 480212 1187891 988773 243680 29612 675904
36215 675904 1277686 1022197 356903 129690 123526 -465307 -1319586 -1083352 575630 2163226
36205 2163226 2226439 1129430 287705 391869 1151266 2125593 2882617 2801876 1754156
36196 1754156 790330 1175092 2692641 3741161 3247259 1760537 463845 -177644 -405788
36187 -405788 -392555 -40877 631271 1314125 1632293 1442367 971715 650744 642607 591091
36177 591091 97249 -608781 -867202 -517103 -168821 -325645 -668125 -621376 -320416 -427610
36167 -427610 -1040198 -1400860 -955956 -209861 -21949 -329003 -256861 466547 995662 689982
36157 689982 248903 698180 1656052 1706926 521156 -519956 -199275 1029568 1988404
36148 1988404 2289967 2107774 1316361 -106 -786032 -83352 1394056 2038050 1606681
36139 1606681 1391930 2058174 2726612 2596399 2126068 1955691 1856383 1553240 1500024 1885851
36129 1885851 1872332 958735 240744 936245 2253528 2271952 748111 -475179 -21473
36120 -21473 1416509 2442561 2752215 2887059 3029787 2837532 2110965 1093982 289277
36111 289277 190870 892061 1794494 2052311 1446687 496642 -302806 -862796 -1084601 -710252
36101 -710252 141382 822019 874134 518457 193312 39431 79216 430027 1001354 1367571
36091 1367571 1273106 951649 699438 482569 196932 -58336 -193462 -244118 -130816 221369
36081 221369 407931 -138538 -1109624 -1389145 -600516 246359 307177 266866 1202951 2737126
36071 2737126 3482577 3003567 2180982 1749247 1569883 1399950 1354667 1422666 1385721 1370255
36061 1370255 1650514 1817638 1107635 -237625 -966093 -562403 -4196 -225029 -766517
36052 -766517 -703612 -114147 257446 215919 78597 -171459 -777169 -1450152 -1540873 -932781
36042 -932781 -179395 159947 -134672 -989094 -1880324 -1968807 -1049078 -55974 111669 -87752
36032 -87752 368193 1256988 1329710 349924 -424644 -174499 337375 216785 -121608 86724
36022 86724 502113 368504 25685 454666 1620474 2504014 2677236 2625902 2449706 1544782
36012 1544782 -10539 -932855 -318687 1093716 1982866 2055529 1822396 1419963 643258
36003 643258 -225605 -631758 -654901 -801798 -964278 -517400 464061 1019651 607641 -205983
35993 -205983 -682832 -766854 -629530 -184435 368575 281091 -669965 -1434116 -922667 410552
35983 410552 1188464 1037163 805337 912817 695113 -240164 -1078200 -927780 -153892 232872
35973 232872 72764 107316 710850 1359690 1462596 1112785 759482 522734 152310 -489799
35963 -489799 -1159575 -1446982 -1154203 -448294 289438 711681 657216 224834 -210722 -221680
35953 -221680 213453 554257 256987 -534947 -1114788 -1013502 -395601 332018 940997 1332081
35943 1332081 1437287 1342340 1218543 1007330 485903 -251013 -775486 -948895 -1099190 -1344955
35933 -1344955 -1277953 -706824 -178220 -184163 -292590 222991 1184641 1728229 1588934 1365906
35923 1365906 1480967 1657374 1606332 1507577 1506048 1346476 879788 430281 275194 189328
35913 189328 -107394 -452849 -623521 -847280 -1406363 -1948981 -1760917 -713777 488580
35904 488580 1084792 990461 692518 621278 725546 618659 135476 -322218 -191928 499459
35894 499459 1111038 1221874 1092533 1037086 784266 -6428 -876638 -933131 -127759 475749
35884 475749 22928 -973148 -1197234 -60058 1687754 2805002 2734921 1902456 1079976
35875 1079976 641104 418361 138937 -176504 -311875 -225709 -136519 -209749 -304297 -150998
35865 -150998 252954 553988 424809 -9745 -263983 -66942 284817 304136 -48575 -349163
35855 -349163 -341046 -298344 -594485 -1092209 -1192437 -480803 770473 1743704 1742872 831837
35845 831837 -198194 -618916 -464639 -266805 -242718 -144101 140951 378171 500199 755297
35835 755297 1091323 996470 359404 -114069 99233 504834 475249 411624 1040811 1922154
35825 1922154 1836530 625656 -511645 -738069 -516225 -535465 -751062 -916578 -1065701
35816 -1065701 -946643 11441 1520770 2240605 1584419 755926 998207 1742401 1709621
35807 1709621 1016295 697652 744203 308714 -419104 -336578 534344 921631 532957 617810
35797 617810 1651423 2192895 1118594 -451625 -763311 139400 940357 1129250 1130298
35788 1130298 999791 465606 -77214 46189 598945 813495 739703 994479 1369183 1042244
35778 1042244 161100 -189621 210972 328742 -334167 -887520 -591584 -35495 17747 -63682
35768 -63682 425542 1212236 1529100 1400705 1486863 1921282 2137234 1760077 1072381 627456
35758 627456 748989 1265933 1540124 1075065 259631 25144 590683 1207574 1390384 1524915
35748 1524915 1794607 1525861 419496 -510497 -327453 259379 -13586 -885041 -1004837
35739 -1004837 -102501 778753 1089323 1272829 1385579 847077 -24707 178643 1828890
35730 1828890 3275837 2972149 1525650 582292 547454 598307 331668 126924 129172 15951
35720 15951 -217773 -155270 258732 558325 514390 444843 583986 630998 199461 -537548
35710 -537548 -891151 -350993 781554 1546497 1305138 479096 -49975 -189595 -664254
35701 -664254 -1695774 -2438148 -2150391 -1257930 -682440 -675951 -911368 -1168841 -1233706 -638454
35691 -638454 661646 1758461 1804772 1229926 1043815 1245993 991808 181972 -301683
35682 -301683 -70880 177246 -124718 -576876 -634740 -450272 -389995 -390484 -307049 -352484 -692490
35671 -692490 -1032474 -1022126 -713509 -324776 55247 289148 171339 -176941 -362121 -355924
35661 -355924 -507298 -702936 -227181 1128326 2469452 2834805 2297029 1556399 996747
35652 996747 682404 747664 1164393 1545421 1712649 1989436 2437892 2458788 1819314 1365823
35642 1365823 1801191 2393037 2027422 1056170 772022 1292442 1405658 593644 -198392
35633 -198392 -151088 344951 684629 942857 1129469 659249 -561381 -1400084 -827369 643766
35623 643766 1749146 2132170 2251889 2151311 1488084 595856 347731 842954 1199780
35614 1199780 885929 399534 302121 360524 141075 -158033 -73304 291400 374728 -67722
35604 -67722 -755446 -1345681 -1703507 -1764116 -1515583 -1175297 -1077653 -1265480 -1389823 -1128380
35594 -1128380 -569410 -89011 44393 -139211 -414887 -556722 -492521 -350262 -302907 -325544
35584 -325544 -228926 -27236 -83782 -640770 -1330640 -1533488 -1237207 -1114646 -1576321 -2171434
35574 -2171434 -2250508 -1842563 -1404028 -983301 -253244 716161 1367471 1441128 1288285 1215490
35564 1215490 1029963 495861 -200800 -729105 -964644 -809954 -121270 834249 1309498
35555 1309498 950061 372649 347672 723643 770058 349225 41803 167512 370495 283165
35545 283165 29163 -98079 2825 335427 832824 1167920 955041 272675 -392073 -776346
35535 -776346 -966899 -872660 -214665 759188 1243728 961262 635356 831443 936256 108532
35525 108532 -1136249 -1293919 136336 1889004 2458887 1768236 935028 838558 1367813
35516 1367813 1855571 1834670 1388604 984480 956298 1085203 838086 134148 -346962 116071
35506 116071 1377736 2538751 2941353 2729758 2365318 1989317 1568131 1358737 1682624
35497 1682624 2242412 2224628 1347279 369498 144595 481590 495366 -55234 -415736 60374
35487 60374 991847 1441345 982447 42555 -594897 -446015 319908 1053834 1321453 1412100
35477 1412100 1862280 2550163 2786557 2357012 1821217 1546098 1147795 331772 -382009
35468 -382009 -391217 75757 453346 748594 1202609 1515985 1319485 1060865 1415143 2039332
35458 2039332 1983589 1215488 587408 322256 -163944 -766171 -479570 771664 1500146
35449 1500146 749880 -365528 -338754 489541 672614 -57516 -686313 -746468 -809980 -1136206
35439 -1136206 -1093964 -215773 1104030 2221709 2804456 2650632 1746427 680968 232409
35430 232409 315666 74584 -755021 -1367505 -1126228 -525256 -414649 -879357 -1432405 -1813165
35420 -1813165 -1994294 -1760193 -900770 318198 1330544 1829576 1873817 1620138 1245245
35411 1245245 967885 889162 939537 1110557 1472601 1818210 1670587 923067 118343 -233037
35401 -233037 -274980 -384711 -480227 -230144 282186 609670 541538 232958 -148447 -509055
35391 -509055 -687459 -626156 -558835 -626818 -477958 270280 1315157 1974746 2107791 2088142
35381 2088142 1912287 1145498 -49228 -672012 -162971 753423 1109294 1008887 1144805
35372 1144805 1451842 1235965 512083 135395 354742 226072 -949298 -2364063 -2680324
35363 -2680324 -1787543 -713878 -57635 500120 1097578 1155600 382828 -485284 -600134
35354 -600134 -123977 231791 394207 876025 1698989 2153153 1742325 795249 -22470 -367707
35344 -367707 -268612 81071 417946 585778 697389 899531 1067556 1066071 1147546 1594422
35334 1594422 2097564 2115574 1782923 1719311 1916144 1679283 856244 181031 48654 -67813
35324 -67813 -438410 -347832 613706 1446251 1026083 -174558 -846627 -815366 -934220 -1307890
35314 -1307890 -1069114 12350 1050382 1467797 1707889 2111512 2185492 1555673 729545
35305 729545 310819 232626 311418 761655 1543755 1977590 1723813 1445601 1703980 1864585
35295 1864585 1057626 -293492 -987413 -815368 -713968 -1160489 -1446866 -822342 414032
35286 414032 1338684 1459860 1098744 1020143 1742772 2902566 3380850 2498159 985930
35277 985930 237183 655636 1382728 1661949 1683283 1828178 1870103 1486129 1029257 1119232
35267 1119232 1689812 2017421 1657592 939531 500829 597566 908343 885522 328860 -340005
35257 -340005 -513408 -145694 192753 119017 -45325 184345 717814 1092391 1219657 1476858
35247 1476858 2081425 2751034 3029659 2680727 1760540 583378 -377538 -833237 -953902
35238 -953902 -1070334 -1155083 -932721 -472787 -220277 -327082 -411483 -209043 -28402 -217492
35228 -217492 -545728 -555709 -263784 -29558 91269 344281 710307 873497 773126 684485
35218 684485 679295 514367 193195 106429 362448 490609 197731 -4377 570788 1771795
35208 1771795 2710278 2763562 2094674 1278726 777414 718310 867848 844166 554122 275562
35198 275562 124786 -226322 -932822 -1442334 -1178208 -529130 -432088 -1015022 -1413074 -1051817
35188 -1051817 -361675 50720 213729 331248 153286 -553366 -1296595 -1290142 -449354 564969
35178 564969 1200634 1442764 1451465 1267328 982803 830068 893627 932202 681752 275333
35168 275333 190933 681704 1323420 1356908 605701 -181082 -174403 542267 1198911 1370695
35158 1370695 1258786 1053564 704183 394960 519023 934589 949093 380488 -66088 94931
35148 94931 373038 208647 -87898 -21639 136174 -44312 -177330 287249 895002 803835
35138 803835 257722 207355 612128 481900 -287948 -549126 194633 836706 353787 -646003
35128 -646003 -956849 -517638 -156449 -195980 -274868 -173401 54201 499790 1160894 1497259
35118 1497259 997153 55338 -440144 -331642 -307826 -788598 -1359122 -1445622 -1013406 -418583
35108 -418583 25252 190280 173187 284266 725176 1256875 1458762 1273013 965949 606024
35098 606024 -18274 -937955 -1835543 -2387225 -2449747 -1928229 -883310 181407 614830
35089 614830 385400 150942 339400 542524 147997 -710113 -1225478 -842393 199672
35080 199672 1215115 1735820 1806544 1766278 1795515 1686169 1114365 119809 -819502 -1207889
35070 -1207889 -893141 -29285 1086472 2084209 2690745 2973719 3211571 3397835 3141702
35061 3141702 2269250 1247003 674495 538118 341298 -138646 -629092 -850817 -802228
35052 -802228 -535109 -92006 248996 152933 -165776 -26399 720784 1293266 1030535 375040
35042 375040 192169 532806 864694 1200091 1928518 2587489 2066673 440960 -589677
35033 -589677 120772 1498124 1762212 854049 130987 129456 63239 -496179 -847046 -429511
35023 -429511 287532 743265 1162890 1837970 2297832 1976611 1205816 800223 946541 1115390
35013 1115390 879453 332863 -129910 -87175 622727 1565184 1962476 1604315 1136917 1100025
35003 1100025 1161726 823204 395990 543376 1138821 1373325 925122 315399 62242 100096
34993 100096 167412 273746 591409 1166366 1816134 2166381 1929381 1335230 987636 1004402
34983 1004402 741163 -147544 -866709 -452034 766424 1554328 1433042 1019842 816733
34974 816733 710738 770297 1430955 2518387 3053990 2542881 1663661 1185389 972249 622210
34964 622210 340081 474935 790977 911216 975633 1155084 1012641 156042 -856841 -1121353
34954 -1121353 -665506 -307609 -380278 -415073 -73745 389992 698928 910506 1074684 1128152
34944 1128152 1248272 1711175 2239614 2124277 1273315 539918 583933 916865 646384 -174607
34934 -174607 -639640 -359860 -27070 -327401 -839403 -587815 500252 1349317 1111700
34925 1111700 244841 -178986 173051 786891 1263064 1644889 1829030 1455690 617416
34916 617416 -16099 -106507 -51965 -151430 -88436 256374 259247 -400097 -800005 101958 1792426
34905 1792426 2701317 2205576 1129806 349146 -22121 20425 686981 1686385 2159456
34896 2159456 1805295 1318565 1286207 1415914 1323633 1281079 1548749 1683316 1273231 803222
34886 803222 972561 1570711 1853885 1729364 1720319 1944042 1993178 1806420 1823762 2131370
34876 2131370 2179040 1621763 866065 436147 216591 -286580 -1141008 -1773919 -1562340 -521807
34866 -521807 634225 1189669 1176617 1225338 1623060 1930298 1795290 1661790 2090130 2703966
34856 2703966 2573000 1570218 592965 337229 565806 810184 1094742 1541128 1793085
34847 1793085 1378829 397348 -536467 -850892 -317622 868509 2003158 2187271 1143098
34838 1143098 -415347 -1485581 -1683464 -1283544 -698621 -254259 -196026 -500169 -812539
34829 -812539 -875790 -819540 -739605 -312577 695618 1777436 2129477 1690835 1194851 1161558
34819 1161558 1333775 1190581 566327 -354898 -1252717 -1749250 -1639196 -1161839 -724218
34810 -724218 -323171 337075 1113406 1381519 953096 488726 623705 1138139 1432215 1411070
34800 1411070 1348449 1193525 689847 65610 -89175 268009 446632 -14027 -684589 -892986
34790 -892986 -660835 -529080 -622726 -422232 401934 1322467 1470419 696860 -232211 -565185
34780 -565185 -369909 -199296 -236384 -188091 65162 215612 59941 -138659 -73771 158590
34770 158590 351502 629902 1187136 1755879 1815337 1334407 920618 1121166 1826542 2454049
34760 2454049 2533858 2055385 1401210 1013097 1041402 1300734 1562223 1739819 1737916 1406470
34750 1406470 880550 679299 1075105 1541506 1279956 224373 -907612 -1493183 -1441780
34741 -1441780 -802563 413689 1830875 2733381 2877709 2845454 3189654 3606937 3438815
34732 3438815 2727892 2218517 2370557 2858729 3114312 2974834 2656951 2376998 2202355
34723 2202355 2122464 2061134 1849093 1348588 680154 240124 346334 845102 1222445 1187877
34713 1187877 975150 920409 965272 863717 695503 754543 989236 1008588 683317 299098
34703 299098 37838 -215275 -415013 -246957 249844 464516 28958 -551153 -528071 148782
34693 148782 976536 1667157 2220711 2425886 1892682 620997 -866305 -1984257 -2417479
34684 -2417479 -2121247 -1343906 -554440 -20707 422611 901895 1087546 730932 349058
34675 349058 678272 1515514 1852746 1281459 532992 350090 525004 531055 516450 974671
34665 974671 1723193 1949679 1310078 417641 47641 239935 449978 342569 103611 22505
34655 22505 90656 143183 173056 275465 405933 462270 524532 674786 624170 254 -887350
34644 -887350 -1133162 -417220 420544 489980 91435 173873 843128 1219775 767970 17163
34634 17163 -219188 234023 981943 1581300 1781176 1602885 1339773 1223455 1114094 840968
34624 840968 665130 854572 971798 366932 -628752 -919933 -261966 310341 105552 -131304
34614 -131304 537378 1706566 2254397 1949807 1452194 1048644 423044 -380615 -705513
34605 -705513 -176582 799914 1566245 1729234 1155226 85645 -653873 -229485 1146357
34596 1146357 2263487 2316482 1802494 1673412 2006468 2027018 1283205 276706 -202186
34587 -202186 -45571 150844 -16768 -160936 340348 1321148 1800510 1145810 -87923
34578 -87923 -775990 -423180 578435 1622891 2344684 2526353 2104646 1394349 933998
34569 933998 942925 1136728 1132548 829388 379481 9808 -126455 -132357 -345504 -875776 -1259076
34558 -1259076 -944514 -100930 498855 480542 310217 536529 1002416 1150154 840176 472950
34548 472950 401569 578645 798195 984202 1114396 1077071 841530 707954 1098241 1961576
34538 1961576 2625552 2536869 2021287 1903287 2389150 2838896 2787156 2585079 2627387 2518787
34528 2518787 1711230 629659 312155 952571 1581420 1364186 556321 -85862 -257234
34519 -257234 -128491 84259 165199 -115304 -637806 -812900 -216098 825868 1607119 1836588
34509 1836588 1742550 1540581 1187125 663249 187427 23207 199002 485822 617410 522394
34499 522394 318531 49933 -441533 -1194777 -1794925 -1708296 -978781 -226162 151312 378593
34489 378593 723016 955532 771688 413461 371360 636038 761323 625039 597803 858017
34479 858017 1054862 932012 865590 1321034 1986358 1996892 1090438 66632 -158510 398581
34469 398581 1057226 1521690 2106395 2942790 3579547 3643083 3434212 3477068 3783943 3968236
34459 3968236 3846974 3516262 3023307 2394017 1823536 1401040 824549 -96078 -816476
34450 -816476 -581598 451286 1267900 1248745 728766 205264 -286678 -738214 -812452 -380230
34440 -380230 113238 259340 229689 334188 509782 651187 938465 1352061 1383951 831340
34430 831340 397779 789375 1609034 1959039 1834447 1970243 2425295 2373564 1512642 730700
34420 730700 886652 1600433 1815712 1138750 112928 -543374 -508113 136961 1019202 1633741
34410 1633741 1710236 1447226 1223132 1150678 1102103 1081714 1298091 1813910 2328992 2440918
34400 2440918 2021612 1224063 235189 -739410 -1278750 -947917 22536 602266 61256
34391 61256 -902960 -812626 665183 2128190 2171295 1092862 250665 197570 313125 114650
34381 114650 -4032 421633 1090033 1350591 1096814 839581 1008440 1431284 1527873 976694
34371 976694 149480 -279511 -186124 -101131 -259032 -58719 974385 2130657 2292729 1607011
34361 1607011 1363207 2037202 2476486 1565863 -121125 -1105714 -925173 -443574 -460455
34352 -460455 -778604 -718813 -10036 1025814 1899420 2421111 2802312 3249164 3479849 2939851
34342 2939851 1610558 220408 -604524 -1000133 -1303152 -1271264 -502900 590704 987176
34333 987176 323921 -607055 -816788 -134946 891358 1680842 1955810 1751701 1410293
34324 1410293 1386641 1827725 2438729 2858030 2984962 2861288 2496246 1982171 1557588 1356754
34314 1356754 1276568 1251825 1428807 1850912 2219129 2261346 2132772 2105113 2046014 1649967
34304 1649967 1093005 953619 1433757 2122567 2630821 2964827 3080521 2617018 1501240
34295 1501240 428259 211057 825250 1533179 1807646 1703935 1446156 1129809 827871
34286 827871 591431 346748 118359 235431 893782 1657689 1941147 1868775 1992703 2226744
34276 2226744 1930507 1182007 970019 1680501 2340783 2064999 1415878 1411998 1848793 1728472
34266 1728472 963509 437991 470837 409718 -76779 -400702 -147546 155777 -74480 -527941
34256 -527941 -557140 -194225 13154 -118654 -274995 -272628 -349098 -765442 -1370673 -1657000
34246 -1657000 -1238783 -310681 451686 581680 282294 8643 -151816 -294989 -169214
34237 -169214 538524 1478419 1899470 1679774 1397205 1295705 1006464 534555 600125 1463715
34227 1463715 2222571 2014630 1297405 1082764 1346749 1143461 126134 -926563 -1149053
34218 -1149053 -470486 610164 1534151 1883372 1639117 1404721 1891292 2983778 3717776
34209 3717776 3397146 2398497 1643387 1573363 1932271 2337632 2676509 2935822 2993944 2823068
34199 2823068 2760412 3250484 4224279 5005689 5046855 4525715 3920994 3258603 2295066 1321086
34189 1321086 1090079 1759668 2482152 2382100 1540090 712970 448503 775868 1431084
34180 1431084 2060515 2430776 2640436 2880964 2943275 2413208 1446819 755473 621352 597501
34170 597501 467075 701388 1474625 2046277 1856233 1532106 1938079 2794470 3197932 3065585
34160 3065585 3042910 3288873 3406989 3426160 3813193 4499033 4792006 4332184 3431792 2554227
34150 2554227 2135275 2619191 3763362 4226285 3013587 1182691 813347 2244008 3677538
34141 3677538 3718455 2862073 2043987 1205911 105377 -707555 -706476 -236889 316066 1267112
34131 1267112 2632152 3370820 2771902 1809450 1871228 2732375 3101409 2764939 2794693 3729229
34121 3729229 4853631 5430821 5552062 5516287 5287074 4872573 4515946 4256669 3921806
34112 3921806 3697110 4045046 4887817 5531696 5607495 5446236 5300495 4878299 4008184 3152342
34102 3152342 2791621 2771739 2736103 2812587 3335980 4143104 4693539 4823062 4930740 5377850
34092 5377850 6013808 6364712 6090288 5226660 4155476 3368102 3105595 3168452 3177769 3050287
34082 3050287 3082222 3486963 4011879 4243540 4248575 4580659 5479819 6352372 6404229 5662524
34072 5662524 4955779 4879794 5202632 5392932 5322700 5243079 5404594 5912011 6632545 7057187
34062 7057187 6659196 5682106 5152334 5703727 6765551 7382854 7445046 7472266 7535881 7283299
34052 7283299 6979201 7536898 9147540 10628016 10715334 9595597 8609479 8680456 9519539
34043 9519539 10261400 10427067 10211131 10117848 10408683 10804587 10791877 10330225 10065053 10564989
34033 10564989 11510715 12071244 12070217 12253525 13184113 14370943 14940343 14804808 14557221
34024 14557221 14417424 14061257 13549760 13576853 14387589 15156264 15066392 14517494 14561550 15479348
34014 15479348 16640950 17535844 18163171 18528500 18571094 18609369 19094652 19857271 20350073
34005 20350073 20706847 21689049 23352213 24647612 24776156 24206612 23906430 24243441 25109801
33996 25109801 26433250 27970226 29171331 29886064 30759456 32357659 34287656 35706290
33988 35706290 36365047 36725247 37387205 38719658 40604950 42294895 43110328 43526868 44780480
33979 44780480 47074554 49186620 50400476 51662635 53892970 56247003 57353971 57487556
33971 57487556 58062855 59437935 60618428 60938579 60789535 60765507 61156049 62204157 63923601
33962 63923601 65752514 67162516 68383133 69878782 71627734 73644419 76455746 80136886
33954 80136886 83765061 86920710 90673595 95747922 100952298 105164913 109577241 115777166
33946 115777166 122845718 129023614 135176507 143431791 153154175 161891000 169864333 179395959
33938 179395959 189871624 198061850 204303501 213064041 225179695 234759601 237426605 237413966
33930 237413966 242525812 255946359 277290444 307062711 342965975 374034223 386355239
33923 386355239 375716583 349451466 315877271 278017742 238460523 203096496 175951553
33916 175951553 154791895 135754250 119082805 106846962 98063089 90095376 82910024
33909 82910024 78132815 75129064 71512336 66882487 63002274 60586014 58566960 56403701
33901 56403701 54738880 53713518 52636430 51423445 50653483 50145374 48981376 46923043
33893 46923043 44475668 41733111 38476207 35129057 32241147 29344707 25778921 22302950
33885 22302950 20263759 19365487 17989863 15732770 13882620 13164805 12718784 11791256 10903118
33876 10903118 10644898 10553448 9913715 8748105 7452810 6261956 5461808 5318302 5479272
33867 5479272 5255976 4695702 4495905 4748978 4826783 4643677 4787403 5105493 4546141 2981245
33857 2981245 1862058 2265063 3437738 4112430 4133625 3862866 3136509 1996146 1441086
33848 1441086 2083383 2831847 2341516 1135087 728745 1103151 801102 -516058 -1404579
33839 -1404579 -957596 -224402 -504026 -1383621 -1473831 -412340 788189 1066250 298577
33830 298577 -859532 -1617469 -1611256 -1115245 -632113 -240251 367341 1188460 1744907 1771245
33820 1771245 1561636 1374975 1024740 444685 152297 582015 1283777 1387210 707740
33811 707740 -136154 -593069 -638611 -424160 -31464 328463 363752 140235 94229 412521
33801 412521 739621 734147 605367 781583 1258432 1627994 1646350 1417248 1038853 458823
33791 458823 -186992 -441289 -44822 584171 757895 385600 56227 160946 366755 288830
33781 288830 301329 1062456 2334509 2993587 2441469 1403779 923459 1063672 1147726 882568
33771 882568 553133 326455 128618 175070 840093 1852648 2358696 2073720 1716436 1920923
33761 1920923 2321741 2186435 1422943 431679 -552460 -1359927 -1567314 -1008826 -329814
33752 -329814 -306185 -798018 -1075259 -989929 -1030711 -1314864 -1401671 -1172895 -1046897 -1134031
33742 -1134031 -975233 -361122 347872 953587 1631877 2099507 1552820 52983 -929692
33733 -929692 -240771 1313647 1947725 1044254 -560532 -1970211 -2846373 -2914987 -2050405
33724 -2050405 -951402 -725664 -1532286 -2396887 -2548932 -2166551 -1612486 -817305 168879
33715 168879 800770 786050 624530 840518 1188720 1227645 1225778 1742360 2532238 2656292
33705 2656292 1771424 721384 582016 1409422 2156287 1758302 243985 -1233847 -1553689
33696 -1553689 -804820 -99332 -186063 -646572 -693820 -327281 -184163 -483543 -749182 -619536
33686 -619536 -383252 -481544 -851425 -1053541 -855584 -436617 -93362 75887 203071 444746
33676 444746 746197 841235 567845 136281 -68730 61935 287853 397324 433687 484467
33666 484467 498791 461392 514891 693894 739352 450241 36940 -240131 -633251 -1566493
33656 -1566493 -2685337 -2889779 -1704119 -139347 377966 -311771 -1065782 -930754 -13753
33647 -13753 1121552 2166596 2897741 2952669 2280865 1434769 965029 805427 603070 296157
33637 296157 -41175 -510722 -1000176 -882628 164856 1307471 1364243 398312 -362597
33628 -362597 -239389 176824 226545 151603 393021 757924 931665 1138066 1555965 1655737
33618 1655737 970548 105304 33938 625525 844749 357843 -66273 95849 361370 223225
33608 223225 36803 335525 903443 1186615 1153218 1072528 826855 199379 -403356 -347964
33598 -347964 162059 247497 -312223 -727631 -465463 -57860 -134587 -353611 -27070 688255
33588 688255 1062405 941332 749045 536010 825 -571353 -489009 1905 -298906 -1670831
33578 -1670831 -2645987 -1905678 -143079 982301 1056154 899425 872411 594221 206568
33569 206568 484337 1438996 2019034 1592523 708330 6085 -597264 -1144270 -1086346 -192248
33559 -192248 815787 1240476 1311168 1443470 1346745 663396 -136166 -324455 128871 890255
33549 890255 1927108 3022554 3299501 2277645 915105 512646 961844 1163354 802996
33540 802996 490546 397538 91684 -334051 -294180 47326 -135288 -821219 -1019047 -432706
33530 -432706 63429 28063 192636 986357 1608356 1389780 943144 1022420 1253722 1037659
33520 1037659 821042 1295588 1993405 1873452 878999 -143352 -693510 -791401 -313446
33511 -313446 740741 1578327 1312451 238954 -546953 -686370 -725782 -852430 -557571
33502 -557571 300196 1069969 1211033 860721 325815 -268362 -686087 -668732 -446839 -450124
33492 -450124 -436285 256131 1440361 1993755 1370226 347608 -151622 -178797 -199481 -187244
33482 -187244 69825 341307 295083 45767 -185947 -536390 -1077185 -1354666 -961767 -258401
33472 -258401 52821 -178796 -584374 -919342 -1138566 -1080967 -650982 -151388 83484 230728
33462 230728 645792 1143055 1170147 639915 59798 -175145 -147672 -36428 207647 692415
33452 692415 1357648 1955807 2110599 1555366 544412 -231230 -488979 -818060 -1797799
33443 -1797799 -2922448 -3087649 -2055993 -707966 232681 978825 1925950 2785376 2938809
33434 2938809 2267816 1216582 279110 -265464 -351766 -186715 -155296 -405038 -626145 -425195
33424 -425195 189071 823557 1090070 894022 477211 241775 393035 737344 988355 1199575
33414 1199575 1603336 2069163 2127927 1608863 869108 288719 -65547 -155516 186585 898691
33404 898691 1565475 1881686 1865182 1471931 572026 -409034 -522166 454094 1363241 999445
33394 999445 -330810 -1337657 -1445224 -1045948 -374157 690232 1662132 1551372 374670
33385 374670 -486101 -115527 588592 220350 -1127880 -2114538 -2022234 -1398181 -938038 -660935
33375 -660935 -336589 17570 331861 634676 788692 566927 196421 297638 960011 1363678
33365 1363678 791310 -313544 -826563 -325790 509861 870574 728458 651743 1032017
33356 1032017 1700908 2180316 2185210 1905177 1756519 1796521 1563252 743393 -177823 -398992
33346 -398992 58199 258608 -336659 -1005686 -729967 334050 1027174 722883 -16625
33337 -16625 -423290 -466812 -484367 -465507 -253822 -94801 -376275 -974198 -1394541 -1495387
33327 -1495387 -1546678 -1580193 -1241204 -434669 374454 753465 800538 788243 693135 449781
33317 449781 366873 794413 1461426 1595698 800692 -453933 -1310759 -1333768 -805387 -362148
33307 -362148 -373441 -596066 -456385 265013 1126491 1524584 1387054 1178601 1296201 1687762
33297 1687762 2044833 2141912 1967034 1723088 1719380 2050453 2365247 2213832 1688527 1414118
33287 1414118 1718954 2103615 1860492 1058173 493474 632522 999374 849427 171895
33278 171895 -360710 -366815 -237598 -471579 -900997 -979560 -652725 -416039 -460978 -313830
33268 -313830 378725 1153948 1292013 782906 199690 -205501 -632975 -985040 -719429 277400
33258 277400 1274326 1565497 1303526 1035221 845097 518787 199023 169268 162922 -333634
33248 -333634 -1081568 -1209002 -559625 -128578 -665518 -1506458 -1509722 -715810 -205898 -440863
33238 -440863 -653682 -129159 661577 710307 -170582 -1169504 -1478424 -1042009 -367867 48502
33228 48502 63740 -122028 -251705 -345723 -636551 -1081134 -1205856 -732154 -140587 -172000
33218 -172000 -842790 -1431482 -1472103 -1254673 -1188373 -1178288 -941861 -527396 -139266 217392
33208 217392 514572 445626 -105420 -577489 -308271 488074 903610 521728 -133009 -418599
33198 -418599 -289150 5363 379631 723121 681726 81806 -650328 -874204 -421256 372182
33188 372182 1170389 1897261 2578050 3163054 3497167 3375717 2725400 1769131 843685 54018
33178 54018 -629396 -980749 -709217 -125044 -5977 -515467 -893652 -670866 -477070 -897245
33168 -897245 -1171787 -172398 1606460 2314143 1165167 -552234 -1292480 -1038398 -645469
33159 -645469 -335399 199077 750978 741367 290678 238701 943576 1731317 1804038 1227256
33149 1227256 699343 626294 774547 783705 719294 896797 1211921 1006118 -75829 -1303169
33139 -1303169 -1487269 -449166 712480 1033305 751463 557861 411594 -156055 -934888
33130 -934888 -1134212 -568391 41017 110348 -103245 -79511 238766 605194 907416 1099067
33120 1099067 1034971 723434 492477 570579 679961 365190 -366027 -986521 -993202 -347718
33110 -347718 541658 1111322 979347 171145 -929587 -1840364 -2161380 -1646919 -407295
33101 -407295 896580 1389872 788115 -252985 -799445 -587841 -155656 -86644 -313553
33092 -313553 -227825 590791 1829044 2672019 2573217 1706757 656822 -115765 -366780 46217
33082 46217 951027 1664220 1501160 548988 -446750 -996164 -1238358 -1362386 -1221796 -774498
33072 -774498 -397303 -368314 -387919 -4070 737883 1387300 1584418 1215217 404755 -353078
33062 -353078 -451675 60399 358376 -65557 -597929 -355152 535115 1182117 1178716 858747
33052 858747 523529 246167 352332 1178064 2236122 2487068 1687522 704894 223907
33043 223907 -75860 -673244 -1300402 -1435671 -1125949 -766529 -505537 -329234 -287742 -202974
33033 -202974 337341 1210967 1548451 903155 104648 194875 938771 1240363 759611 227666
33023 227666 277152 812932 1529182 2241557 2642951 2487836 2128696 2158572 2419548 2118771
33013 2118771 1088034 133200 -133635 -7750 130911 521802 1317323 1889321 1613022
33004 1613022 869527 491539 540421 422673 26766 -78900 392478 1001984 1272873 1272758
32994 1272758 1307945 1478541 1748217 2093802 2370573 2320689 1914815 1441124 1092201 731627
32984 731627 270247 -10370 174921 611825 816041 682326 516103 420286 133960 -296212
32974 -296212 -161845 1047399 2635658 3214605 2326558 966695 243356 123446 -18878
32965 -18878 -171971 193773 1022029 1563082 1435894 1042806 747160 352750 -290975 -815479
32955 -815479 -894744 -774518 -819870 -982382 -1111934 -1316399 -1564126 -1443257 -881282 -612461
32945 -612461 -1223448 -2118732 -2223448 -1448796 -638270 -254814 -33375 129743 -46467 -385307
32935 -385307 -159472 742548 1363073 936867 -6619 -387269 37654 620302 835112 751055
32925 751055 627321 528209 351253 -32818 -637863 -1224633 -1453439 -1299713 -1109676 -1113876
32915 -1113876 -1135979 -922016 -469955 116283 761576 1226461 1172309 681992 318990 339944
32905 339944 258351 -367150 -1075911 -1010859 -95813 844738 1090650 699732 204029 34066
32895 34066 256983 572826 571260 211267 -59370 120097 535364 768411 781409 727399
32885 727399 463444 -186057 -850354 -926118 -449521 -83221 -216894 -628247 -1045569 -1435577
32875 -1435577 -1654470 -1448710 -956680 -589094 -258353 544301 1646823 2033555 1324508
32866 1324508 598338 910557 1642364 1415610 301745 -151395 801038 1999757 2071008
32857 2071008 1263582 816101 1123745 1463597 1264794 712665 59858 -780591 -1630956
32848 -1630956 -1781125 -922068 121072 306495 -178875 -150148 859138 1870746 1778040
32839 1778040 778556 -9935 59177 715504 1405165 1718900 1346640 319316 -654946
32830 -654946 -757875 -149350 93962 -622455 -1636034 -2002784 -1718472 -1468472 -1568187 -1748069
32820 -1748069 -1752518 -1545517 -1025666 -129962 753532 1011744 567578 -18870 -325064 -492353
32810 -492353 -689744 -622041 34409 977014 1482256 1192518 402912 -368783 -809411 -840141
32800 -840141 -542186 -166080 -13581 -175582 -476049 -713723 -817893 -722012 -303071 375690
32790 375690 919266 951658 562091 164690 -53678 -248291 -444585 -336966 197924 692430
32780 692430 588326 23671 -286757 24544 531946 607209 179277 -244257 -122727 662617
32770 662617 1713596 2367575 2234504 1612479 1208204 1336797 1587329 1411725 826748
32761 826748 320052 225740 443014 683147 759930 675345 615426 830612 1333794 1740840
32751 1740840 1621904 1063189 710569 1127330 2148421 2970718 2943745 2250626 1685897
32742 1685897 1683194 1734650 1032152 -397769 -1578623 -1693084 -944322 -117791 354530 552457
32732 552457 568220 333753 -75836 -346265 -232940 216943 757245 1106846 1092489 828103
32722 828103 679555 823678 912468 454556 -476263 -1193753 -1132495 -428639 298568 585138
32712 585138 476208 356682 500367 790813 945622 984365 1232020 1755020 2102816 1871699
32702 1871699 1254013 683825 210436 -295017 -534603 -60756 832384 1199050 680977
32693 680977 74966 262073 1008875 1345507 903524 339959 409492 1019307 1406737 1097656
32683 1097656 466422 259095 661295 1068450 847650 43403 -890391 -1731786 -2423400
32674 -2423400 -2613507 -1923734 -694328 168981 261205 43848 -26526 -108571 -389211 -506454
32664 -506454 -93234 533366 793256 664989 562006 619901 625322 492682 331305 171970
32654 171970 74397 351919 1189754 2136798 2495541 2207897 1878518 1881344 1881825 1353506 256467
32643 256467 -863158 -1246003 -507560 839327 1608669 1103185 -55136 -675024 -421439
32634 -421439 31676 123661 -13139 -121805 -249759 -417226 -481609 -548043 -910415 -1371328
32624 -1371328 -1312160 -758864 -616995 -1323702 -1996783 -1672878 -800264 -561987 -1077640 -1335397
32614 -1335397 -852200 -348078 -509255 -982995 -1110178 -999582 -1215016 -1739178 -1916415
32605 -1916415 -1401906 -673333 -444773 -841780 -1339142 -1395237 -962063 -366614 114595 390581
32595 390581 387709 63466 -366335 -560377 -585822 -962378 -1859553 -2578690 -2307068 -1197180
32585 -1197180 -193591 91566 -201611 -766658 -1440228 -1857327 -1545551 -671513 -65947
32576 -65947 -117903 -220547 216953 779485 711675 134772 -155653 149623 677446 1186592
32566 1186592 1767685 2219053 2034440 1216164 413509 -3693 -374161 -954610 -1354189
32557 -1354189 -1208085 -861966 -824180 -924474 -585130 321939 1378994 2156536 2396545
32548 2396545 1926934 913555 2942 -303789 -256993 -348140 -436747 -34479 702676 1043789
32538 1043789 776115 479843 573725 821198 1014529 1389620 1954277 2092138 1412748 504649
32528 504649 243960 686200 1172613 1242218 925333 402801 -88589 -220433 33089 143476
32518 143476 -311077 -905640 -857363 -136622 523869 711401 796172 1189197 1688783 1803852
32508 1803852 1357623 589153 -56809 -157544 344040 937976 1004370 540470 120110 101324
32498 101324 254204 251458 125193 72829 126295 165242 24316 -443259 -1122813 -1503537
32488 -1503537 -1185711 -482880 -30145 163590 624843 1338409 1590441 1172099 864829
32479 864829 1164529 1330950 552944 -537824 -575257 559650 1516787 1310078 465163
32470 465163 54602 309576 620637 457825 -135653 -723875 -846930 -363074 377260 821912
32460 821912 802577 698911 928003 1412867 1679816 1423040 889438 666374 1031953 1556882
32450 1556882 1552297 951106 442612 567395 1019237 1149908 849598 498540 290903 129135
32440 129135 61134 274431 670409 945067 1107631 1420061 1778388 1691605 1023353 268194
32430 268194 -105497 -153060 -97972 68862 346780 465866 224342 -151965 -276536 -51928
32420 -51928 355109 795593 1194449 1480208 1616363 1594698 1368431 972406 663327 637529
32410 637529 653849 346169 -103610 -125694 337581 697439 669885 705544 1135831 1544923
32400 1544923 1487476 1249161 1280110 1360997 1040571 534729 422988 674910 745240 531103
32390 531103 485195 765186 963533 794805 467242 239956 116371 92038 231805 379350
32380 379350 220361 -257156 -746520 -1098254 -1389898 -1515108 -1208925 -566668 -51089 128920
32370 128920 196488 296754 305677 222230 211481 168682 -162711 -534195 -368375 184293 148733
32359 148733 -907115 -2146073 -2623321 -2459686 -2204010 -1730136 -686720 416214 601756
32350 601756 -223093 -1179179 -1636592 -1744882 -1758063 -1626997 -1389387 -1271957 -1228085 -960534
32340 -960534 -533661 -366695 -482451 -396735 44541 363611 267089 129123 282706 430785
32330 430785 252423 70327 324200 781335 917135 806718 956341 1376607 1516045 1179929
32320 1179929 912644 1246045 1982647 2465636 2302064 1657347 1050330 957084 1364969 1600821
32310 1600821 896380 -644555 -1882327 -1785311 -648716 192502 -80724 -872299 -1061232
32301 -1061232 -471832 36113 -123433 -494280 -428286 -171606 -464265 -1282154 -1719456 -1204826
32291 -1204826 -179724 646252 1084397 1169179 715417 -230179 -951878 -791707 -71287
32282 -71287 385308 449980 640853 952865 663341 -409924 -1242090 -741019 890843 2425271
32272 2425271 2952640 2552753 1870456 1453752 1432999 1556849 1543286 1447900 1511810 1661480
32262 1661480 1556729 1221624 1089826 1177352 847081 -109812 -778170 -277232 818241
32253 818241 1154088 493155 -74721 159375 648174 693414 441754 286416 141618 -40949
32243 -40949 214039 1087786 1782403 1549761 902315 767103 818211 -63687 -1713348 -2472125
32233 -2472125 -1496076 -22151 463180 298123 789925 1964226 2501273 1778030 736323
32224 736323 433734 677770 577126 -208421 -1275847 -2075798 -2225648 -1574856 -442414
32215 -442414 411335 463226 -22759 -377208 -258518 242063 909098 1404954 1238451 284786
32205 284786 -780141 -1119739 -777945 -526659 -680984 -742017 -396850 -168133 -629036 -1499755
32195 -1499755 -2050095 -2025606 -1661344 -1125691 -551214 -343892 -747615 -1201284 -857260 209343
32185 209343 1003416 964825 616899 581144 651031 351272 -143446 -300410 -98139 39571
32175 39571 -28888 -109327 -178010 -277608 117 1135533 2639955 3189222 2232232 857769
32165 857769 486632 1143322 1707024 1599481 1385612 1639943 2039960 2023966 1779417 1921350
32155 1921350 2424485 2584582 2132739 1747596 2065055 2621806 2407535 1342588 505717
32146 505717 656065 1125042 728756 -536190 -1409089 -1002546 121646 803325 711424
32137 711424 437000 433473 457669 126073 -433666 -752619 -630931 -311340 -78912 96790
32127 96790 399332 728121 651940 -34333 -843442 -1018061 -471510 56180 -9448 -295526
32117 -295526 -93057 530317 821461 493625 142913 312798 686808 580586 -125651 -924890
32107 -924890 -1296998 -1045685 -267334 640195 1117750 961229 568636 382004 311547 71042
32097 71042 -220584 -307393 -405842 -843103 -1216311 -755830 383162 1072390 763151 246460
32087 246460 367438 775161 680187 216752 132095 498520 696594 527037 402428 405335
32077 405335 50364 -799847 -1547232 -1708646 -1541373 -1492707 -1567203 -1593856 -1636917 -1735941
32067 -1735941 -1613022 -1032365 -176094 642738 1356796 1961265 2274419 2199159 1956896 1779023
32057 1779023 1633507 1495660 1538386 1752729 1759598 1380932 1034903 1114324 1308296 1068639
32047 1068639 480466 84253 7616 -122154 -474379 -799130 -914907 -888800 -693410 -179553
32037 -179553 511124 927381 831287 448103 157539 191978 571843 1038289 1173378 934499
32027 934499 888074 1489871 2366704 2851866 2958057 3073312 2907785 1762715 -47656
32018 -47656 -1089438 -555310 697981 1332258 1036862 382664 -101806 -102366 583942 1601648
32008 1601648 1966045 1160744 -41974 -502685 -121636 317939 387947 383131 639163 1134011
31998 1134011 1661850 1897890 1495043 621051 109000 488988 1184949 1337924 1067044
31989 1067044 1056305 1174963 605746 -619818 -1309763 -685970 591373 1411942 1535598
31980 1535598 1444281 1415115 1266273 749035 -147640 -1093943 -1501824 -1008683 46766 955999
31970 955999 1428734 1632676 1549714 946476 48106 -466992 -372865 -179775 -271073 -354456
31960 -354456 -45336 562883 1167296 1554533 1459377 771263 54081 71783 535264 239118
31950 239118 -1119559 -2244397 -2022399 -1059191 -564510 -547594 -199613 542169 966354
31941 966354 768936 251684 -344572 -774104 -465598 675189 1522381 983513 -282567
31932 -282567 -701789 -155366 -20607 -766212 -1138641 -280948 807105 813919 2446 -460424
31922 -460424 -279381 -128566 -445086 -986936 -1334175 -1207501 -520737 439360 1172443 1615531
31912 1615531 2197463 2927079 3025331 1995595 569214 -24248 563344 1588859 2066472
31903 2066472 1489537 151117 -884706 -640935 519234 1040956 47914 -1519268 -2152786
31894 -2152786 -1512517 -291449 911341 1716427 1621114 620655 -224385 87195 1064648
31885 1064648 1415915 888483 338507 200255 103133 -65112 11644 102156 -427776 -1264336
31875 -1264336 -1254963 -291806 219002 -568437 -1599707 -1534642 -680119 -254290 -488639 -616568
31865 -616568 -305555 -4058 -24022 -162828 -202382 -135874 35581 236766 214961 -62805
31855 -62805 -185380 79147 302049 59867 -339492 -438352 -507994 -1039235 -1682244 -1627227
31845 -1627227 -899622 -329681 -228946 -43863 503203 826817 395703 -459512 -1050758
31836 -1050758 -1116360 -779181 -213602 318352 509864 382723 292448 392110 460882 367125
31826 367125 237711 63554 -307912 -650576 -497791 -40024 -112019 -851562 -1179425 -317639
31816 -317639 878820 1053728 329156 32303 613887 1040837 516393 -248058 -92978
31807 -92978 936319 1708715 1459655 508382 -358648 -692955 -512898 -32021 501164 822011
31797 822011 728926 251691 -278003 -444243 -141972 290857 440161 267803 73627 62507
31787 62507 132129 96635 -62787 -241293 -384571 -536900 -741843 -899463 -739530 -80186
31777 -80186 809526 1325085 1234525 1078814 1506103 2316327 2635329 2083621 1280768 981057
31767 981057 1144460 1198366 880848 402246 -25713 -379738 -618220 -672026 -636388 -651665
31757 -651665 -604881 -283559 147956 179712 -413859 -1255067 -1814526 -1940397 -1774988 -1354848
31747 -1354848 -529267 754026 2166141 2998285 2595280 1062243 -527083 -1050713 -568326
31738 -568326 -198352 -591273 -1072040 -725155 189654 629689 304779 -33235 145743 451392
31728 451392 426568 336896 569645 796253 423977 -380594 -786008 -375338 407920 948880
31718 948880 1135405 1184266 1141721 824324 161968 -558674 -851967 -504352 111220 373172
31708 373172 146054 -58905 195451 698744 1006273 1091185 1172918 1205413 1108470 1285176
31698 1285176 2162610 3224785 3308498 2111218 694062 87218 20022 -413834 -1320016
31689 -1320016 -1935236 -1783214 -1234742 -885809 -875438 -977277 -1074215 -1336828 -1941266 -2645582
31679 -2645582 -2802979 -2066076 -1002435 -549646 -788317 -821091 -80755 913779 1522202
31670 1522202 1958606 2561939 2729189 1649913 -177813 -1303757 -1220038 -850148 -985526
31661 -985526 -1297785 -1292269 -1236106 -1495370 -1743205 -1573774 -1301958 -1372472 -1430954 -799224
31651 -799224 406679 1396369 1756558 1680036 1329673 756407 378019 691887 1380165 1490084
31641 1490084 776724 133802 271766 642615 318714 -538321 -898537 -395423 185784
31632 185784 116815 -283037 -302268 21475 80147 -173499 -49089 720597 1338244 1026360
31622 1026360 298073 333245 1200809 1629509 853027 -146972 86706 1495310 2614506
31613 2614506 2483965 1634625 1109278 1225708 1582945 1736152 1484575 853334 163585
31604 163585 -97523 225704 749906 1051401 1163111 1345877 1607405 1776142 1877136 2041592
31594 2041592 2107587 1717977 880364 86112 -255077 -205629 21313 428748 955055 1095011
31584 1095011 351440 -895398 -1515867 -951157 -11847 138612 -431577 -525815 431913
31575 431913 1476954 1370994 249391 -683405 -841853 -814180 -1122669 -1232332 -343422
31566 -343422 1252546 2288278 1996291 990047 508250 1091983 2239639 3150399 3430348
31557 3430348 3042961 1982489 385838 -1154773 -1869717 -1596465 -984652 -677602 -544766
31548 -544766 -34896 943513 1936971 2629340 3088708 3269452 2799343 1569451 203824
31539 203824 -438845 -142204 522410 868777 733153 448267 311877 193938 -211939 -757282
31529 -757282 -768428 114191 1270150 1727276 1339324 800415 515702 128994 -635791 -1331670
31519 -1331670 -1400216 -944504 -481411 -324231 -545023 -1046737 -1273336 -469698 1159795
31510 1159795 2172909 1615376 507738 539781 1618626 2015580 963184 -271324 -323641
31501 -323641 488568 1032262 997732 781721 498673 105571 13749 588794 1335190 1481780
31491 1481780 1151380 1042574 1128976 708268 -221387 -709369 -303007 188631 -89841 -810367
31481 -810367 -1096070 -829335 -595638 -647658 -648780 -341731 141604 642408 1127843 1408565
31471 1408565 1152397 342075 -589653 -1219370 -1482318 -1470354 -1163604 -549665 179756 754455
31461 754455 1068885 1186097 1191356 1137539 1034401 794503 300235 -355992 -803574 -715756
31451 -715756 -128862 696222 1616392 2574425 3293752 3366713 2787463 2099617 1750167 1502271
31441 1502271 840142 -144186 -710891 -418917 282889 656869 560684 379976 284994 26261
31431 26261 -501457 -901894 -684833 176847 1242758 2002490 2186766 1880910 1487606 1442900
31421 1442900 1808149 2200316 2193612 1698567 939013 256225 -18760 213729 570390 433512
31411 433512 -319162 -1080989 -1255799 -935342 -513471 19373 856219 1698798 2003036 1856730
31401 1856730 1894231 2234361 2236418 1560500 735133 260078 -147183 -819122 -1286152 -951792
31391 -951792 -190632 105691 -158552 -316667 -179078 -289760 -839831 -1235579 -1045056 -597996
31381 -597996 -294713 -48495 179053 38302 -448424 -478950 434244 1487650 1534895 653783
31371 653783 -84882 -160612 9738 125348 429153 907088 1001572 546173 242768 679985
31361 679985 1437687 1721922 1451730 1128327 940548 621587 57924 -506019 -847314 -934418
31351 -934418 -762691 -398345 -121439 -131982 -180258 70017 360531 70539 -779843 -1338882
31341 -1338882 -1003896 -192316 322428 375483 229224 -140724 -873020 -1543291 -1465762 -739334
31331 -739334 -247514 -393542 -561161 -221750 146422 -108098 -646767 -681297 -314402 -326667
31321 -326667 -724498 -606694 288270 961931 617319 -151294 -351923 -43282 93571 69774
31311 69774 422872 1019619 1121483 651321 384617 679136 908738 486365 -324782 -1004863
31301 -1004863 -1481559 -1805614 -1779838 -1445692 -1376866 -1880590 -2346423 -2012441 -1034099 -176170
31291 -176170 262997 576379 922956 1144703 1191790 1116943 750236 15464 -508710 -71573
31281 -71573 1134124 2050172 2133954 1972926 2198924 2441695 1909986 614795 -564560
31272 -564560 -893424 -453649 100318 148893 -420926 -1066464 -1000869 -12635 1198526 1734136
31262 1734136 1461910 1029713 1001521 1291712 1490176 1445911 1332685 1269259 1104733 653028
31252 653028 41894 -321589 -188259 244627 614964 882255 1307754 1930188 2320391 2041036
31242 2041036 1233378 559391 558924 1153909 1788706 1993456 1761921 1374138 964342 487939
31232 487939 142381 444450 1536646 2645307 2746017 1765669 637559 94768 -45741
31223 -45741 -203073 -258807 56784 464010 463222 154375 97231 409554 609256 440630 312492
31212 312492 694059 1480702 2201915 2544254 2435688 1894459 1076275 304114 -165340 -272797
31202 -272797 49872 921210 2092280 2784100 2394372 1289613 476404 455912 779998
31193 779998 818648 550017 343849 291928 136242 -271865 -793538 -1248272 -1530601 -1478019
31183 -1478019 -939672 -68313 713606 1137567 1237404 1023008 407222 -309718 -334596 699859
31173 699859 1930059 2033362 865819 -270701 -250005 490818 604851 -437129 -1771615
31164 -1771615 -2234553 -1630996 -813165 -687846 -1254377 -1635121 -1112012 -58817 431610
31155 431610 -103945 -919552 -1070599 -590342 -191134 -102921 108219 597120 826701 356050
31145 356050 -487551 -1072629 -1205714 -1053086 -698011 -254306 -137624 -603387 -1088821 -688294
31135 -688294 529680 1284138 594612 -859626 -1446518 -495244 1032308 1776723 1356410
31126 1356410 372935 -428579 -653125 -281294 354710 787253 925034 1133745 1492756
31117 1492756 1352971 248883 -1004746 -984485 489127 1985420 2241529 1565392 1024241
31108 1024241 930610 809786 406207 -31876 -276681 -319177 -162064 101226 152567 -164055
31098 -164055 -516013 -569506 -532697 -726139 -935615 -795257 -513331 -528902 -711456 -640527
31088 -640527 -398899 -243514 194078 1293625 2236730 1735484 63414 -1009278 -641239
31079 -641239 79887 76085 -186962 89281 601462 771305 877468 1200486 1084401 170528
31069 170528 -405726 389637 1493418 1137484 -279731 -686465 438577 1369100 929585
31060 929585 38418 -195371 -159899 -568489 -1059653 -1090653 -1080981 -1515111 -1829955 -1333124
31050 -1333124 -457338 20254 315913 1017993 1722292 1593679 929015 819516 1365989
31041 1365989 1538674 950788 539269 1050532 1847840 1862074 1091014 523462 896698 1983816
31031 1983816 2926887 2986956 2126507 1062714 633565 998045 1552526 1626137 1090102 315844
31021 315844 -226447 -282465 89031 652232 1229826 1699428 1792856 1275411 504119 349218
31011 349218 1127300 1964353 1769594 607443 -475889 -790677 -508988 25577 694354
31002 694354 1228048 1202962 687825 306001 399777 675038 886218 1229271 1713386 1808747
30992 1808747 1262609 731515 944504 1603760 1811084 1363750 902398 818770 722643 157109
30982 157109 -715688 -1413219 -1732630 -1788910 -1741908 -1743597 -1929692 -2184533 -2066878 -1259904
30972 -1259904 -23744 1065638 1768404 2239038 2433064 1953489 811299 -73455 238408
30963 238408 1396097 2012157 1400692 427856 252846 826794 1286102 1385172 1632669 2102127
30953 2102127 2069531 1146121 47937 -250949 319955 1073043 1533457 1777767 1988006
30944 1988006 2149702 2213799 2231821 2220439 2035658 1482292 573399 -318627 -691079 -431893
30934 -431893 8484 180710 213745 482004 850211 800169 340353 179974 762722 1653190
30924 1653190 2201596 2339607 2313071 2051934 1347120 438860 -68277 158279 897849 1608995
30914 1608995 1747162 1105330 132300 -308397 191120 1111461 1618971 1415340 786588
30905 786588 169051 -46558 303009 754550 411241 -926178 -2155336 -2023226 -667087
30896 -667087 607437 911592 491383 -9496 -275795 -260546 -45879 85663 -79542 -287474
30886 -287474 -145327 201931 304684 270178 644001 1329141 1469598 772393 164917 548336
30876 548336 1492988 1883913 1468261 976896 870789 774268 294000 -272587 -431298 -271871
30866 -271871 -262702 -440649 -351098 109156 320203 -187519 -860100 -769157 -19067 300488
30856 300488 -207571 -446225 675979 2532176 3406258 2601896 1148655 446584 865147
30847 865147 1729747 2144197 1730898 932569 566938 820932 969130 480426 -80221 50766
30837 50766 510460 365911 -310387 -586660 -290155 -190284 -415931 -26307 1375450 2781195
30827 2781195 3145240 2626772 1895497 1194809 734180 1000533 1880916 2354649 1860449
30818 1860449 1138572 953869 939677 622967 569164 1299720 1955533 1448135 283965 -241639
30808 -241639 -174170 -635579 -1691730 -2123919 -1391547 -333801 312698 751977 1177320
30799 1177320 1234601 858823 572715 553315 390154 101916 326039 1061418 1292305 465488
30789 465488 -593500 -903896 -657068 -624382 -936064 -1186971 -1236731 -1219162 -1124323 -914785
30779 -914785 -740023 -641080 -409037 -48990 73086 -130295 -180890 250957 812839 987669
30769 987669 684769 50355 -757320 -1322364 -1146417 -443730 -110067 -470938 -733357 -187601
30759 -187601 726170 1158333 1028299 794451 621692 501634 685295 1213848 1448740 879028
30749 879028 52838 -116364 289103 358851 -255661 -920484 -994625 -553820 -55688 209886
30739 209886 233828 157918 55082 -239509 -815561 -1159751 -531702 868489 1812132 1568260
30729 1568260 780629 280821 -73235 -556698 -538800 489704 1584349 1494890 684059
30720 684059 650447 1479403 1732414 833430 -117514 -289033 -302005 -830993 -1403251 -1404730
30710 -1404730 -1134322 -992137 -608313 311604 1116570 1120153 695548 565887 612575 313923
30700 313923 -132227 -96375 358940 512069 21306 -711412 -1090462 -785234 100918 927315
30690 927315 982924 450021 326698 894521 1041695 -58744 -1347842 -1153669 373834
30681 373834 1421185 979147 -142270 -858925 -1086916 -1103058 -796105 -191803 142845
30672 142845 -103813 -431280 -362951 -236095 -512894 -831333 -496517 398631 1068062 1104275
30662 1104275 839625 700253 730011 752078 574434 59424 -618242 -853357 -222917 764324
30652 764324 1019964 131148 -1127155 -1719158 -1445614 -893476 -598815 -574731 -508712 -143791
30642 -143791 472607 940734 823510 202994 -214082 189022 1193212 1986026 2104792
30633 2104792 1824515 1594757 1469049 1269398 1006871 841601 775048 663854 495827 430136
30623 430136 544518 677871 560230 86280 -483394 -636454 -134665 552297 653301 68305
30613 68305 -442283 -307247 42002 -108608 -585915 -599966 -46787 289656 -18878 -389801
30603 -389801 -188798 326827 547479 462994 444341 451058 162282 -292780 -439791 -252526
30593 -252526 -167823 -243365 11560 723486 1218949 961078 453436 612012 1461445 2068201
30583 2068201 1758205 846808 23951 -465637 -696614 -525879 262301 1355675 1991023
30574 1991023 1823519 1387219 1426974 1957699 2267789 1812888 881974 310402 606813 1402680
30564 1402680 1800172 1326577 470604 88202 336704 541248 197394 -312452 -276561 424684
30554 424684 1329817 2035562 2355465 2059088 1049767 -193633 -877883 -739263 -287299
30545 -287299 -149212 -487118 -1055942 -1459108 -1326130 -623327 170764 551227 620277 831557
30535 831557 1192209 1286229 1082660 1041461 1271998 1279516 822991 362318 277674 269046 10828
30524 10828 -149701 273111 1071450 1615654 1679046 1503074 1285291 1046568 805329 533387
30514 533387 169972 -63171 267886 1114081 1746944 1621179 988854 305471 -385768 -994504
30504 -994504 -990316 -195458 607601 694004 507204 817788 1266218 918418 809 -236999
30494 -236999 547342 1250750 1033419 457540 414702 824773 1031709 858513 662443 725640
30484 725640 1018390 1293825 1220879 766448 501402 1024363 2025203 2545784 2283555 1912711
30474 1912711 1895663 1789872 1171352 501841 446323 849438 1038061 809629 553026 605375
30464 605375 942214 1336204 1492669 1230873 795132 730341 1199571 1712409 1773820 1480237
30454 1480237 1199708 990950 674842 244637 -99267 -187659 -12019 215063 138623 -271871
30444 -271871 -381473 473963 1955790 2900567 2674233 1786965 1024641 614058 446779
30435 446779 425403 289066 -235171 -832117 -883308 -600060 -931654 -1930857 -2312287 -1376552
30425 -1376552 -306265 -487981 -1402415 -1443646 -276644 909233 1194395 783668 225836
30416 225836 -137913 -17247 581113 1025065 820026 502150 873333 1632002 1845724 1566412
30406 1566412 1727266 2462648 2836969 2426567 1897904 1649009 1079037 -220726 -1532489
30397 -1532489 -1898478 -1234684 -131337 764912 895002 163557 -511850 36016 1520424
30388 1520424 2275765 1540880 552151 605177 1137411 840891 -180553 -691748 -295490
30379 -295490 186275 183103 90993 387101 892381 1140424 922054 350630 -206697 -300410
30369 -300410 117085 518445 500467 410009 785058 1433725 1673962 1325604 851492 610218
30359 610218 557281 614466 747039 715123 332293 -46236 111032 635401 756151 178105
30349 178105 -509625 -652801 -227821 457591 1219518 1866968 2064775 1689462 1046276 452280
30339 452280 -152974 -916679 -1606267 -1749075 -1201203 -390269 45697 -143596 -537450 -410583
30329 -410583 515197 1758039 2624323 2920774 2938322 2928924 2910476 2843513 2633330 2055189
30319 2055189 1063139 79215 -461164 -761924 -1323379 -1961016 -1818805 -553944 1075655
30310 1075655 2095267 2274064 1905956 1211121 456321 194860 706077 1400425 1411011
30301 1411011 725823 183830 315853 698538 617338 -13423 -615368 -620095 -19428 647778
30291 647778 809757 465115 228866 613171 1345694 1671310 1311189 807645 830031 1400141
30281 1400141 1932853 1847250 1038651 -45779 -677746 -402672 494132 1197896 1171344 635643
30271 635643 160733 -36699 -217302 -664860 -1267356 -1502225 -837294 642696 1986369
30262 1986369 2132129 1127589 217139 374958 1124617 1306832 671668 -13330 -279383
30253 -279383 -499370 -951513 -1168738 -673488 220157 836144 958850 791031 476008 127624
30243 127624 24802 322474 801256 1226782 1605156 1767707 1260156 188949 -401097
30234 -401097 215572 1253315 1396275 655038 235461 748282 1640841 2339339 2761895
30225 2761895 2606311 1436650 -160055 -791873 -223447 96801 -774146 -1762186 -1490712
30216 -1490712 -442233 -83845 -587902 -875165 -515843 -160134 -205561 -326450 -350509 -453449
30206 -453449 -426806 146829 914437 1069646 766218 1000563 1815082 1928445 738520 -522867
30196 -522867 -498894 413765 918440 805870 925671 1570516 2050356 1867942 1396594 1194754
30186 1194754 1272295 1257020 910407 347313 -37667 104048 619326 867675 434617 -361290
30176 -361290 -930145 -1088159 -906352 -229902 1040422 2333440 2747788 2106704 1157248
30167 1157248 594618 371641 160059 7176 154883 489976 603750 372779 193736
30158 193736 532683 1322125 1904045 1662775 739799 -19125 43773 697856 1216272 1307517
30148 1307517 1290265 1386090 1334940 936593 565911 728186 1283839 1545212 1119940 281093
30138 281093 -538039 -1211619 -1708304 -1794315 -1318190 -600184 -154306 -95914 -174566 -326382
30128 -326382 -749073 -1376668 -1761612 -1684315 -1453231 -1322781 -1035233 -334033 441368 778809
30118 778809 740282 743375 820097 712314 546857 686456 925017 624474 -179731 -592251
30108 -592251 -119590 581499 676354 246392 -163309 -541455 -1206729 -1922431 -2008201 -1308686
30098 -1308686 -439313 -10094 -61382 -291927 -412459 -216316 307047 817308 874841 442755
30088 442755 -77448 -346774 -407674 -456175 -480932 -229917 469130 1322327 1608247 911531
30078 911531 -155230 -416267 469598 1556545 1889413 1682371 1675007 1857314 1665048 1092174
30068 1092174 628864 242531 -497607 -1226395 -924932 328197 917556 -189357 -1791151
30059 -1791151 -1968982 -671619 372068 71979 -870892 -1322214 -1134807 -789574 -474509
30050 -474509 -169995 -119224 -518987 -999499 -1035486 -757120 -747269 -1021669 -852893 133355
30040 133355 1234074 1517645 1051561 690004 778018 744941 114958 -716462 -1082669 -942169
30030 -942169 -705725 -532462 -350092 -310900 -568147 -700677 -75995 1109173 1813668 1433724
30020 1433724 550272 85812 211952 474508 561297 473975 254005 5244 -48971 55522
30010 55522 -127406 -751717 -1143673 -624339 340016 624597 95229 -132840 590246 1337051
30000 1337051 896443 -410184 -1121041 -631042 159551 343249 251731 657199 1370644
29991 1370644 1491689 873792 469466 993647 1931868 2326179 2044959 1670115 1440742
29982 1440742 1053554 468662 154993 315124 513574 440816 482868 1022449 1626832 1575020
29972 1575020 915386 307003 -50374 -575606 -1360928 -1843026 -1687314 -1327957 -1203133
29963 -1203133 -1009114 -273624 722927 1235233 1056441 616597 177484 -412720 -1082326
29954 -1082326 -1300693 -796011 -57790 253198 89871 -157460 -359366 -693835 -1092098
29945 -1092098 -1143648 -681223 -91367 175377 170630 301723 770994 1382255 1815908 1881050
29935 1881050 1539069 906279 273959 -52456 -19699 155342 248165 188728 -23221 -345894
29925 -345894 -556832 -318158 428231 1282728 1797184 1913121 1786928 1413804 827805 519110
29915 519110 1045160 2110195 2635085 2084638 1215383 1015440 1333912 1234447 448041 -327259
29905 -327259 -550040 -445076 -317812 -57533 299839 247816 -373609 -825804 -440475 302036
29895 302036 458780 75633 31918 529801 732125 119530 -682908 -875443 -577852 -403298
29885 -403298 -464818 -430787 -253617 -235587 -483194 -757157 -818769 -617202 -240138 64688
29875 64688 5802 -320538 -328155 382817 1439298 2144555 2302468 2175343 1850521 1222161
29865 1222161 509940 164677 174607 28075 -476539 -910361 -922319 -748035 -671660 -447624
29855 -447624 237183 1009424 1096562 348397 -476535 -538920 273191 1440395 2401021 2859557
29845 2859557 2755930 2252533 1732410 1557025 1734504 1962599 2036497 2018348 1924346 1539077
29835 1539077 809855 177517 92882 342090 360236 154748 272302 746980 839319 193709
29825 193709 -463716 -383805 47254 -26708 -555128 -763104 -468930 -288541 -559794 -923871
29815 -923871 -1055195 -1031248 -878848 -510712 -217547 -426773 -831624 -625226 179082 608116
29805 608116 268303 10602 463075 884681 364999 -603266 -794197 -11401 833541 1109251
29795 1109251 976607 704317 415510 467221 1190897 2156767 2449097 1816396 919661 343450
29785 343450 -4106 -372458 -682100 -801677 -817826 -790432 -628352 -385144 -321170 -529696
29775 -529696 -823180 -1066562 -1274414 -1334500 -1052356 -572651 -342745 -499946 -659018 -486346
29765 -486346 -174356 -152143 -533931 -977393 -949207 -162826 1029903 1780205 1591314 935517
29755 935517 654497 858135 913811 496220 61339 120790 536542 784875 603027 196239
29745 196239 17740 363983 953063 1033538 274150 -650328 -869593 -499199 -334613 -546960
29735 -546960 -565561 -230120 -43741 -112263 94064 573985 511906 -274243 -717975 -140343
29725 -140343 549474 334287 -163495 269257 1321130 1609470 934777 521060 952689
29716 952689 1345918 955028 330726 262694 545709 490783 -22548 -600628 -887221 -578398
29706 -578398 542218 2055657 2893863 2432319 1242360 325444 6079 3441 90419 90026
29696 90026 -339044 -1178847 -1592836 -779037 797728 1762420 1465083 591879 36739 -136431
29686 -136431 -308077 -509356 -537493 -505779 -734868 -1220871 -1638387 -1816934 -1834776 -1649519
29676 -1649519 -1043008 -79809 705575 861684 629134 729084 1522998 2548023 2961265
29667 2961265 2388063 1290786 513142 466273 778127 785278 329852 -85179 19134 465845
29657 465845 671281 388119 -77141 -344376 -344853 -167740 174069 655571 1124410 1449445
29647 1449445 1642098 1710832 1581705 1314264 1189611 1362216 1584101 1522572 1237074 1082669
29637 1082669 1204175 1364386 1247449 751849 46980 -480470 -441847 155624 803718 1017414
29627 1017414 856491 646829 339709 -380561 -1339126 -1760686 -1191762 -163400 427863
29618 427863 394030 343776 772812 1424745 1660880 1245058 576950 191232 174747 155152
29608 155152 -203693 -834875 -1408478 -1669270 -1536713 -1048899 -429927 -119389 -438653 -1146001
29598 -1146001 -1509932 -965460 317754 1534124 1912618 1393853 710623 677284 1317329
29589 1317329 1869527 1764927 1302679 1085255 1098154 847885 265025 -122118 21506 392363
29579 392363 543126 360963 -123749 -907861 -1671776 -1692761 -582728 1056001 2088059
29570 2088059 1904648 840612 -286047 -817510 -634278 -204779 -181607 -715798 -1248314
29561 -1248314 -1164498 -525231 76904 276261 286790 521352 1062687 1547384 1513793 917800
29551 917800 309233 318565 915577 1420228 1356664 993698 826884 840700 652216 201121
29541 201121 -131106 -103294 -5596 -349792 -1267083 -2265741 -2634207 -2176419 -1439688 -980530
29531 -980530 -583228 294057 1396952 1782830 1232290 652966 594453 314242 -812127
29522 -812127 -1799152 -1244244 453468 1481994 1108554 355604 44725 -330911 -1212801
29513 -1212801 -1814597 -1319107 -298117 98584 -246668 -586489 -628287 -721440 -960242 -969510
29503 -969510 -554684 54534 561778 748984 432237 -273028 -824799 -787231 -256467 535650
29493 535650 1561709 2509462 2593627 1600331 595279 696429 1523427 1797019 1136482
29484 1136482 239047 -423421 -902558 -947498 -208592 691244 657095 -73963 -21210 1224258
29474 1224258 2194032 1744931 729936 539491 1152377 1728353 2111779 2500451 2454142
29465 2454142 1584247 624325 470293 637305 57554 -957449 -1067468 -110255 560297
29456 560297 134572 -618936 -756905 -421304 -218269 -309459 -599182 -1013229 -1185532 -611524
29446 -611524 539848 1454557 1736716 1709752 1556094 1101186 619426 737855 1210073 994294
29436 994294 41528 -304285 580949 1459462 1259315 911188 1674332 2696836 2115139
29427 2115139 55963 -1387670 -1141760 -337109 -209108 -419886 -127219 550881 995645
29418 995645 1153989 1323235 1408889 1098598 491672 74599 211307 831334 1404799 1259733
29408 1259733 338020 -447176 -203706 640220 802902 -399 -583571 349 1171502
29399 1171502 1823734 1851277 1908007 2173164 2214142 1842980 1347814 929513 534240 262254
29389 262254 379525 781000 884274 312815 -549698 -932771 -526879 243289 804253 1056181
29379 1056181 1203285 1171764 697126 32280 -82259 488973 856613 388314 -197233 94375
29369 94375 852546 830243 -30918 -496585 -74352 235073 -327350 -1067306 -1051324 -448259
29359 -448259 122018 611891 1079075 1103865 605960 427097 1105311 1817358 1584799 794594
29349 794594 357023 71111 -778000 -1729237 -1608106 -441732 591416 1026127 1410301
29340 1410301 1730475 1195494 -41875 -517609 502027 1891851 2341248 2048695 1911681
29331 1911681 1978472 1661996 861884 30195 -470871 -508657 -132810 198130 -79949 -750458
29321 -750458 -960291 -609465 -630181 -1305029 -1430042 -131247 1489302 1829746 1184386
29312 1184386 1162605 2111490 2735629 2304129 1671710 1682274 1899409 1634635 1197845 1240550
29302 1240550 1546141 1389766 726707 181138 8583 -156802 -478760 -560416 -208166 14723
29292 14723 -434275 -1027108 -650130 724163 1612880 853504 -685767 -1125893 -73223
29283 -73223 1001676 998658 571935 693616 999001 654405 64976 326233 1292714 1608431
29273 1608431 773792 -71547 169306 1099071 1601925 1284371 531128 -295320 -1071290
29264 -1071290 -1671208 -2041662 -2327257 -2585751 -2598634 -2231881 -1730742 -1397294 -1203013 -920628
29254 -920628 -407975 345700 1124759 1374968 705715 -300730 -406704 727640 1868171
29245 1868171 1675456 412686 -514951 -422163 75021 260735 240408 422428 769224 997840
29235 997840 1086693 1120458 921667 366465 -40188 474277 1774941 2529344 1691777 66308
29225 66308 -436265 680042 1607106 598618 -1489485 -2255777 -1088779 71593 -362545
29216 -362545 -1509136 -1742579 -1215074 -1171646 -1592832 -1324803 -329033 21714 -791373 -1499776
29206 -1499776 -1066611 -249425 -170977 -456949 -40523 921270 1297888 827644 410373 541023
29196 541023 602891 23852 -774635 -1055378 -777219 -453616 -395120 -518454 -686488 -893741
29186 -893741 -1178367 -1510689 -1736693 -1657463 -1295797 -977108 -902204 -769898 -187469 634188
29176 634188 1048297 815062 275261 -338680 -1133496 -1895242 -1877772 -751731 678290
29167 678290 1266663 808352 74421 -223396 -40299 273125 356228 -24236 -802300 -1512138
29157 -1512138 -1628250 -1041062 -55899 945582 1649299 1845944 1649219 1491073 1559130
29148 1559130 1462700 877526 259070 307825 874276 1121974 801671 587150 928061 1329569
29138 1329569 1199292 769635 607569 690243 622854 462408 619997 1040734 1129999 587914
29128 587914 -167154 -546804 -396064 90135 729506 1410271 1958794 2163238 1939933 1437440
29118 1437440 966443 761166 770006 774874 746517 889187 1219008 1330671 827711 -150087
29108 -150087 -1054376 -1459331 -1263132 -563739 337946 962400 1088668 1116808 1577429 2281273
29098 2281273 2434057 1723847 811432 453008 547284 496751 255085 436498 1336915 2336032
29088 2336032 2555948 1862990 901250 240506 -155973 -555453 -900361 -915615 -598251 -245209
29078 -245209 -10429 216132 408955 251720 -390779 -1114771 -1372087 -1044099 -369555 496581
29068 496581 1508688 2436216 2923190 2859475 2450285 1967092 1656530 1734742 2093035 2122995
29058 2122995 1334733 179295 -263518 417217 1448857 1906117 1819727 1890290 2426063
29049 2426063 3011731 3087067 2472721 1373804 161295 -845821 -1550063 -1980587 -1969149
29040 -1969149 -1184706 275895 1604129 1987604 1488050 846899 523200 358163 153723
29031 153723 58031 212352 439474 530399 537346 567477 581800 624327 928722 1491257 1833790
29020 1833790 1570916 967140 510876 187111 -279340 -664096 -472069 69441 87492 -575863
29010 -575863 -859172 147276 1954694 3387530 3933128 3640178 2299113 -125631 -2494695
29001 -2494695 -3220193 -2218397 -1065673 -862061 -982699 -494268 218534 153324 -659451
28992 -659451 -1197827 -822198 193132 1252529 1848827 1621131 718591 -59739 -119642
28983 -119642 143425 22886 -372176 -446328 -250541 -312751 -513758 -226068 412175 515164
28973 515164 -36148 -250306 367743 977043 845688 652091 1409910 2770611 3413931
28964 3413931 2802340 1671914 928647 785945 950740 1072428 954617 667081 411858
28955 411858 121887 -502094 -1319963 -1591436 -943017 -72693 97043 -344073 -536320 -108896
28945 -108896 464810 670775 478437 55424 -476351 -909138 -1012972 -822494 -548368 -225650
28935 -225650 212954 575415 527346 96246 -285907 -301716 -56997 159023 237485 366921
28925 366921 838163 1594201 2005831 1501498 507563 164791 802750 1364297 876490 -182579
28915 -182579 -744409 -750047 -869789 -1076965 -749013 -56116 64376 -482840 -595256 317328
28905 317328 1336912 1409811 864233 766971 1335639 1799565 1574293 913886 459763 565616
28895 565616 1066126 1513177 1659621 1674061 1722691 1574555 1070658 740265 1200893 2005076
28885 2005076 1987283 923914 -83776 -215402 35494 -34213 -128539 358918 1159106 1528321
28875 1528321 1378209 1190324 1155290 1139289 1189994 1371519 1400610 1119872 983498 1352103
28865 1352103 1690419 1326939 697739 840122 1782885 2463878 2295103 1825246 1644386
28856 1644386 1540522 1103162 424355 -208186 -740944 -1116442 -1093436 -627722 -32174 459958
28846 459958 877513 1127291 965474 560913 524095 1076638 1702100 1918476 1846121 1640635
28836 1640635 971189 -337777 -1585629 -1832767 -1097452 -312306 -125033 -247752 -50083
28827 -50083 601815 1240790 1341813 896020 477218 628095 1150164 1271832 654664 -108428
28817 -108428 -258796 200111 699638 913604 887116 594470 -34397 -701957 -933989 -745802
28807 -745802 -605865 -648522 -477593 49535 427957 301761 183694 796479 1925025 2533161
28797 2533161 2026789 895527 -17835 -449230 -676980 -880739 -905010 -596979 -101866
28788 -101866 273183 399247 437389 569127 663997 398321 -186664 -477527 35446 1000119
28778 1000119 1580394 1611267 1807599 2575459 3208980 2821599 1679473 903621 987762 1300175
28768 1300175 1080304 301162 -569555 -1080286 -901963 1592 1061118 1471066 1134908
$$ [...]
##END NTUPLES=NMR SPECTRUM
##END=
