##TITLE=31Pdec_LY-TMF-7.70.3
 D2O, 24 sc
 2.3.2020
##JCAMPDX= 6.0         $$ Bruker NMR JCAMP-DX V2.0
##DATA TYPE= NMR SPECTRUM
##DATA CLASS= NTUPLES
##ORIGIN= UXNMR, Bruker Analytische Messtechnik GmbH
##OWNER= root
$$ XWIN-NMR		Version 3.5
$$ Mon Mar  2 16:04:31 2020 Russian Standard Time (UT+4h)  she@DPX200
##.OBSERVE FREQUENCY= 81.013821
##.OBSERVE NUCLEUS= ^31P
##.ACQUISITION MODE= SIMULTANEOUS
##.ACQUISITION SCHEME= undefined
##.AVERAGES= 24
##.DIGITISER RES= 17
##SPECTROMETER/DATA SYSTEM= spect
##.PULSE SEQUENCE= zgpg30
##.SOLVENT NAME= D2O
##.SHIFT REFERENCE= (INTERNAL, D2O, 0, 182.463)
##AUDIT TRAIL= $$ (NUMBER, WHEN, WHO, WHERE, WHAT)
$$ ##TITLE= Audit trail, XWIN-NMR		Version 3.5
$$ ##JCAMPDX= 5.01
$$ ##ORIGIN= Bruker BioSpin GmbH
$$ ##OWNER= she
$$ F:/spectra/data/she/nmr/P31/1/pdata/1/auditp.txt
$$ ##AUDIT TRAIL=  $$ (NUMBER, WHEN, WHO, WHERE, WHAT)
(   1,<2020-03-02 16:03:03.53 +0400>,<she>,<DPX200>,
      <created by zg, POWCHK disabled, PULCHK disabled
       configuration hash MD5:
       00 E9 B6 7A A2 85 ED C7 34 08 36 98 17 FE 4E 26
       data hash MD5: 32K
       4F EF CA 99 C5 9D 1C D8 BB 40 94 1F B6 1C 4D 76>)
(   2,<2020-03-02 16:03:05.87 +0400>,<she>,<DPX200>,
      <Start of raw data processing
       efp BC_mod = 2 LB = 1 FT_mod = 6 PKNL = 1 PHC0 = -1171.617 PHC1 = -244.5984 SI = 64K 
       data hash MD5: 64K
       81 56 E6 C9 56 41 E5 49 97 E4 1E 91 71 F4 F1 81>)
(   3,<2020-03-02 16:03:38.15 +0400>,<she>,<DPX200>,
      <pk PHC0 = -289.4475 PHC1 = 604.2001 
       data hash MD5: 64K
       03 ED 64 1B 85 1F 63 68 57 66 49 26 8B 03 E2 2B>)
(   4,<2020-03-02 16:03:41.25 +0400>,<she>,<DPX200>,
      <abs ABSG = 5 
       data hash MD5: 64K
       94 6C 4A 66 7B 82 68 01 0C 0B 3A B1 28 B0 53 56>)
(   5,<2020-03-02 16:03:58.51 +0400>,<she>,<DPX200>,
      <pk PHC0 = -3.400968 PHC1 = 0 
       data hash MD5: 64K
       8A 27 B5 C9 82 D3 E2 2B EF FC 6F AC 26 A0 1A 79>)
$$ ##END=
$$ 
$$ hash MD5
$$ CE 1A A1 DA 74 E9 BB 7F 14 A6 D0 A5 EA 24 C6 37
##$RELAX= 
##$RELAX= 
##$RELAX= 
##$RELAX= 
##$RELAX= 
##$RELAX= 
##$RELAX= 
##$RELAX= 
$$ Bruker specific parameters
$$ --------------------------
##$DU= <F:/spectra>
##$EXPNO= 1
##$NAME= <P31>
##$PROCNO= 1
##$TYPE= <nmr>
##$USER= <she>
##$AMP= (0..31)
100 100 100 100 100 100 100 100 100 100 100 100 100 100 100 100 100 100 
100 100 100 100 100 100 100 100 100 100 100 100 100 100 
##$AQSEQ= 0
##$AQ_mod= 1
##$AUNM= <au_zg>
##$AUTOPOS= <>
##$BF1= 81.014009
##$BF2= 200.13
##$BF3= 200.13
##$BF4= 200.13
##$BF5= 200.13
##$BF6= 200.13
##$BF7= 200.13
##$BF8= 200.13
##$BYTORDA= 1
##$CFDGTYP= 0
##$CFRGTYP= 5
##$CHEMSTR= <none>
##$CNST= (0..31)
1 1 145 1 1 1 1 1 1 1 1 1 1 1 1 1 1 1 1 1 1 1 1 1 1 1 1 1 1 1 1 1 
##$CPDPRG= <waltz16>
##$CPDPRG1= <>
##$CPDPRG2= <waltz16>
##$CPDPRG3= <>
##$CPDPRG4= <mlev>
##$CPDPRG5= <mlev>
##$CPDPRG6= <mlev>
##$CPDPRG7= <mlev>
##$CPDPRG8= <mlev>
##$CPDPRGB= <>
##$CPDPRGT= <>
##$D= (0..31)
0 1 0 0 0 0 0 0 0 0 0 0.03 2e-05 3e-06 0 0 0 0 0 0 0 0 0 0 0 0 0 0 0 0 
$$ [...]
##$SUBNAM3= <"">
##$SUBNAM4= <"">
##$SUBNAM5= <"">
##$SUBNAM6= <"">
##$SUBNAM7= <"">
##$SUBNAM8= <"">
##$SUBNAM9= <"">
##$SW= 369.568048894756
##$SWIBOX= (0..15)
0 1 3 0 0 0 0 0 0 0 0 0 0 0 0 0 
##$SW_h= 29940.119760479
##$TD= 32768
##$TD0= 1
##$TE= 0
##$TE2= 300
##$TE3= 300
##$TEG= 300
##$TL= (0..7)
0 120 53 12 22 120 120 120 
##$TP= (0..7)
150 150 150 150 150 150 150 150 
##$TP07= 0
##$TPNAME0= <>
##$TPNAME1= <>
##$TPNAME2= <>
##$TPNAME3= <>
##$TPNAME4= <>
##$TPNAME5= <>
##$TPNAME6= <>
##$TPNAME7= <>
##$TPOAL= (0..7)
0.5 0.5 0.5 0.5 0.5 0.5 0.5 0.5 
##$TPOFFS= (0..7)
0 0 0 0 0 0 0 0 
##$TUNHIN= 0
##$TUNHOUT= 0
##$TUNXOUT= 0
##$USERA1= <user>
##$USERA2= <user>
##$USERA3= <user>
##$USERA4= <user>
##$USERA5= <user>
##$V9= 5
##$VALIST= <valist>
##$VCLIST= <CCCCCCCCCCCCCCC>
##$VD= 0
##$VDLIST= <DDDDDDDDDDDDDDD>
##$VPLIST= <PPPPPPPPPPPPPPP>
##$VTLIST= <TTTTTTTTTTTTTTT>
##$WBST= 1024
##$WBSW= 4
##$XGAIN= (0..3)
0 0 0 0 
##$XL= 0
##$YL= 0
##$YMAX_a= 11637
##$YMIN_a= -10804
##$ZGOPTNS= <>
##$ZL1= 120
##$ZL2= 120
##$ZL3= 120
##$ZL4= 120
##$ABSF1= 182.463
##$ABSF2= -187.1042
##$ABSG= 5
##$ABSL= 3
##$ALPHA= 0
##$AQORDER= 0
##$ASSFAC= 0
##$ASSFACI= 0
##$ASSFACX= 0
##$ASSWID= 0
##$AUNMP= <proc_1d>
##$AZFE= 0.1
##$AZFW= 0.5
##$BCFW= 0
##$BC_mod= 2
##$BYTORDP= 0
##$COROFFS= 0
##$CY= -3
##$DATMOD= 1
##$DC= 0
##$DFILT= <>
##$DTYPP= 0
##$F1P= 0
##$F2P= 0
##$FCOR= 1
##$FTSIZE= 65536
##$FT_mod= 6
##$GAMMA= 0
##$GB= 0
##$INTBC= 1
##$INTSCL= 5.30512e-09
##$ISEN= 30
##$LB= 1
##$LEV0= 0
##$LPBIN= 0
##$MAXI= 10000
##$MC2= 0
##$MEAN= 0
##$ME_mod= 0
##$MI= 50
##$NCOEF= 0
##$NC_proc= -4
##$NLEV= 6
##$NOISF1= 182.463
##$NOISF2= 159.3651
##$NSP= 0
##$NTH_PI= 0
##$NZP= 0
##$OFFSET= 182.463
##$PC= 4
##$PHC0= -1464.465
##$PHC1= 359.6017
##$PH_mod= 1
##$PKNL= yes
##$PPARMOD= 0
##$PSCAL= 0
##$PSIGN= 0
##$REVERSE= no
##$SF= 81.0140089999434
##$SI= 65536
##$SIGF1= 159.3651
##$SIGF2= -187.1042
##$SINO= 113.3802
##$SIOLD= 16384
##$SREGLST= <1H.CDCl3>
##$SSB= 0
##$STSI= 65536
##$STSR= 0
##$SW_p= 29940.119760479
##$SYMM= 0
##$S_DEV= 0
##$TDeff= 32768
##$TDoff= 0
##$TI= <>
##$TILT= no
##$TM1= 0
##$TM2= 0
##$TOPLEV= 0
##$USERP1= <user>
##$USERP2= <user>
##$USERP3= <user>
##$USERP4= <user>
##$USERP5= <user>
##$WDW= 1
##$XDIM= 65536
##$YMAX_p= 295101743
##$YMIN_p= -7199241
$$ End of Bruker specific parameters
$$ ---------------------------------
##NTUPLES= NMR SPECTRUM
##VAR_NAME=  FREQUENCY,     SPECTRUM/REAL,   SPECTRUM/IMAG
##SYMBOL=    X,             R,               I
##VAR_TYPE=  INDEPENDENT,   DEPENDENT,       DEPENDENT
##VAR_FORM=  AFFN,          ASDF,            ASDF
##VAR_DIM=   65536,         65536,           65536
##UNITS=     HZ,            ARBITRARY UNITS, ARBITRARY UNITS
##FACTOR=    0.456856943014862, 1,           1
##FIRST=     14782.0589164792, 0,            0
##LAST=      -15158.0608439998, 0,           0
##MIN=       -15158.0608439998, -7199241,    0
##MAX=       14782.0589164792, 295101743,    0
$$ Real data points
##PAGE= N=1
##DATA TABLE= (X++(R..R)), XYDATA
$$ [...]
39295 210738 5310 -31396 268717 693642 715776 130046 -625508 -973879 -818151 -487359
39285 -487359 -278626 -279985 -497890 -895223 -1311012 -1506194 -1337831 -879743 -410851 -244989
39275 -244989 -436763 -663055 -559189 -172889 107136 67503 -144248 -380162 -702774 -1088986
39265 -1088986 -1253562 -1037291 -737597 -751543 -1044250 -1260597 -1234100 -1070098 -815440 -409018
39255 -409018 32084 236988 202133 278655 647475 952970 739247 124406 -279278 -129694
39245 -129694 263871 456940 487954 678441 972799 920494 399003 -68040 10189 409207
39235 409207 559276 374943 252781 345095 356113 114013 -144105 -212371 -205376 -210491 -75476
39224 -75476 195483 245528 -81582 -341600 -62256 544307 872126 725254 402614 151366
39214 151366 -4250 -7101 173068 265313 -45012 -566884 -752234 -441846 -49108 51944
39204 51944 -102574 -373741 -729733 -998795 -865274 -343425 121184 247635 252793 364770
39194 364770 411207 211256 1366 63096 216642 125996 -104762 -99619 159362 328211
39184 328211 274915 231913 369917 599484 825681 1040276 1109154 831756 330146 58742
39174 58742 259751 656537 852017 813007 769616 803592 760537 514174 151218 -119151
39164 -119151 -173291 -85587 -34329 -78995 -90446 29362 153530 100356 -79996 -182466 -162673
39153 -162673 -146218 -134382 32447 351515 543015 385292 -4271 -324456 -382743 -174158
39143 -174158 154167 343925 214310 -106124 -305372 -291188 -244057 -219198 -15226 400075
39133 400075 653818 431181 -52876 -325874 -224800 64351 337187 451929 279792 -74029
39123 -74029 -156693 336737 1059004 1393361 1244006 1009626 854452 556724 127505 -19623
39113 -19623 254363 486699 292912 -52223 -96572 83137 99158 -85987 -193440 -170107
39103 -170107 -225749 -382517 -417788 -269379 -119314 -31021 143676 414074 532156 356313
39093 356313 78990 -36020 66815 314399 639940 918564 975749 798928 572396 395905
39083 395905 169034 -117658 -213184 53551 440611 554170 336035 53049 -104340 -139640
39073 -139640 -18439 354743 851711 1093109 881687 493125 344684 467979 506807 221402
39063 221402 -196178 -392586 -310479 -208158 -227026 -134007 336071 973663 1208885 829834
39053 829834 339862 356015 799647 1017376 688437 235207 181499 437986 537054 379871
39043 379871 350661 694179 1142333 1299353 1142745 942463 838006 715056 448278 83006
39033 83006 -234220 -387956 -349865 -197633 -87006 -128138 -279872 -418362 -489992 -528556
39023 -528556 -550618 -529464 -462618 -364626 -196824 73382 318850 298350 -52549 -466263
39013 -466263 -590533 -360026 -38853 90278 7594 -74051 35085 301061 507302 477090
39003 477090 231285 -81429 -356771 -580875 -753602 -861588 -903773 -840059 -547492 18892
38993 18892 623725 903889 786356 576724 556224 690946 843881 1016350 1163528 1015177
38983 1015177 418480 -285048 -607595 -577638 -642422 -900380 -916550 -486868 -125061 -404997
38973 -404997 -1106689 -1469935 -1186413 -705814 -538174 -651452 -713948 -627438 -558239 -576417
38963 -576417 -524273 -262950 105554 335486 301818 110308 -50784 -120835 -187246 -317661
38953 -317661 -454964 -515341 -506094 -454520 -277322 134923 679017 1014279 874781 360894
38943 360894 -162222 -440349 -529410 -618121 -748434 -792305 -666867 -459797 -300166 -186460
38933 -186460 -22229 217410 439104 539880 496485 363172 246382 248520 347717 373957
38923 373957 231026 103916 256685 612884 773218 552453 265997 286581 496048 445989
38913 445989 -18592 -570357 -832545 -757231 -527538 -308479 -204265 -299292 -591380 -933419
38903 -933419 -1121220 -1029372 -681181 -262477 -35435 -106963 -280770 -275129 -85058 45246
38893 45246 26263 67721 315007 560404 505156 162854 -198870 -409995 -475215 -380927 -90879
38882 -90879 247003 331741 53853 -343688 -556613 -559761 -540346 -570379 -499562 -196518 214099
38871 214099 453207 411496 267421 213834 159232 -126890 -575611 -758866 -415732 131671
38861 131671 323024 53334 -228101 -132094 192170 300567 11351 -428664 -664112 -591518
38851 -591518 -398862 -312345 -356229 -407228 -451212 -613934 -847862 -816415 -364389 52768
38841 52768 -171994 -906409 -1310321 -922364 -272275 -101740 -359296 -417000 -32095 426827
38831 426827 609139 524261 249992 -204439 -629849 -652842 -236915 196772 340055 367307
38821 367307 530281 712466 670115 454545 279837 163483 10110 -98027 -9278 195859
38811 195859 293696 227082 75865 -165900 -492891 -682936 -542726 -305138 -397460 -792466
38801 -792466 -974880 -650011 -125893 169126 223906 277266 380683 412604 376902 412857
38791 412857 558011 704093 775811 810277 854138 864655 722272 346719 -138086 -394392
38781 -394392 -188457 264371 466432 219053 -155793 -266492 -106210 89991 216716 294230
38771 294230 263491 75818 -86831 32843 382050 600954 457399 97713 -184836 -270784
38761 -270784 -233091 -162466 -74271 54276 215205 348019 400612 402208 400001 311247 -19941
38750 -19941 -533143 -879572 -813480 -537824 -436926 -538068 -510889 -207749 89815 83213
38740 83213 -127710 -247557 -256225 -416240 -809331 -1094206 -876988 -247489 232575 152571
38730 152571 -246299 -353026 50203 507845 465290 -52548 -515905 -539959 -245883 3492
38720 3492 21830 -97015 -144107 13506 329883 617767 718052 619732 384030 37535
38710 37535 -356071 -606101 -547927 -262753 7487 147528 226120 305815 381268 482506
38700 482506 618725 618838 295682 -168303 -297159 52733 411464 294245 -127226 -291205
38690 -291205 -78348 34660 -267398 -614997 -468164 77808 389263 165732 -182268 -175635
38680 -175635 74425 181078 191320 466545 908166 903980 258987 -359172 -306032 136248
38670 136248 268300 66373 107909 547529 882658 797167 565734 438401 261932 5138
38660 5138 52206 538553 899566 603821 -44223 -374949 -315372 -296228 -428968 -420097 -220338
38649 -220338 -130131 -215424 -170303 135800 454068 606607 682631 671522 387328 -55405
38639 -55405 -173212 201214 587491 536107 258445 196806 300011 199086 -112250 -277553
38629 -277553 -175753 -56024 -75185 -120616 -145633 -274131 -437852 -280486 339930 1010290
38619 1010290 1189394 831546 358623 119681 113927 202834 351358 589896 885436 1144259
38609 1144259 1287691 1283912 1153676 975741 841771 764932 650425 388133 -13233 -378233
38599 -378233 -466127 -181341 271677 495822 258870 -251142 -604423 -574584 -329582 -174078
38589 -174078 -219925 -364923 -465584 -404606 -78999 501993 1114774 1464822 1461550 1252949
38579 1252949 997361 737424 510039 408498 452129 524898 544796 593312 768313 984353
38569 984353 1034149 816808 432157 86097 -51137 37295 174838 137666 -96154 -314519
38559 -314519 -336829 -204351 -34111 177354 465077 715231 742887 505510 115758 -286638
38549 -286638 -543893 -469898 -46937 407698 500882 222617 -31171 64417 411285 645605
38539 645605 509173 41571 -450439 -584247 -221071 337483 595945 373899 -25843 -190479
38529 -190479 -26490 217639 237709 -59060 -456989 -564993 -175359 459557 834103 726093
38519 726093 400469 230871 287697 409159 515593 657232 812479 835732 652750 398981
38509 398981 282295 325509 315594 70217 -278390 -399459 -202742 20611 36231 48259
38499 48259 371436 856680 1016748 708482 294514 50902 -178029 -558291 -884879 -890369
38489 -890369 -624800 -246058 264288 841573 1097193 780186 267748 108660 216301 45145
38479 45145 -492070 -871795 -794940 -589514 -575965 -571963 -345490 -84450 -3109 116056 479829
38468 479829 694960 247194 -554618 -778340 -111470 679648 780595 331587 30050 101487
38458 101487 161538 -56461 -343877 -431634 -359061 -279112 -192258 -67113 -9573 -94797 -176165
38447 -176165 -74611 150902 336962 514026 799359 1050545 964258 570160 277762 280436
38437 280436 257941 -59189 -351387 -173840 229553 143155 -539924 -1016285 -638661 144962
38427 144962 361788 -208183 -816891 -769056 -192139 335381 532903 525810 441128 228821
38417 228821 -145841 -574083 -923533 -1156383 -1283307 -1286922 -1136499 -839349 -465228 -147679
38407 -147679 -36337 -180333 -452886 -647650 -671264 -614516 -632781 -784080 -981521 -1080845
38397 -1080845 -1017566 -857108 -675240 -408051 60095 605320 815290 413988 -317667 -737787
38387 -737787 -488303 172582 668710 614370 84914 -423563 -344834 389700 1127283 1135407
38377 1135407 514364 109250 387590 840462 793651 388459 262518 538409 732269 570112
38367 570112 286011 63160 -236569 -617913 -766636 -599289 -544016 -917121 -1381978 -1432929
38357 -1432929 -1147706 -1019650 -1200567 -1344744 -1158203 -724152 -260108 133461 412479
38348 412479 517389 458407 340557 263767 281414 418732 620201 735869 684014 561019
38338 561019 469802 346410 121543 -54636 37361 370720 698849 834235 715292 297368
38328 297368 -364724 -977114 -1223295 -1122674 -942310 -780152 -508030 -119888 178636 288081
38318 288081 329358 361083 283002 136987 188931 512516 753723 549321 -9353 -539779
38308 -539779 -799733 -735750 -332694 250977 549892 199790 -525206 -942732 -791812 -500115
38298 -500115 -506315 -659308 -547020 -170601 67163 -41690 -277521 -394254 -440772 -541288
38288 -541288 -606517 -497194 -334575 -383257 -649096 -821858 -663277 -286207 10671 60017
38278 60017 -70762 -180775 -91518 210532 558127 789330 903865 936898 800271 474537
38268 474537 252199 446225 881581 1078309 967912 931630 1003647 660951 -233283 -894777
38258 -894777 -639563 23329 78777 -508797 -848532 -548696 -171058 -143244 -115241 243534
38248 243534 571069 451309 152203 167086 431817 534952 390564 192559 -32804 -309571
38238 -309571 -354640 118688 831710 1172470 986025 707846 687302 760448 573096 39379
38228 39379 -597304 -964032 -818001 -295710 133596 147743 -72241 -159627 -97704 -156337
38218 -156337 -403167 -621113 -679792 -651624 -545500 -256832 146995 385066 319011 130487
38208 130487 47583 75963 78014 -32404 -218728 -312883 -94567 441633 919791 908018 438311
38197 438311 -1251 -28138 267626 540826 575516 404725 220813 219477 404813 543970
38187 543970 437285 184699 36427 74037 232874 497906 786092 773278 244263 -439100
38177 -439100 -668105 -396128 -139531 -122931 -4380 352711 465264 15516 -466194 -283622
38167 -283622 393872 800964 688453 530501 664543 849773 809332 684231 708990 821402
38157 821402 849931 803925 743518 598841 343914 142105 96543 58159 -75606 -90100 181590
38146 181590 396991 73599 -589285 -769755 -105104 728447 880575 440362 191611 436718
38136 436718 671393 485800 178901 172462 295206 115545 -303755 -495762 -313540 -84814
38126 -84814 -52669 -89516 -26661 107704 274668 515867 750337 785694 641326 556213 558683
38115 558683 361034 -143175 -598665 -638550 -351132 -67618 63062 50769 -111350 -300318
38105 -300318 -188870 321854 778425 673568 155543 -153910 4290 271345 270802 76794
38095 76794 -40222 -33567 -62288 -217348 -409996 -470617 -319892 -86697 4298 -55107 5779
38084 5779 319342 570488 393296 -39595 -192256 93050 422244 480456 435629 536598
38074 536598 660325 538434 210904 -31304 -40923 75379 169233 195635 194277 246229 390179
38063 390179 510646 426138 172858 43294 205497 435034 410336 161977 18018 159749
38053 159749 432921 587651 533149 342331 144563 39527 18629 -36715 -204919 -400855
38043 -400855 -488427 -465244 -416321 -335472 -157216 47446 96550 -40588 -191647 -275362 -452354
38032 -452354 -810985 -1061036 -823657 -211406 177921 -22664 -469992 -567524 -241260 51326
38022 51326 42299 6962 258661 618540 681528 418735 170425 108401 52769 -142129 -341420
38011 -341420 -395284 -395362 -485731 -586638 -491312 -151635 262130 521937 490205 207156 -98062
38000 -98062 -187281 -59406 100602 232190 451387 738664 855352 729287 641654 785079
37990 785079 897832 667719 281758 157651 258877 146147 -306811 -713098 -753805 -522615
37980 -522615 -184863 247931 614930 552790 74207 -198417 201494 876194 1069260 657367
37970 657367 152320 -122256 -295458 -434602 -371916 -178157 -257007 -698280 -992653 -737928
37960 -737928 -259304 -114323 -267168 -243744 52735 219762 60696 -92520 65224 328874
37950 328874 325350 82149 -46381 98893 292861 225875 -191466 -795027 -1268660 -1285120
37940 -1285120 -719158 208726 1080452 1611341 1788664 1705891 1389075 857375 271222 -108127
37930 -108127 -147155 13813 91638 -51077 -273429 -333402 -163605 93553 311120 522057
37920 522057 774829 953874 898133 677984 580547 737412 887622 658141 59120 -439266
37910 -439266 -390873 133084 620109 672492 397130 197889 263706 395211 347668 183536
37900 183536 139239 219161 147117 -198190 -479218 -232716 527628 1229562 1321949 817168
37890 817168 199554 -76452 103031 561303 982566 1048477 651796 53043 -322968 -319695
37880 -319695 -147513 -10149 142245 341856 340373 -59390 -537681 -526743 21290 518803
37870 518803 537587 362276 490436 873237 1034604 804436 524124 510822 671430 758725
37860 758725 736360 723462 756910 778447 755002 675699 496125 195324 -145865 -385334 -406898
37849 -406898 -164395 264783 649592 761227 627024 511389 570023 657256 586295 439321
37839 439321 438772 589647 649014 441757 42390 -361310 -623989 -633845 -319360 231693 753515
37828 753515 1005144 964873 783214 594916 423967 227514 -20410 -269526 -395939 -302565
37818 -302565 -41563 204250 284303 179270 -68484 -424196 -794399 -990907 -903940 -687127
37808 -687127 -621702 -766863 -886864 -799921 -652679 -683255 -799159 -633035 -62348 550781
37798 550781 782734 642609 437426 268737 -32791 -469598 -715579 -564949 -287891 -277364
37788 -277364 -496788 -577463 -393740 -215889 -262151 -409045 -458320 -415570 -326957 -78004
37778 -78004 391386 818259 833561 396296 -193528 -645484 -824064 -628638 -37088 699458
37768 699458 1179522 1256525 1117627 926208 660056 385174 353079 605334 758658 483896
37758 483896 9769 -171143 29655 255170 250750 104716 -43814 -191997 -317241 -339932
37748 -339932 -314349 -379368 -461955 -341158 -90737 -99750 -486336 -846078 -825135 -608693 -527028
37737 -527028 -490219 -231936 112985 163106 -79663 -237878 -184503 -200526 -459220 -798587
37727 -798587 -1096617 -1407273 -1565876 -1168607 -261233 406921 276143 -207957 -211773 269757
37717 269757 457567 36041 -325924 26070 746526 970765 492961 -47723 -94958 177159
37707 177159 264226 19528 -316122 -578356 -851877 -1167661 -1286085 -954491 -294814 248487
37697 248487 394886 346231 511936 966115 1326995 1224420 756624 346353 204665 127529
37687 127529 -128306 -449921 -514257 -252858 24727 9642 -243611 -418215 -323158 -87903
37677 -87903 12874 -140964 -419412 -629747 -746411 -875780 -993080 -871226 -412735 57626
37667 57626 70382 -411960 -921003 -1041838 -823910 -542902 -311707 -128873 -102551 -334379
37657 -334379 -666506 -810777 -707414 -535514 -388673 -171976 153433 434836 513103 411163
37647 411163 285163 268130 351909 346034 32060 -509789 -836738 -615455 -80514 224134
37637 224134 109741 -124722 -188838 -103500 16490 135524 161576 -28313 -295574 -304540
37627 -304540 -52394 4085 -403433 -897977 -976425 -733442 -674547 -954618 -1215765 -1157978
37617 -1157978 -899046 -691716 -563430 -362359 4171 476369 888593 1051073 858454
37608 858454 378296 -161979 -481337 -411003 -68860 173337 70274 -167697 -141284 166229
37598 166229 392582 382100 346501 332011 50428 -463330 -562965 133644 1006347 1195912
37588 1195912 794634 565098 678971 567158 27333 -369602 -205047 190306 392099
37579 392099 484078 599647 456469 -122976 -680600 -693486 -374220 -344766 -714088 -1006967
37569 -1006967 -884452 -445284 110386 644001 929536 794728 460398 356548 542595
37560 542595 665762 557502 487566 673050 880829 773480 432034 257381 435841 731288
37550 731288 818824 671339 536785 580630 652893 488536 93655 -229348 -294192 -290644 -487879
37539 -487879 -821013 -981133 -843258 -585180 -391225 -230926 34113 450969 898065 1129432
37529 1129432 959048 517286 233078 394317 805244 1066194 1097748 1138968 1294228 1390316
37519 1390316 1292488 1058238 725749 254241 -235025 -470087 -424206 -398281 -514486 -435635
37509 -435635 110173 764741 895312 434647 -6713 91239 572084 887806 751435 359021
37499 359021 78448 66203 193070 277593 321595 447302 628668 650713 433796 252594
37489 252594 446668 973152 1428127 1498717 1244479 951787 870086 1077223 1417987 1549118
37479 1549118 1227469 614726 140904 7805 -3124 -145427 -316086 -211474 238571 765681
37469 765681 1047374 968767 644660 309139 164733 228889 324256 285935 148964 59503
37459 59503 54033 42735 -8086 -9657 93938 196525 127840 -138688 -420993 -501363 -375491
37448 -375491 -281840 -411642 -636890 -678551 -543125 -559716 -869282 -1120290 -918389 -407993
37438 -407993 -79882 -74850 -52453 200462 406029 234682 -163610 -340173 -137596 147114
37428 147114 178922 -732 -32556 322115 837737 1009716 662563 241912 285663 704155
37418 704155 923090 729514 537038 660286 780907 469464 -117313 -493903 -559561 -578979
37408 -578979 -593818 -371539 66624 360480 358271 328294 469841 593691 506123 381670
37398 381670 464679 631426 570840 280570 67828 66932 31337 -296241 -792168 -1099774 -1097700
37387 -1097700 -1015555 -1027486 -948629 -559392 -86172 9702 -276265 -445210 -280964 -199173
37377 -199173 -491931 -708752 -335137 268516 302534 -261436 -638166 -390756 88674 369487
37367 369487 533869 698045 656571 362083 188026 322163 403454 150179 -155349 -226828
37357 -226828 -291348 -544252 -606771 -151946 374244 374860 99721 240860 768120 1006477
37347 1006477 779179 611095 716359 603778 -61325 -882536 -1336705 -1412574 -1338255 -1141861
37337 -1141861 -812109 -527248 -425242 -424893 -464753 -602520 -718549 -502705 39061 419176
37327 419176 263551 -222074 -594285 -676178 -515236 -168223 226131 451859 512120 621361
37317 621361 729221 464623 -184086 -596392 -331718 188823 292398 -6920 -232963 -310471
37307 -310471 -536939 -849166 -833879 -494781 -340444 -551371 -652051 -269331 276201 452678
37297 452678 206729 -148684 -412980 -521440 -349114 127029 608642 757456 630488 565368
37287 565368 696528 843547 834208 680597 445793 182560 27416 128148 421704 668084
37277 668084 746276 733491 663895 443829 93229 -166691 -209130 -171446 -169306 -79647 158904
37266 158904 272534 27936 -289995 -204822 221084 455464 316614 212506 415797 620693
37256 620693 513522 322401 394317 591928 574002 395446 336502 347930 177669 -106374
37246 -106374 -238401 -266172 -389051 -406295 22487 596336 580346 -85514 -605415 -485175
37236 -485175 -157882 -120076 -170721 -15965 36209 -334620 -700234 -499995 -66773 -191798
37226 -191798 -833299 -1117278 -654591 -53802 84914 -3733 217956 733853 1055969 887023
37216 887023 395162 -10414 -15977 311163 502104 190664 -317375 -309367 393016 1121517
37206 1121517 1183135 652376 88667 -212729 -335329 -346692 -219104 -76253 -145704 -427702
37196 -427702 -672793 -718855 -624118 -446944 -151748 169503 213239 -202216 -818758 -1139024
37186 -1139024 -945996 -509703 -256746 -315922 -432994 -288173 157282 630172 831176 732756
37176 732756 576198 563815 601889 440330 73462 -138668 131176 737217 1178162 1136310
37166 1136310 744117 314896 3615 -184368 -219309 -46536 283816 588799 667301 461215
37156 461215 159006 81171 328799 601053 557330 305318 235107 372386 301455 -123664
37146 -123664 -418993 -137520 438854 683635 480020 249403 251427 315218 266921 217419
37136 217419 330353 587060 860657 1024475 980860 771546 609369 599211 542676 280613
37126 280613 66072 214732 508939 430252 -43157 -387986 -337185 -187217 -159589 -18684
37116 -18684 390356 729592 681756 468497 430769 436231 182215 -176272 -228980 10081 153617
37105 153617 120981 246904 643293 921626 732830 234065 -186299 -376499 -401009 -279109
37095 -279109 -8510 260630 315026 120875 -178829 -471695 -717549 -811329 -621438 -238937
37085 -238937 133 -107199 -360659 -448790 -400317 -482247 -701539 -761141 -586791 -510244
37075 -510244 -701523 -774131 -324425 387841 735906 554644 223778 26828 -68039 -18007
37065 -18007 327591 752340 722616 163542 -289493 -129538 332484 463724 147999 -251817
37055 -251817 -482440 -540884 -429689 -168674 71085 160954 204982 266397 124325 -343614
37045 -343614 -745372 -583225 25996 463419 388816 18419 -321902 -495419 -404924 20350
37035 20350 588815 938256 948533 771800 444815 -138535 -793050 -1016949 -618640 -32446
37025 -32446 235081 195426 159129 185262 89153 -129991 -209561 7830 344446 482904 282497
37014 282497 -122778 -477096 -646733 -729048 -886679 -1088089 -1119997 -891223 -602828 -524848
37004 -524848 -675751 -815775 -727721 -437121 -162689 -86361 -178947 -258282 -221195 -174825 -304254
36993 -304254 -653075 -1069782 -1314224 -1194268 -712843 -148648 145919 139958 173752 470073
36983 470073 772194 697138 291432 -75406 -272219 -493356 -801746 -982761 -946967 -914299
36973 -914299 -1026571 -1082080 -866099 -497711 -222652 -62195 104000 273113 369042 424129
36963 424129 486434 455572 234081 -43271 -147482 -52892 109975 321184 644604 969203
36953 969203 1044540 816828 507462 300014 164469 74643 162640 474284 744557 671283
36943 671283 354244 206226 391809 594142 471211 148162 21627 164108 215299 -70276
36933 -70276 -418882 -361115 172866 769465 990347 767771 377390 147128 175318 246606
36923 246606 70756 -329515 -589936 -482499 -247683 -217400 -263147 23375 649215 1131999
36913 1131999 1171376 1010635 954544 905789 664414 372878 284926 291074 82646 -298816
36903 -298816 -465199 -225893 219945 650333 1013553 1173272 849482 41622 -771951 -1133965
36893 -1133965 -1117210 -1055472 -933257 -423201 477454 1223268 1301627 818897 330302 225741
36883 225741 450834 722965 811808 626633 219491 -225690 -494301 -484790 -236041 146261
36873 146261 519441 712279 629486 350180 29559 -274727 -567734 -755632 -701277 -455455
36863 -455455 -245179 -171900 -87733 156630 500131 783746 914901 844521 562438 215210
36853 215210 38570 53992 33047 -102804 -87272 282814 771080 995568 923561 807446
36843 807446 793606 878323 1083973 1350745 1397774 1052832 602338 432226 438930 243613
36833 243613 -97833 -144617 142184 246586 -81509 -369436 -76970 688059 1397334 1703663
36823 1703663 1545677 1006336 400118 199070 501773 799200 608212 115343 -169521
36814 -169521 -171777 -212955 -358226 -325747 -72242 16893 -296980 -696485 -723734 -385825 -84577
36803 -84577 -43744 -59556 149228 530671 768061 682947 410520 158621 -40089 -243586
36793 -243586 -434599 -606870 -870479 -1235316 -1405089 -1091647 -486206 -92540 -94175 -221267
36783 -221267 -257180 -290319 -385059 -401235 -283626 -167204 -63289 158803 336116 53040
36773 53040 -618221 -925144 -389792 463384 797925 533325 228354 199910 305310 392150
36763 392150 413844 221299 -255527 -706501 -770973 -557148 -399203 -266696 70106 434990
36753 434990 394521 -50549 -496975 -811127 -1157712 -1385420 -1090551 -401648 195 -137971
36743 -137971 -295625 -86511 152423 76511 17481 398405 921763 958679 484817 58238
36733 58238 -4685 56098 -91809 -471482 -841220 -884932 -446748 191402 420930 -16001
36723 -16001 -600775 -615515 -44149 452187 411773 53096 -170296 -153361 -112203 -197242 -346348
36712 -346348 -448319 -483407 -477639 -416799 -289318 -188836 -251881 -434902 -481872 -250118 39688
36701 39688 72090 -122162 -223451 -68963 219572 518968 811106 1002098 966669 823534
36691 823534 836440 982041 972619 770916 656314 669401 495329 111048 -13012 274605
36681 274605 347524 -290764 -1086285 -1114567 -410643 120672 14851 -280261 -293669 -174143
36671 -174143 -218662 -355438 -421475 -502326 -656862 -666446 -407922 -189767 -354779 -748750
36661 -748750 -929516 -762353 -472552 -203118 117587 458075 576463 377383 157316 292457
36651 292457 760433 1148515 1152513 933861 892374 1157154 1446446 1448495 1189439 922853
36641 922853 777319 680528 566500 452269 302602 27172 -313941 -486624 -389716 -238751
36631 -238751 -283370 -454621 -491197 -342933 -199619 -121345 61572 359949 433993 60323
36621 60323 -416212 -463019 -96602 174458 137025 118921 311531 369519 12883 -435950
36611 -435950 -580774 -621794 -906417 -1127879 -726317 49305 321951 -100101 -429251 -153663
36601 -153663 245902 251440 183852 483233 756151 348443 -523653 -1023348 -864971 -503327
36591 -503327 -294931 -195648 -236358 -570238 -972028 -938499 -428763 45530 184340 205268
36581 205268 258674 124064 -274434 -580589 -536999 -367078 -339029 -364516 -333877 -433247 -754837
36570 -754837 -958487 -755985 -448568 -506272 -787148 -665570 86898 955642 1283189 933487
36560 933487 290049 -191949 -341696 -307194 -320338 -429858 -503799 -483525 -492084 -624525 -775117
36549 -775117 -783234 -647983 -510295 -518506 -757311 -1162177 -1447649 -1309223 -799508 -326492
36539 -326492 -168082 -175412 -81574 106930 204834 149243 5534 -174623 -300500 -192953
36529 -192953 189783 586299 705797 576617 421506 288926 49656 -292841 -538580 -567957
36519 -567957 -509160 -575631 -816338 -1038475 -964069 -542177 -118052 -127890 -557686 -898213
36509 -898213 -740148 -191638 424215 985057 1424819 1467678 919138 87090 -484395 -638456
36499 -638456 -609234 -494580 -165765 299357 575177 614417 782662 1238600 1548483 1244501
36489 1244501 527510 55307 125170 381177 349198 21700 -198649 -29631 351129 545860
36479 545860 449946 356779 470837 522516 132119 -549649 -930490 -749691 -401595 -330885
36469 -330885 -437630 -355202 -71389 84264 -31259 -202711 -217681 -105733 57110 330030
36459 330030 728692 1015757 887242 375258 -87381 -98168 279893 620899 648353 481876
36449 481876 320242 97559 -324699 -763003 -832694 -469159 -33353 159791 133337 -861
36439 -861 -237309 -456438 -362917 78534 446075 430991 325197 528536 829441 732926 366776
36428 366776 386672 902016 1183718 755761 192817 318608 990940 1294163 807541 101000
36418 101000 -112305 148300 338107 186610 -23669 63413 363086 465199 206376 -85439
36408 -85439 -52802 159803 128182 -169972 -294278 -37523 248736 236334 103189 97116 21388
36397 21388 -358450 -712213 -556037 -83539 75213 -138324 -156767 183709 306935 -141444
36387 -141444 -684152 -787237 -660285 -754346 -937760 -794046 -406544 -179806 -71739 315722
36377 315722 923566 1166538 789034 251095 78852 263230 496770 623447 622885 466556
36367 466556 247362 215630 442733 636462 524443 264185 221097 441106 611694 530146
36357 530146 350688 273777 194725 -124771 -597023 -785670 -463674 17746 169631 43784
36347 43784 113423 499594 765693 623136 370915 325473 251378 -169154 -638647 -611577
36337 -611577 -173593 82847 9547 77648 516570 904961 846280 526117 315239 260185
36327 260185 261600 349654 446255 214951 -462411 -1122963 -1220392 -808750 -401860 -305778 -396423
36316 -396423 -425786 -252867 131546 549516 691179 450870 115906 19182 121888 155722
36306 155722 53265 -16991 32061 101183 96596 34205 -50879 -177835 -409445 -796546 -1236409
36295 -1236409 -1391771 -982931 -245917 170956 -54572 -524785 -678724 -506041 -423916 -614713
36285 -614713 -800518 -618632 733 777038 1254386 1154571 700125 426481 523459 578037
36275 578037 179007 -451166 -718160 -397883 164188 494777 398328 17607 -306017 -318739
36265 -318739 -134695 -95290 -277632 -403048 -335156 -299705 -417675 -443556 -255499 -153600
36255 -153600 -283947 -235262 277581 767031 645999 192898 128185 484905 664902 457461
36245 457461 211753 68522 -177956 -438917 -346942 -760 71795 -180266 -232418 46354
36235 46354 138723 -151437 -310934 -90975 -61357 -639077 -1250042 -1119762 -394090 182130
36225 182130 324661 326364 394236 446852 404069 230943 -138938 -579574 -720309 -454516
36215 -454516 -196827 -268985 -379155 -152185 170830 99174 -310433 -598708 -667172 -814279
36205 -814279 -1087075 -1146882 -808469 -275713 198521 536483 710546 702594 590585 447589
36195 447589 233467 -3045 7436 403588 896253 1129239 1130965 1079696 891528 487687
36185 487687 224548 498545 1058300 1282963 1077720 907442 954538 878622 529760 289302
36175 289302 443912 707262 664898 325883 -42387 -306720 -419977 -260129 174836 583756
36165 583756 641548 373352 77012 -34668 22265 122758 164185 123598 61792 48980 81899
36154 81899 116459 142435 161795 162982 190164 324969 507053 535963 379919 270245 306196
36143 306196 229503 -131038 -467648 -429078 -203488 -197664 -334577 -230564 47222 39269 -281038
36132 -281038 -393719 -82954 208550 104178 -179418 -313881 -367514 -498256 -573156 -451857
36122 -451857 -282742 -182111 18755 363052 489870 184624 -143047 -29026 273876 159208
36112 159208 -354754 -606795 -259595 253241 379485 116822 -168294 -261729 -200282 -64127
36102 -64127 76659 102436 -56458 -271010 -322255 -191388 -108728 -224510 -348612 -210641
36092 -210641 61250 7828 -506491 -1000279 -979439 -584173 -297969 -227068 -110941 90130
36082 90130 143736 45990 20464 -14537 -371633 -871184 -869438 -279336 125880 -134805 -452546
36071 -452546 -106907 509387 450710 -319583 -894704 -773992 -434075 -431782 -632981 -615576
36061 -615576 -347777 -142401 -211965 -494453 -762517 -817399 -704515 -687636 -829786 -766926
36051 -766926 -227892 386287 418245 -105010 -468874 -262099 142736 227139 -58448 -514946
36041 -514946 -1035263 -1430084 -1352096 -778847 -252993 -255214 -573106 -646043 -318136 119196
36031 119196 434320 578313 418326 -185958 -1001534 -1503319 -1461725 -1185326 -1067447 -1117629
36021 -1117629 -1074080 -795585 -373973 36628 333675 434426 271670 -117697 -547883 -796493
36011 -796493 -787731 -644396 -543856 -557313 -654589 -794754 -928483 -973548 -917302 -908766 -1094083
36000 -1094083 -1369152 -1466779 -1298191 -1016635 -728022 -395586 -111193 -151646 -549114 -861998
35990 -861998 -676972 -169704 164536 212221 273289 423956 317841 -204924 -697578 -616768
35980 -616768 -49449 388358 293572 -160975 -573002 -741359 -689739 -494628 -238777 -17068
35970 -17068 147516 336503 583808 746593 648784 337970 76333 43980 150713 198503
35960 198503 140411 78274 59527 18232 -67419 -103627 -57594 -99630 -417726 -917407 -1263081
35949 -1263081 -1256745 -1043798 -872907 -778930 -629796 -398992 -223090 -205727 -314263 -479988
35939 -479988 -655976 -745306 -620689 -285417 98245 395247 588650 641151 451940 72840
35929 72840 -210253 -198251 -51930 -43733 -152179 -141295 41311 220058 307879 377425 410266
35918 410266 285034 85704 114183 451698 768474 750476 501993 330642 313364 286520
35908 286520 132781 -125629 -422653 -657860 -688929 -472505 -157060 65725 117695 -12686
35898 -12686 -297977 -548401 -478924 -83353 243760 162573 -202322 -502077 -605653 -554913
35888 -554913 -302749 163551 595678 743914 732951 828285 958815 880746 692460 678137
35878 678137 690397 289191 -411829 -671157 -168909 428605 366725 -175966 -456680 -241147
35868 -241147 44307 72964 -20340 -41873 -37241 -74948 -78678 -25432 -69406 -318835 -639567
35857 -639567 -791925 -670386 -356997 -31074 139323 96371 -95248 -372083 -739434 -1120715
35847 -1120715 -1251604 -940568 -412701 -154568 -349694 -669204 -724087 -530865 -358901 -270444
35837 -270444 -69520 318478 670391 761683 664080 608684 665306 718472 695164 635620 559169
35826 559169 452142 404243 544995 785421 854356 699286 586978 617101 432263 -242729
35816 -242729 -995791 -1132735 -620150 -133772 -118516 -298615 -290463 -209758 -339368 -575781
35806 -575781 -628736 -537715 -564567 -695624 -649291 -346146 -35375 58470 -49644 -236462
35796 -236462 -366061 -266311 124444 554898 638433 288004 -200902 -510246 -562077 -450132
35786 -450132 -345073 -461294 -840725 -1128381 -869456 -149592 356792 178793 -353452 -560467
35776 -560467 -281472 20416 -60842 -416614 -686225 -695506 -505590 -232481 -3635 24312
35766 24312 -192206 -460871 -557041 -544110 -682939 -975313 -1056598 -726775 -357812 -440897
35756 -440897 -838685 -906630 -408708 121101 143696 -141047 -170232 130407 320414 164041
35746 164041 -75604 -98510 56177 207454 310109 404662 510889 662321 837850 814752
35736 814752 370686 -276052 -550215 -230664 212913 241259 -57847 -212489 -102351 -54894
35726 -54894 -277816 -582835 -718118 -657576 -466500 -142095 279463 641714 813138 785012
35716 785012 566945 153087 -333251 -646971 -690156 -613994 -536318 -343913 47355 410389
35706 410389 444224 209041 59785 168052 364618 473127 533086 605744 601943 448235
35696 448235 235634 49510 -172392 -429547 -480690 -142546 322844 419726 45768 -340094
35686 -340094 -267384 206379 613478 615951 325161 138903 320766 725465 961632 862186
35676 862186 693816 776535 1015863 1050616 806833 596690 627193 730199 709616 659717
35666 659717 733200 834601 791015 654071 591335 612658 623926 620351 614564 522992 353101
35655 353101 328264 543801 681725 438488 101437 247882 900897 1455374 1508385 1297551
35645 1297551 1163833 1037853 731799 365987 162553 79022 -18879 -36788 147399 335232
35635 335232 242473 -10958 -30671 247332 450619 329111 80719 -16706 -11377 -107863 -288234
35624 -288234 -348147 -229474 -95144 -65683 -47440 115431 412512 661496 692711 490472
35614 490472 180163 -62638 -92101 141243 542517 910625 1071308 976700 676060 252996
35604 252996 -157327 -363352 -253393 57984 306460 316331 118871 -123216 -224971 -72102
35594 -72102 256966 492767 449847 272823 234127 333361 357024 325841 512438 883090 925975
35583 925975 356113 -320163 -389115 94409 413917 236732 13287 186675 508552 489634
35573 489634 186626 87260 350861 604973 523217 237169 44609 -3724 -22679 1866
35563 1866 164003 374351 412657 273328 222697 391010 492171 160884 -506596 -984024
35553 -984024 -922974 -527102 -210903 -55937 184343 595011 862611 643390 42175 -441548
35543 -441548 -450508 -143471 13573 -243469 -746615 -1118963 -1110978 -715520 -94991 507949
35533 507949 870123 922120 775968 569824 346820 145369 78979 167557 193152 -45211
35523 -45211 -375645 -420336 -138353 91573 25797 -110193 -33737 120984 33004 -271725
35513 -271725 -439671 -277328 63730 357293 483550 345360 -93478 -594887 -728384 -338721
35503 -338721 209945 412876 176712 -123156 -99865 223067 461014 310611 -90401 -300211
35493 -300211 -70086 407352 796695 998576 1077811 977527 581958 18330 -384718 -480676
35483 -480676 -433612 -446500 -581386 -842807 -1147887 -1174034 -591295 401101 1101552 1097065
35473 1097065 742377 592344 653877 566997 287411 108239 90726 -35126 -353877 -592739
35463 -592739 -605358 -636729 -880878 -1083326 -876156 -335650 56985 -64808 -634031 -1248255
35453 -1248255 -1452929 -1071924 -430329 -119189 -349485 -663677 -500079 87790 554034
35444 554034 613099 517207 552408 615180 462442 125877 -152004 -253146 -251205 -230713 -223575
35433 -223575 -282109 -452302 -673154 -811554 -799497 -672679 -507680 -387890 -375200 -422464
35423 -422464 -358067 -57962 390204 770637 942680 883121 607495 192970 -164286 -289825
35413 -289825 -250764 -289112 -494476 -679517 -652623 -495437 -448099 -564542 -606401 -326337
35403 -326337 196307 588076 582224 308127 79922 -25602 -169791 -348009 -312662 -46527
35393 -46527 38810 -293978 -592457 -282844 397433 607285 55281 -642756 -909439 -912114
35383 -912114 -1011378 -1062015 -763357 -303152 -70162 25935 351174 803440 890790 553945
35373 553945 322782 524766 842728 857714 605397 356182 200575 121400 199450 471671
35363 471671 766261 883102 780695 467815 -43629 -529873 -604188 -221586 131713 47886
35353 47886 -236839 -224007 104069 336757 315454 304661 470204 617604 572910 462503
35343 462503 423266 319870 -7625 -397955 -514912 -259619 141151 406572 430419 294917
35333 294917 174477 176218 182995 -63973 -606961 -1089416 -1111214 -717951 -324882 -152026
35323 -152026 11287 371995 706905 612877 72091 -491343 -710433 -612956 -445011 -386997
35313 -386997 -515250 -813698 -1076915 -995162 -536491 -106762 -102958 -392281 -474372 -128826
35303 -128826 336985 506016 302437 -36479 -264481 -310773 -260957 -220190 -171557 -23594
35293 -23594 144577 47860 -396997 -778619 -624685 -63188 317157 271913 155041 272535
35283 272535 414539 252831 -165157 -594180 -941941 -1138558 -956646 -332667 350088 661548
35273 661548 627654 506364 307162 -31126 -197496 187662 865720 1085957 552431 -221108
35263 -221108 -609968 -523904 -236598 21762 117770 -5780 -222143 -354340 -501390 -894231
35253 -894231 -1348364 -1315596 -696888 -154765 -274682 -777445 -957251 -610966 -103008 272452
35243 272452 524009 665149 629674 488754 414355 416124 378866 321159 343932 372438 238827
35232 238827 -12564 -182492 -233493 -255158 -175712 133113 480408 486765 152669 -97848
35222 -97848 -56671 -17072 -233100 -482307 -458407 -284469 -275090 -405117 -407385 -283692 -317941
35211 -317941 -581220 -789797 -759374 -705289 -901249 -1223830 -1268966 -877475 -350654 -89826
35201 -89826 -148962 -253483 -189929 -966 231509 578746 1054557 1352054 1085799 324247
35191 324247 -366873 -515574 -208037 118025 165709 -37608 -274165 -322648 -155622 -59252
35181 -59252 -378785 -1010633 -1360455 -1021890 -319993 74945 -73962 -465383 -797414 -1034383
35171 -1034383 -1163621 -1076398 -790565 -489690 -229058 123534 529717 644164 235735 -455595
35161 -455595 -975627 -1112608 -938383 -581425 -175391 105241 190734 221223 325879 397375
35151 397375 278602 58149 -62023 -105809 -249461 -450376 -463154 -263077 -141014 -253396
35141 -253396 -347984 -131025 284496 518568 410199 172643 115905 362640 789164 1102459
35131 1102459 1011474 484921 -129394 -354873 -27352 525804 762825 411165 -263453 -673128
35121 -673128 -485295 7200 225523 30457 -117381 155029 553516 520197 36918 -385276
35111 -385276 -483563 -547324 -806776 -959176 -635792 -47598 255470 151323 63467 303225
35101 303225 661182 775858 629054 486928 517526 653570 753833 752827 677958 604921
35091 604921 573600 513456 316455 24736 -141989 -24901 263958 444109 347457 51937
35081 51937 -221163 -300566 -201370 -107560 -175894 -336250 -351020 -100623 259656 457229 351638
35070 351638 25486 -270852 -265465 90269 485049 529753 244265 68243 289688 699259
35060 699259 976570 1145262 1347503 1395601 977658 235318 -298739 -380374 -282698 -266485
35050 -266485 -222243 -11291 204058 229106 151580 113224 10384 -270633 -521063 -461981
35040 -461981 -198748 -65568 -97946 -44472 112240 70097 -250855 -483509 -364822 -188298
35030 -188298 -368347 -759435 -821064 -415361 -18475 -15882 -159636 -7606 357872 458895
35020 458895 188790 -1514 198369 472859 363728 -51804 -320751 -276129 -156803 -154594
35010 -154594 -234730 -388483 -661395 -881998 -769278 -425767 -322540 -608576 -815252 -502456
35000 -502456 126833 538665 517560 236442 -39763 -40365 413587 1066767 1293424 881641
34990 881641 430411 514451 804157 621572 79764 -106025 177736 289440 -26907 -213026
34980 -213026 77994 306299 -95536 -781145 -1003819 -677083 -343261 -333893 -487038 -548126
34970 -548126 -399889 2227 537878 855084 727048 375348 147578 31280 -181640 -423279
34960 -423279 -454903 -337087 -359911 -531010 -545449 -287487 23298 234696 428645 592982
34950 592982 504207 112294 -271993 -391825 -399566 -557407 -772198 -713527 -320194 83322
34940 83322 214771 168299 195766 286076 183248 -152537 -343960 -66735 422266 543106
34930 543106 160047 -264298 -362542 -318803 -423860 -558577 -470251 -267362 -217746 -260445
34920 -260445 -164638 -25760 -125797 -386500 -462534 -351895 -387485 -579154 -519725 -97339
34910 -97339 232258 134653 -108925 -92888 143279 365857 577560 810447 828665 482506
34900 482506 99418 61142 197654 90651 -176455 -124116 308431 621360 530114 368887
34890 368887 502013 759908 766675 524976 338694 336712 388841 399065 403744 410196 363670
34879 363670 268127 152312 -70600 -497914 -955491 -1044023 -610799 -34462 155936 -90821
34869 -90821 -292402 -55220 419567 603309 316774 -84326 -229873 -207484 -341522 -654996
34859 -654996 -825099 -665266 -380219 -238795 -221940 -177113 -145992 -282013 -521214 -609535
34849 -609535 -468063 -282101 -170031 -2026 343186 749492 1025038 1107608 976226 574713
34839 574713 15350 -355998 -355303 -237658 -288644 -330857 -25631 479729 697814 559422
34829 559422 484979 612286 521178 -32913 -638620 -848336 -833896 -969444 -1117794 -878922
34819 -878922 -344976 -53827 -247079 -643653 -939091 -1098370 -1119213 -904392 -476633 -34647
34809 -34647 280618 459520 476717 325799 179023 236544 424423 505155 454349 440854 478448
34798 478448 428163 326849 362213 512462 565699 522179 613125 876524 1084985 1153343 1235161
34787 1235161 1337044 1239112 919480 670916 655721 712221 725727 792799 882668 780076
34777 780076 550294 591216 969397 1177963 888354 497217 521485 844716 1023661 1009307
34767 1009307 1055340 1156646 1103786 950338 937716 1035639 997716 828920 788685 923065
34757 923065 940080 592526 -51227 -702419 -1029868 -833935 -249704 322766 661214 928247
34747 928247 1267894 1465122 1284050 884495 568305 352568 148222 90934 258166 310025
34737 310025 -66152 -537599 -519435 -77435 149179 -103278 -431251 -454366 -239431 41433
34727 41433 328545 427903 86488 -491042 -684533 -246256 373865 706692 847097 1097883
34717 1097883 1409695 1488806 1201609 624176 -80845 -648414 -821634 -659685 -505812 -517708
34707 -517708 -494179 -278272 -10979 153028 234696 181662 -175810 -703984 -907404 -580664
34697 -580664 -141596 6579 60895 374532 798048 961942 933051 1030125 1170150 1001022
34687 1001022 620796 543715 860908 1008923 606773 57584 -17640 372031 676439 571597
34677 571597 277658 134964 161008 130486 -75155 -345040 -522029 -584563 -597727 -552184
34667 -552184 -354674 7069 377577 575546 586135 557918 620891 742478 764357 574111
34657 574111 240501 -42136 -152862 -135004 -58076 116630 430115 757732 896442 807371
34647 807371 644798 545537 498636 413472 214184 -109371 -447609 -622822 -603756 -576897
34637 -576897 -659176 -662991 -359249 141169 535948 766898 991631 1185308 1141642 876026
34627 876026 654822 577589 494457 383485 402154 483757 333590 -34782 -237934 -190677
34617 -190677 -307589 -733418 -925476 -477739 117503 140794 -271670 -404838 -112900 58857
34607 58857 -129295 -242698 20827 296326 149829 -262020 -504590 -509031 -525362 -635877
34597 -635877 -668190 -503947 -199679 152432 464664 591794 438849 140357 -37908 -6763
34587 -6763 78478 96904 156041 397622 714388 825403 625391 321678 195897 344724
34577 344724 677238 1014809 1134535 899382 467626 189804 144896 7714 -385127 -613032
34567 -613032 -235858 410173 552375 105591 -167726 199334 680993 581122 61565 -173936
34557 -173936 78889 368304 366792 280430 401541 646438 730628 606314 527999 686518
34547 686518 878921 681772 27363 -568913 -599653 -237921 -33654 -29198 266938 948022
34537 948022 1394605 1189154 751983 625212 653912 441273 162311 230152 456884 303913
34527 303913 -157804 -267642 228028 836473 1053747 877898 494621 -9193 -462736 -610498
34517 -610498 -472038 -328056 -241884 5533 405103 598739 460577 389517 756521 1355051
34507 1355051 1652982 1395294 786686 247975 97668 303896 495678 381635 114096
34498 114096 6284 7027 -159499 -411766 -379858 -93512 -36862 -342521 -489163 -107906
34488 -107906 407778 500923 246322 74803 26419 -169291 -437180 -355320 157955 616198
34478 616198 565997 105865 -339997 -531142 -530658 -479003 -442029 -438046 -459277 -433842 -266267
34467 -266267 17228 230578 231995 118338 75794 69065 -103318 -407359 -494652 -161751 359701
34456 359701 746153 945585 970801 655256 2507 -469849 -226847 539451 1104480 1089369
34446 1089369 730616 355927 66606 -79170 -46920 -18064 -164425 -244718 88819 607493
34436 607493 712020 356857 116084 205157 166075 -194339 -303886 243837 890182 882739
34426 882739 399814 221670 553667 856370 747860 463827 366704 466931 567143 583693
34416 583693 587543 654642 729294 628406 279874 -51156 -5545 350596 548581 367405
34406 367405 120534 123144 243841 243722 211368 333566 516895 566250 494622 358468 60802
34395 60802 -359273 -537678 -275417 40715 -65389 -448161 -568029 -278212 57776 144447
34385 144447 42025 -75769 -99696 38437 271617 346923 127955 -162672 -244542 -148422
34375 -148422 -25005 165004 422918 440689 8652 -510018 -599262 -321856 -128033 -99737
34365 -99737 19633 143446 -117465 -670627 -879337 -494049 -45760 -10914 -111420 157496
34355 157496 708298 1029155 942151 775792 864825 1180571 1429996 1333494 852180 272305
34345 272305 -6466 127336 386756 447818 294146 104853 -57401 -278714 -569275 -754641
34335 -754641 -626952 -176057 328517 512943 228568 -283955 -613986 -558800 -236304 126799
34325 126799 404996 575537 629105 544221 324416 38961 -178284 -200782 1569 353739
34315 353739 720449 919941 794189 420131 182605 405524 905065 1147056 880486 361859
34305 361859 -88432 -436031 -727903 -871022 -817159 -696560 -558363 -230765 342964 872238
34295 872238 1050583 900966 597853 208021 -176463 -341414 -253013 -182458 -267035 -257768
34285 -257768 325 198424 75749 -33044 339689 1020682 1398259 1243215 847769 490614
34275 490614 263991 327139 797128 1380910 1572634 1265610 824974 578577 570621 740483
34265 740483 965223 990266 707992 453517 639168 1144442 1453032 1351484 1108961 995002
34255 995002 986910 940160 738238 336205 -65809 -51539 477948 1004368 1015268 698145
34245 698145 568897 671427 689499 604844 605295 539082 174347 -136460 167297 861246 1126129
34234 1126129 763512 396736 362635 289401 16594 37159 588400 1077872 953984 521852
34224 521852 337788 337995 175849 -13583 145662 513876 544485 84645 -412577 -496282
34214 -496282 -202682 114137 215261 166118 171237 280576 342455 288276 286140 449208 599081
34203 599081 570700 520356 592595 534207 86424 -465189 -651136 -525114 -442217 -352688 -8779
34192 -8779 297959 25889 -626193 -856906 -453089 -16678 101816 231554 554125 724502
34182 724502 614921 618880 881501 1014173 912676 1040226 1499103 1659552 1205206 733587
34172 733587 738583 772423 298845 -308598 -375770 9282 279557 293471 269403 209001 48461
34161 48461 46419 384988 665776 400953 -211016 -520332 -253443 311267 791034 973769
34151 973769 869786 761281 945622 1268164 1284966 997024 881503 1044199 1019134 659587
34141 659587 462757 631169 610615 75829 -394715 -242831 181830 323850 339152 586205
34131 586205 822719 698392 526202 768678 1187109 1252875 1023310 907162 915323 793244
34121 793244 560059 358013 150207 38579 359396 975598 1128129 575324 157526 530767
34111 530767 1093334 1000102 507780 354999 469236 339280 115599 254917 524020 425489
34101 425489 223236 500455 1052505 1241066 1111318 1152552 1292716 1150510 951941 1158847
34091 1158847 1500526 1415073 1138908 1289138 1664115 1567765 1070460 826597 857967 654164
34081 654164 312617 438156 1002454 1383614 1468431 1695008 2084659 2214123 2053232 1907322
34071 1907322 1690234 1156370 610669 471126 446606 90928 -253946 -94238 156177 -89217
34061 -89217 -364581 17733 488042 86112 -691686 -591800 218006 466071 54465 128671
34051 128671 884504 1208840 715926 348251 621395 927930 932536 1085906 1417331 1336861
34041 1336861 939673 1012251 1500768 1505569 997704 921287 1374626 1396795 836337 664511
34031 664511 1086456 1152434 667391 644068 1353939 1778131 1557103 1602730 2133490 2036658
34021 2036658 983112 293294 777040 1475512 1494751 1390031 1753874 2049870 1834090
34012 1834090 1634349 1734481 1548153 941557 655974 796774 563197 25498 298169
34003 298169 1356601 1730571 1051737 719095 1257710 1376862 609721 408928 1423398
33994 1423398 2169629 1777113 1576024 2440701 3037189 2397836 1807269 2317670 2762191
33985 2762191 2137607 1631927 2311135 3068548 2856224 2660874 3273457 3478721 2515758
33976 2515758 1858716 2409673 2523682 1110282 -11571 691115 1703794 1492725 1382646
33967 1382646 2594084 3411385 2388099 1372026 2097363 2866698 2042615 1540870 3111105
33958 3111105 4571031 3805042 2959253 4296157 5660719 4842363 4377761 6690368 8799216
33949 8799216 7838494 7163217 10173848 13171937 12312483 12211584 18234238 25996174 29757819
33940 29757819 34951938 48380883 63171084 73392808 98368243 163422551 250084647
33933 250084647 295101743 258317418 171835588 100962581 72121665 62970219 50708365
33926 50708365 38593179 34606500 32663158 25583812 18234835 16729657 17049832 13674193
33918 13674193 9607487 9421729 10381482 8223978 5163657 5067825 6174374 5072327 3212668
33909 3212668 3484642 4395021 3221167 1413883 1674869 2772551 2121937 734211 980563
33900 980563 1911765 1238647 -185259 -96603 832945 430892 -776470 -661612 482443
33891 482443 652633 -130540 -161561 659622 944180 588415 653633 1030428 751758 122538
33881 122538 219033 753531 566100 -234205 -567403 -320350 -202274 -216836 51558 229691
33871 229691 -178535 -561121 -140301 546413 548160 119481 20101 30456 -380228 -737617
33861 -737617 -382370 186810 186227 -75209 -37183 -139455 -801676 -1181718 -527652 214737
33851 214737 -181475 -1113336 -1193685 -571059 -391581 -661937 -509712 -19221 17889 -241481
33841 -241481 -16568 495455 500272 211747 432898 894093 671837 -40635 -248787 10518
33831 10518 -168993 -749734 -803124 -321280 -293381 -876627 -1084980 -525094 9580 -30384
33821 -30384 -216045 -133939 23838 118946 305122 437772 176300 -261920 -356638 -246105
33811 -246105 -486042 -961225 -1061261 -828790 -848269 -1070329 -871835 -270217 44203 -74862
33801 -74862 -67810 214267 287593 14955 -198806 -257605 -439466 -581235 -211665 446059
33791 446059 614756 180476 -207371 -284340 -395963 -535646 -250393 354080 576391 276613
33781 276613 61129 136813 13466 -430881 -629763 -376322 -214466 -449664 -686489 -684269
33771 -684269 -776097 -1074561 -1122875 -740613 -436041 -577429 -853478 -904423 -823061 -727957
33761 -727957 -496168 -194967 -143835 -319311 -329797 -144404 -161013 -406439 -419836 -108344
33751 -108344 58784 -80485 -104249 160827 316892 178030 107489 283781 382526 279744
33741 279744 316881 571256 639200 464616 575955 1107884 1384440 955240 331095 180194
33731 180194 418744 583343 533007 335565 4353 -250965 -71997 369683 335732 -422965
33721 -422965 -1160378 -1137014 -582509 -194084 -178526 -274938 -304515 -238909 -48368 176154
33711 176154 249589 223657 295202 297137 -153537 -876652 -1180204 -900554 -658187 -791854
33701 -791854 -825422 -402107 31803 7280 -197016 -142734 17924 -41609 -208481 -294298
33691 -294298 -482388 -855680 -1000263 -651764 -236776 -192356 -240913 51439 475442 594629
33681 594629 538093 688364 906205 741891 195492 -313047 -531335 -448528 -43830 549264
33671 549264 880844 662295 187234 -107539 -208232 -285253 -268396 -97343 -24612 -206396
33661 -206396 -346067 -192547 -4391 -47054 -55695 257122 569145 435158 61687 -32567
33651 -32567 149263 200193 28859 -120708 -174873 -235575 -278519 -303061 -521879 -951486 -1140494
33640 -1140494 -794133 -307279 -146098 -103945 210654 551800 430698 11036 -156728 -56118
33630 -56118 -93297 -253662 -147749 210198 409196 359822 323944 313276 141074 -12355
33620 -12355 211098 645254 774901 568949 455776 519214 437124 198177 133237 205015
33610 205015 19569 -379028 -482500 -219206 -135093 -470271 -754934 -585545 -176529 129644
33600 129644 324254 434239 300816 -58204 -318755 -308056 -171905 41190 464348 956652
33590 956652 1128210 994860 1020457 1291431 1277505 725460 169698 121341 282056 71417
33580 71417 -468588 -814922 -737258 -467340 -267216 -196834 -193702 -136429 36838 139807 -90614
33569 -90614 -514592 -624312 -248278 151542 148398 -48387 5042 308497 546452 665448
33559 665448 877923 1170313 1199964 748469 61916 -337806 -134872 455662 845068 651711
33549 651711 90380 -365976 -599547 -819632 -1006194 -849210 -343635 12268 -152472 -606716
33539 -606716 -912901 -972849 -915860 -748671 -445387 -182666 -176848 -399110 -655862 -815025
33529 -815025 -798152 -545313 -175317 12440 -99656 -247817 -133489 190748 446572 468354
33519 468354 258314 -100222 -399288 -363544 36358 463934 584457 416007 170806 -70454
33509 -70454 -332099 -544516 -591165 -480343 -315175 -157520 -26458 46794 41653 -41420 -201733
33498 -201733 -368570 -376882 -209806 -178774 -547457 -1011774 -952000 -264620 457863 685338
33488 685338 475975 108043 -338047 -769801 -901154 -651455 -399483 -484169 -728535 -785535
33478 -785535 -669894 -600804 -598004 -605511 -744391 -1037405 -1139043 -792587 -343023 -309222 -608376
33467 -608376 -720145 -518903 -396344 -558645 -730359 -655049 -434741 -229774 -18162 170578
33457 170578 123031 -240257 -656034 -820285 -726049 -558941 -419535 -289125 -146434 9699
33447 9699 185022 364517 511454 606073 627049 525808 306564 79103 -82024 -264234
33437 -264234 -556914 -831254 -863028 -642044 -378578 -227103 -191934 -286771 -565435 -954018
33427 -954018 -1245792 -1332482 -1296518 -1229620 -1115151 -950995 -827184 -765282 -594382 -145504
33417 -145504 440732 730294 411642 -317173 -868551 -836065 -379196 55791 295627 496116
33407 496116 675400 539259 -56372 -742003 -1008668 -795938 -452638 -238515 -154387 -190999
33397 -190999 -408944 -718298 -854583 -705280 -495679 -526972 -818962 -1098016 -1083582 -724508
33387 -724508 -180036 372863 860952 1228257 1330657 1078177 662237 428335 463109 519910
33377 519910 445177 429359 665364 1003882 1198203 1289470 1442628 1543597 1310259 758082
33367 758082 233420 -24182 -74700 -21960 147194 399605 578476 598051 546993 518506
33357 518506 478267 358818 158761 -92848 -355018 -535207 -547035 -425497 -286090 -180966
33347 -180966 -102168 -89678 -189982 -316492 -288920 -22034 408670 837169 1044855 843866
33337 843866 309163 -156156 -212198 5699 97450 -19828 -30901 238653 508324 427745
33327 427745 66963 -180152 -88596 170326 277592 132433 -65518 -75768 79091 125889
33317 125889 -127521 -546824 -804244 -698143 -317130 30158 51535 -219889 -363764 -42306
33307 -42306 466917 548666 139640 -117780 145104 404270 74088 -491841 -508923 1796
33297 1796 263039 -56502 -486972 -670610 -820842 -1038222 -953984 -468763 -162496 -428734
33287 -428734 -762976 -535019 -16766 72301 -261263 -347986 11477 255643 24686 -266237
33277 -266237 -128787 210551 140696 -453607 -1018322 -998449 -442570 104135 200275 -76677
33267 -76677 -330579 -384597 -439592 -634924 -694479 -276518 439550 854146 684026 324624
33257 324624 346872 821105 1306017 1411086 1204912 1057626 1169828 1324416 1135773 524585
33247 524585 -145077 -452082 -353902 -149162 -94125 -198467 -354844 -498423 -609171 -682083
33237 -682083 -741057 -803646 -815336 -696244 -458813 -203981 -16337 41260 -137045 -606311
33227 -606311 -1181022 -1507298 -1424037 -1136197 -927780 -817830 -644432 -398950 -268285 -333607
33217 -333607 -416944 -317441 -72609 126926 189777 153709 20712 -258962 -608584 -798439
33207 -798439 -720554 -607342 -824204 -1423314 -2004303 -2091029 -1626542 -1039892 -805368 -974460
33197 -974460 -1190000 -1130987 -837781 -572746 -501059 -623945 -898695 -1217831 -1329053 -1036337
33187 -1036337 -525836 -260890 -455529 -836404 -1014071 -893060 -612467 -306840 -88583
33178 -88583 -65437 -182641 -214189 -85909 -20040 -171598 -342639 -295080 -117427 3392
33168 3392 129076 332957 363928 6680 -416288 -442934 -243155 -369104 -772429 -793541
33158 -793541 -273771 68831 -267155 -756771 -658219 -122277 141194 -25658 -138274 30455
33148 30455 115193 -184880 -614685 -728673 -437545 -7201 290989 368059 258929 19154
33138 19154 -280607 -474441 -328127 180697 645476 566432 -23398 -550832 -637667 -507893
33128 -507893 -462657 -346231 76181 516555 459824 -61301 -480243 -461910 -206035 30346
33118 30346 253424 465402 503443 356087 313822 560453 851877 846203 583357 394108
33108 394108 436012 549070 531168 344087 16294 -469517 -1052750 -1443573 -1304483 -675796
33098 -675796 -80187 -25813 -464401 -923006 -1093303 -1015795 -744979 -271448 127802 -25780
33088 -25780 -668878 -990704 -424545 511585 897116 628783 310879 142238 -274200 -982179
33078 -982179 -1367917 -1098400 -677276 -653309 -831801 -749679 -472881 -361676 -356303 -79246
33068 -79246 499862 1006696 1189610 1073218 675485 35119 -506659 -539017 -186287 -50792
33058 -50792 -395599 -769926 -679294 -293802 -150105 -351452 -464307 -196124 181474 233891
33048 233891 -44591 -267242 -180134 105782 416539 767507 1156739 1348711 1168186 885173
33038 885173 924184 1184041 1072389 379840 -286020 -258209 302644 685680 597036 382214
33028 382214 355641 410650 387533 382156 474445 485565 258752 -60203 -261988 -382643 -524969
33017 -524969 -565584 -340257 3962 151993 50840 -96244 -211391 -381864 -511212 -310590
33007 -310590 217033 601034 441231 -90383 -518017 -669550 -763213 -983419 -1227301 -1274128
32997 -1274128 -1036496 -642325 -371142 -443970 -755120 -908457 -669047 -258344 -13652 84071
32987 84071 250007 404935 269837 -60977 -117827 229297 493608 263227 -210445 -446417
32977 -446417 -427036 -437963 -459728 -225891 199717 407004 248066 30173 3218 65093
32967 65093 139530 430001 986339 1335664 978187 135125 -411884 -261314 171856 275105
32957 275105 -16761 -337206 -529047 -792146 -1192736 -1395984 -1093678 -474132 -2638 143020
32947 143020 138998 95944 -77024 -340931 -404356 -106639 321479 561683 564748 430438 164408
32936 164408 -202603 -448034 -395799 -184837 -16394 236707 825804 1583541 1946536 1594158
32926 1594158 814300 162117 -59037 50061 158986 -4893 -401022 -710401 -736438 -667919
32916 -667919 -760988 -909209 -824556 -531507 -305545 -170222 108740 486150 563567 222360
32906 222360 -101066 -47492 110944 -103990 -646083 -1023953 -991088 -797785 -761412 -873263
32896 -873263 -906877 -735669 -439078 -160754 51222 218637 264763 5856 -561120 -1074263
32886 -1074263 -1143065 -837499 -588852 -604182 -677201 -632336 -605142 -708882 -737546 -470976
32876 -470976 -65686 139572 83677 1889 63527 199886 248489 118449 -132759 -280658
32866 -280658 -92395 378712 771312 813137 616288 444435 334632 138118 -176520 -478848
32856 -478848 -686863 -826810 -887131 -774370 -457721 -73337 155010 89765 -211951 -562992
32846 -562992 -828361 -985302 -982349 -716731 -305093 -161767 -488193 -835964 -613513 30002
32836 30002 346283 69909 -221199 -37180 323665 397389 357610 636050 1079637 1107878
32826 1107878 580458 -37406 -354010 -442163 -523313 -641413 -731991 -755337 -702705 -626908
32816 -626908 -632446 -704552 -669423 -476154 -332520 -359123 -328127 -13109 404253 571729 428265
32805 428265 146461 -172233 -439356 -466105 -274208 -269335 -680375 -1063054 -847357 -185154
32795 -185154 260443 203539 -118953 -513888 -928590 -1095387 -751994 -204763 -23675 -162581
32785 -162581 -53376 386707 590387 326967 74134 113943 4147 -605023 -1250614 -1281681
32775 -1281681 -753541 -215302 26968 5140 -197803 -384611 -179882 542396 1355951 1714825
32765 1714825 1490871 891389 179453 -295323 -204637 290221 561637 345442 139727 398436
32755 398436 778721 688606 188069 -222031 -380963 -431447 -276767 250419 819009 855064
32745 855064 336634 -224090 -547607 -774754 -914559 -715877 -199385 204486 211569 -25744
32735 -25744 -282569 -506267 -595732 -363974 99785 380125 242245 -68248 -172761 17663
32725 17663 318141 483993 340523 -83141 -496961 -614357 -465294 -254354 -11238 317603
32715 317603 539354 395683 56905 -8105 283708 508839 411152 269565 418137 779723
32705 779723 1081289 1204158 1128852 852107 554687 535552 772497 862681 619127 393937
32695 393937 534626 836633 877444 643465 454679 441306 459493 420897 377281 335662 255308
32684 255308 165312 66710 -160163 -499778 -607981 -217739 358071 528841 228202 -4239
32674 -4239 156206 343114 109448 -322703 -347018 115192 441462 147502 -466154 -760054
32664 -760054 -599992 -385334 -328964 -165135 290749 701992 654008 275041 25005 15506
32654 15506 -34320 -215276 -255593 -10979 274242 351589 285356 219766 133980 17246 6847
32643 6847 141761 230563 170751 139489 234811 201953 -172849 -614446 -658833 -276460 124986
32632 124986 235192 89839 -139127 -315063 -333660 -188651 -10401 136216 383312 785978
32622 785978 1074984 962886 561645 182673 -144298 -574806 -973801 -992911 -635427 -305740
32612 -305740 -227795 -244909 -295570 -592875 -1084955 -1202787 -569563 321017 592844 44359
32602 44359 -673226 -902497 -641597 -296443 -96097 29915 137717 89371 -230816 -634573
32592 -634573 -736626 -399182 61156 242018 135779 62253 193741 391890 506074 551398
32582 551398 524465 327202 11685 -154370 -49496 92190 36463 -87020 -16195 211820
32572 211820 327570 217629 -10030 -258358 -476244 -531809 -333704 -57331 18118 -100026
32562 -100026 -148530 -34802 53548 16844 17632 154719 231221 48589 -259840 -409522 -356087
32551 -356087 -291133 -315395 -326010 -233828 -128974 -166986 -356047 -500517 -366134 60201
32541 60201 478600 538427 237603 -39371 39809 374072 599005 557344 433521 424492 447918
32530 447918 275459 -125715 -511028 -639063 -549142 -473969 -504208 -478624 -276679 -76709
32520 -76709 -137551 -390458 -492845 -314288 -109918 -97745 -119174 64201 336230 386744
32510 386744 209586 118237 254351 376901 238119 -59947 -222284 -125085 95109 207016
32500 207016 57709 -300660 -580973 -494831 -112612 155402 67131 -110577 38568 486396
32490 486396 775972 623280 257652 70157 109333 94185 -146008 -418975 -403131 -49008
32480 -49008 337799 423706 201754 -35116 -53699 72191 105172 -44929 -231250 -257627
32470 -257627 -85936 137643 225950 140426 55299 170702 427711 516651 270765 -54120
32460 -54120 -71947 210365 383919 178862 -221544 -517883 -712200 -957433 -1138560 -934951
32450 -934951 -338476 169081 120293 -402621 -893503 -984563 -716426 -315498 74801 392617
32440 392617 573372 601566 561839 517346 387467 71275 -324934 -520497 -366979 -26144
32430 -26144 224604 294867 301723 328898 293997 108502 -124121 -201788 -116964 -109915 -325467
32419 -325467 -530030 -373423 82977 344495 89910 -424918 -755387 -853197 -963749 -1071996
32409 -1071996 -873043 -357783 -21170 -241521 -714319 -797520 -282289 448276 939599 1065319
32399 1065319 921090 595249 160139 -246720 -450535 -346034 7252 369987 485160
32390 485160 342529 200271 235899 283379 89195 -261608 -416611 -236772 47625 212037
32380 212037 317868 487542 608015 468153 97000 -234727 -344476 -328141 -395544 -611306
32370 -611306 -841641 -904683 -729261 -392427 -55393 129426 108120 -25204 -112508 -135443
32360 -135443 -269672 -598520 -833847 -574488 109275 635824 616129 328847 250268 365473
32350 365473 302826 -23626 -337474 -495556 -613303 -678678 -493107 -105191 119977 38090
32340 38090 -46440 111747 328974 363336 290998 224384 13710 -399591 -649217 -420265
32330 -420265 -33920 -60982 -486264 -771062 -695777 -601072 -718608 -781321 -516478 -120392
32320 -120392 47166 -25666 -75688 20786 148253 165404 23468 -269575 -650001 -974462
32310 -974462 -1070603 -817899 -223828 484677 908090 805025 380093 51463 -64876 -196921
32300 -196921 -430442 -518534 -322287 -115536 -182716 -350763 -240997 161585 518257 629193
32290 629193 584192 455509 198323 -78037 -76652 280650 659796 724335 556398 461338
32280 461338 503226 490679 353784 264398 358127 563442 767761 945938 1031452 872799
32270 872799 481516 144046 66528 47027 -225647 -644366 -803510 -635860 -523327 -660010
32260 -660010 -741147 -555691 -469961 -858005 -1343940 -1222847 -548279 -142972 -407628 -755946
32250 -755946 -556552 -87808 -44364 -456537 -708712 -496274 -182092 -163684 -378956 -580505
32240 -580505 -707054 -794271 -818216 -813575 -900134 -1032371 -980739 -734818 -631215 -824524 -920274
32229 -920274 -515056 96993 231754 -214975 -592488 -401584 63682 227370 41694 -69378
32219 -69378 102019 286658 159925 -240838 -589649 -630275 -426298 -305185 -502913 -821624
32209 -821624 -786622 -260226 285755 325820 -52385 -327540 -268298 -108253 -46329 -7451
32199 -7451 27098 -102285 -330161 -248341 309270 888499 966379 625492 318546 196829
32189 196829 100897 43175 197272 459032 516216 392752 441606 690869 688120 216770 -277382
32178 -277382 -299931 4442 161565 101883 144419 379715 516391 363601 113421 56876
32168 56876 266262 621270 925486 939702 542534 -23094 -268461 12094 468918 614114
32158 614114 396385 171966 180968 293090 295191 189340 69910 -107595 -400265 -599022
32148 -599022 -363785 283952 834081 826006 379710 4942 -33347 45237 -97714 -515038
32138 -515038 -963254 -1134628 -863065 -248459 361960 629371 523080 305852 231966 354077
32128 354077 578867 745518 677476 376423 177410 450387 1066924 1428128 1164371 558438
32118 558438 90565 -176192 -469938 -765645 -749917 -313972 232467 521480 508560 423407
32108 423407 462324 578212 527575 161852 -294963 -408587 -92043 195466 37196 -341037
32098 -341037 -411002 -165998 -135402 -523740 -829944 -582083 -63244 82423 -255564 -572738
32088 -572738 -491704 -193480 -51857 -158067 -351647 -495296 -530841 -392678 -61967 321122
32078 321122 537277 492866 278667 53614 -49913 49703 318770 561579 579852 424851
32068 424851 351066 452075 518200 394900 286809 438523 643757 448135 -151373 -610226
32058 -610226 -573146 -320234 -231708 -177252 158962 604911 670964 320814 55868 148970
32048 148970 257747 3648 -439360 -621248 -430546 -134888 42912 111045 141906 156915
32038 156915 171122 191794 173385 72901 -84208 -267880 -492625 -708394 -747432 -525817
32028 -525817 -223828 -102380 -177769 -237396 -161189 -61022 -73231 -161638 -204250 -183599 -192769
32017 -192769 -268125 -290678 -108434 244656 524507 536075 347164 121127 -183950 -703707
32007 -703707 -1248936 -1339912 -849653 -316470 -297794 -624043 -691873 -365710 -91024 -96100
31997 -96100 -34314 342508 630688 313991 -430994 -934097 -909010 -686292 -594506 -553223
31987 -553223 -397453 -233502 -246640 -388817 -479041 -459706 -358192 -126078 265498 641052
31977 641052 744704 551718 307874 250959 402695 619315 725012 600711 270441 -74342
31967 -74342 -239089 -243769 -292711 -506676 -766617 -850528 -660819 -306363 -31472 -67441 -458244
31956 -458244 -986618 -1322504 -1275137 -892859 -375483 32674 134701 -71476 -333978 -382439
31946 -382439 -244228 -182100 -292948 -345475 -101884 341532 639467 529195 15918 -654288
31936 -654288 -1135136 -1213437 -985691 -719522 -529522 -342343 -174471 -176859 -320075 -336554
31926 -336554 -148601 -52281 -225829 -354602 -101995 287376 296522 -93817 -415101 -434798
31916 -434798 -378909 -392268 -270766 102400 466198 552158 429312 270235 61526 -224059
31906 -224059 -412865 -337629 -102961 38781 -53929 -362760 -708573 -732029 -191304 570442
31896 570442 803025 239265 -507902 -720603 -431602 -158725 -97666 -42854 99817 231723
31886 231723 387856 649144 778071 448128 -137588 -356722 513 470490 623243 562888
31876 562888 511323 361222 -6119 -317600 -246058 64013 211745 151019 197281 471710
31866 471710 705627 646138 364693 73967 -134109 -259606 -285057 -235046 -246618 -452510
31856 -452510 -816581 -1143740 -1230264 -987068 -484282 61853 393975 405298 247376 180413
31846 180413 288263 417817 453887 537147 841653 1195824 1179799 662547 -9066 -488255
31836 -488255 -821996 -1132571 -1189650 -721169 -16147 277816 642 -323733 -257957 8076
31826 8076 89493 -18940 -97769 -117757 -165496 -192385 -167489 -276720 -632520 -966363 -964407
31815 -964407 -748171 -645473 -637823 -473614 -222150 -211900 -431652 -514292 -387666 -406959
31805 -406959 -666094 -710931 -255440 261003 242790 -249861 -679342 -790573 -758483 -724134
31795 -724134 -626779 -461239 -317271 -146597 176922 530119 588492 282671 -60552 -137597
31785 -137597 -4698 115415 158702 198534 237402 187765 16485 -208727 -422232 -646844
31775 -646844 -932765 -1200915 -1219306 -863520 -383275 -199697 -362411 -449769 -171016 191578
31765 191578 210583 -51175 -204035 -160745 -149804 -174803 34873 484343 814835 881964
31755 881964 971402 1235858 1355246 1034088 459393 -36968 -418889 -718846 -723158 -310133
31745 -310133 154237 207927 -77114 -253185 -144804 37459 91916 -35864 -356168 -691330
31735 -691330 -617820 -17088 494140 254395 -423844 -579741 31471 598074 450195 -86281
31725 -86281 -364274 -325481 -260289 -150215 163905 456154 349864 -46951 -254933 -136537
31715 -136537 -37181 -172231 -286920 -80105 333507 602991 628991 648847 839193 1007412
31705 1007412 818417 284442 -177351 -270679 -188054 -238629 -319189 -119947 269722 430265
31695 430265 286615 220171 415635 607702 652853 814598 1184713 1336837 969906 467193
31685 467193 351221 532019 562751 328017 11885 -304062 -523248 -354104 195646 487405
31675 487405 73207 -459813 -243407 500271 736547 187936 -339280 -297593 -89454 -131376
31665 -131376 -164636 32353 73920 -294561 -588497 -386005 -146512 -474988 -1027005 -971930
31655 -971930 -276344 282754 264407 -32089 -289078 -565674 -847979 -851983 -528518 -273313
31645 -273313 -347302 -456628 -201313 325212 671056 594275 241941 -156700 -550323 -989402
31635 -989402 -1420750 -1662649 -1603256 -1345653 -1045985 -658825 -53414 596609 833972 491715
31625 491715 -13691 -194311 -61699 88107 208938 422537 565425 303180 -299822 -750008
31615 -750008 -731941 -387813 54880 527133 877388 826476 421370 185893 489793 1007270
31605 1007270 1144176 835648 555444 613489 818294 863885 703557 407921 -51132 -630490
31595 -630490 -1015128 -902506 -458146 -187929 -280085 -365505 -129501 110195 -178974 -855886
31585 -855886 -1116895 -531601 337853 633343 230664 -266338 -372016 -175280 -13861 -52020
31575 -52020 -225072 -344408 -218182 124619 333013 85153 -459127 -803436 -728416 -495125
31565 -495125 -394359 -393508 -358021 -349915 -491302 -692486 -721549 -479759 -89670 228320 305041
31554 305041 142644 -64530 -133673 -139283 -308351 -649292 -888681 -852881 -702033 -660336
31544 -660336 -707384 -696294 -611674 -526740 -432092 -290157 -158497 -86888 9749 194971 321991
31533 321991 215195 -12609 -56842 147582 297449 103027 -340431 -664156 -639565 -383071
31523 -383071 -147434 10972 252764 616435 809613 540143 2909 -251363 -16770 286048
31513 286048 217217 -63120 -91260 177597 352953 264930 199141 363987 506150 309656
31503 309656 -64332 -133434 300996 936588 1321290 1239915 778078 194601 -225405 -332186
31493 -332186 -211127 -67982 13113 125209 318549 425695 229999 -206519 -527251 -484201
31483 -484201 -266272 -262908 -512865 -603831 -237347 302512 487812 250566 30998 110178
31473 110178 252651 180520 76866 296393 770754 1079535 1045146 889300 790035 652740
31463 652740 412388 214172 129286 -4969 -264896 -444587 -408607 -357523 -459215 -495665
31453 -495665 -239831 69339 85141 -5630 251855 759948 930019 624976 412388 661242
31443 661242 962814 792682 269233 -152800 -352100 -467265 -475405 -304790 -129898 -117993
31433 -117993 -85003 185732 499734 557130 472212 507926 524395 258850 -35184 112042
31423 112042 538505 600126 166434 -255866 -463429 -825250 -1383804 -1493451 -796327 106645
31413 106645 480765 407112 371038 406444 272009 84127 109688 197038 44724 -183323
31403 -183323 -147088 -50275 -378656 -998013 -1228385 -881119 -553507 -713222 -1073489 -1128790
31393 -1128790 -820417 -384002 50211 386975 419675 81249 -365142 -633300 -729006 -770979
31383 -770979 -725100 -553167 -434777 -568302 -850454 -985552 -866727 -673701 -615515 -694553
31373 -694553 -709780 -447040 73401 524393 569901 275737 81485 301619 794977 1193109
31363 1193109 1298426 1169656 976912 897276 1021330 1226303 1233360 904305 409650 30324
31353 30324 -110405 -56672 103356 269410 347038 334647 312654 294939 210113 71017 -8474
31342 -8474 -33589 -156612 -372340 -425693 -213967 -48162 -236462 -590977 -698600 -582877
31332 -582877 -694791 -1213290 -1731461 -1783807 -1394208 -910896 -529635 -219129 30628 157273
31322 157273 198078 302356 527519 735693 718141 360828 -273174 -918839 -1205894 -947309
31312 -947309 -376018 31991 29265 -211965 -414325 -528306 -624395 -620699 -368702 29433
31302 29433 243830 118378 -139832 -246577 -150315 15809 110071 9931 -339759 -749347
31292 -749347 -829745 -415044 188710 567216 671109 714322 770596 777801 819162 1016085 1171086
31281 1171086 923874 324379 -141425 -220211 -201740 -375753 -566140 -504893 -345153 -402543
31271 -402543 -581619 -489353 -67510 266342 156658 -286505 -680920 -757352 -504041 -118556
31261 -118556 110324 6377 -333528 -633678 -693434 -512371 -241527 -84786 -136019 -208241
31251 -208241 22950 543812 853118 548543 -88347 -430251 -329906 -201512 -296492 -377316
31241 -377316 -245632 -124266 -225074 -314542 -91427 267691 364121 217973 211522 450556
31231 450556 624954 551884 435362 430660 320346 -112365 -640210 -828776 -598040 -284338
31221 -284338 -199157 -351713 -580098 -737796 -729551 -549160 -335136 -254064 -293926 -298582 -219283
31210 -219283 -166626 -172245 -97453 107083 230434 71549 -233257 -349838 -154515 178469
31200 178469 451158 606136 638931 571906 552781 759690 1116690 1293179 1105161 747940
31190 747940 489575 302191 -570 -384586 -606252 -563271 -392794 -203977 55063 392623
31180 392623 645255 678495 558491 391687 140704 -230700 -557450 -648182 -597142 -658803
31170 -658803 -804209 -694729 -212513 257248 295674 286 -211854 -206179 -190452 -233892
31160 -233892 -138141 121905 215045 -75764 -498429 -695116 -664247 -581044 -406378 -41667
31150 -41667 304184 327271 132829 113168 342339 499069 403150 205830 3853 -275005
31140 -275005 -504053 -384483 -38326 -53874 -624292 -1133336 -1017519 -588190 -468464 -604494
31130 -604494 -492564 -128781 7045 -172493 -239281 -52608 22672 -138733 -141306 189899
31120 189899 420736 253520 102030 423337 925107 1012134 702696 496669 533216 495369
31110 495369 270474 104772 70587 -61918 -301908 -295779 83987 427465 313492 -178661
31100 -178661 -699358 -1039914 -1074170 -645570 126078 689472 628542 228786 79548 237720
31090 237720 243227 -74275 -319675 -188045 70555 98967 -20482 -548 128587 107004
31080 107004 -86118 -216366 -193786 -157446 -163676 -100996 42124 118305 113329 220490 493689
31069 493689 677893 561442 284266 84183 -85152 -417368 -831760 -975594 -670606 -146004
31059 -146004 239092 365630 377956 426860 469003 328532 -40849 -389543 -374408 34912
31049 34912 474362 588917 389008 100889 -170456 -432385 -590958 -516855 -288596 -115097
31039 -115097 -13491 182936 463594 559787 329974 -9790 -183172 -181156 -128183 -6763
31029 -6763 254835 519591 505747 124758 -387234 -684230 -573855 -115269 422013 712771
31019 712771 608919 252638 -74432 -183986 -40589 298263 683854 898424 839490 667666
31009 667666 632809 764019 873880 850543 747999 557084 138661 -458140 -823672 -610649
30999 -610649 -50401 248183 47379 -244140 -156887 231977 492263 458879 354682 351213
30989 351213 324834 130490 -135405 -300228 -374110 -471974 -584597 -606014 -546080 -559144 -749527
30978 -749527 -1045726 -1281930 -1347461 -1254461 -1093523 -926782 -744837 -568355 -524807 -683720
30968 -683720 -851968 -749523 -418846 -203080 -224969 -194722 59622 191036 -172514 -750443
30958 -750443 -888790 -459923 -30871 -77840 -447464 -739297 -847464 -880872 -818086 -538787
30948 -538787 -85299 328873 528434 472078 205990 -170469 -532310 -784270 -872099 -771421
30938 -771421 -544176 -338919 -201118 23931 400027 632215 414998 -6474 -41390 409545
30928 409545 754119 534681 57283 -91115 166025 428434 420628 216016 -2519 -106451
30918 -106451 -40541 84843 25782 -272050 -530161 -522062 -415240 -479325 -641835 -633654 -421786
30907 -421786 -181381 34970 279997 475148 506205 443714 362653 109876 -368524 -656325
30897 -656325 -342886 222820 254657 -349357 -827211 -673514 -329238 -408195 -758258 -783597
30887 -783597 -361367 81160 225203 123358 -116782 -480509 -850177 -994622 -830327 -487043
30877 -487043 -107076 220935 356148 183270 -169879 -410959 -436831 -425478 -525321 -644418
30867 -644418 -627153 -458079 -182138 203994 624774 829098 626825 167095 -203034 -333447
30857 -333447 -355310 -401926 -464052 -544025 -703427 -861664 -801963 -546040 -466965 -766842 -1070988
30846 -1070988 -911817 -466309 -359814 -771341 -1214085 -1270739 -1055550 -785841 -394257 149547
30836 149547 573300 708009 774577 901348 769473 208518 -249674 -23640 586076 781932
30826 781932 406197 -12446 -247643 -622856 -1204456 -1533799 -1402575 -1205749 -1214461 -1136762
30816 -1136762 -779099 -535058 -722563 -950348 -722131 -277242 -202317 -468901 -515425 -193758
30806 -193758 -11640 -346693 -900665 -1119454 -854190 -421612 -159936 -64623 139437 576837
30796 576837 953945 891278 492245 265084 398806 503634 284514 68029 284440 739444
30786 739444 870997 558284 213185 138929 214765 212002 73382 -142999 -328124 -344699
30776 -344699 -217715 -230942 -578062 -1004407 -1077213 -739973 -323773 -93709 -70842 -205508
30766 -205508 -402575 -445167 -220722 31590 14393 -156453 -108845 219534 520404 568867
30756 568867 388993 26445 -466958 -865234 -969320 -937126 -1030091 -1108968 -832625 -289808
30746 -289808 92672 253464 534512 976814 1192701 1053021 864710 686020 149684 -724413
30736 -724413 -1211503 -827183 -38867 433594 514885 477745 276763 -192437 -580974 -517283
30726 -517283 -261286 -267422 -347764 16383 697721 1019922 798105 538537 522384 418496
30716 418496 28115 -245863 -41931 335565 338278 -104087 -633563 -985788 -1136823 -1108726
30706 -1108726 -934606 -733851 -601034 -472515 -246975 33055 240439 335306 374262 398298
30696 398298 389361 316025 195454 118226 163874 257744 225162 71522 34143 182069 170079
30685 170079 -301854 -933063 -1127284 -807595 -496268 -540184 -705126 -683471 -566668 -553535
30675 -553535 -554978 -428477 -345805 -557877 -939391 -1111980 -960260 -731813 -633395 -581372
30665 -581372 -411515 -171336 -108768 -389598 -834494 -988062 -575466 111804 463951 232998
30655 232998 -225280 -449231 -373894 -217782 -119369 -80143 -67344 26242 335325 742259
30645 742259 870632 598080 329398 445868 726622 727009 524303 554388 796909 742990
30635 742990 274067 -33285 237796 689252 708939 349043 127730 193546 210124 2197
30625 2197 -181768 -131809 7940 54654 102613 300545 536700 598226 507798 443755 400277
30614 400277 209596 -87807 -193708 -1557 162942 -18483 -368574 -483987 -380622 -451295
30604 -451295 -744435 -768019 -270326 206746 8009 -661820 -996584 -731498 -430501 -536958
30594 -536958 -732314 -551890 -164355 -78365 -357087 -609061 -631432 -612535 -718231 -870234
30584 -870234 -974767 -1036832 -989044 -722790 -380543 -312825 -596239 -853283 -736632 -386135
30574 -386135 -199633 -307586 -497603 -563755 -509193 -433357 -413313 -521816 -811010 -1197483
30564 -1197483 -1425059 -1227549 -581045 193536 648407 627459 441956 503123 781784 799732
30554 799732 224045 -675835 -1271247 -1191165 -633600 -157633 -210799 -734520 -1174416 -1013833
30544 -1013833 -352129 209476 303041 166272 163674 249558 183347 24178 19586 125333 45411
30533 45411 -262932 -498713 -483201 -385059 -387756 -419643 -335547 -140921 66486 188933 112103
30522 112103 -190869 -503805 -555180 -393772 -314268 -390346 -404212 -276766 -176517 -112934
30512 -112934 124096 450422 421966 -20941 -254730 146987 693738 688499 270107 87656
30502 87656 218776 175222 -130073 -215264 112536 464242 587363 688241 815257 611222
30492 611222 31918 -317915 -29930 442678 467246 136465 -53418 -50907 -161530 -371450
30482 -371450 -392407 -245560 -201972 -206814 57275 531307 765073 613227 427333 440263
30472 440263 464788 378948 416956 700108 891449 657963 177253 -143304 -208981 -176992
30462 -176992 -70620 170864 373329 242810 -179950 -472059 -321718 110451 403406 343339
30452 343339 113452 49265 232991 378826 203311 -144239 -229893 48118 260827 38843
30442 38843 -382498 -489037 -191347 146011 301318 415125 550469 447977 -24448 -459336
30432 -459336 -312218 362752 910805 865000 479930 345477 656709 1071909 1205448 1019758
30422 1019758 701437 378958 110420 2649 126652 339238 369337 116409 -257435 -546144
30412 -546144 -678949 -662393 -508645 -308718 -249929 -436921 -742266 -903210 -732128 -235589
30402 -235589 360942 692819 535251 90292 -164034 -24795 197160 132718 -133253 -234241
30392 -234241 -71621 105093 129421 121655 197175 236076 92561 -135788 -219796 -112486 -18937
30381 -18937 -148686 -454923 -649935 -515489 -203637 -126150 -455127 -836560 -760027 -153504
30371 -153504 567511 996706 1066485 899509 606227 322352 213865 283413 314345 144216
30361 144216 -118880 -265683 -252517 -174369 -80342 32283 94936 -23846 -379705 -871344
30351 -871344 -1279880 -1398226 -1210719 -949644 -860420 -909019 -865735 -666004 -470921 -347183
30341 -347183 -171366 46169 60017 -184695 -325728 -75345 308874 390742 188212 38736
30331 38736 -6731 -170312 -382891 -267454 211451 565314 453614 135694 8742 60480
30321 60480 82140 101097 219941 259720 -4050 -368470 -400769 -92588 101041 -39485
30311 -39485 -150111 159314 697784 949280 786910 599199 699823 916253 920124 748059
30301 748059 705291 803130 641615 22408 -595693 -596870 -63856 265824 -26080 -481035
30291 -481035 -400484 242514 835636 907040 550988 148002 -28005 83215 347915 516771
30281 516771 479041 441422 643163 925591 892916 541287 361331 644712 1036813 1071803
30271 1071803 870236 898461 1192141 1297549 1005379 684216 699287 860720 740623 309784
30261 309784 -66724 -158228 -79396 1051 66585 112714 53528 -118324 -269826 -347151 -481082
30250 -481082 -722841 -844300 -621977 -213638 4693 -59947 -153947 -147548 -267088 -688545
30240 -688545 -1131088 -1128975 -630372 -80241 97474 -98405 -393182 -583667 -624495 -507606
30230 -507606 -234680 96743 300525 250234 -5866 -293912 -465047 -498134 -472341 -451649
30220 -451649 -406819 -263263 -18235 220609 328535 273722 115186 -82111 -282161 -428627
30210 -428627 -430773 -269488 -100823 -157083 -481010 -806806 -795402 -396677 82190 278624
30200 278624 93849 -276604 -534594 -480048 -144430 187405 185717 -171235 -525077 -561449
30190 -561449 -428803 -508664 -790723 -800644 -298671 253841 240938 -273290 -645874 -528655
30180 -528655 -193639 86706 477734 1094879 1498245 1183520 379519 -178083 -216966 -141202
30170 -141202 -230935 -210590 147790 511868 477804 195313 60236 70485 -20130 -115204 93881
30159 93881 480110 530821 115348 -303504 -370074 -286995 -351244 -448729 -306123 52673 396084
30148 396084 609190 673529 531711 235825 58427 193133 468220 575305 451548 230564
30138 230564 -36129 -375153 -723226 -973377 -1088228 -1013758 -657402 -140923 150378 39023
30128 39023 -135539 7339 320702 431695 416585 648878 1032420 972192 254573 -539772
30118 -539772 -761568 -466413 -184805 -206034 -400685 -569151 -648626 -628005 -494580 -290508
30108 -290508 -119090 -99732 -330813 -788946 -1211485 -1219148 -690106 37116 432016 244511
30098 244511 -305709 -772142 -888792 -741354 -533733 -265874 180702 642924 674356 133044
30088 133044 -509006 -744656 -683202 -747670 -944680 -947130 -774937 -767999 -844960 -455327 495589
30077 495589 1273192 1242928 699072 328289 232420 2676 -470978 -804893 -695169 -284554
30067 -284554 66190 114229 -134663 -423597 -427443 -110638 189051 181873 -20156 -140542
30057 -140542 -134949 -120738 -91862 22595 145842 152619 59366 -107260 -452662 -941483 -1162404
30046 -1162404 -740047 89131 660801 630288 244422 -113066 -338717 -520751 -688842 -777330
30036 -777330 -748981 -704968 -841145 -1174697 -1344278 -965372 -244605 148560 2267 -104591
30026 -104591 276555 694449 491525 -116465 -343657 -7830 324317 304684 202839 269011
30016 269011 354947 338959 377878 549806 710959 841527 1069687 1250529 1039510 525447
30006 525447 251175 413286 582354 458116 355426 613262 1010104 1147219 1020959 858421
29996 858421 722921 594112 523857 461194 259159 38675 107612 330288 141445 -523633
29986 -523633 -944999 -681507 -267521 -291194 -424023 -110188 328490 182713 -404945 -643470
29976 -643470 -364915 -168913 -341013 -517227 -494529 -528218 -652262 -488339 14871 356462
29966 356462 295080 245778 528498 810097 699085 401796 351641 567028 785941 928374
29956 928374 1042266 1030883 773401 350022 -72564 -379285 -394477 49143 741065 1150668
29946 1150668 1102344 1029794 1259138 1423138 1011718 213435 -276080 -134373 325287 664748
29936 664748 692824 395789 -99369 -464317 -392322 46313 462476 554908 299568 -170086
29926 -170086 -636997 -828212 -635517 -296338 -134943 -148280 -67510 196430 412931 365595
29916 365595 124807 -67113 -56734 84852 96345 -241249 -787651 -1066562 -787707 -249810
29906 -249810 -3725 -189577 -455735 -482679 -302073 -90504 64551 120539 44522 -81444
29896 -81444 -110822 -66625 -144411 -407264 -652861 -664753 -441226 -118316 162052 255694 96923
29885 96923 -134181 -130209 150888 422819 517980 631413 905532 1038867 667512 -1472
29875 -1472 -343707 -108663 310272 476364 423117 386758 349160 166555 -33882 35986 347769
29864 347769 535217 421871 254581 247463 184795 -216563 -724602 -778654 -279809 186929
29854 186929 98290 -339127 -548751 -403809 -298786 -448732 -550472 -313817 12101 -22702
29844 -22702 -363457 -461442 -15128 623628 928974 840055 692249 665024 594614 323528
29834 323528 -43452 -331394 -526309 -649628 -552059 -56661 718489 1363087 1546634 1297620
29824 1297620 900275 601392 440304 301377 102671 -64242 -32298 170857 254647 -16606
29814 -16606 -512121 -888539 -1004457 -1010335 -1054489 -1104061 -1084380 -1000355 -853504 -600694 -261393
29803 -261393 77326 401738 747885 1005986 975626 701847 514078 586933 689518 550129
29793 550129 252235 53855 21912 99003 329883 699983 903286 642909 89844 -316532
29783 -316532 -474014 -640464 -876279 -914457 -670746 -431879 -352638 -194547 155726 302897
29773 302897 -113696 -758313 -939644 -492464 104955 433389 514177 461173 209581 -214293
29763 -214293 -508045 -467922 -340908 -513395 -954077 -1229234 -1036624 -500723 55556 411979
29753 411979 480981 254663 -136967 -431350 -446537 -264642 -125857 -175375 -372013 -586240
29743 -586240 -706988 -700570 -649215 -685097 -802506 -806723 -572871 -282565 -223354 -388489 -490278
29732 -490278 -378100 -199953 -89099 37848 224405 275750 57031 -195127 -141823 173293
29722 173293 366766 186759 -280991 -803142 -1147210 -1112139 -707532 -290744 -235656 -451291
29712 -451291 -518907 -323247 -203504 -387210 -627527 -586273 -284715 38268 263645 359923
29702 359923 241956 -79682 -380553 -492985 -537332 -661445 -738646 -596114 -366570 -287844
29692 -287844 -280540 -72398 337885 688956 861625 896224 656339 -47100 -910652 -1212210
29682 -1212210 -693337 8436 139289 -238699 -467564 -247867 72489 131850 37503 55449
29672 55449 135420 33266 -215024 -241905 164510 728215 1001075 901285 724835 652075
29662 652075 523033 211344 -58793 -23589 189335 274476 280004 528057 1002498 1234900
29652 1234900 938074 404140 81124 43254 83749 63639 -55112 -272182 -414652 -205844
29642 -205844 271627 477295 118027 -343010 -326398 -22292 -58875 -444637 -547643 -178997
29632 -178997 38715 -323237 -758268 -563691 117002 532673 355862 -43369 -241202 -207282
29622 -207282 -109970 -56323 -89326 -181338 -197540 -73640 -3463 -211993 -565055 -675625 -432880
29611 -432880 -179833 -290456 -754846 -1238011 -1387710 -1057793 -408249 164946 347464 189822
29601 189822 -34128 -190094 -310849 -338307 -149876 136650 219477 78894 65574 360649
29591 360649 663930 659667 505797 534697 683954 621814 339859 204799 384869 587929
29581 587929 501707 215123 15281 -48124 -184743 -526533 -938919 -1164749 -1062484 -707057
29571 -707057 -322947 -114775 -103200 -110478 48833 333350 474745 294465 15299 110687
29561 110687 731344 1404112 1511851 1025096 496891 315799 294524 142718 -9079 108731
29551 108731 342493 285967 -43512 -144634 255792 795622 962040 710572 391765 264265
29541 264265 308260 393082 413046 324188 213845 263129 480303 561061 231927 -305569 -531200
29530 -531200 -266431 60196 -39952 -491228 -815014 -812255 -756012 -835154 -746388 -135909
29520 -135909 729460 1133733 794557 221764 28080 177443 193706 -90299 -357478 -323632
29510 -323632 -70412 212050 513636 860059 1074260 911224 396887 -125846 -339848 -289867
29500 -289867 -317466 -635724 -1023341 -1055664 -638792 -144148 55545 -16318 -140375 -262344
29490 -262344 -400369 -392143 -94308 267560 337994 188050 220174 487930 566245 247271
29480 247271 -75137 11063 317672 365883 90721 -110456 67426 506441 852341 865620
29470 865620 632066 498075 687356 964587 898782 492584 224531 352676 558154 497514
29460 497514 316796 295954 344306 255319 156757 243066 304306 28379 -397930 -503444 -230585
29449 -230585 81830 298342 521178 608005 281685 -244990 -381986 -34908 217592 1473
29439 1473 -368506 -521667 -575868 -704096 -671587 -246561 314648 628146 711770 745760 621259
29428 621259 198210 -226520 -214397 165705 423053 315932 61526 -66551 -5356 180500
29418 180500 330911 202451 -234944 -582045 -426367 74077 364247 215085 -88451 -275163
29408 -275163 -396853 -518029 -482448 -198234 107294 148399 -43308 -180069 -85902 100242
29398 100242 54175 -414628 -1111503 -1559730 -1457848 -984587 -537952 -281760 -141054 -119969
29388 -119969 -303567 -552997 -533949 -155238 270555 418207 293180 81451 -132663 -354854
29378 -354854 -545346 -644004 -646521 -577588 -474683 -425665 -499360 -621219 -657396 -615573 -584127
29367 -584127 -499745 -238077 47521 6476 -375225 -649460 -514359 -253828 -301142 -608428
29357 -608428 -780357 -671255 -488070 -365142 -188265 120135 417998 533699 459307 289237
29347 289237 96851 -90711 -291106 -532342 -734418 -703991 -398464 -107446 -142209 -381768
29337 -381768 -400518 -79860 205075 141805 -53480 22597 327600 404864 32344 -455321
29327 -455321 -606298 -402130 -180436 -127151 -98773 30472 101982 -68904 -336641 -418154
29317 -418154 -418957 -821646 -1760887 -2564085 -2364942 -1145976 141698 602003 308683 33451
29307 33451 241754 643024 736788 516653 418694 675761 984924 899750 380182 -205819
29297 -205819 -538991 -621457 -615691 -612582 -622241 -635236 -591134 -397887 -81031 180227 259205
29286 259205 231236 221561 210356 119199 1116 -14807 80066 179970 231259 252646 225614
29275 225614 117921 -2839 -32513 2570 -4762 -39448 6516 88681 6022 -274115 -468429
29264 -468429 -287292 221894 756521 1090932 1212771 1200894 1094514 880078 555754 221064
29254 221064 76869 216390 398022 208510 -428491 -1065049 -1237646 -1053430 -1022658 -1336115
29244 -1336115 -1595462 -1368356 -777119 -324707 -258523 -354608 -325103 -199468 -189323 -336170
29234 -336170 -468339 -454003 -341035 -243746 -214051 -244626 -297858 -314482 -289543 -335608 -537412
29223 -537412 -745045 -704305 -439634 -271184 -334570 -358114 -149005 -29353 -397497 -1009168
29213 -1009168 -1176746 -696212 -107222 92009 34951 63504 148615 113782 115792 419803
29203 419803 847862 942425 670570 518014 786288 1181607 1269426 1010742 621102 177770
29193 177770 -309192 -597146 -369694 268535 756586 682867 251681 -8474 120290 388223
29183 388223 490401 396969 213895 -62421 -463701 -836128 -934811 -735861 -479794 -369296
29173 -369296 -368245 -343458 -266513 -205796 -217481 -288999 -305139 -88954 362445 697066 515021
29162 515021 -71900 -464911 -320726 -2073 -51470 -460757 -793955 -865857 -893776 -1011256
29152 -1011256 -1028660 -775497 -388935 -129217 -102230 -259194 -500059 -689624 -712042 -582323
29142 -582323 -400282 -180623 134262 484030 674914 600456 368914 206070 319267 775359
29132 775359 1349919 1593830 1285580 758179 527313 661338 808976 769373 651256 497138
29122 497138 206754 -103516 -141306 27715 -28291 -392726 -601600 -440646 -379224 -766244
29112 -766244 -1118440 -825478 -171933 62760 -211209 -373744 -173873 -36176 -183315 -201175
29102 -201175 223022 727097 822642 574338 343267 201512 5062 -202445 -259056 -205439
29092 -205439 -182784 -108849 210369 674502 889812 627168 83673 -360895 -500200 -362057
29082 -362057 -45550 371867 762642 895770 602880 39276 -356893 -288561 106943 497853
29072 497853 741304 842171 714214 312842 -89356 -150073 21837 -15995 -364572 -651927
29062 -651927 -666801 -645278 -725950 -613946 -132132 320743 311040 48049 27771 228942 200824
29051 200824 -149084 -379497 -158907 330452 695049 715034 402415 -26730 -234422 -98554
29041 -98554 67255 -64423 -277787 -85948 475845 815888 623009 252007 104130 89285
29031 89285 -34493 -204342 -278587 -390663 -693168 -969505 -867620 -383394 187513 640299
29021 640299 923288 962885 741154 450979 293771 214598 86722 16098 163703 404072
29011 404072 498810 485662 530254 532274 330430 181283 466911 950120 977042 521403 292360
29000 292360 545391 623392 236102 360270 1876293 3818956 4218371 2634977 684353
28991 684353 -182056 -252907 -389330 -428200 215334 1086311 1111882 283574 -256086 79459
28981 79459 563062 419945 -80118 -328638 -396760 -615627 -690049 -104497 822958 1144639
28971 1144639 569544 -168488 -384288 -258382 -300766 -520605 -552441 -298761 -23015 59569
28961 59569 -46342 -266979 -499010 -549626 -291471 132349 457077 622023 748680 838373
28951 838373 754440 530135 411512 478418 481865 254894 64655 258504 675563 767645
28941 767645 335693 -199147 -421414 -528084 -1011162 -1872943 -2501763 -2374351 -1635903 -878788
28931 -878788 -516084 -498625 -534153 -430661 -234325 -113960 -132169 -139115 60370 433700
28921 433700 692955 585932 176538 -198204 -244823 -3027 170714 -24715 -444500 -605048
28911 -605048 -286159 133559 151944 -186004 -400740 -282639 -91343 -27755 51147 230047
28901 230047 268464 12378 -273312 -315689 -293603 -516878 -871581 -988862 -819557 -646899
28891 -646899 -622349 -656374 -692920 -733285 -651479 -339428 21805 181960 235768 446276 743775
28880 743775 826818 693169 593219 497506 159140 -266563 -273934 173683 469356 242339
28870 242339 -148491 -289614 -318942 -471970 -543862 -289104 60645 181002 200782 361287
28860 361287 478496 306825 127582 331541 643757 480306 -21655 -84147 524442 1079965
28850 1079965 902971 188839 -457842 -841149 -1154827 -1460738 -1559698 -1268806 -626017 96197
28840 96197 531836 552017 463273 621632 853258 627522 -113330 -725471 -677089 -199330
28830 -199330 174486 360937 602748 853244 802186 453611 192486 192691 168001 -109680
28820 -109680 -385272 -296855 44197 199643 57667 -25820 183565 405576 271917 -94211
28810 -94211 -258039 -119189 -2242 -98214 -201193 -118321 10079 -8294 -116024 -191100
28800 -191100 -239226 -188203 153214 627597 611570 -175288 -1064715 -1197779 -656546 -236372
28790 -236372 -279415 -442427 -535751 -778553 -1117410 -1103200 -712189 -539591 -814580 -945844
28780 -945844 -523764 -84234 -240510 -634045 -511156 65106 391649 269464 156180 262287
28770 262287 280035 87593 33807 328542 685357 780615 655875 500730 390916 358049
28760 358049 386175 270714 -167375 -681428 -802818 -502935 -239123 -272224 -393202 -428838
28750 -428838 -505398 -623380 -506512 -164502 -85286 -478019 -819605 -668262 -501863 -1078513
28740 -1078513 -2195956 -2800029 -2311157 -1216626 -259294 372725 827531 1073094 986248
28731 986248 692107 468001 413742 435932 458297 451663 326017 -16129 -507551 -902084
28721 -902084 -960153 -636303 -112970 345461 605809 709037 674399 396707 -101148 -453592
28711 -453592 -306050 137048 290975 11176 -174065 111247 442676 207601 -420097 -696074
28701 -696074 -412542 -166382 -387718 -679345 -464784 131536 499052 388139 91673 -95314
28691 -95314 -156425 -108225 117333 445895 627198 564839 459569 508051 641592 669624 528625
28680 528625 296667 86765 -19415 -56171 -197639 -527500 -805975 -719855 -374430 -203678
28670 -203678 -304282 -255871 174338 547506 360952 -153522 -332915 -52292 119415 -243832
28660 -243832 -878766 -1241103 -1103783 -600499 25040 528816 747519 743963 723867 716905
28650 716905 529351 95225 -366329 -674303 -908422 -1112939 -1035801 -476024 257900 591482
28640 591482 377451 55048 69445 380562 647029 688748 597075 495259 379060 209968
28630 209968 44048 -15054 30122 37889 -105072 -314319 -378961 -215919 11444 65780 -114424
28619 -114424 -367273 -475113 -362322 -165946 -116520 -295735 -514132 -506689 -249354 28880
28609 28880 165569 247338 404280 579702 636216 563735 418613 164877 -215673 -528965
28599 -528965 -547280 -392942 -466341 -875443 -1168954 -839726 33470 847896 1117643 872754
28589 872754 458809 146031 -12566 -93287 -182099 -291644 -347430 -291335 -195837 -195248 -294411
28578 -294411 -348162 -264927 -122295 -24900 36103 93651 89494 -22360 -148305 -192252 -257262
28567 -257262 -510799 -850531 -917125 -528341 49237 379988 329675 156320 177274 434758
$$ [...]
##END NTUPLES=NMR SPECTRUM
##END=
