##TITLE=31Pdec_LY-TMF-7.5.R.t
 D2O, 24 sc
 28.2.2020
##JCAMPDX= 6.0         $$ Bruker NMR JCAMP-DX V2.0
##DATA TYPE= NMR SPECTRUM
##DATA CLASS= NTUPLES
##ORIGIN= UXNMR, Bruker Analytische Messtechnik GmbH
##OWNER= root
$$ XWIN-NMR		Version 3.5
$$ Fri Feb 28 15:38:53 2020 Russian Standard Time (UT+4h)  she@DPX200
##.OBSERVE FREQUENCY= 81.013821
##.OBSERVE NUCLEUS= ^31P
##.ACQUISITION MODE= SIMULTANEOUS
##.ACQUISITION SCHEME= undefined
##.AVERAGES= 24
##.DIGITISER RES= 17
##SPECTROMETER/DATA SYSTEM= spect
##.PULSE SEQUENCE= zgpg30
##.SOLVENT NAME= CDCl3
##.SHIFT REFERENCE= (INTERNAL, CDCl3, 0, 182.463)
##AUDIT TRAIL= $$ (NUMBER, WHEN, WHO, WHERE, WHAT)
$$ ##TITLE= Audit trail, XWIN-NMR		Version 3.5
$$ ##JCAMPDX= 5.01
$$ ##ORIGIN= Bruker BioSpin GmbH
$$ ##OWNER= she
$$ F:/spectra/data/she/nmr/P31/1/pdata/1/auditp.txt
$$ ##AUDIT TRAIL=  $$ (NUMBER, WHEN, WHO, WHERE, WHAT)
(   1,<2020-02-28 15:37:34.00 +0400>,<she>,<DPX200>,
      <created by zg, POWCHK disabled, PULCHK disabled
       configuration hash MD5:
       00 E9 B6 7A A2 85 ED C7 34 08 36 98 17 FE 4E 26
       data hash MD5: 32K
       DC C2 34 92 E3 C3 B5 96 28 BA A7 8E BB 33 ED 04>)
(   2,<2020-02-28 15:37:38.78 +0400>,<she>,<DPX200>,
      <Start of raw data processing
       efp BC_mod = 2 LB = 1 FT_mod = 6 PKNL = 1 PHC0 = -1614.22 PHC1 = 663.0013 SI = 64K 
       data hash MD5: 64K
       41 40 8B 27 BD E3 BF CE 35 15 6B B3 F8 66 37 27>)
(   3,<2020-02-28 15:38:06.87 +0400>,<she>,<DPX200>,
      <pk PHC0 = 0.3124049 PHC1 = 8 
       data hash MD5: 64K
       D3 A1 7E EA 30 E6 85 C5 60 6D 49 B4 FD D8 28 0B>)
$$ ##END=
$$ 
$$ hash MD5
$$ 81 8B E4 96 0E 6E 8C 99 D0 8A 92 F4 68 3C D2 64
##$RELAX= 
##$RELAX= 
##$RELAX= 
##$RELAX= 
##$RELAX= 
##$RELAX= 
##$RELAX= 
##$RELAX= 
$$ Bruker specific parameters
$$ --------------------------
##$DU= <F:/spectra>
##$EXPNO= 1
##$NAME= <P31>
##$PROCNO= 1
##$TYPE= <nmr>
##$USER= <she>
##$AMP= (0..31)
100 100 100 100 100 100 100 100 100 100 100 100 100 100 100 100 100 100 
100 100 100 100 100 100 100 100 100 100 100 100 100 100 
##$AQSEQ= 0
##$AQ_mod= 1
##$AUNM= <au_zg>
##$AUTOPOS= <>
##$BF1= 81.014009
##$BF2= 200.13
##$BF3= 200.13
##$BF4= 200.13
##$BF5= 200.13
##$BF6= 200.13
##$BF7= 200.13
##$BF8= 200.13
##$BYTORDA= 1
##$CFDGTYP= 0
##$CFRGTYP= 5
##$CHEMSTR= <none>
##$CNST= (0..31)
1 1 145 1 1 1 1 1 1 1 1 1 1 1 1 1 1 1 1 1 1 1 1 1 1 1 1 1 1 1 1 1 
##$CPDPRG= <waltz16>
##$CPDPRG1= <>
##$CPDPRG2= <waltz16>
##$CPDPRG3= <>
##$CPDPRG4= <mlev>
##$CPDPRG5= <mlev>
##$CPDPRG6= <mlev>
##$CPDPRG7= <mlev>
##$CPDPRG8= <mlev>
##$CPDPRGB= <>
##$CPDPRGT= <>
##$D= (0..31)
0 1 0 0 0 0 0 0 0 0 0 0.03 2e-05 3e-06 0 0 0 0 0 0 0 0 0 0 0 0 0 0 0 0 
0 0 
##$DATE= 1582889853
##$DBL= (0..7)
120 120 120 11 120 120 24 19 
##$DBP= (0..7)
150 150 150 150 150 150 150 150 
##$DBP07= 0
##$DBPNAM0= <>
##$DBPNAM1= <>
##$DBPNAM2= <>
##$DBPNAM3= <>
##$DBPNAM4= <>
##$DBPNAM5= <>
##$DBPNAM6= <>
##$DBPNAM7= <>
##$DBPOAL= (0..7)
0.5 0.5 0.5 0.5 0.5 0.5 0.5 0.5 
##$DBPOFFS= (0..7)
$$ [...]
##$SUBNAM2= <"">
##$SUBNAM3= <"">
##$SUBNAM4= <"">
##$SUBNAM5= <"">
##$SUBNAM6= <"">
##$SUBNAM7= <"">
##$SUBNAM8= <"">
##$SUBNAM9= <"">
##$SW= 369.568048894756
##$SWIBOX= (0..15)
0 1 3 0 0 0 0 0 0 0 0 0 0 0 0 0 
##$SW_h= 29940.119760479
##$TD= 32768
##$TD0= 1
##$TE= 0
##$TE2= 300
##$TE3= 300
##$TEG= 300
##$TL= (0..7)
0 120 53 12 22 120 120 120 
##$TP= (0..7)
150 150 150 150 150 150 150 150 
##$TP07= 0
##$TPNAME0= <>
##$TPNAME1= <>
##$TPNAME2= <>
##$TPNAME3= <>
##$TPNAME4= <>
##$TPNAME5= <>
##$TPNAME6= <>
##$TPNAME7= <>
##$TPOAL= (0..7)
0.5 0.5 0.5 0.5 0.5 0.5 0.5 0.5 
##$TPOFFS= (0..7)
0 0 0 0 0 0 0 0 
##$TUNHIN= 0
##$TUNHOUT= 0
##$TUNXOUT= 0
##$USERA1= <user>
##$USERA2= <user>
##$USERA3= <user>
##$USERA4= <user>
##$USERA5= <user>
##$V9= 5
##$VALIST= <valist>
##$VCLIST= <CCCCCCCCCCCCCCC>
##$VD= 0
##$VDLIST= <DDDDDDDDDDDDDDD>
##$VPLIST= <PPPPPPPPPPPPPPP>
##$VTLIST= <TTTTTTTTTTTTTTT>
##$WBST= 1024
##$WBSW= 4
##$XGAIN= (0..3)
0 0 0 0 
##$XL= 0
##$YL= 0
##$YMAX_a= 9293
##$YMIN_a= -9595
##$ZGOPTNS= <>
##$ZL1= 120
##$ZL2= 120
##$ZL3= 120
##$ZL4= 120
##$ABSF1= 0
##$ABSF2= 0
##$ABSG= 0
##$ABSL= 0
##$ALPHA= 0
##$AQORDER= 0
##$ASSFAC= 0
##$ASSFACI= 0
##$ASSFACX= 0
##$ASSWID= 0
##$AUNMP= <proc_1d>
##$AZFE= 0.1
##$AZFW= 0.5
##$BCFW= 0
##$BC_mod= 2
##$BYTORDP= 0
##$COROFFS= 0
##$CY= -3
##$DATMOD= 1
##$DC= 0
##$DFILT= <>
##$DTYPP= 0
##$F1P= 0
##$F2P= 0
##$FCOR= 1
##$FTSIZE= 65536
##$FT_mod= 6
##$GAMMA= 0
##$GB= 0
##$INTBC= 1
##$INTSCL= 5.30512e-09
##$ISEN= 30
##$LB= 1
##$LEV0= 0
##$LPBIN= 0
##$MAXI= 10000
##$MC2= 0
##$MEAN= 0
##$ME_mod= 0
##$MI= 50
##$NCOEF= 0
##$NC_proc= -5
##$NLEV= 6
##$NOISF1= 182.463
##$NOISF2= 159.3651
##$NSP= 0
##$NTH_PI= 0
##$NZP= 0
##$OFFSET= 182.463
##$PC= 4
##$PHC0= -1613.908
##$PHC1= 671.0013
##$PH_mod= 1
##$PKNL= yes
##$PPARMOD= 0
##$PSCAL= 0
##$PSIGN= 0
##$REVERSE= no
##$SF= 81.0140089999434
##$SI= 65536
##$SIGF1= 159.3651
##$SIGF2= -187.1042
##$SINO= 113.3802
##$SIOLD= 16384
##$SREGLST= <1H.CDCl3>
##$SSB= 0
##$STSI= 65536
##$STSR= 0
##$SW_p= 29940.119760479
##$SYMM= 0
##$S_DEV= 0
##$TDeff= 32768
##$TDoff= 0
##$TI= <>
##$TILT= no
##$TM1= 0
##$TM2= 0
##$TOPLEV= 0
##$USERP1= <user>
##$USERP2= <user>
##$USERP3= <user>
##$USERP4= <user>
##$USERP5= <user>
##$WDW= 1
##$XDIM= 65536
##$YMAX_p= 356921509
##$YMIN_p= -13976059
$$ End of Bruker specific parameters
$$ ---------------------------------
##NTUPLES= NMR SPECTRUM
##VAR_NAME=  FREQUENCY,     SPECTRUM/REAL,   SPECTRUM/IMAG
##SYMBOL=    X,             R,               I
##VAR_TYPE=  INDEPENDENT,   DEPENDENT,       DEPENDENT
##VAR_FORM=  AFFN,          ASDF,            ASDF
##VAR_DIM=   65536,         65536,           65536
##UNITS=     HZ,            ARBITRARY UNITS, ARBITRARY UNITS
##FACTOR=    0.456856943014862, 1,           1
##FIRST=     14782.0589164792, 0,            0
##LAST=      -15158.0608439998, 0,           0
##MIN=       -15158.0608439998, -13976059,   0
##MAX=       14782.0589164792, 356921509,    0
$$ Real data points
##PAGE= N=1
##DATA TABLE= (X++(R..R)), XYDATA
$$ [...]
$$ plain form
36810 1883109 1770450 1616795 1730804 1711581 891760 -433566 -1071317 -507648 388154
36801 388154 690287 649984 913212 1220620 893713 222436 212498 925928 1137461 4250
36791 4250 -1734209 -2734634 -2668258 -2316298 -2396712 -2815568 -2939159 -2234407 -735865 851092
36781 851092 1628760 1332607 568734 46032 -205224 -549180 -912720 -760729 45006 824558
36771 824558 791515 -37229 -896812 -1132132 -780285 -335832 -152034 -159920 -80290 191674
36761 191674 432026 313441 -209754 -781472 -984758 -803155 -635381 -793229 -1103378 -1150746
36751 -1150746 -835938 -460102 -230222 53931 637781 1315285 1560700 1123706 274985
36742 274985 -544716 -1101130 -1338405 -1208438 -712679 -16064 646282 1143921 1416507 1329855
$$ packed form
36810A883109j12659j53655J14009j9223q19821j325326o37751N63669Q95802
36801C88154L02133m0303K63228L07408l26907o71277r938P13430K11533j133211
36791D250j738459j000425O6376L51960q0414m18856j23591P04752J498542J586957
36781H51092P77668k96153p63873n22702k51256l43956l63540J51991Q05735P79552
36771H24558l3043q28744q59583k35320L51847M44453J83798p886P9630K71964
36761A91674K40352j18585n23195n71718k03286J81603J67774j57848l10149m7368
36751a150746L14808L75836K29880K84153N83850O77504K45415m36994q48721
36742B74985q19701n56414k37275J29967M95759O96615O62346M97639K72586q6652
$$ plain form
36732 1329855 774306 -41885 -607361 -619108 -397949 -543943 -1132306 -1496316 -978912 268888
36722 268888 1455744 1993072 1911996 1529528 1053221 571283 112459 -424908 -1156450 -1893126
36712 -1893126 -2187679 -1867431 -1312128 -1040245 -1192516 -1504577 -1533234 -859456 508634
36703 508634 1767834 1883471 879416 38028 286886 892286 501433 -892623 -1949914
36694 -1949914 -1794881 -847816 204995 1242103 2167978 2463486 1868395 906651 200760
36685 200760 -245994 -643527 -846033 -725019 -604828 -706437 -576999 239319 1263197
36676 1263197 1538979 902201 138906 -87544 91469 167882 -122423 -646054 -1010488 -895930
36666 -895930 -511626 -523496 -1172636 -1732947 -1358218 -279550 417413 113702 -804619 -1641356
$$ packed form
36732A329855n55549q16191n65476j1747K21159j45994n88363l64010N17404J247800
36722B68888J186856N37328q1076l82468m76307m81938m58824n37367p31542p36676
36712a893126k94553L20248N55303K71883j52271l12061k8657O73778J368090
36703E08634J259200J15637j004055q41388K48858O05400l90853j394056j057291
36694a949914J55033R47065J052811J037108R25875K95508n95091r61744p05891
36685B00760m46754l97533k02506J21014J20191j01609J29438Q16318J023878
36676A263197K75782o36778p63295k26450J79013P6413k90305n23631l64434J14558
36666h95930L84304j1870o49140n60311L74729J078668O96963l03711r18321q36737
$$ plain form
36656 -1641356 -1994670 -1662082 -618450 692883 1531262 1547357 1013378 364616 -97338
36647 -97338 -107904 398705 969157 1012496 608051 416367 696533 988804 910392 635863
36637 635863 357536 -79509 -649881 -861658 -457352 102274 344334 520055 1070699 1712095
36627 1712095 1702846 903453 20324 -227128 183294 723633 921870 782973 692827 876184
36617 876184 1047388 862690 603616 880069 1579486 1746705 825474 -521704 -1236949
36608 -1236949 -1062485 -520500 -152532 -226702 -783443 -1482905 -1748560 -1478618 -1215414 -1214366
36598 -1214366 -901851 170023 1384672 1801994 1379193 694465 -74968 -1006656 -1692292
36589 -1692292 -1699697 -1500511 -1809447 -2163407 -1410184 351386 1641592 1705965 1465496 1812829
$$ packed form
36656a641356l53314L32588J043632J311333Q38379J6095n33979o48762m61954
36647i7338j0566N06609N70452M3339m04445j91684K80166K92271p8412k74529
36637F35863k78327m37045n70372k11777M04306N59626K42060J75721N50644O41396
36627A712095r249p99393q83129k47452M10422N40339J98237j38897r0146J83357
36617H76184J71204j84698k59074K76453O99417J67219r21231j347178p15245
36608a236949J74464N41985L67968p4170n56741o99462k65655K69942K63204J048
36598a214366L12515J071874J214649M17322m22801o84728p69433r31688o85636
36589a692292p405J99186l08936l53960P53223J761570J290206O4373k40469L47333
$$ plain form
36579 1812829 2146981 1454790 -14728 -1080280 -1093688 -315342 718289 1496431 1573903
36570 1573903 971957 304593 43872 -12078 -129908 27594 892147 2174760 3122427
36561 3122427 3314246 2773300 1698817 596523 216556 712318 1220049 913871 103320
36552 103320 -409917 -633138 -1127871 -1745847 -1699156 -913473 -310050 -518862 -1155312 -1641202
36542 -1641202 -1942947 -2127132 -1920477 -1224621 -516552 -205024 5574 598964 1396162
36533 1396162 1721256 1258067 337478 -518203 -981706 -917140 -341950 506224 1223336 1478322
36523 1478322 1250744 866968 720863 844202 854787 501250 100715 124466 475215 626503
36513 626503 478156 541526 1077666 1533785 1216274 233311 -634859 -864727 -612807 -226874
$$ packed form
36579A812829L34152o92191j469518j065552j3408P78346J033631P78142P7472
36570A573903o01946o67364k60721n5950j17830J57502Q64553J282613R47667
36561C122427J91819n40946j074483j102294l79967M95762N07731l06178q10551
36552A03320n13237k23221m94733o17976M6691P85683O03423k08812o36450m85890
36542a641202l01745j84185K06655O95856P08069L11528K10598N93390P97198
36533A396162L25094m63189r20589q55681m63503O4566N75190Q48174P17112K54986
36523A478322k27578l83776j46105J23339J0585l53537m00535K3751L50749J51288
36513F26503j48347O3370N36140M56119l17511r82963q68170k29868K51920L85933
$$ plain form
36503 -226874 304793 1189601 2233611 2733708 2216178 1151938 510044 517909 399019 -332467
36493 -332467 -925110 -437245 706151 1173802 607744 -23880 -77470 -100835 -584657 -912013
36483 -912013 -377462 509432 704092 160857 -244363 -90269 141856 -77216 -728379 -1475351
36473 -1475351 -1905066 -1608928 -607067 357265 493535 -114716 -749664 -1052164 -1173838
36464 -1173838 -1123143 -752232 -391455 -663661 -1474085 -1924068 -1505558 -722951 -223283 45662
36454 45662 415417 822208 1043752 1170728 1360934 1465705 1343018 1239066 1412641 1612339
36444 1612339 1352538 562857 -372004 -1079395 -1432143 -1470334 -1333387 -1143623 -834198 -310111
36434 -310111 173489 202313 -97912 -79757 443791 817853 558329 138920 166781 333888
$$ packed form
36503b26874N31667Q84808J044010N00097n17530j064240o41894P865j18890p31486
36493c32467n92643M87865J143396M67651n66058o31624n3590k3365m83822l27356
36483i12013N34551Q86894J94660n43235m05220J54094K32125k19072o51163p46972
36473a475351m29715K96138J001861R64332J36270o08251o34948l02500j21674
36464a173838N0695L70911L60777k72206q10424m49983M18510P82607M99668K68945
36454D5662L69755M06791K21544J26976J90206J04771j22687j03952J73575J99698
36444A612339k59801p89681r34861p07391l52748l8191J36947J89764L09425N24087
36434c10111M83600K8824l00225J8155N23548L74062k59524m19409K7861J67107
$$ plain form
36424 333888 -16 -577056 -547313 136505 566124 185130 -562650 -1023849 -1034751 -683700
36414 -683700 -131096 109124 -517643 -1640129 -2006419 -981253 565641 1354468 1154680
36405 1154680 629461 258108 110775 317051 945600 1529105 1446123 834869 521861 918223
36395 918223 1503874 1570734 1013074 167026 -697063 -1387175 -1609650 -1198505 -434115 188860
36385 188860 499245 712143 975180 1150031 1149407 1214394 1605716 2174916 2548055 2665661
36375 2665661 2769409 2824723 2424689 1501806 676055 447493 395171 -208485 -1179730 -1552686
36365 -1552686 -959570 -139414 178513 218185 545990 1061383 1190319 798342 351748 262490
36355 262490 484542 723624 759582 591207 412668 339897 129758 -515260 -1289389 -1432905
$$ packed form
36424C33888l33904n77040K9743O83818M29619l80994p47780m61199j0902L51051
36414f83700N52604K40220o26767j122486l66290J025166J546894P88827j99788
36405A154680n25219l71353j47333K06276O28549N83505q2982o11254l13008L96362
36395I18223N85651O6860n57660q46048q64089o90112k22475M11145P64390O22975
36385A88860L10385K12898K63037J74851o24O4987L91322N69200L73139J17606
36375B665661J03748N5314m00034r22883q25751k28562n2322o03656r71245l72956
36365a552686N93116Q20156L17927L9672L27805N15393J28936l91977m46594q9258
36355B62490K22052K39082L5958j68375j78539p2771k10139o45018p74129j43516
$$ plain form
36345 -1432905 -797391 -202699 -275615 -468600 103202 1251427 1950206 1805720 1473874
36336 1473874 1566245 1838955 1670676 891292 -15721 -290976 403785 1370112 1296864 -162231
36326 -162231 -1609071 -1474489 -82360 822914 459469 -229433 -289965 14899 140620
36317 140620 287942 772718 1233811 1240629 1026740 916521 654247 30358 -427072 -193789
36307 -193789 308020 320551 -104048 -364965 -348359 -380842 -450640 -297521 -49176 8160
36297 8160 64839 432929 824612 798125 636755 870982 1194409 901384 209619 -39153
36287 -39153 69142 -393481 -1391939 -1635564 -603421 464850 390942 -262897 -296429 286366
36277 286366 643865 612091 677673 860659 759827 492920 536397 718416 388185 -348263
$$ packed form
36345a432905O35514N94692p2916j92985N71802J148225O98779j44486l31846
36336A473874R2371K72710j68279p79384r07013k75255O94761R66327p3248j459095
36326a62231j446840J34582J392129R05274l63445o88902o0532L04864J25721
36317A40620J47322M84776M61093O818k13889j10219k62274o23889m57430K33283
36307a93789N01809J2531m24599k60917J6606l2483o9798J53119K48345N7336
36297H160N6679L68090L91683k6487j61370K34227L23427k93025o91765k48772
36287c9153J08295m62623r98458k43625J032143J068271p3908o53839l3532N82795
36277B86366L57499l1774O5582J82986j00832k66907M3477J82019l30231p36448
$$ plain form
36267 -348263 -518912 341884 1501241 2032002 1864504 1477519 1090413 619396 98335
36258 98335 -291237 -479107 -530602 -499488 -404392 -265424 -103701 -7357 -160544 -597539
36248 -597539 -960273 -802684 -197188 259278 172227 -175181 -246079 51362 294743 83495
36238 83495 -504052 -953673 -769971 29484 850774 1058710 582523 -129691 -704397 -1139119
36228 -1139119 -1474972 -1498565 -1003316 -176864 516519 781426 657920 334837 4491 -136995
36218 -136995 16926 311101 397417 77633 -478850 -892969 -873556 -344005 568780 1531272
36208 1531272 2079846 1922876 1252794 650487 562479 864631 981190 462351 -513282 -1192250
36198 -1192250 -900155 237524 1299534 1473562 911175 434604 419061 370170 -218359
$$ packed form
36267c48263j70649Q60796J159357N30761j67498l86985l87106m71017n21061
36258I8335l89572j87870n1495L1114R5096J38968J61723R6344j53187m36995
36248e97539l62734J57589O05496M56466q7051l47408p0898K97441K43381k11248
36238H3495n87547m49621J83702P99455Q21290K07936m76187p12214n74706m34722
36228a139119l35853k3593M95249Q26452O93383K64907j23506l23083l30346j41486
36218a36995J53921K94175Q6316l19784n56483m14119J9413N29551R12785R62492
36208A531272N48574j56970o70082o02307q8008L02152J16559n18839r75633o78968
36198a192250K92095J137679J062010J74028n62387m76571j5543m8891n88529
$$ plain form
36189 -218359 -1020152 -1311304 -997571 -692264 -817535 -1103962 -1075487 -655067 -135209 193294
36179 193294 245356 136900 31757 -106580 -488855 -1026091 -1123187 -369944 730556 1267674
36169 1267674 1067863 712122 473004 59652 -438673 -318355 542074 1105695 522106
36160 522106 -609763 -1141924 -1007800 -1016091 -1380461 -1505507 -1152758 -815320 -788368 -722815
36150 -722815 -357196 25893 179950 332945 723331 1178802 1442359 1506040 1402070 1086639
36140 1086639 731769 668518 791284 488313 -504653 -1587543 -2007898 -1787462 -1592045
36131 -1592045 -1908161 -2619223 -3164603 -2907828 -1657595 -70182 817558 768521 691936
36122 691936 1404287 2406800 2486591 1351080 3189 -559078 -408047 -197402 -90089
$$ packed form
36189b18359q01793k91152L13733L05307j25271k86427K8475M20420N19858L28503
36179A93294N2062j08456j05143j38337l82275n37236r7096P53243J100500N37118
36169A267674j99811l55741k39118m13352m98325J20318Q60429N63621n83589
36160E22106j131869n32161J34124q291l64370j25046L52749L37438K6952O5553
36150g22815L65619L83089J54057J52995L90386M55471K63557O3681j03970l15431
36140A086639l54870o3251J22766l02971r92966j082890m20355K20436J95417
36131a592045l16116p11062n45380K56775J250233J587413Q87740m9037p6585
36122F91936P12351J002513P9791j135511j347891n62267J51031K10645J07313
$$ plain form
36113 -90089 340074 1264325 2114332 2150183 1350126 486341 269685 598249 791902 437059
36103 437059 -225974 -704131 -775461 -561132 -302605 -193977 -310191 -585173 -872699 -1013173
36093 -1013173 -834930 -266043 411836 633601 145430 -637918 -1167868 -1430269 -1659284
36084 -1659284 -1640029 -969221 33445 413670 -238425 -1309842 -2035777 -2210009 -1848660
36075 -1848660 -947787 10598 101184 -839672 -1662436 -1295917 -218340 241223 -298935
36066 -298935 -1022553 -1250350 -1147300 -1087532 -1082960 -1017840 -903673 -730249 -422612 4830
36056 4830 511882 1106802 1558421 1357166 455207 -290124 -62080 797634 1334089 1359111
36046 1359111 1410470 1564451 1372611 937231 842076 852889 13996 -1507167 -2054040 -820463
$$ packed form
36113i0089M30163R24251Q50007L5851q00057q63785k16656L28564J93653l54843
36103D37059o63033m78157p1330K14329K58527J08628j16214k74982k87526j40474
36093a013173J78243N68887O77879K21765m88171p83348n29950k62401k29015
36084a659284J9255O70808J002666L80225o52095j071417p25935j74232L61349
36075a848660R00873R58385R0586r40856q22764L66519J077577M59563n40158
36066b98935p23618k27797J03050N9768M572O5120J14167J73424L07637M27442
36056D830N07052N94920M51619k01255r01959p45331K28044Q59714N36455K5022
36046A359111N1359J53981j91840m35380r5155J0813q38893j521163n46873J233577
$$ plain form
36036 -820463 660352 560648 -639306 -1006671 -5846 1075267 1331847 1257602 1325133
36027 1325133 1058510 200381 -363290 221747 1418816 2038983 1856144 1580424 1522474
36018 1522474 1258212 643151 271558 598940 1231662 1516367 1413952 1319157 1285677 975696
36008 975696 345572 -108048 48256 653355 1221982 1511165 1581957 1469366 1103852 555513
35998 555513 107166 -6237 191137 516655 845084 1172729 1516647 1782228 1751820 1297317
35988 1297317 649479 310704 548224 1066616 1350693 1252963 1059720 1073551 1377982 1938702
35978 1938702 2601305 2959837 2592757 1616259 756538 647861 1185237 1731873 1840317
35969 1840317 1584119 1251832 939336 554463 160288 126583 727063 1589058 1858686 1140192
$$ packed form
36036h20463J480815r9704j199954l67365J000825J081113K56580p4245O7531
36027A325133k66623q58129n63671N85037J197069O20167j82839k75720n7950
36018A522474k64262o15061l71593L27382O32722K84705j02415r4795l3480l09981
36008I75696o30124m53620J56304O05099N68627K89183P0792j12591l65514n48339
35998E55513m48347j13403J97374L25518L28429L27645L43918K65581l0408m54503
35988A297317o47838l38775K37520N18392K84077r7730j93243J3831L04431N60720
35978A938702O62603L58532l67080r76498q59721j08677N37376N46636J08444
35969A840317k56198l32287l12496l84873l94175l3705O00480Q61995K69628p18494
$$ plain form
35959 1140192 35967 -559206 -500962 -345091 -453401 -701806 -1009020 -1495796 -1988989
35950 -1988989 -2003872 -1478649 -941565 -640397 -141858 744007 1294786 849199 -22771 -178265
35940 -178265 527892 1228089 1499961 1843542 2496857 2736178 1929882 631460 -92184
35931 -92184 -79767 -125500 -715152 -1359814 -1344997 -689252 -73120 -43579 -553080 -1163441
35921 -1163441 -1418294 -1022384 14975 1206283 1775481 1351198 410570 -270218 -525671
35912 -525671 -724270 -821678 -211961 1126294 2046695 1544358 222559 -438893 -75886
35903 -75886 309245 117905 9204 514170 886831 274734 -681967 -581001 694520 1804638
35893 1804638 1863518 1433637 1298488 1259913 815384 269153 279476 702682 805158 501741
$$ packed form
35959A140192j104225n95173N8244J55871j08310k48405l07214m86776m93193
35950a988989j4883N25223N37084L01168M98539Q85865N50779m45587q71970j55494
35940a78265P06157P00197K71872L43581O53315K39321q06296j298422p23644
35931i2184J2417m5733n89652o44662J4817O55745O16132K9541n09501o10361
35921a163441k54853L95910J037359J191308N69198m24283r40628o80788k55453
35912e25671j98599r7408O09717J338255R20401n02337j321799o61452L63007
35903g5886L85131j91340j08701N04966L72661o12097r56701J00966J275521J110118
35893A804638N8880m29881j35149l8575m44529n46231J0323M23206J02476l03417
$$ plain form
35883 501741 488340 1004323 1271295 559839 -756760 -1678130 -1713154 -1097540 -211559 696431
35873 696431 1378581 1665809 1618524 1258366 338243 -1163964 -2506504 -2761099 -1929498
35864 -1929498 -884645 -149164 581320 1498807 2028515 1630022 722851 214748 421034
35855 421034 958281 1400126 1487602 964277 -136946 -1148410 -1343168 -871844 -566978
35846 -566978 -764548 -891325 -401381 372998 606314 -60402 -1152056 -1768587 -1295533
35837 -1295533 45926 1291403 1615219 1163579 790774 1027147 1640173 2153141 2330961
35828 2330961 2104218 1517846 916711 704260 702074 237207 -827560 -1629461 -1316040 -162864
35818 -162864 811043 1089593 995618 933093 872259 656343 364903 182614 168362 306303
$$ packed form
35883E01741j3401N15983K66972p11456j316599r21370l5024O15614Q85981R07990
35873F96431O82150K87228m7285l60158r20123j502207j342540k54595Q31601
35864a929498J044853P35481P30484R17487N29708l98493r07171n08103K06286
35855D21034N37247M41845Q7476n23325j101223j011464j94758M71324L04866
35846e66978j97570j26777M89944P74379K33316o66716j091654o16531M73054
35837a295533J341459J245477L23816m51640l72805K36373O13026N12968J77820
35828B330961k26743n86372o01135k12451k186m64867j064767q01901L13421J153176
35818a62864R73907K78550r3975o2525o0834k15916k91440j82289j4252J37941
$$ plain form
35808 306303 611560 1056841 1492089 1729668 1684524 1417011 1060367 698837 335492 29436
35798 29436 -18978 299085 722287 836636 608472 411223 444090 470063 292240 111223
35788 111223 134241 186783 83458 64935 396371 782345 745938 449546 502320 940567
35778 940567 1067237 508339 -183809 -356458 -194435 -331938 -860214 -1314953 -1522302 -1831422
35768 -1831422 -2389413 -2730822 -2422247 -1759719 -1391010 -1413819 -1322417 -849153 -360483 -208557
35758 -208557 -129401 305659 923111 1153005 908389 724598 957804 1340227 1497490 1451367
35748 1451367 1362395 1184684 886042 653514 542512 257679 -338817 -818948 -718919 -198599
35738 -198599 273227 587126 815447 687185 -40353 -848924 -885082 -119075 663645 1043272
$$ packed form
35808C06303L05257M45281M35248K37579m5144k67513l56644l61530l63345l06056
35798B9436m8414L18063M23202J14349k28164j97249L2867K5973j77823j81017
35788A11223K3018N2542j03325j8523L31436L85974l6407k96392N2774M38247
35778I40567J26670n58898o92148j72649J62023j37503n28276m54739k07349l09120
35768a831422n57991l41409L08575O62528L68709k2809R1402M73264M88670J51926
35758b08557P9156M35060O17452K29894k44616j83791K33206L82423J57263m6123
35748A451367q8972j77711k98642k32528j11002k84833n96496m80131J00029N20320
35738a98599M71826L13899K28321j28262p27538q08571l6158P66007P82720L79627
$$ plain form
35728 1043272 1296759 1446864 1002808 72077 -268375 540441 1473694 1271298 272444
35719 272444 -152765 345043 767296 441114 -130006 -351671 -459760 -844692 -1237983 -1204577
35709 -1204577 -889427 -618914 -174776 803877 1893603 2105894 1127859 -189800 -770465
35700 -770465 -384652 373874 876849 984682 941398 1002717 1209994 1433282 1536287 1432115
35690 1432115 1025732 280603 -577012 -1086114 -950057 -342234 274163 513088 195651
35681 195651 -615135 -1485711 -1780887 -1330392 -765061 -774353 -1143753 -1028140 -156509 807643
35671 807643 1211117 1101311 712042 -93331 -1319334 -2230908 -1965566 -663459 550589
35662 550589 723780 -133574 -1297974 -1966339 -1741858 -939984 -388762 -545268 -900020
$$ packed form
35728A043272K53487J50105m44056r30731l40452Q08816R33253k02396r98854
35719B72444m25209M97808M22253l26182n71120k21665j08089l84932l93291L3406
35709a204577L15150K70513M44138R78653J089726K12291r78035j317659n80665
35700g70465L85813P58526N02975J07833m3284O1319K07277K23288J03005j04172
35690A432115m06383p45129q57615n09102J36057O07823O16397K38925l17437
35681A95651q10786q70576k95176M50495N65331r292l69400J15613Q71631R64152
35671H07643M03474j09806l89269q05373j226003r11574K65342J302107J214048
35662E50589J73191q57354j164400o68365K24481Q01874N51222j56506l54752
$$ plain form
35653 -900020 -681619 8767 370268 137752 -101246 43828 166881 -145761 -600880 -731004
35643 -731004 -574445 -331765 99811 642615 610668 -433831 -1715486 -2001079 -1196632
35634 -1196632 -337601 12601 414681 1314626 2023311 1586831 204226 -904563 -914561
35625 -914561 -184334 343175 132598 -617144 -1334325 -1578342 -1294305 -751154 -308494 -202276
35615 -202276 -444944 -869398 -1309166 -1737619 -2132696 -2244555 -1768169 -851547 -122271 40181
35605 40181 -2538 309613 949531 1451234 1618664 1594894 1384339 900402 458235 578625
35595 578625 1169029 1483964 1114076 479188 81929 -185144 -616336 -1054355 -1144813 -901147
35585 -901147 -581041 -279900 -70351 -264413 -1025123 -1873048 -2078292 -1507551 -701725 -187006
$$ packed form
35653i00020K18401O90386L61501k32516k38998J45074J23053l12642m55119j30124
35643g31004J56559K42680M31576N42804l1947j044499j281655k85593Q04447
35634a196632Q59031L50202M02080Q99945P08685m36480j382605j108789r998
35625i14561P30227N27509k10577p49742p17181k44017K84037N43151M42660J06218
35615b02276k42668m24454m39768m28453l95077j11859M76386R16622P29276J62452
35605D0181m2719L12151O39918N01703J67430k3770k10555m83937m42167J20390
35595E78625N90404L14935l69888o34888l97259k67073m31192m38019r0458K43666
35585i01147L20106L01141K09549j94062p60710q47925k05244N70741Q05826N14719
$$ plain form
35575 -187006 -89230 -333714 -750565 -949658 -556514 244879 728682 399178 -448085 -1101737
35565 -1101737 -1214917 -1031056 -913153 -861843 -605592 -78309 412042 593535 590202 610236
35555 610236 470693 -109046 -811373 -924148 -362848 164921 290812 541486 1236274 1581938
35545 1581938 760938 -580299 -1013707 -298976 434802 478331 346479 517172 528403 -25006
35535 -25006 -526540 -237836 439407 496280 -221301 -898280 -934627 -523867 -100007 161765
35525 161765 242989 178852 138603 262388 420512 431810 419632 607290 894491 1032674
35515 1032674 1072822 1174702 1118070 585419 -125321 -333644 -10889 89748 -434764 -1030183
35505 -1030183 -1095361 -905102 -1037389 -1270488 -757460 755050 2438147 3220139 2772607
$$ packed form
35575a87006R7776k44484m16851j99093L93144Q01393M83803l29504q47263o53652
35565a101737j13180J83861J17903N1310K56251N27283M90351J81493l333K0034
35555F10236j39543n79739p02327j12775N61300N27769J25891K50674O94788L45664
35545A581938q21000j341237m33408P14731P33778M3529j31852J70693J1231n53409
35535b5006n01534K88704O77243N6873p17581o76979l6347M10760M23860K61772
35525A61765Q1224o4137m0249J23785J58124J1298j2178J87658K87201J38183
35515A032674M0148J01880n6632n32651p10740k08323L22755J00637n24512n95419
35505a030183o5178J90259j32287k33099N13028J512510J683097P81992m47532
$$ plain form
35496 2772607 1577427 317762 -607476 -1104069 -1161333 -781903 -170008 206498 31611
35487 31611 -397127 -438550 76636 600719 567987 48135 -449276 -532125 -137482 482317
35477 482317 811228 482787 -156172 -339911 14468 80561 -591798 -1233479 -980505 -235465
35467 -235465 13856 -231400 -203500 121242 31717 -411261 -272071 556747 940052 381963
35457 381963 -15828 623017 1377461 994121 -29443 -288572 188031 21229 -1238163
35448 -1238163 -2382143 -2308100 -1319466 -346098 141662 75428 -497785 -1211210 -1512636 -1326182
35438 -1326182 -1086214 -1016391 -982097 -1056428 -1416079 -1598529 -838464 586261 1339120 781569
35428 781569 -203545 -625219 -585608 -409749 300836 1689165 2631319 2044337 683361
$$ packed form
35496B772607j195180j259665r25238m96593n7264L79430O11895L76506j74887
35487C1611m28738m1423N15186N24083l2732n19852m97411q2849L94643O19799
35477D82317L28911l28441o38959j83739L54379O6093o72359o41681K52974P45040
35467b35465K49321k45256K7900L24742q9525m42978J39190Q28818L83305n58089
35457C81963l97791O38845P54444l83340j023564k59129M76603j66802j259392
35448a238163j143980P4043R88634R73368M87760o6234n73213p13425l01426J86454
35438a326182K39968O9823L4294p4331l59651j82450P60065J424725P52859n57551
35428G81569r85114m21674L9611J75859P10585J388329R42154n86982j360976
$$ plain form
35419 683361 279107 1127220 1849899 1518587 716641 278223 176991 134391 325694 835561
35409 835561 1139106 810825 285275 302124 882911 1355748 1205901 514646 -295669 -834115
35399 -834115 -958157 -836548 -711729 -522575 19036 877083 1526245 1572650 1307028 1348793
35389 1348793 1845958 2278007 2050909 1164212 285959 162958 846628 1500474 1163752
35380 1163752 -193605 -1501926 -1591569 -335635 1220132 1827861 1178139 143048 -163684
35371 -163684 417615 1014750 901440 400412 292257 627141 679066 38713 -797396 -1095673
35361 -1095673 -756506 -304871 -252129 -634932 -1047374 -1063321 -732253 -586192 -976771 -1556909
35351 -1556909 -1720949 -1403393 -1026904 -778399 -472464 -126473 -70739 -332656 -470174 -280662
$$ packed form
35419F83361m04254Q48113P22679l31312q01946m38418j01232m2600J91303N09867
35409H35561L03545l28281n25550J6849N80787M72837j49847o91255q10315n38446
35399h34115j24042J21609J24819J89154N41611Q58047O49162M6405k65622M1765
35389A348793M97165M32049k27098q86697q78253j23001O83670O53846l36722
35380A163752j357357j308321q9643J255934J555767O07729o49722j035091l06732
35371a63684N81299N97135j13310n01028j08155L34884N1925o40353q36109k98277
35361a095673L39167M51635N2742l82803m12442j5947L31068J46061l90579n80138
35351a556909j64040L17556L76489K48505L05935L45991N5734k61917j37518J89512
$$ plain form
35341 -280662 -189203 -596984 -1239073 -1564803 -1469479 -1280827 -1200345 -1076615 -661430 78635
35331 78635 832825 1110335 730992 144402 -19239 294593 580850 474141 -18755 -877566
35321 -877566 -1967654 -2546083 -1764465 -27342 1014657 448174 -655857 -754737 34363
35312 34363 328062 -344322 -900068 -341379 904860 1650305 1349794 475865 -146753 -85522
35302 -85522 431449 825937 815581 687038 795201 1008128 964624 699209 584876 722366
35292 722366 794604 527323 -40048 -713385 -1260403 -1442911 -1275144 -1164584 -1423670 -1737121
35282 -1737121 -1547513 -908630 -466767 -566763 -852807 -850325 -506546 -24052 433191 689695
35272 689695 563154 130988 -241679 -287815 -76539 175105 312163 263196 106830 98536
$$ packed form
35341b80662R1459m07781o42089l25730R5324J88652Q0482J23730M15185P40065
35331G8635P54190K77510l79343n86590j63641L13832K86257j06709m92896q58811
35321h77566j090088n78429P81618J737123J041999n66483j104031r8880P89100
35312C4363K93699o72384n55746N58689J246239P45445l00511q73929o22618O1231
35302h5522N16971L94488j0356j28543J08163K12927m3504k65415j14333J37490
35292G22366P2238k67281n67371o73337n47018j82508J67767J10560k59086l13451
35282a737121J89608O38883M41863r9996k86044K482L43779M82494M57243K56504
35272F89695j26541m32166l72667m6136K11276K51644J37058m8967j56366q294
$$ plain form
35262 98536 342621 482295 83702 -673851 -1099305 -841201 -241714 235225 499769 616264
35252 616264 519703 214281 -43032 -3677 315484 755628 1165103 1346996 1151852 739021
35242 739021 468890 435925 390116 179761 -77149 -328400 -662715 -913525 -671025 51810
35232 51810 622600 617210 446918 706264 1180354 1033057 -73786 -1464753 -2128316 -1711226
35222 -1711226 -813717 -370931 -690166 -1130194 -920479 -202166 173230 -98587 -340091
35213 -340091 -12918 361297 19359 -725255 -785730 155164 1154907 1253837 646075 279376
35203 279376 627616 1235864 1384645 907696 259943 -99371 -206366 -385107 -677675 -735549
35193 -735549 -298015 461703 1122800 1308385 773683 -416221 -1651531 -2128133 -1703681
$$ packed form
35262I8536K44085J39674l98593p57553m25454K58104N99487M76939K64544J16495
35252F16264r6561l05422k57313L9355L19161M40144M09475J81893j95144m12831
35242G39021k70131l2965m5809k10355k56910k51251l34315k50810K42500P22835
35232E1810N70790n390j70292K59346M74090j47297j106843j390967o63563M17090
35222a711226Q97509M42786l19235m40028K09715P18313L75396k71817k41504
35213c40091L27173L74215l41938p44614o0475R40894R99743R8930o07762l66699
35203B79376L48240O08248J48781m76949o47753l59314j06995j78741k92568n7874
35193g35549M37534P59718O61097J85585n34702j189904j235310m76602M24452
$$ plain form
35184 -1703681 -1060001 -740702 -441405 338800 1346218 1847460 1612132 1054296 584148
35175 584148 402176 749555 1652406 2475644 2491042 1964446 1908823 2572446 2987352 2391660
35165 2391660 1308576 631744 334881 -117888 -585961 -443688 227719 584964 237962
35156 237962 -293522 -538417 -733395 -1163013 -1489635 -1259558 -641190 -144448 78160 170112
35146 170112 113537 -122379 -210275 147594 588050 478070 -106773 -460534 -336373 -232085
35136 -232085 -443182 -628601 -635976 -913600 -1543094 -1672915 -745990 356294 424838 -264659
35126 -264659 -421982 194273 505724 26719 -308562 238189 943343 806852 128116 -78192
35116 -78192 339897 690465 723053 908624 1459683 1888344 1717141 1108687 642008 763677
$$ packed form
35184a703681O43680L19299K99297P80205J007418N01242k35328n57836m70148
35175E84148j81972L47379R02851Q23238J5398n26596n5623O63623M14906n95692
35165B391660j083084o76832k96863m52769m68073J42273O71407L57245l47002
35156B37962n31484k44895j94978m29618l26622K30077O18368M96742K22608R1952
35146A70112n6575k35916q7896L57869M40456j09980n84843l53761J24161J04288
35136b32085k11097j85419p375k77624o29494j29821R26925J102284O8544o89497
35126b64659j57323O16255L11451m79005l35281N46751P05154j36491o78736k06308
35116g8192M18089L50568L2588J85571N51059M28661j71203o08454m66679J21669
$$ plain form
35106 763677 1418724 1936167 1461168 -100073 -1738862 -2380026 -2066472 -1610835 -1296621
35097 -1296621 -642397 558106 1720279 2231899 2143074 1786047 1198981 340506 -439354
35088 -439354 -606119 -79504 615132 902905 779368 791120 1314593 1921296 1773976 773932
35078 773932 -120921 -111988 296685 -4155 -1112862 -1973524 -1866450 -1245344 -831248 -593958
35068 -593958 -113182 566892 1026532 1149868 1198397 1302095 1275778 936208 336785 -322447
35058 -322447 -854777 -1156074 -1193232 -919684 -268645 621108 1256018 1154527 396635 -442522
35048 -442522 -917135 -1006631 -853696 -612511 -549745 -798135 -936184 -384695 611283 1058807
35038 1058807 614767 209619 697240 1506233 1460666 533564 -188988 -154418 53269 -103965
$$ packed form
35106G63677O55047N17443m74999j561241j638789o41164L13554M55637L14214
35097a296621O54224J200503J162173N11620q8825l57027n87066q58475p79860
35088d39354j66765N26615O94636K87773j23537J1752N23473O06703j47320j000044
35078G73932q94853Q933M08673l00840j108707q60662J07074O21106M14096K37290
35068e93958M80776O80074M59640J23336M8529J03698k6317l39570n99423o59232
35058c22447n32330l01297l7158K73548O51039Q89753O34910j01491p57892q39157
35048d42522m74613q9496J52935K41185O2766k48390j38049N51489R95978M47524
35038A058807m44040m05148M87621Q08993m5567r27102p22552L4570K07687j57234
$$ plain form
35028 -103965 -286662 -50204 320859 356830 249945 475666 875485 819110 198081 -385291
35018 -385291 -516718 -518143 -868443 -1473248 -1800632 -1484030 -537144 768102 1902129 2181452
35008 2181452 1376455 237864 -44284 893657 2181012 2777692 2632776 2459265 2604875
34999 2604875 2638145 2077847 1107803 335862 43163 -83955 -486215 -1135742 -1501216 -1136387
34989 -1136387 -237893 521600 726721 607908 634081 933420 1256263 1298999 889106 94009
34979 94009 -605020 -520884 463572 1504297 1631648 902933 277247 375737 853450 1066695
34969 1066695 872751 568767 419969 488291 667779 702156 377464 -171541 -538935 -501603
34959 -501603 -188887 219075 692744 1206819 1647148 1901265 1851185 1396061 773532 613540
$$ packed form
35028a03965j82697K36458L71063L5971j06885K25721L99819n6375o21029n83372
35018c85291j31427j425l50300o04805l27384L16602R46886J305246J134027K79323
35008B181452q04997j138591k82148R37941J287355N96680j44916j73511J45610
34999B604875L3270n60298r70044p71941k92699j27118m02260o49527l65474L64829
34989a136387Q98494P59493K05121j18813K6173K99339L22843M2736m09893p95097
34979I4009o99029Q4136R84456J040725J27351p28715o25686R8490M77713K13245
34969A066695j93944l03984j48798O8322J79488L4377l24692n49005l67394L7332
34959e01603L12716M07962M73669N14075M40329K54117n0080m55124o22529j59992
$$ plain form
34949 613540 1136226 1495882 700188 -811715 -1407652 -365536 1094143 1357293 301966
34940 301966 -915185 -1344434 -883767 61098 868682 989703 547288 370714 934677
34931 934677 1623042 1558632 742809 -212160 -1016074 -1647002 -1804107 -1292873 -683246 -687048
34921 -687048 -1041865 -891824 -155468 400537 387881 137200 -188457 -775343 -1307005 -1030480
34911 -1030480 -47673 481059 -40354 -720032 -504648 382640 1047516 1235984 1208412 922023
34901 922023 311064 -27350 537247 1519808 1787600 1182762 731755 1062748 1543298 1436315
34891 1436315 1134317 1525314 2554679 3197885 2800346 1791654 921993 336550 -223765
34882 -223765 -670807 -601652 -72380 222662 -145148 -615976 -278100 922015 2095674
$$ packed form
34949F13540N22686L59656p95694j511903n95937J042116J459679K63150j055327
34940C01966j217151m29249M60667R44865Q07584J21021m42415j76574N63963
34931I34677O88365o4410q15823r54969q03914o30928j57105N11234O09627l802
34921f87048l54817J50041P36356N56005j2656k50681l25657n86886n31662K76525
34911a030480R82807N28732n21413o79678K15384Q87288O64876J88468k7572k86389
34901I22023o10959l38414N64597R82561K67792o04838m51007L30993M80550j06983
34891A436315l01998L90997J029365O43206l97539j008692q69661n85443n60315
34882b23765m47042O9155N29272K95042l67810m70828L37876J200115J173659
$$ plain form
34873 2095674 2554122 2534095 2574939 2608877 2096672 896536 -407896 -1069789 -822755 40618
34863 40618 973761 1465700 1255798 513375 -202243 -358640 48022 478461 437000 -5528
34853 -5528 -410305 -572467 -643245 -695465 -575785 -312155 -230755 -388101 -308446 276807 780571
34842 780571 431062 -611185 -1424628 -1510268 -1154578 -654816 40348 738684 828849 133449
34832 133449 -637977 -789991 -560091 -617694 -999355 -1142399 -804211 -364680 -208079 -262096
34822 -262096 -235553 14860 438016 850864 975691 647032 94045 -151255 230100 996119
34812 996119 1634783 1965030 2272824 2762401 3073104 2662745 1638974 770456 492843
34803 492843 363303 -126948 -644516 -510920 205893 825429 1121369 1458421 1891805 1986695
$$ packed form
34873B095674M58448k0027M0844L3938n12205j200136j304432o61893K47034Q63373
34863D0618R33143M91939k09902p42423p15618j56397M06662M30439m1461m42528
34853e528m04777j62162p0778n2220J19680K63630Q1400j57346P9655N85253N03764
34842G80571l49509j042247q13443q5640L55690M99762O95164O98336R0165o95400
34832A33449p71426j52014K29900n7603l81661j43044L38188M39531J56601n4017
34822b62096K6543K50413M23156M12848J24827l28659n52987k45300L81355P66019
34812I96119O38664L30247L07794M89577L10703m10359j023771q68518k77613
34803D92843j29540m90251n17568J33596P16813O19536K95940L37052M33384R4890
$$ plain form
34793 1986695 1659251 1339427 1086363 462473 -375528 -480819 396097 1112279 761868
34784 761868 112475 343143 1082876 1042117 187320 -182171 476454 1172820 1025066 495010
34774 495010 440744 861786 1211543 1267168 1089564 666831 161377 64514 589124 1292656
34764 1292656 1739166 2076840 2453687 2381762 1433400 226753 -173144 242475 420168
34755 420168 -107366 -471721 142193 1096892 1103177 50201 -894256 -1019869 -971438 -1486032
34745 -1486032 -2009971 -1415288 228415 1529675 1521439 742450 246299 205391 69777 -327123
34735 -327123 -539582 -294548 93834 209865 47337 -108860 -72651 80128 100220 -212436
34725 -212436 -758611 -1126889 -943712 -235209 579941 978737 672057 -88357 -540378 -126325
$$ packed form
34793A986695l27444l19824k53064o23890q38001j05291Q76916P16182l50411
34784G61868o49393K30668P39733m0759q54797l69491O58625O96366j47754n30056
34774D95010n4266M21042L49757N5625j77604m22733n05454r6863N24610P03532
34764A292656M46510L37674L76847p1925r48362j206647l99897M15619J77693
34755D20168n27534l64355O13914R54699O285j052976r44457j25613M8431n14594
34745a486032n23939N94683J643703J301260q236p78989m96151m0908j35614l96900
34735c27123k12459K45034L88382J16031j62528j56197L6209J52779K0092l12656
34725b12436n46175l68278J83177P08503Q15150L98796l06680p60414m52021M14053
$$ plain form
34715 -126325 729218 1013019 467556 -42370 139128 437859 28769 -734470 -821932 -180696
34705 -180696 163350 -304664 -867088 -711552 367 560864 586266 116164 -597415 -1039686
34695 -1039686 -673489 369937 1223969 1259869 800578 575605 795943 1060025 892125
34686 892125 130579 -948279 -1710603 -1669309 -1060743 -607348 -631170 -810410 -853022 -830009
34676 -830009 -704070 -229675 364426 313599 -570436 -1365675 -1205135 -402404 242137 693839
34666 693839 1400285 2161426 2261901 1632622 1013443 898727 1038637 1085166 1086938 1173697
34656 1173697 1257950 1203521 923933 327665 -409494 -626997 162509 1398718 1920127 1414280
34646 1414280 773754 780936 1094525 949593 324248 -147496 -136960 29963 -88552 -519417
$$ packed form
34715a26325Q55543K83801n45463n09926J81498K98731m09090p63239q7462O41236
34705a80696L44046m68014n62424J55536P11919N60497K5402m70102p13579m42271
34695a039686L66197J043426Q54032L5900m59291k24973K20338K64082j67900
34686H92125p61546j078858p62324M1294O08566M53395k3822j79240m2612K3013
34676h30009J25939M74395N94101n0827q84035p95239J60540Q02731O44541M51702
34666F93839P06446P61141J00475o29279o19179j14716J39910M6529J772Q6759
34656A173697Q4253n4429k79588n96268p37159k17503P89506J236209N21409n05847
34646A414280o40526P182L13589j44932o25345m71744J0536J66923j18515m30865
$$ plain form
34636 -519417 -887412 -781491 -150818 581450 908400 782706 600216 637430 786064 905117
34626 905117 1072176 1288265 1263898 808806 232383 49596 389782 930529 1328133 1515026
34616 1515026 1657497 1984985 2546426 2972459 2659763 1474612 162671 -303367 177488
34607 177488 724091 613508 221121 480019 1545977 2485865 2466622 1829895 1530738 1729526
34597 1729526 1594335 610405 -576868 -1043443 -797656 -509439 -374674 15342 800590
34588 800590 1612610 2251234 2850545 3205874 2718940 1375298 61038 -585685 -972846
34579 -972846 -1591908 -1934906 -1288835 -152264 275351 -88309 -82432 769185 1351322 616267
34569 616267 -750762 -1247459 -605142 92538 148625 68496 444125 927225 857041 341687
$$ packed form
34636e19417l67995J05921O30673P32268L26950j25694j82490L7214J48634J19053
34626I05117J67059K16089k4367m55092n76423j82787L40186N40747L97604J86893
34616A515026J42471L27488N61441M26033l12696j185151j311941m66038M80855
34607A77488N46603j10583l92387K58898J065958R39888j9243o36727k99157J98788
34597A729526j35191r83930j187273m66575K45787K88217J34765L90016P85248
34588H00590Q12020O38624N99311L55329m86934j343642j314260o46723l87161
34579i72846o19062l42998O46071J136571M27615l63660N877Q51617N82137p35055
34569F16267j367029m96697O42317O97680N6087q0129L75629M83100p0184n15354
$$ plain form
34559 341687 44485 140168 138575 -241672 -601364 -501670 -174123 -202635 -651390 -905619
34549 -905619 -470828 315415 580671 -93553 -1118779 -1438283 -619042 689020 1449379
34540 1449379 1287879 692932 281793 207097 357160 726849 1251033 1537468 1221212 499318
34530 499318 -109454 -486114 -907391 -1303576 -1140795 -327705 305803 -66583 -1181914
34521 -1181914 -2018340 -1995971 -1361830 -549545 273642 1025660 1601639 2063563 2542352 2868303
34511 2868303 2686927 2030041 1376081 1033906 863281 708859 642053 595304 265467 -337151
34501 -337151 -743046 -775892 -913651 -1403433 -1556659 -667866 712812 1285006 668921 -248532
34491 -248532 -649404 -632932 -564646 -403306 -49187 307339 613216 1148646 1846207 1990335
$$ packed form
34559C41687k97202R5683j593l80247l59692R9694L27547k8512m48755k54229
34549i05619M34791P86243K65256o74224j025226l19504Q19241J308062P60359
34540A449379j61500n94947m11139p4696J50063L69689N24184K86435l16256p21894
34530D99318o08772l76660m21277l96185J62781Q13090O33508l72386j115331
34521a181914q36426K2369O34141Q12285Q23187P52018N75979M61924M78789L25951
34511B868303j81376o56886o53960l42175j70625j54422o6806m6749l29837o02618
34501c37151m05895l2846j37759m89782j53226Q88793J380678N72194o16085r17453
34491b48532m00872J6472O8286J61340L54119L56526L05877N35430O97561J44128
$$ plain form
34481 1990335 1184879 167466 -4148 717968 1487360 1763108 1716129 1577361 1301597
34472 1301597 931177 678861 518165 196296 -228424 -355696 -101027 103535 -415
34463 -415 -49182 360622 946084 987861 229263 -725004 -937950 -32535 1386801 2238967
34453 2238967 2011850 1235404 776845 850511 1016031 963170 824903 754162 689555 625180
34443 625180 690611 876761 1062602 1322440 1746363 1977737 1551402 779795 592301 1256511
34433 1256511 1977293 2097646 1926189 1888021 1671133 965807 354192 506504 969667 792596
34423 792596 66387 -244501 103146 336827 96689 59634 730745 1520541 1603583 1056163
34413 1056163 569141 478730 571991 500782 -9724 -1011681 -2017238 -2196482 -1321659 -226232
$$ packed form
34481A990335q05456j017413j71614P22116P69392K75748m6979j38768k75764
34472A301597l70420k52316j60696l21869m24720j27272K54669K04562j03950
34463d15m8767M09804N85462M1777p58598r54267k12946R05415J419336Q52166
34453B238967k27117p76446m58559P3666J65520n2861j38267p0741o4607o4375
34443F25180O5431J86150J85841K59838M23923K31374m26335p71607j87494O64210
34433A256511P20782J20353j71457l8168k16888p05326o11615J52312M63163j77071
34423G92596p26209l10888L47647K33681k40138l7055O71111P89796Q3042n47420
34413A056163m87022r0411R3261p1209n10506j001957j005557j79244Q74823J095427
$$ plain form
34403 -226232 87955 -442847 -1094961 -1321061 -1113222 -646499 -105306 207069 86170 -191529
34393 -191529 -81813 556599 1292440 1664257 1618553 1367608 1100664 942555 958348 1043269
34383 1043269 953423 578733 103036 -177118 -93626 389241 1255993 2349270 3253063 3494270
34373 3494270 3000705 2284567 2013253 2360513 2880419 3063857 2897120 2759914 2864499
34364 2864499 2975389 2707699 1992399 1194769 790983 912680 1215350 1273007 1078189 963758
34354 963758 1015057 893090 437290 88407 314176 862403 1092031 919585 866422 1166153
34344 1166153 1420708 1267060 807382 183917 -641186 -1327695 -1027080 549556 2335245
34335 2335245 2902268 2110643 1135987 916341 1205287 1253951 835995 308717 34012 37222
$$ packed form
34403b26232L14187n30802o52114k26100K07839M66723N41193L12375j20899k77699
34393a91529J09716O38412P35841L71817m5704k50945k66944j58109J5793Q4921
34383A043269q9846l74690m75697k80154Q3492M82867Q66752J093277R03793K41207
34373C494270m93565p16138k71314L47260N19906J83438j66737j37206J04585
34364B864499J10890k67690p15300p97630m03786J21697L02670N7657j94818j14431
34354I63758N1299j21967m55800l48883K25769N48227K29628j72446n3163K99731
34344A166153K54555j53648m59678o23465q25103o86509L00615J576636J785689
34335B335245N67023p91625r74656k19646K88946M8664m17956n27278k74705L210
$$ plain form
34325 37222 53574 -248151 -910028 -1464568 -1311298 -450615 372508 411067 -359490 -1344869
34315 -1344869 -1926184 -1828983 -1201283 -594256 -638951 -1380898 -2020673 -1651707 -255173 1299954
34305 1299954 2202519 2328155 1965974 1383128 830612 564339 545435 405411 10382 -246417
34295 -246417 -95627 -775 -534511 -1351116 -1509276 -823659 -124485 21152 53328 471130
34285 471130 887412 700821 171574 41689 400472 695169 670443 543014 375654 65620
34275 65620 -86677 378794 1186935 1478176 1022216 496049 338714 198018 -106597 1854
34265 1854 797313 1363276 671684 -889506 -1950059 -1868126 -1175469 -470566 233284 952684
34255 952684 1332089 1146834 705160 421306 317673 199973 52197 8124 95038 194862
$$ packed form
34325C7222J6352l01725o61877n54540J53270Q60683Q23123L8559p70557r85379
34315a344869n81315R7201O27700O07027m4695p41947o39775L68966J396534J555127
34305A299954R02565J25636l62181n82846n52516k66273j8904j40024l95029k56799
34295b46417J50790R4852n33736q16605j58160O85617O99174J45637L2176M17802
34285D71130M16282j86591n29247j29885L58783K94697k4726j27429j67360l10034
34275F5620j52297M65471Q08141K91241m55960n26167j57335j40696l04615J08451
34265A854P95459N65963o91592j561190j060553Q1933O92657P04903P03850P19400
34255I52684L79405j85255m41674k83854j03633j17700j47776m4073Q6914R9824
$$ plain form
34245 194862 180300 14436 -204380 -306577 -281362 -374602 -753129 -1137883 -1070358 -562024
34235 -562024 -140554 -113809 -103606 414770 1301446 1821982 1507666 649141 -144029 -599168
34225 -599168 -800945 -797540 -570953 -358407 -552409 -1082128 -1253659 -540524 693751 1613096
34215 1613096 1872592 1787611 1691238 1570659 1291444 771397 -17539 -827536 -1073526 -544196
34205 -544196 -17848 -409965 -1334027 -1452897 -476420 240289 -350505 -1414137 -1485874 -548980
34195 -548980 217772 300716 261594 415150 287408 -346107 -832903 -539264 226486 639340
34185 639340 328289 -411782 -1059833 -1211418 -724979 167900 993792 1446182 1571030 1466421
34175 1466421 990450 -15807 -1272658 -2078887 -1958675 -1224445 -655388 -550415 -418020
$$ packed form
34245A94862j4562j65864k18816j02197K5215r3240l78527l84754O7525N08334
34235e62024M21470K6745J0203N18376Q86676N20536l14316q58525p93170m55139
34225e99168k01777L405K26587K12546j94002n29719j71531P13135J234275R19345
34215A613096K59496q4981r6373j20579k79215n20047p88936q09997k45990N29330
34205e44196N26348l92117r24062j18870R76477P16709n90794j063632p1737R36894
34195e48980P66752Q2944l9122J53556j27742o33515m86796K93639P65750M12854
34185F39340l11051p40071o48051j51585M86439Q92879Q25892M52390J24848j04609
34175A466421m75971j006257j256851q06229J20212P34230N69057J04973J32395
$$ plain form
34166 -418020 145418 650059 339566 -601768 -1200131 -1013356 -490700 68642 940429 2009741
34156 2009741 2404446 1767335 1020947 1028075 1254400 755236 -159681 -443496 -99212 -166489
34146 -166489 -983757 -1633309 -1299694 -252296 743233 1228306 1072597 360367 -529090
34137 -529090 -1179284 -1497924 -1448148 -714396 726837 2018037 2248885 1692622 1347750
34128 1347750 1417301 1226053 580623 154876 411887 1085841 1832932 2471522 2529870 1602115
34118 1602115 315376 -98812 564719 1251688 1218217 789516 375704 -91736 -437776
34109 -437776 -184935 347508 108759 -971043 -1536655 -725647 624391 1377896 1533640
34100 1533640 1476066 1022044 208734 -83574 584268 1272596 1129197 822896 1268262 1855937
$$ packed form
34166d18020N63438N04641l10493r41334n98363J86775N22656N59342Q71787J069312
34156B009741L94705o37111p46388P128K26325m99164r14917k83815L44284o7277
34146a66489q17268o49552L33615J047398R95529M85073j55709p12230q89457
34137e29090o50194l18640M9776P33752J441233J291200K30848n56263l44872
34128A347750O9551j91248o45430m25747K57011O73954P47091O38590N8348r27755
34118A602115j286739m14188O63531O86969l3471m28701m13812m67440l46040
34109d37776K52841N32443k38749j079802n65612Q11008J350038P53505J55744
34100A533640n7574m54022q13310k92308O67842O88328j43399l06301M45366N87675
$$ plain form
34090 1855937 1439375 396958 130830 903588 1676769 1882281 1909735 1890063 1380787 425171
34080 425171 -243946 -296188 -161103 -134318 11714 378135 683440 797907 873364 896193
34070 896193 745451 661623 984954 1458694 1469505 980697 604663 757821 1297476 1918490
34060 1918490 2363183 2354683 1852328 1228244 750173 218566 -385361 -420411 483465 1498066
34050 1498066 1543907 830883 477508 847172 1284689 1356233 1310481 1322986 1248255 1190021
34040 1190021 1482119 2040215 2425428 2489728 2327461 1845757 1102018 670828 806218 722726
34030 722726 -223282 -1152350 -785684 466756 1077997 817392 895347 1725899 2354889 2364068
34020 2364068 2517131 3002529 2822123 1701081 946783 1428454 2181995 2118306 1761822
$$ packed form
34090A855937m16562j042417k66128P72758P73181K05512K7454j9672n09276r55616
34080D25171o69117n2242J35085K6785J46032L66421L05305J14467P5457K2829
34070H96193j50742q3828L23331M73740J0811m88808l76034J53158N39655O21014
34060A918490M44693q500n02355o24084m78071n31607o03927l5050R03876J014601
34050A498066M5841p13024l53375L69664M37517P1544m5752J2505p4731n8234
34040A190021K92098N58096L85213O4300j62267m81704p43739m31190J35390q3492
34030G22726r46008r29068L66666J252440O11241k60605P7955Q30552O28990R179
34020B364068J53063M85398j80406j121042p54298M81671P53541o3689l56484
$$ plain form
34011 1761822 2030973 2453546 2010882 926452 244805 206665 265896 259367 432788 677440
34001 677440 776591 1090643 2036574 3183664 3791566 3957611 4265594 4522015 3922729 2530712
33991 2530712 1587459 1991052 3135204 3688829 3132339 2107917 1434549 1221925 1105671
33982 1105671 1033112 1321991 1918012 2207383 1931953 1727426 2177425 2858573 3083636 3090351
33972 3090351 3496920 3961852 3598626 2590359 2138490 2721313 3563673 3988791 4192607
33963 4192607 4500326 4922622 5633603 6875531 8252093 9070612 9383334 9744628 10187968
33954 10187968 10552566 11360053 12989528 14588438 15466271 16793774 19867419 23655064
33946 23655064 26702580 30420127 37111047 45808508 54382276 64855383 81207325 102943101
$$ packed form
34011A761822K69151M22573m42664j084430o81647l8140N9231o529J73421K44652
34001F77440R9151L14052R45931J147090O07902J66045L07983K56421n99286j392017
33991B530712r43253M03593J144152N53625n56490j024422o73368k12624j16254
33982A105671p2559K88879N96021K89371k75430k04527M49999O81148K25063O715
33972C090351M06569M64932l63226j008267m51869N82823Q42360M25118K03816
33963D192607L07719M22296P10981J241928J376562Q18519L12722L61294M43340
33954A0187968L64598Q07487J629475J598910Q77833J327503L073645L787645
33946B3655064L047516L717547O690920Q697461Q573768J0473107J6351942K1735776
$$ plain form
33938 102943101 128818082 166993697 228778215 304612652 356921509 351081901 291591542
33931 291591542 216949822 160185792 125212602 100687958 81433296 68700282 60196525
33924 60196525 51114048 41530052 34913053 31229930 27489370 23343110 20699863 19026477
33916 19026477 16013323 12148521 10126709 10121506 9709947 8259502 7556140 8046404 8055535
33907 8055535 7058518 6447062 6552971 5942093 4348960 3538608 4363280 5368639 5261066
33898 5261066 4652247 4419082 4204906 3507104 2681859 2040454 1324604 707033 937410
33889 937410 1932051 2580599 2460434 2344431 2515969 2112602 836534 -174591 -84577
33880 -84577 325869 35864 -667926 -1028204 -1196547 -1676738 -2144588 -1907453 -1065888 -321977
$$ packed form
33938A02943101K5874981L8175615O1784518P5834437N2308857n839608n9490359
33931B91591542p4641720n6764030l4973190k4524644j9254662j2733014q503757
33924F0196525r082477r583996o616999l683123l740560m146260k643247j673386
33916A9026477l013154l864802k021812n203m11559j450445p03362M90264R131
33907H055535r97017o11456J05909o10878j593133q10352Q24672J005359j07573
33898E261066o08819k33165k14176o97802q25245o41405p15850o17571K30377
33889I37410R94641O48548j20165j16003J71538m03367j276068j011125R0014
33880h4577M10446k90005p03790l60278j68343m80191m67850K37135Q41565P43911
$$ plain form
33870 -321977 17209 139374 182056 204165 389385 766086 1014153 934351 773911 791020
33860 791020 914507 1086844 1411016 1664112 1288687 283398 -504045 -478503 -146871 -311256
33850 -311256 -898372 -1205335 -935084 -381540 126880 411100 341350 106287 317116 1229757
33840 1229757 2057282 1742720 389883 -732519 -730984 -42434 386227 339195 312513 577001
33830 577001 814666 679231 270597 -97414 -267029 -175530 234881 699958 529351 -621799
33820 -621799 -1982912 -2296881 -1288283 94496 985098 1393269 1467466 918765 -175987
33811 -175987 -829663 -345554 501065 494183 -230529 -532213 -122852 167074 -52512 -199996
33801 -199996 6414 -13814 -490960 -631288 119912 1005551 969761 118787 -652904 -1035952
$$ packed form
33870c21977L39186J22165M2682K2109J85220L76701K48067p9802j60440J7109
33860G91020J23487J72337L24172K53096l75425j005289p87443K5542L31632j64385
33850c11256n87116l06963K70251N53544N08420K84220o9750k35063K10829R12641
33840A229757Q27525l14562j352837j122402J535O88550M28661m7032k6682K64488
33830E77001K37665j35435m08634l68011j69615R1499M10411M65077j70607j151150
33820f21799j361113l13969J008598J382779Q90602M08171P4197n48701j094752
33811a75987o53676M84109Q46619o882p24712l01684M09361K89926k19586j47484
33801a99996K06410k0228m77146j40328P51200Q85639l5790q50974p71691l83048
$$ plain form
33791 -1035952 -1443670 -1985972 -2107592 -1354362 -35725 1011518 1169966 625419 282565
33782 282565 858891 1950100 2328625 1361626 -198178 -1045278 -622414 580671 1613618
33773 1613618 1703252 757249 -387142 -560843 498572 1748038 1965357 993172 -362371
33764 -362371 -1239563 -1191407 -253973 899580 1234973 415061 -615900 -667912 253731 1108992
33754 1108992 1232635 886118 461238 -65163 -655606 -888138 -556781 -149157 -247370 -727288
33744 -727288 -1015993 -964494 -944765 -1097015 -1047520 -630616 -422378 -1022949 -1993985 -2162503
33734 -2162503 -1136066 66626 296114 -270668 -548010 -139847 254104 70553 -261417
33725 -261417 -73229 514092 879843 916954 1135580 1755259 2205845 1797597 668982 -250496
$$ packed form
33791a035952m07718n42302j21620P53230J318637J047243J58448n44547l42854
33782B82565N76326J091209L78525r66999j559804q47100M22864J203085J032947
33773A613618Q9634r46003j144391j73701J059415J249466K17319r72185j355543
33764c62371q77192M8156R37434J153553L35393q19912j030961n2012R21643Q55261
33754A108992J23643l46517m24880n26401n90443k32532L31357M07624r8213m79918
33744g27288k88705N1499J9729j52250M9495M16904K08238o00571r71036j68518
33734b162503J026437J202692K29488n66782k77342M08163L93951j83551l31970
33725b61417J88188N87321L65751L7111K18626O19679M50586m08248j128615r19478
$$ plain form
33715 -250496 -287276 187026 280468 -171710 -333018 428072 1505491 1773316 1103141 488616
33705 488616 651313 1210772 1464009 1368403 1309776 1301690 962092 210699 -409523 -272744
33695 -272744 522898 1043696 486803 -694421 -1111965 -237090 693057 272271 -1059814
33686 -1059814 -1655121 -1045746 -366499 -311382 -168243 556426 984468 314373 -732416
33677 -732416 -1088009 -1036356 -1416710 -1845305 -1227163 310492 1449608 1555980 1214108
33668 1214108 902181 453252 2413 182335 971830 1426100 999098 200786 -450285
33659 -450285 -1149156 -1990638 -2406933 -2089337 -1666652 -1753946 -2012365 -1865107 -1497627 -1359272
33649 -1359272 -1237589 -697291 -13141 224774 130782 258197 526036 340213 -269367 -555329
$$ packed form
33715b50496l6780M74302R3442m52178j61308P61090J077419K67825o70175o14525
33705D88616J62697N59459K53237r5606n8627q086l39598p51393o20222J36779
33695b72744P95642N20798n56893j181224m17544Q74875R30147m20786j332085
33686a059814n95307O09375O79247N5117J43139P24669M28042o70095j046789
33677g32416l55593N1653l80354m28595O18142J537655J139116J06372l41872
33668A214108l11927m48929m50839J79922P89495M54270m27002p98312o51071
33659d50285o98871q41482m16295L17596M22685q7294k58419J47258L67480J38355
33649a359272J21683N40298O84150K37915r3992J27415K67839j85823o09580k85962
$$ plain form
33639 -555329 -216267 185326 207568 160292 367718 454735 -82223 -974906 -1373251 -783255
33629 -783255 501131 1738428 2273221 1947310 1252396 901565 1020211 984842 336707
33620 336707 -419958 -379715 536287 1423960 1510615 951651 350107 -65002 -425471 -692497
33610 -692497 -623222 -230455 141134 326615 624258 1330145 2151040 2388492 1761159 816708
33600 816708 332087 395797 350122 -290751 -1153200 -1502390 -1248460 -1037480 -1314617 -1733381
33590 -1733381 -1712355 -1225664 -715474 -474802 -501448 -796003 -1357141 -1892880 -1934258 -1343316
33580 -1343316 -469802 242498 614683 731015 794782 925138 890859 225677 -1045660 -1999984
33570 -1999984 -1684172 -361128 683885 661483 42224 -326969 -251345 -47659 55407
$$ packed form
33639e55329L39062M01593K2242m7276K07426Q7017n36958q92683l98345N89996
33629g83255J284386J237297N34793l25911o94914l50831J18646l5369o48135
33620C36707p56665M0243R16002Q87673Q6655n58964o01544m15109l60469k67026
33610f92497O9275L92767L71589J85481K97643P05887Q20895K37452o27333r44451
33600H16708m84621O3710m5675o40873q62449l49190K53930K10980k77137m18764
33590a733381K1026M86691N10190K40672k6646k94555n61138n35739m1378N90942
33580a343316Q73514P12300L72185J16332O3767J30356l4279o65182j271337r54324
33570a999984L15812J323044J045013k2402o19259l69193P5624K03686J03066
$$ plain form
33561 55407 -45598 -472540 -1118881 -1556642 -1525594 -1217790 -811757 -142746 788578 1401006
33551 1401006 1145872 286691 -394724 -490351 -192322 157841 368901 419698 479497 731101
33541 731101 1012230 982895 794813 1017516 1603274 1651907 746848 -216472 -306238 25887
33531 25887 -223576 -937406 -1224515 -1058536 -1226492 -1743544 -1704518 -902864 -290996 -425441
33521 -425441 -635967 -290880 173365 151375 -136884 -300882 -609772 -1313196 -1786777 -1295168
33511 -1295168 -204379 430020 219611 -388345 -1074371 -1946091 -2882346 -3325276 -2950413
33502 -2950413 -2088288 -1280253 -710156 -234185 223694 488424 359479 -28176 -215831
33493 -215831 42005 379570 258543 -266868 -601040 -401067 105294 596994 960524 1064065
$$ packed form
33561E5407j01005m26942o46341m37761L1048L07804M06033O69011R31324O12428
33551A401006k55134q59181o81415r5627K98029L50163K11060N0797N9799K51604
33541G31101K81129k9335j88082K22703N85758M8633r05059r63320q9766L32125
33531B5887k49463p13830k87109J65979j67956n17052L9026Q01654O11868j34445
33521d25441k10526L45087M64245k1990k88259j63998l08890p03424m73581M91609
33511a295168J090789O34399k10409o07956o86026q71720r36255m42930L74863
33502b950413Q62125Q08035N70097M75971M57879K64730j28945l87655j87655
33493b15831K57836L37565j21027n25411l34172J99973N06361M91700L63530J03541
$$ plain form
33483 1064065 787207 409401 419371 788628 1007866 968989 1100821 1421881 1303383 574434
33473 574434 -14289 -25184 -169697 -1083902 -2008914 -1732616 -368836 875596 1418002
33464 1418002 1703891 2022446 2028703 1596841 1192247 1069442 831086 137926 -703819 -1191817
33454 -1191817 -1226204 -983264 -570681 -95346 195100 123512 -141174 -146690 473292 1570608
33444 1570608 2377858 2115179 905200 -212116 -441919 -73368 166085 156754 261390
33435 261390 523556 655722 621046 590073 475875 132392 -156491 -64047 55734 -400378
33425 -400378 -1187285 -1364876 -633490 262106 633868 619283 604238 570044 375881 159152
33415 159152 102215 185818 398318 807197 1267649 1466018 1378780 1282781 1249151 1095925
$$ packed form
33483A064065k76858l77806R970L69257K19238l8877J31832L21060j18498p28949
33473E74434n88723j0895j44513r14205r25012K76298J363780J244432N42406
33464A418002K85889L18555O257m31862m04594j22805k38356o93160q41745m87998
33454a191817l4387K42940M12583M75335K90446p1588k64686n516O19982J097316
33444A570608Q07250k62679j209979j117316k29803L68551K39453r331J04636
33435B61390K62166J32166l4676l0973j14198l43483k88883R2444J19781m56112
33425d00378p86907j77591P31386Q95596L71762j4585j5045l4194j94163k16729
33415A59152n6937Q3603K12500M08879M60452J98369q7238r5999l3630j53226
$$ plain form
33405 1095925 887976 944081 1261734 1479861 1488687 1499783 1460005 1074458 526846 442645
33395 442645 925067 1339059 1292514 1118283 1126387 1115648 909733 629801 181275 -682771
33385 -682771 -1524191 -1472788 -723697 -624219 -1636503 -2436623 -1937074 -976556 -790346 -945691
33375 -945691 -357775 548929 551816 -29415 285745 1508560 1937474 868558 -316554
33366 -316554 -423298 -122404 -425088 -932680 -800817 -348015 -394653 -738174 -564758 78736
33356 78736 408360 233752 87427 156786 92907 -114783 271 519093 943299 1046140
33346 1046140 1168553 1404273 1208872 261993 -819764 -1142362 -576570 283412 899520
33337 899520 1078273 764471 142832 -147253 468870 1644859 2331518 2085344 1625386
$$ packed form
33405A095925k07949N6105L17653K18127Q826J1096l9778l85547n47612q4201
33395D42645M82422M13992m6545j74231Q104j0739k05915k79932m48526q64046
33385f82771q41420N1403P49091R9478j012284q00120M99549R60518J86210j55345
33375i45691N87916R06704K887n81231L15160J222815M28914j068916j185112
33366c16554j06744L00894l02684n07592J31863M52802m6638l43521J73416O43494
33356G8736L29624j74608j46325O9359o3879k07690J15054N18822M24206J02841
33346A046140J22413K35720j95401r46879j081757l22598N65792Q59982O16108
33337H99520J78753l13802o21639k90085O16123J175989O86659k46174m59958
$$ plain form
33328 1625386 1711757 2018282 1774116 1121034 895701 1136159 883359 -177541 -899909
33319 -899909 -272554 899380 930288 -476081 -1915994 -2171424 -1453239 -650709 -227864
33310 -227864 -165471 -269199 -151310 537372 1529440 2091535 1993081 1753799 1688225 1426462
33300 1426462 794402 387990 603195 772129 139810 -774719 -779996 258086 1265612
33291 1265612 1496188 1281819 1132825 974348 604535 231494 176723 500527 1126929 1851391
33281 1851391 2111262 1421271 294719 -3585 914707 1845345 1514576 253857 -597784
33272 -597784 -539280 -263697 -354048 -567818 -556354 -493436 -629994 -766822 -557378 -1092
33262 -1092 652349 1207781 1495207 1321988 735043 128893 -156177 -182121 -162021 -67835
$$ packed form
33328A625386Q6371L06525k44166o53082k25333K40458k52800j060900p22368
33319h99909O27355J171934L0908j406369j439913k55430P18185Q02530M22845
33310b27864O2393j03728J17889O88682R92068N62095r8454k39282o5574k61763
33300A426462o32060m06412K15205J68934o32319r14529n277J038082J007526
33291A265612K30576k14369j48994j58477l69813l73041n4771L23804O26402P24462
33281A851391K59871o89991j126552k98304R18292R30638l30769j260719q51641
33272e97784N8504K75583r0351k13770J1464O2918j36558j36828K09444N56286
33262a092O53441N55432K87426j73219n86945o06150k85070k5944K0100R4186
$$ plain form
33252 -67835 243096 658859 873606 772680 515832 272723 123599 223077 767999 1635725
33242 1635725 2229637 1946136 841765 -318140 -789487 -549522 -139075 90455 272906
33233 272906 530376 589724 202693 -362734 -707057 -972772 -1558936 -2232025 -2208261 -1282829
33223 -1282829 -227985 234163 244446 194605 -51692 -680380 -1163235 -790119 249208
33214 249208 1064168 1236735 1098832 931430 659933 385948 445781 761251 820613 499978
33204 499978 216904 55344 -478701 -1449403 -2011910 -1506574 -401527 460309 956222
33195 956222 1329594 1331644 652754 -143105 -141945 536516 829227 286332 -361894 -427696
33185 -427696 -198262 -193030 -187251 362466 1273048 1655594 957407 -390180 -1415279 -1550267
$$ packed form
33252f7835L10931M15763K14747j00926k56848k43109j49124R9478N44922Q67726
33242A635725N93912k83501j104371j159905m71347K39965M10447K29530J82451
33233B72906K57470N9348l87031n65427l44323k65715n86164o73089K3764R25432
33223a282829J054844M62148J0283m9841k46297o28688m82855L73116J039327
33214B49208Q14960J72567j37903j67402k71497k73985N9833L15470N9362l20635
33204D99978k83074j61560n34045r70702n62507N05336J105047Q61836M95913
33195I56222L73372K050o78890p95859J160O78461K92711n42895o48226o5802
33185d27696K29434N232N779N49717R10582L82546o98187j347587j025099j34988
$$ plain form
33175 -1550267 -1153686 -1121127 -1871842 -2763005 -2748476 -1619083 -283343 246426 -171751
33166 -171751 -927960 -1365314 -1176131 -472553 219537 295536 -268907 -771350 -592732 22735
33156 22735 341366 156759 -450 299526 742943 676780 -77248 -1048136 -1644486 -1638473
33146 -1638473 -1175847 -588473 -311901 -720306 -1704836 -2488102 -2268760 -1184145 -276999
33137 -276999 -290491 -869674 -1294227 -1571590 -2162521 -2863012 -2820624 -1814402 -753816 -503388
33127 -503388 -777221 -694541 -29093 632425 741829 299653 -370691 -933692 -1160733 -1054724
33117 -1054724 -840106 -645017 -325481 203900 681803 820241 725435 716938 913763 1257022
33107 1257022 1666422 1846098 1297599 40044 -993240 -938583 -189286 138939 -183431
$$ packed form
33175a550267L96581L2559p50715q91163J4529J129393J335740N29769m18177
33166a71751p56209m37354J89183P03578O92090P5999n64443n02443J78618O15467
33156B2735L18631j84607j57209K99976M43417o6163p54028r70888n96350O013
33146a638473M62626N87374K76572m08405r84530p83266K19342J084615R07146
33137b76999j3492n79183m24553k77363n90931p00491M2388J006222J060586K50428
33127e03388k73833Q2680O65448O61518J09404m42176o70344n63001k27041J06009
33117a054724K14618J95089L19536N29381M77903J38438r4806q497J96825L43259
33107A257022M09400J79676n48499j257555j033284N4657P49297L28225l22370
$$ plain form
33098 -183431 -310311 176426 556741 173809 -522621 -762731 -598386 -517590 -468128 -138026
33088 -138026 148032 -216899 -970020 -1133744 -457105 153773 -57559 -712613 -1038536 -927989
33078 -927989 -689050 -266827 555194 1447199 1771966 1512310 1337806 1650731 2091139 2157509
33068 2157509 1866582 1569734 1490432 1695959 2183098 2674165 2614415 1767677 659585 57546
33058 57546 100582 288484 244207 76502 -11735 -27376 35500 319576 757477 906169 442088
33047 442088 -348047 -843985 -739385 -186139 544689 1226100 1585654 1433743 961098 621836
33037 621836 590872 553255 173487 -415128 -780923 -735436 -492416 -319135 -230556 -84743
33027 -84743 166304 437493 659111 841417 978868 977719 724952 190250 -545500 -1275376
$$ packed form
33098a83431j26880M86737L80315l82932o96430k40110J64345Q0796M9462L30102
33088a38026K86058l64931p53121j63724O76639O10878k11332o55054l25923J10547
33078i27989K38939M22223Q22021Q92005L24767k59656j74504L12925M40408O6370
33068B157509k90927k96848p9302K05527M87139M91067n9750q46738j108092o02039
33058E7546M3036J87902m4277j67705q8237j5641O2876K84076M37901J48692m64081
33047D42088p90135m95938J04600N53246P30828O81411L59554j51911m72645l39262
33037F21836l0964l7617l79768n88615l65795M5487K43020J73281Q8579J45813
33027h4743K51047K71189K21618J82306J37451j149k52767n34702p35750p29876
$$ plain form
33017 -1275376 -1656468 -1383044 -537090 332798 705823 628589 520796 474449 127358 -618241
33007 -618241 -1154423 -832504 142464 920197 1041496 828524 705388 602450 269911 -185157
32997 -185157 -439161 -430691 -324520 -96233 424157 1032778 1102504 343084 -644738 -964004
32987 -964004 -501581 -22063 -124172 -520742 -599002 -313491 -57924 135838 647523 1440275
32977 1440275 1770504 1068445 -242093 -1156027 -1108255 -332384 531248 889112 555568
32968 555568 64735 362446 1686827 2942917 2787224 1280699 -157276 -489196 -93580
32959 -93580 128524 -11105 -97269 53779 256431 413944 601354 778730 806094 692844
32949 692844 553523 413048 314026 472115 1001195 1565388 1618184 981302 -6907 -824787
$$ packed form
33017a275376l81092K73424Q45954Q69888L73025p7234j07793m6347l47091p45599
33007f18241n36182L21919R74968P77733J21299k12972j23136j02938l32539m55068
32997a85157k54004Q470J06171K28287N20390O08621O9726p59420r87822l19266
32987i64004M62423M79518j02109l96570p8260K85511K55567J93762N11685P92752
32977A440275L30229p02059j310538r13934M7772P75871Q63632L57864l33544
32968E55568m90833K97711J324381J256090j55693j506525j437975l31920L95616
32959i3580K22104j39629q6164J51048K02652J57513J87410J77376K7364j13250
32949F92844j39321j40475r9022J58089N29080N64193N2796o36882r88209q17880
$$ plain form
32939 -824787 -1069843 -642984 61083 342763 -33434 -416619 -71184 736812 1050726 617822
32929 617822 266827 644280 1256594 1299714 949809 1099962 1981303 2778212 2747165 2134192
32919 2134192 1667081 1546553 1378307 912075 374989 38882 -147692 -322236 -407283 -315753
32909 -315753 -243634 -409107 -611219 -451900 16867 329182 392391 713271 1531692 2221587
32899 2221587 2075349 1343264 856034 796382 563481 -130976 -768076 -847253 -568080 -332439
32889 -332439 -102111 288289 588266 431893 -55093 -428145 -543739 -568163 -510752 -228831
32879 -228831 151338 295166 191252 194181 424656 533706 283540 26766 259660 849738
32869 849738 1086693 576732 -190070 -405461 19695 302599 -215446 -1239606 -2008402
$$ packed form
32939h24787k45056M26859P04067K81680l76197l83185L45435Q07996L13914m32904
32929F17822l50995L77453O12314M3120l49905J50153Q81341P96909l1047o12973
32919B134192m67111j20528j68246m66232n37086l36107j86574j74544q5047R1530
32909c15753P2119j65473k02112J59319M68767L12315O3209L20880Q18421O89895
32899B221587j46238p32085m87230n9652k32901o94457o37100p9177K79173K35641
32889c32439K30328L90400K99977j56373m86986l73052j15594k4424N7411K81921
32879b28831L80169J43828j03914K929K30475J09050k50166k56774K32894N90078
32869H49738K36955n09961p66802k15391M25156K82904n18045j024160p68796
$$ plain form
32860 -2008402 -2350595 -2696513 -3092323 -2937087 -1999252 -1028947 -792315 -977161 -756486
32851 -756486 -119850 176013 -109257 -323917 -16980 321844 -7853 -934405 -1737302 -1844585
32841 -1844585 -1249707 -421920 -6861 -322681 -966282 -1199275 -848310 -474387 -537128 -848774
32831 -848774 -1051437 -1106824 -978500 -367775 718452 1560998 1503083 859650 440304 364512
32821 364512 24208 -827129 -1624902 -1765851 -1293793 -626316 -30704 413356 669710 787719
32811 787719 861180 807538 415220 -269600 -829110 -890204 -506338 -49757 130103 -80152
32801 -80152 -495759 -751708 -658005 -437810 -428615 -604107 -658299 -514116 -393831 -361694 -198591
32790 -198591 140652 340315 235045 192483 669740 1564332 2287143 2388696 1905497 1173104
$$ packed form
32860b008402l42193l45918l95810J55236R37835R70305K36632j84846K20675
32851g56486O36636K95863k85270k14660L06937L38824l29697r26552q02897j07283
32841a844585N94878Q27787M15059l15820o43601k32993L50965L73923o2741l11646
32831h48774k02663n5387J28324O10725J086227Q42546n7915o43433m19346p5792
32821C64512l40304q51337p97773j40949M72058O67477N95612M44060K56354J18009
32811G87719P3461n3642l92318o84820n59510o1094L83866M56581J79860k10255
32801h0152m15607k55949R3703K20195R195j75492n4192J44183J20285L2137J63103
32790a98591L39243J99663j05270m2562M77257Q94592P22811J01553m83199p32393
$$ plain form
32780 1173104 502957 35785 -201684 -125353 441788 1452347 2306166 2170637 849431
32771 849431 -821746 -1647349 -1108516 290870 1534574 1878470 1357477 695862 591033
32762 591033 967056 1076613 430095 -585168 -1160924 -939354 -234313 437495 796475
32753 796475 866767 840079 872653 910146 771624 466765 282011 447322 878358 1353377
32743 1353377 1724253 1803451 1350935 505390 224 482424 1633378 2373544 2024983
32734 2024983 950637 -39194 -544885 -628769 -351388 298176 1049552 1345567 921757
32725 921757 224107 5735 528007 1344405 1872372 1954569 1777874 1482946 1060574 490744
32715 490744 -210813 -960893 -1464155 -1319491 -538357 254078 463770 152436 -347064 -1065409
$$ packed form
32780A173104o70147m67172k37469P6331N67141J010559Q53819j35529j321206
32771H49431j671177q25603N38833J399386J243704L43896n20993o61615j04829
32762E91033L76023J09557o46518j015263n75756K21570P05041O71808L58980
32753G96475P0292k6688L2574L7493j38522l04859j84754J65311M31036M75019
32743A353377L70876P9198m52516q45545n05166M82200J150954P40166l48561
32734B024983j074346r89831n05691q3884K77381O49564P51376K96015m23810
32725I21757o97650k18372N22272Q16398N27967Q2197j76695k94928m22372n69830
32715D90744p01557p50080n03262J44664P81134P92435K09692l11334m99500p18345
$$ plain form
32705 -1065409 -1978532 -2275802 -1103094 876083 1795844 946790 -189128 -95 1047299
32696 1047299 1281521 273296 -813492 -1049238 -668258 -96562 777351 1925794 2663447
32687 2663447 2431899 1607744 999802 839694 698250 227260 -369691 -593102 -232701
32678 -232701 301426 286721 -548095 -1653536 -2210392 -1905832 -993691 109377 925994
32669 925994 950803 177565 -560251 -398922 456206 1036243 950122 723015 762506 765536
32659 765536 397341 -106519 -335606 -181396 305164 988957 1409091 1123233 546468 704771
32649 704771 1746507 2444356 1756692 227765 -856050 -1135680 -1191418 -1305827 -1144079
32640 -1144079 -551043 139923 641652 942873 978370 650215 269644 458611 1402131 2501038
$$ packed form
32705a065409r13123k97270J172708J979177R19761q49054j135918J89033J047394
32696A047299K34222j008225j086788k35746L80980N71696Q73913J148443P37653
32687B663447k31548q24155o07942j60108j41444m70990n96951k23411L60401
32678b32701N34127j4705q34816j105441n56856L04560R12141J103068Q16617
32669I25994K4809p73238p37816J61329Q55128N80037q6121k27107L9491L030
32659G65536l68195n03860k29087J54210M86560O83793M20134k85858n76765J58303
32649G04771J041736O97849o87664j528927j083815k79630n5738j14409J61748
32640a144079N93036O90966N01729L01221L5497l28155l80571J88967R43520J098907
$$ plain form
32630 2501038 2909470 2260263 883530 -498148 -1330339 -1621910 -1692399 -1531735 -811388
32621 -811388 296090 878884 370633 -568722 -918889 -749101 -1033408 -2117865 -3168417
32612 -3168417 -3294398 -2582458 -1766671 -1349702 -1315956 -1385181 -1322827 -1172917 -1227886 -1579778
32602 -1579778 -1808956 -1455705 -709342 -209381 -204067 -362826 -424720 -533331 -831017 -1174301
32592 -1174301 -1381463 -1365164 -944044 3410 1049109 1364815 624760 -586962 -1446190
32583 -1446190 -1595407 -1073271 -97011 776422 834881 99367 -346491 460665 2031258
32574 2031258 2887659 2334004 1177594 573081 702142 907377 713234 246879 -162494
32565 -162494 -314743 -79571 527454 1073280 954517 208037 -309306 26421 707820 831144
$$ packed form
32630B501038M08432o49207j376733j381678q32191k91571p0489J60664P20347
32621h11388J107478N82794n08251r39355l50167J69788k84307j084457j050552
32612c168417j25981P11940Q15787M16969L3746o9225O2354J49910n4969l51892
32602a579778k29178L53251P46363M99961N314j58759o1894j08611k97686l43284
32592a174301k07162J6299M21120R47454J045699L15706p40055j211722q59228
32583a446190j49217N22136R76260Q73433N8459p35514m45858Q07156J570593
32574B031258Q56401n53655j156410o04513J29061K05235j94143m66355m09373
32565a62494j52249K35172O07025N45826j18763p46480n17343L35727O81399J23324
$$ plain form
32555 831144 463023 454405 932125 977549 153014 -599991 -254547 840832 1586693 1638986
32545 1638986 1409797 1035161 377347 -179733 964 741956 1171989 968426 630139
32536 630139 476830 284394 27606 45407 254849 136434 -215129 -1020 903929 1459014
32526 1459014 948002 98599 -15649 521661 847484 632048 227360 -63540 -138499 111522
32516 111522 491584 363378 -478958 -1125946 -502799 1177377 2574378 2721714 1838127
32507 1838127 816934 418148 788134 1313221 1143430 227959 -519117 -466448 -135058
32498 -135058 -254033 -568938 -420455 18642 95429 -114053 -57707 76563 -386194 -1200271
32488 -1200271 -1326642 -638178 -239893 -717591 -1280059 -1219236 -1074866 -1502509 -1925418 -1385376
$$ packed form
32555H31144l68121q618M77720M5424q24535p53005L45444J095379P45861N2293
32545A638986k29189l74636o57814n57080J80697P40992M30033k03563l38287
32536F30139j53309j92436k56788J7801K09442j18415l51563K14109R04949N55085
32526A459014n11012q49403j14248N37310L25823k15436m04688k90900p4959K50021
32516A11522L80062j28206q42336o46988O23147J680176J397001J47336q83587
32507A838127j021193l98786L69986N25087j69791r15471p47076N2669L31390
32498a35058j18975l14905J48483M39097P6787k09482N6346J34270m62757q14077
32488a200271j26371O88464L98285m77698n62468O0823J44370m27643m22909N40042
$$ plain form
32478 -1385376 -174084 449672 -49975 -951454 -1353560 -1063198 -389003 341469 902972
32469 902972 1166720 1090465 596238 -394336 -1603094 -2313751 -1998483 -916923 181989
32460 181989 817860 978923 770126 266429 -310042 -594902 -349818 371060 1236644 1722654
32450 1722654 1405665 432358 -455293 -651017 -347555 -194458 -384551 -434247 78569 871599
32440 871599 1246064 897208 278340 149206 813522 1820557 2403944 2174823 1378423
32431 1378423 570171 138803 79483 105478 1789 -79375 204842 841868 1336745 1333911
32421 1333911 1080924 941865 770330 287807 -198472 -199419 -36937 -512129 -1443443 -1515144
32411 -1515144 -44223 1925076 2884105 2520169 1504671 387923 -436813 -340538 825836
$$ packed form
32478a385376J211292O23756m99647r01479m02106K90362O74195P30472N61503
32469I02972K63748p6255m94227r90574j208758p10657L15268J081560J098912
32460A81989O35871J61063k08797n03697n76471k84860K45084P20878Q65584M86010
32450A722654l16989r73307q87651j95724L03462J53097j90093m9696N12816P93030
32440H71599L74465l48856o18868j29134O64316J007035N83387k29121p96400
32431A378423q08252m31368n9320K5995j03689q1164K84217O37026M94877k834
32421A333911k52987j39059j71535m82523m86279r47J62482m75192r31314p1701
32411a515144J470921J969299R59029l63936j015498j116748q24736R6275J166374
$$ plain form
32402 825836 1969295 1878506 978655 785013 1579158 1923571 867833 -592866 -997718
32393 -997718 -380872 200217 410226 795784 1484480 1816374 1413449 817645 748536 1208224
32383 1208224 1605294 1474021 873656 266681 100917 354942 497686 101044 -562651
32374 -562651 -845311 -640784 -572418 -1098742 -1796087 -1855180 -1094201 -130348 397371 450339
32364 450339 373761 337145 215850 -47550 -204905 30450 545763 848693 612455 62264
32354 62264 -340560 -482830 -603178 -747238 -589098 36141 730107 958913 709082 423673
32344 423673 424780 730544 1333111 2220775 3076022 3359788 2870996 1957821 1073139 417703
32334 417703 106874 275001 773263 1129381 1116162 1037584 1121275 1008838 360323 -327180
$$ packed form
32402H25836J143459r0789q99851j93642P94145L44413j055738j460699m04852
32393i97718O16846N81089K10009L85558O88696L31894m02925n95804o9109M59688
32383A208224L97070j31273o00365o06975j65764K54025J42744l96642o63695
32374e62651k82660K04527O8366n26324o97345n9093P60979R63853N27719N2968
32364D50339p6578l6616j21295k63400j57355K35355N15313L02930k36238n50191
32354F2264m02824j42270j20348j44060J58140O25239O93966K28806k49831k85409
32344D23673J107L05764O02567Q87664Q55247K83766m88792r13175q84682o55436
32334D17703l10829J68127M98262L56118j3219p8578Q3691j12437o48515o87503
$$ plain form
32324 -327180 -181506 809583 1661680 1602872 870565 120477 -432091 -945221 -1403157 -1552926
32314 -1552926 -1260380 -665987 -49677 336174 407812 299958 153280 -137183 -735549 -1431767
32304 -1431767 -1715031 -1365932 -679618 -30091 424938 503311 -53226 -1072747 -1777895
32295 -1777895 -1543245 -624367 213769 588334 650549 550952 250525 -132434 -232963 102258
32285 102258 474753 251999 -755053 -1953491 -2384600 -1633904 -319305 545377 691702
32276 691702 791358 1413102 2179168 2251696 1381084 144669 -673439 -673050 -22435 651843
32266 651843 747562 339334 149459 607784 1232686 1322503 976389 915562 1431865 2013644
32256 2013644 1971132 1033317 -564453 -2133699 -2780191 -2138890 -896352 -145926 -228442
$$ packed form
32324c27180J45674R91089Q52097n8808p32307p50088n52568n13130m57936j49769
32314a552926K92546N94393O16310L85851P1638j07854j46678k90463n98366o96218
32304a431767k83264L49099O86314O49527M55029P8373n56537j019521p05148
32295a777895K34650R18878Q38136L74565O2215r9597l00427l82959j00529L35221
32285A02258L72495k22754j007052j198438m31109P50696J314599Q64682J46325
32276F91702R9656O21744P66066P2528q70612j236415q18108L89O50615O74278
32266F51843R5719m08228j89875M58325O24902Q9817l46114o0827N16303N81779
32256B013644m2512r37815j597770j569246o46492O41301J242538P50426q2516
$$ plain form
32247 -228442 -629401 -904034 -1068750 -1040231 -425709 784894 1845765 1997808 1297426
32238 1297426 424062 -64618 -56583 224630 352800 -69574 -1017030 -1932986 -2146137 -1378536
32228 -1378536 44712 1265719 1340015 84665 -1503847 -2152472 -1706849 -1148056 -1161911
32219 -1161911 -1328268 -975264 -188945 466937 717705 576094 24343 -757595 -1205022
32210 -1205022 -968874 -422342 -51469 325899 1094604 1873085 1803498 777678 -360463
32201 -360463 -944198 -1162747 -1411798 -1551746 -1159512 -169451 1004624 1762188 1647522
32192 1647522 734431 -205005 -306533 409563 997016 713676 -135289 -695694 -561410
32183 -561410 3542 525420 664165 335284 -168665 -362273 -171924 -120062 -544689 -910588
$$ packed form
32247b28442m00959k74633j64716K8519O14522J210603J060871J52043p00382
32238A297426q73364m88680Q035K81213J28170m22374r47456r15956k13151P67601
32228a378536J423248J221007P4296j255350j588512o48625M45623N58793j3855
32219a161911j66357L53004P86319O55882K50768j41611n51751p81938m47427
32210a205022K36148N46532L70873L77368P68705P78481o9587j025820j138141
32201c60463n83735k18549k49051j39948L92234R90061J174075P57564j14666
32192A647522r13091r39436j01528P16096N87453k83340q48965n60405J34284
32183e61410N64952N21878J38745l28881n03949j93608J90349N1862m24627l65899
$$ plain form
32173 -910588 -437979 734151 1651286 1816765 1676772 1662199 1496511 927291 499901 845299
32163 845299 1551625 1596524 829057 190437 320548 734815 740377 481385 517795 844462
32153 844462 958306 636622 88748 -478124 -927519 -1008163 -644509 -275512 -342329 -559592
32143 -559592 -318215 279939 526223 259000 87732 287924 354417 48462 18773 732477
32133 732477 1516435 1487294 895708 622805 713527 443490 -290516 -714698 -444598 -25941
32123 -25941 115311 365248 1030153 1507916 1102414 193094 -230718 -8127 21478 -660625
32113 -660625 -1485087 -1661108 -1275476 -1026635 -1127098 -1053786 -452277 214434 270638 -171919
32103 -171919 -285091 371646 1220737 1366091 676985 -103423 -210837 424158 1224247 1478681
$$ packed form
32173i10588M72609J172130R17135J65479j39993j4573j65688n69220m27390L45398
32163H45299P06326M4899p67467o38620J30111M14267N562k58992L6410L26667
32153H44462J13844l21684n47874n66872m49395q0644L63654L68997o6817k17263
32143e59592K41377N98154K46284k67223j71268K00192O6493l05955k9689P13704
32133G32477P83958k9141n91586k72903R0722k70037p34006m24182K70100M18657
32123b5941J41252K49937O64905M77763m05502r09320m23812K22591K9605o82103
32113f60625q24462j76021L85632K48841j00463P3312O01509O66711N6204m42557
32103a71919j13172O56737Q49091J45354o89106p80408j07414O34995Q00089K54434
$$ plain form
32093 1478681 866796 -244770 -986963 -697974 462095 1709668 2410832 2481457 2104803
32084 2104803 1410502 557214 -161056 -538688 -659814 -692070 -597824 -269225 104882 70792
32074 70792 -565860 -1361036 -1542315 -755550 546442 1528095 1774476 1586531 1462757 1451084
32064 1451084 1194875 560736 -41922 -110973 309342 642173 448182 -85222 -448213 -496490
32054 -496490 -592377 -998461 -1402571 -1329922 -893787 -719604 -1022321 -1149649 -367273 1094796
32044 1094796 2165202 2129461 1423314 1082551 1544685 2200710 2172536 1367815 545340 346949
32034 346949 581666 666744 462527 256569 133408 -54897 -135136 276254 930908 920538
32024 920538 -107921 -1313038 -1752984 -1579282 -1497657 -1524049 -1131775 -386441 -3405 -238534
$$ packed form
32093A478681o11885j111566p42193K88989J160069J247573P01164P0625l76654
32084B104803o94301q53288p18270l77632j21126l2256R4246L28599L74107l4090
32074G0792o36652p95176j81279P86765J301992R81653K46381j87945j23774j1673
32064A451084k56209o34139o02658o9051M20315L32831j93991n33404l62991m8277
32054d96490r5887m06084m04110P2649M36135J74183l02717j27328P82376J462069
32044A094796J070406l5741p06147l40763M62134O56025k8174q04721q22475j98391
32034C46949K34717Q5078k04217k05958j23161j88305q0239M11390O54654j0370
32024I20538j028459j205117m39946J73702Q1625k6392L92274P45334L83036k35129
$$ plain form
32014 -238534 -526083 -381279 24377 385871 722265 1057850 1231748 1324549 1722395 2384370
32004 2384370 2555393 1710621 447958 -91629 440791 1270442 1468200 933061 360456
31995 360456 413424 1022117 1523883 1460565 1027998 596408 115486 -570118 -1060253 -727629
31985 -727629 286502 1091635 1228989 1167176 1344542 1404592 866172 3057 -528249 -565827
31975 -565827 -405048 -192973 101929 357007 449056 548330 796225 925546 716300 582376
31965 582376 1056270 1811120 1906397 1061344 652 -662204 -1211359 -2060199 -2720356 -2268674
31955 -2268674 -795592 292558 -159926 -1478843 -1733476 -13502 2395445 3538189
31947 3538189 3073788 2317494 2201863 2185680 1449732 230675 -672049 -1037250 -1127344 -961464
$$ packed form
32014b38534k87549J44804M05656L61494L36394L35585J73898R2801L97846O61975
32004B384370J71023q44772j262663n39587N32420Q29651J97758n35139n72605
31995C60456N2968O08693N01766o3318m32567m31590m80922o85604m90135L32624
31985g27629J014131Q05133J37354o1813J77366O0050n38420q63115n31306l7578
31975e65827J60779K12075K94902K55078R2049R9274K47895J29321k09246j33924
31965E82376M73894P54850R5277q45053j060692o62856n49155q48840o60157M51682
31955b268674J473082J088150m52484j318917k54633J719974K408947J142744
31947C538189m64401p56294j15631j6183p35948j219057r02724l65201r0094J65880
$$ plain form
31937 -961464 -486362 -110015 -227213 -441843 -94337 574469 627405 -238407 -1366302 -2139826
31927 -2139826 -2489795 -2375729 -1671571 -761740 -376417 -533687 -458395 134231 557655 391733
31917 391733 260045 690190 1063695 636472 -47739 130409 1088506 1596139 1032993 65324
31907 65324 -540023 -826573 -1092817 -1268330 -1296547 -1483685 -1932416 -2108645 -1533135 -569617
31897 -569617 37491 176919 322197 579158 461470 -219195 -830468 -689363 8270 504496
31887 504496 531140 504761 673678 652338 84828 -663504 -918949 -577194 -123186 109508
31877 109508 245085 457901 718168 1003449 1314883 1374495 807354 -129440 -488598 286875
31867 286875 1583589 2365226 2386194 2121791 1754012 981679 -113939 -752773 -361372
$$ packed form
31937i61464M75102L76347j17198k14630L47506O68806N2936q65812j127895p73524
31927b139826l49969J14066P04158R09831L85323j57270P5292N92626M23424j65922
31917C91733j31688M30145L73505m27223o84211J78148R58097N07633n63146r67669
31907F5324o05347k86550k66244j75513k8217j87138m48731j76229N75510R63518
31897e69617O07108J39428J45278K56961j17688o80665o11273J41105O97633M96226
31887E04496K6644k6379J68917k1340n67510p48332k55445L41755M54008K32694
31877A09508J35577K12816K60267K85281L11434N9612n67141r36794l59158P75473
31867B86875J296714P81637K0968k64403l67779p72333j095618o38834L91401
$$ plain form
31858 -361372 684139 1615242 2219627 2785562 3323816 3366601 2571461 1164307 -283518
31849 -283518 -1230186 -1275548 -295276 1246002 2326461 2112925 792084 -501077 -712869
31840 -712869 165204 1157156 1295610 560507 -154357 -20141 816264 1392420 985028 -170229
31830 -170229 -1261407 -1746377 -1623778 -1132104 -589100 -426686 -883464 -1543164 -1602228 -818473
31820 -818473 142033 542065 425907 329462 454419 564493 514609 401023 220131 -186579
31810 -186579 -775784 -1225240 -1306300 -1077889 -651065 -32190 677369 1136340 1005783 314572
31800 314572 -473502 -807821 -581718 -308707 -533189 -1012982 -874776 185748 1301982
31791 1301982 1486854 914871 538176 683031 802506 577007 427559 713472 1113548
$$ packed form
31858c61372J045511R31103O04385N65935N38254M2785p95140j407154j447825
31849b83518r46668m5362R80272J541278J080459k13536j320841j293161k11792
31840g12869Q78073R91952J38454p35103p14864J34216Q36405N76156m07392j155257
31830a70229j091178m84970J22599M91674N43004J62414m56778o59700n9064P83755
31820h18473R60506M00032j16158r6445J24957J10074m9884j13586j80892m06710
31810a86579n89205m49456q1060K28411M26824O18875P09559M58971j30557o91211
31800C14572p88074l34319K26103K73011k24482m79793J38206J060524J116234
31791A301982J84872n71983l76695J44855J19475k25499j49448K85913M00076
$$ plain form
31782 1113548 1148272 802252 334363 -42322 -4019 844456 2378173 3782864 4323779
31773 4323779 3969491 3068161 1931112 1046640 1068312 1993147 2798208 2554380 1619533
31764 1619533 1116270 1470344 2102639 2393639 2283989 1971888 1635962 1484316 1542497 1381798
31754 1381798 590606 -478619 -1026832 -950031 -1010873 -1627595 -2124511 -1658089 -458022
31745 -458022 415877 364683 -207054 -591760 -561051 -342190 -179253 -159653 -283552 -438990
31735 -438990 -373750 50675 551105 608570 61422 -686240 -1140468 -1145060 -715233 141276
31725 141276 1088207 1360729 599252 -464832 -830967 -559281 -492281 -776858 -698293 -127456
31715 -127456 16455 -759128 -1625760 -1710262 -1335455 -1158520 -948424 -252471 453554 473576
$$ packed form
31782A113548L4724l46020m67889l76685L8303Q48475J533717J404691N40915
31773D323779l54288r01330j137049q84472K1672R24835Q05061k43828r34847
31764A619533n03263L54074O32295K91000j09650l12101l35926j51646N8181j60699
31754A381798p91192j069225n48213P6801o0842o16722m96916M66422J200067
31745d58022Q73899n1194n71737l84706L0709K18861J62937J9600j23899j55438
31735d38990O5240M24425N00430N7465n47148p47662m54228m592M29827Q56509
31725A41276R46931K72522p61477j064084l66135K71686O7000k84577P8565N70837
31715a27456J43911p75583q66632q4502L74807J76935K10096O95953P06025K0022
$$ plain form
31705 473576 224030 621672 1505799 1918929 1688170 1430445 1184389 471173 -309494 -101798
31695 -101798 926014 1256592 299881 -638164 -381347 454281 743221 605395 750121
31686 750121 1014510 816459 431061 579626 1122841 1270504 849367 374179 52261 -337530
31676 -337530 -698205 -655214 -317052 -185869 -305488 -245154 53424 143413 -146127 -475295
31666 -475295 -634284 -774479 -870741 -589402 66404 500250 217044 -539229 -1041573 -773417
31656 -773417 150304 1007139 992142 53441 -895428 -977666 -422623 -155703 -481191 -823210
31646 -823210 -737257 -411410 2271 758245 1795851 2317302 1728290 609089 77076
31637 77076 339226 507562 -103375 -1051076 -1403786 -956735 -402071 -335774 -488909 -190056
$$ packed form
31705D73576k49546L97642Q84127M13130k30759k57725k46056p13216p80667K07696
31695a01798J027812L30578r56711r38045K56817Q35628K88940j37826J44726
31686G50121K64389j98051l85398J48565N43215J47663m21137m75188l21918l89791
31676c37530l60675M2991L38162J31183j19619O0334K98578Q9989k89540l29168
31666d75295j58989j40195r6262K81339O55806M33846k83206p56273n02344K68156
31656g73417R23721Q56835j4997r38701r48869q2238N55043K66920l25488l42019
31646h23210Q5953L25847M13681P55974J037606N21451n89012j119201n32013
31637G7076K62150J68336o10937r47701l52710M47051N54664O6297j53135K98853
$$ plain form
31627 -190056 618152 1233382 1116073 574467 307066 564906 1076317 1558337 1902696 1982737
31617 1982737 1691375 1172136 721161 505755 623070 1246861 2303687 3145717 3079815
31608 3079815 2239735 1453687 1213380 1274290 1326357 1454917 1713973 1797226 1473193 921436
31598 921436 335452 -363598 -1081254 -1310642 -814741 -116886 253972 607378 1454511 2318737
31588 2318737 2125407 819598 -346439 -478996 -167908 -380329 -922460 -840277 21952
31579 21952 799291 903816 680075 576576 451740 113750 -91064 197928 671510 776533
31569 776533 514728 224430 -157547 -897351 -1643105 -1585117 -575951 532860 866129
31560 866129 345474 -552526 -1275686 -1300838 -416326 826380 1523509 1540117 1611578 2089954
$$ packed form
31627a90056Q08208O15230j17309n41606k67401K57840N11411M82020L44359Q0041
31617A982737k91362n19239m50975k15406J17315O23791J056826Q42030o5902
31608C079815q40080p86048k40307O0910N2067J28560K59056Q3253l24033n51757
31598I21436n85984o99050p17656k29388M95901O97855L70858L53406Q47133Q64226
31588B318737j93330j305809j166037j32557L11088k12421n42131Q2183Q62229
31579B1952P77339J04525k23741j03499j24836l37990k04814K88992M73582J05023
31569G76533k61805k90298l81977p39804p45754N7988J009166J108811L33269
31560H66129n20655q98000p23160k5152Q84512J242706O97129J6608P1461M78376
$$ plain form
31550 2089954 2382095 2067709 1713026 1868930 2037257 1550121 851784 822450 1239785 1091611
31540 1091611 258284 -289551 -46185 352426 262908 -67899 -94430 258387 754072 1187915
31530 1187915 1309502 931983 324876 17635 104536 236355 281678 355382 222252 -506498
31520 -506498 -1476538 -1767301 -1203179 -626089 -560676 -527530 -132795 93949 -373706 -1065853
31510 -1065853 -1227193 -944253 -802209 -877177 -817406 -583362 -409977 -284516 -64676 122759
31500 122759 151247 314052 919054 1652665 1860065 1336218 445427 -379761 -908243 -1062586
31490 -1062586 -918764 -629591 -237117 179059 216952 -414066 -1154993 -1096890 -390653 -182273
31480 -182273 -787862 -1086431 -388373 326797 84520 -320450 341281 1513419 1654278
$$ packed form
31550B089954K92141l14386l54683J55904J68327m87136o98337k9334M17335j48174
31540A091611q33327n47835K43366L98611q9518l30807k6531L52817M95685M33843
31530A187915J21587l77519o07107l07241Q6901J31819M5323P3704j33130p28750
31520e06498r70040k90763N64122N77090O5413L3146L94735K26744m67655o92147
31510a065853j61340K82940J42044p4968N9771K34044J73385J25461K19840J87435
31500A22759K8488J62805O05002P33611K07400n23847q90791q25188n28482j54343
31490a062586J43822K89173L92474M16176L7893o31018p40927N8103P06237K08380
31480a82273o05589k98569O98058P15170k42277m04970O61731J172138J40859
$$ plain form
31471 1654278 743294 200438 463969 458345 -303947 -791097 -195774 795159 1204525 1111605
31461 1111605 1025141 835910 229450 -495402 -772614 -535760 -115704 269954 539883 602092
31451 602092 460469 172727 -359590 -1136453 -1658651 -1415575 -744545 -440725 -500099 -157249
31441 -157249 719189 1315573 1252197 1186659 1542497 1684784 1050156 167995 -238550 -351797
31431 -351797 -605533 -688068 -184117 387552 247881 -323347 -399905 84550 282341 -147491
31421 -147491 -531648 -277595 305647 602464 568724 641873 1026680 1376239 1214679 604251
31411 604251 214983 506353 993219 794707 -110109 -786519 -636609 -122541 68679 -91047
31401 -91047 -301496 -505496 -679279 -628523 -414703 -401164 -533980 -329073 49894 -298884
$$ packed form
31471A654278r10984n42856K63531n624p62292m87150N95323R90933M09366r2920
31461A111605q6464j89231o06460p24852k77212K36854M20056L85658K69929O2209
31451F02092j41623k87742n32317p76863n22198K43076O71030L03820n9374L42850
31441a57249Q76438N96384o3376o5538L55838J42287o34628q82161m06545j13247
31431c51797k53736q2535N03951N71669j39671n71228p6558M84455J97791m29832
31421a47491l84157K54053N83242K96817l3740P3149L84807L49559j61560o10428
31411F04251l89268K91370M86866j98512r04816o76410J49910N14068J91220j59726
31401i1047k10449k04000j73783N0756K13820J3539j32816K04907L78967l48778
$$ plain form
31391 -298884 -1402265 -1827246 -689533 793105 1021867 397070 445323 1224449 1377234
31382 1377234 541121 -88883 212721 688813 530349 25162 -196071 -12800 462811
31373 462811 1073053 1277739 605579 -366077 -519151 161567 608055 492524 648958 1302067
31363 1302067 1395637 414422 -541792 -471229 -3499 -114533 -443969 -185386 283101 100189
31353 100189 -406450 -228026 527169 768285 214508 -246226 -27998 458149 713615 772046
31343 772046 711060 368549 -228116 -770992 -1113279 -1271829 -1070559 -421037 149868 -1148
31333 -1148 -635528 -874921 -430644 174692 607275 1069192 1523630 1493394 955298 605485
31323 605485 778956 814777 56738 -1050583 -1465474 -835337 206370 822174 684864
$$ packed form
31391b98884j103381m24981J137713J482638K28762o24797M8253P79126J52785
31382A377234q36113o30004L01604M76092j58464n05187k21233J83271M75611
31373D62811O10242K04686o72160r71656j53074O80718M46488j15531J56434O53109
31363A302067R3570r81215r56214P0563M67730j11034l29436K58583M68487j82912
31353A00189n06639J78424P55195K41116n53777m60734K18228M86147K55466N8431
31343G72046o0986l42511n96665n42876l42287j58550K01270O49522N70905j51016
31333a148o34380k39393M44277O05336M32583M61917M54438l0236n38096l49813
31323F05485J73471L5821p58039j107321m14891O30137J041707O15804j37310
$$ plain form
31314 684864 88095 -356108 -232023 317119 840542 1133300 1243315 1045049 364709 -411038
31304 -411038 -493369 285185 1165844 1473112 1353093 1155364 753966 90540 -188816 496972
31294 496972 1530368 1630149 548362 -542805 -576580 121991 435620 -85959 -815696
31285 -815696 -949022 -436508 64521 -6740 -543298 -1062066 -1404010 -1839351 -2438085 -2734380
31275 -2734380 -2315072 -1459830 -795273 -493773 -274334 -88322 -232781 -701745 -996992
31266 -996992 -865070 -762773 -1191151 -1897919 -2208808 -1945856 -1508392 -1137885 -683745 -194275
31256 -194275 -146611 -736780 -1376052 -1380886 -902347 -628668 -708046 -605828 -76089 423103
31246 423103 580347 844270 1629607 2387960 2212052 1155453 194566 -91165 -50534 -76666
$$ packed form
31314F84864n96769m44203J24085N49142N23423K92758J10015j98266o80340p75747
31304d11038q2331P78554Q80659L07268j20019j97729m01398o63426k79356O85788
31294D96972J033396R9781j081787j091167l3775O98571L13629n21579p29737
31285h15696j33326N12514N01029p1261n36558n18768l41944m35341n98734k96295
31275b734380M19308Q55242O64557L01500K19439J86012j44459m68964k95247
31266i96992J31922J02297m28378p06768l10889K62952M37464L70507M54140M89470
31256a94275M7664n90169o39272m834M78539K73679p9378J02218N29739M99192
31246D23103J57244K63923P85337P58353j75908j056599r60887k85731M0631k6132
$$ plain form
31236 -76666 10791 364401 595131 380659 62737 76552 215574 71642 -164214 -30537
31226 -30537 361406 583824 792945 1468913 2271162 2167997 995525 -77653 -184285
31217 -184285 4620 -537552 -1474529 -1635929 -912557 -434835 -784638 -1139253 -645564 236276
31207 236276 475266 7780 -273617 129299 709356 748394 173674 -535160 -892069 -679932
31197 -679932 -7362 689323 928598 677910 405279 483071 744490 840268 812239 966798
31187 966798 1286429 1382386 1102024 828448 1003110 1606219 2282606 2725224 2707482 2013134
31177 2013134 731518 -491914 -924062 -512249 118540 440882 453935 337444 164926
31168 164926 142127 628340 1540560 2137137 1891583 1289810 1173635 1480432 1342750 461407
$$ packed form
31236g6666Q7457L53610K30730k14472l17922J3815J39022j43932k35856J33677
31226c0537L91943K22418K09121O75968Q02249j03165j172472j073178j06632
31217a84285J88905n42172r36977j61400P23372M77722l49803l54615M93689Q81840
31207B36276K38990m67486k81397M02916N80057L9038n74720p08834l56909K12137
31197f79932O72570O96685K39275k50688k72631P7792K61419R5778k8029J54559
31187I66798L19631R5957k80362k73576J74662O03109O76387M42618j7742o94348
31177B013134j281616j223432m32148M11813O30789L22342J3053j16491j72518
31168A64926k2799M86213R12220N96577k45554o01773j16175L06797j37682q81343
$$ plain form
31158 461407 -358097 -308899 389001 965219 1118473 1060380 880407 444150 -174629 -625327
31148 -625327 -670166 -384866 -42164 3179 -468187 -1114820 -1065838 143371 1780667 2578269
31138 2578269 2182471 1445331 1216718 1385569 1326342 808274 101033 -507902 -905827 -997348
31128 -997348 -683335 -27064 692698 1128148 1100662 776986 528069 470209 297385 -186804
31118 -186804 -594107 -456734 -47875 -72236 -539801 -676650 -152264 366344 300862 105086
31108 105086 513063 1378186 1964351 2032490 1930476 1843682 1648595 1370327 1141959 799262
31098 799262 113319 -654227 -1004733 -918914 -736165 -445659 218945 1036317 1386575 1128980
31088 1128980 698145 302796 -198787 -572816 -285634 450666 658490 51507 -405030
$$ packed form
31158D61407q19504M9198O97900N76218J53254n8093j79973m36257o18779m50698
31148f25327m4839K85300L42702M5343m71366o46633M8982J209209J637296P97602
31138B578269l95798p37140k28613J68851n9227n18068p07241o08935l97925r1521
31128i97348L14013O56271P19762M35450k7486l23676k48917n7860j72824m84189
31118a86804m07303J37373M08859k4361m67565j36849N24386N18608o5482j95776
31108A05086M07977Q65123N86165O8139j02014q6794j95087k78268k28368l42697
31098G99262o85943p67546l50506Q5819J82749K90506O64604Q17372L50258k57595
31088A128980m30835l95349n01583l74029K87182P36300K07824o06983m56537
$$ plain form
31079 -405030 8050 564271 188982 -944792 -1842475 -2179640 -2343700 -2306595 -1562947 -222562
31069 -222562 774287 792013 241813 -4305 485388 1428892 2062384 1726882 657455 -2941
31059 -2941 468315 1285271 1161614 218728 -128647 726693 1705086 1676967 972999 587017
$$ packed form
31079d05030M13080N56221l75289j133774q97683l37165j64060L7105P43648J340385
31069b22562R96849J7726n50200k46118M89693R43504O33492l35502j069427o60396
31059b941M71256Q16956j23657r42886l47375Q55340R78393k8119p03968l85982
$$ [...]
##END NTUPLES=NMR SPECTRUM
##END=
