##TITLE=31Pdec_LY-TMF-7.24.R.t
 D2O, 24 sc
 2.3.2020
##JCAMPDX= 6.0         $$ Bruker NMR JCAMP-DX V2.0
##DATA TYPE= NMR SPECTRUM
##DATA CLASS= NTUPLES
##ORIGIN= UXNMR, Bruker Analytische Messtechnik GmbH
##OWNER= root
$$ XWIN-NMR		Version 3.5
$$ Mon Mar  2 15:38:23 2020 Russian Standard Time (UT+4h)  she@DPX200
##.OBSERVE FREQUENCY= 81.013821
##.OBSERVE NUCLEUS= ^31P
##.ACQUISITION MODE= SIMULTANEOUS
##.ACQUISITION SCHEME= undefined
##.AVERAGES= 24
##.DIGITISER RES= 17
##SPECTROMETER/DATA SYSTEM= spect
##.PULSE SEQUENCE= zgpg30
##.SOLVENT NAME= D2O
##.SHIFT REFERENCE= (INTERNAL, D2O, 0, 182.463)
##AUDIT TRAIL= $$ (NUMBER, WHEN, WHO, WHERE, WHAT)
$$ ##TITLE= Audit trail, XWIN-NMR		Version 3.5
$$ ##JCAMPDX= 5.01
$$ ##ORIGIN= Bruker BioSpin GmbH
$$ ##OWNER= she
$$ F:/spectra/data/she/nmr/P31/1/pdata/1/auditp.txt
$$ ##AUDIT TRAIL=  $$ (NUMBER, WHEN, WHO, WHERE, WHAT)
(   1,<2020-03-02 15:36:29.64 +0400>,<she>,<DPX200>,
      <created by zg, POWCHK disabled, PULCHK disabled
       configuration hash MD5:
       00 E9 B6 7A A2 85 ED C7 34 08 36 98 17 FE 4E 26
       data hash MD5: 32K
       7C 07 07 10 A8 89 08 C9 D7 2F 95 C8 EF 99 61 2E>)
(   2,<2020-03-02 15:36:37.21 +0400>,<she>,<DPX200>,
      <Start of raw data processing
       efp BC_mod = 2 LB = 1 FT_mod = 6 PKNL = 1 PHC0 = -1238.113 PHC1 = -111.5984 SI = 64K 
       data hash MD5: 64K
       43 76 5C 35 DE 23 9B 86 FB 22 BA 6B 1D C6 58 E1>)
(   3,<2020-03-02 15:37:06.87 +0400>,<she>,<DPX200>,
      <pk PHC0 = 68.02302 PHC1 = -133 
       data hash MD5: 64K
       A3 F6 F1 07 C4 B2 51 B5 B0 05 C5 DB 24 E9 2D BB>)
(   4,<2020-03-02 15:37:09.51 +0400>,<she>,<DPX200>,
      <abs ABSG = 5 
       data hash MD5: 64K
       73 A7 C5 28 96 19 62 91 81 CC 26 28 DF A9 87 11>)
(   5,<2020-03-02 15:37:24.15 +0400>,<she>,<DPX200>,
      <pk PHC0 = -4.80138 PHC1 = 0 
       data hash MD5: 64K
       B5 CB 89 1D 3D 48 4D 37 0F 0B AF 7F 6B 1C 24 7B>)
(   6,<2020-03-02 15:37:37.54 +0400>,<she>,<DPX200>,
      <pk PHC0 = 6.199999 PHC1 = 0 
       data hash MD5: 64K
       5C 7C A1 8B 22 25 37 6C 5B D5 AF 60 2A 1B 83 2A>)
$$ ##END=
$$ 
$$ hash MD5
$$ 37 A3 D9 BE 9E DC 86 95 D8 52 E5 36 37 3A 3D 7F
##$RELAX= 
##$RELAX= 
##$RELAX= 
##$RELAX= 
##$RELAX= 
##$RELAX= 
##$RELAX= 
##$RELAX= 
$$ Bruker specific parameters
$$ --------------------------
##$DU= <F:/spectra>
##$EXPNO= 1
##$NAME= <P31>
##$PROCNO= 1
##$TYPE= <nmr>
##$USER= <she>
##$AMP= (0..31)
100 100 100 100 100 100 100 100 100 100 100 100 100 100 100 100 100 100 
100 100 100 100 100 100 100 100 100 100 100 100 100 100 
##$AQSEQ= 0
##$AQ_mod= 1
##$AUNM= <au_zg>
##$AUTOPOS= <>
##$BF1= 81.014009
##$BF2= 200.13
##$BF3= 200.13
##$BF4= 200.13
##$BF5= 200.13
##$BF6= 200.13
##$BF7= 200.13
##$BF8= 200.13
##$BYTORDA= 1
##$CFDGTYP= 0
##$CFRGTYP= 5
##$CHEMSTR= <none>
##$CNST= (0..31)
1 1 145 1 1 1 1 1 1 1 1 1 1 1 1 1 1 1 1 1 1 1 1 1 1 1 1 1 1 1 1 1 
##$CPDPRG= <waltz16>
##$CPDPRG1= <>
##$CPDPRG2= <waltz16>
##$CPDPRG3= <>
##$CPDPRG4= <mlev>
##$CPDPRG5= <mlev>
$$ [...]
##$SUBNAM3= <"">
##$SUBNAM4= <"">
##$SUBNAM5= <"">
##$SUBNAM6= <"">
##$SUBNAM7= <"">
##$SUBNAM8= <"">
##$SUBNAM9= <"">
##$SW= 369.568048894756
##$SWIBOX= (0..15)
0 1 3 0 0 0 0 0 0 0 0 0 0 0 0 0 
##$SW_h= 29940.119760479
##$TD= 32768
##$TD0= 1
##$TE= 0
##$TE2= 300
##$TE3= 300
##$TEG= 300
##$TL= (0..7)
0 120 53 12 22 120 120 120 
##$TP= (0..7)
150 150 150 150 150 150 150 150 
##$TP07= 0
##$TPNAME0= <>
##$TPNAME1= <>
##$TPNAME2= <>
##$TPNAME3= <>
##$TPNAME4= <>
##$TPNAME5= <>
##$TPNAME6= <>
##$TPNAME7= <>
##$TPOAL= (0..7)
0.5 0.5 0.5 0.5 0.5 0.5 0.5 0.5 
##$TPOFFS= (0..7)
0 0 0 0 0 0 0 0 
##$TUNHIN= 0
##$TUNHOUT= 0
##$TUNXOUT= 0
##$USERA1= <user>
##$USERA2= <user>
##$USERA3= <user>
##$USERA4= <user>
##$USERA5= <user>
##$V9= 5
##$VALIST= <valist>
##$VCLIST= <CCCCCCCCCCCCCCC>
##$VD= 0
##$VDLIST= <DDDDDDDDDDDDDDD>
##$VPLIST= <PPPPPPPPPPPPPPP>
##$VTLIST= <TTTTTTTTTTTTTTT>
##$WBST= 1024
##$WBSW= 4
##$XGAIN= (0..3)
0 0 0 0 
##$XL= 0
##$YL= 0
##$YMAX_a= 8735
##$YMIN_a= -9603
##$ZGOPTNS= <>
##$ZL1= 120
##$ZL2= 120
##$ZL3= 120
##$ZL4= 120
##$ABSF1= 182.463
##$ABSF2= -187.1042
##$ABSG= 5
##$ABSL= 3
##$ALPHA= 0
##$AQORDER= 0
##$ASSFAC= 0
##$ASSFACI= 0
##$ASSFACX= 0
##$ASSWID= 0
##$AUNMP= <proc_1d>
##$AZFE= 0.1
##$AZFW= 0.5
##$BCFW= 0
##$BC_mod= 2
##$BYTORDP= 0
##$COROFFS= 0
##$CY= -3
##$DATMOD= 1
##$DC= 0
##$DFILT= <>
##$DTYPP= 0
##$F1P= 0
##$F2P= 0
##$FCOR= 1
##$FTSIZE= 65536
##$FT_mod= 6
##$GAMMA= 0
##$GB= 0
##$INTBC= 1
##$INTSCL= 5.30512e-09
##$ISEN= 30
##$LB= 1
##$LEV0= 0
##$LPBIN= 0
##$MAXI= 10000
##$MC2= 0
##$MEAN= 0
##$ME_mod= 0
##$MI= 50
##$NCOEF= 0
##$NC_proc= -5
##$NLEV= 6
##$NOISF1= 182.463
##$NOISF2= 159.3651
##$NSP= 0
##$NTH_PI= 0
##$NZP= 0
##$OFFSET= 182.463
##$PC= 4
##$PHC0= -1168.691
##$PHC1= -244.5984
##$PH_mod= 1
##$PKNL= yes
##$PPARMOD= 0
##$PSCAL= 0
##$PSIGN= 0
##$REVERSE= no
##$SF= 81.0140089999434
##$SI= 65536
##$SIGF1= 159.3651
##$SIGF2= -187.1042
##$SINO= 113.3802
##$SIOLD= 16384
##$SREGLST= <1H.CDCl3>
##$SSB= 0
##$STSI= 65536
##$STSR= 0
##$SW_p= 29940.119760479
##$SYMM= 0
##$S_DEV= 0
##$TDeff= 32768
##$TDoff= 0
##$TI= <>
##$TILT= no
##$TM1= 0
##$TM2= 0
##$TOPLEV= 0
##$USERP1= <user>
##$USERP2= <user>
##$USERP3= <user>
##$USERP4= <user>
##$USERP5= <user>
##$WDW= 1
##$XDIM= 65536
##$YMAX_p= 433608190
##$YMIN_p= -11870811
$$ End of Bruker specific parameters
$$ ---------------------------------
##NTUPLES= NMR SPECTRUM
##VAR_NAME=  FREQUENCY,     SPECTRUM/REAL,   SPECTRUM/IMAG
##SYMBOL=    X,             R,               I
##VAR_TYPE=  INDEPENDENT,   DEPENDENT,       DEPENDENT
##VAR_FORM=  AFFN,          ASDF,            ASDF
##VAR_DIM=   65536,         65536,           65536
##UNITS=     HZ,            ARBITRARY UNITS, ARBITRARY UNITS
##FACTOR=    0.456856943014862, 1,           1
##FIRST=     14782.0589164792, 0,            0
##LAST=      -15158.0608439998, 0,           0
##MIN=       -15158.0608439998, -11870811,   0
##MAX=       14782.0589164792, 433608190,    0
$$ Real data points
##PAGE= N=1
##DATA TABLE= (X++(R..R)), XYDATA
$$ [...]
##PAGE= N=2
##DATA TABLE= (X++(I..I)), XYDATA
36734a790395Q22869J142024Q39745N9004p31337p84735M2609Q06693N85729k53452
$$ -1790395 -967526 174498 1014243 1073247 341910 -442825 -400216 406477 992206 738754
36724G38754o29453k69504J53784J88343M4936o2860k14596l62342k94201r8030
$$ 738754 109301 -160203 -6419 181924 226860 164000 -50596 -412938 -707139 -805169
36714h05169q9335k35907j77292J68560M87649N28070K86304r6548k47090K59030
$$ -805169 -894504 -1130411 -1307703 -1139143 -651494 -123424 162880 66332 -180758 78272
36704G8272J110858J179892p823j253401j146907o9134M98263K62893J93909M69222
$$ 78272 1189130 2369022 2361199 1107798 -39109 -108243 390020 652913 846822 1316044
36694A316044J46444q34708j136834k12540O37543L59331j83203J68505Q60787
$$ 1316044 1462488 627780 -509054 -721594 -84051 275280 92077 260582 1121369
36685A121369O91990p2702k14902L68051N94050k7661p98771r61126m78805K27735
$$ 1121369 1813359 1740657 1525755 1893806 2487856 2460195 1661424 700298 221493 449228
36675D49228O01342K30375n48894p37247j7347N81663J86615m54135j14495R03438
$$ 449228 1050570 1280945 732051 -5196 -22543 559120 745735 291600 177105 1080543
36665A080543J241341N99593j9699n4714m685k43372m56127m43633m20175l70022
$$ 1080543 2321884 2921477 2901778 2847064 2842379 2599007 2142880 1699247 1279072 909050
36655I09050r1313Q7548l07788p99641m39558N27125P82595j4776o30861j72040
$$ 909050 817737 905285 597497 -202144 -641702 -114577 668018 653242 22381 -149659
36645a49659O45131P64880K30927l36452p21847q48686m14279M43479Q59550L60046
$$ -149659 495472 1260352 1491279 1154827 432980 -415706 -829985 -386506 473044 833090
36635H33090l67974m75400r4326J46352J34634J52548K62102M00214O18872P72756
$$ 833090 465116 -10284 -104610 41742 176376 328924 591026 991240 1610112 2382868
36625B382868N00009r4350l72329j61217o2358l32996l48215K27942O50498K44992
$$ 2382868 2882877 2788527 2416198 2254981 2192623 1859627 1511412 1739354 2389852 2634844
36615B634844m70166o51992l72228j31376J07966M54670L84316m32366j202029
$$ 2634844 2164678 1512686 1140458 1009082 1117048 1571718 1956034 1523668 321639
36606C21639j001964j92150K21578J19659O5963R1235j18750k59855J08105M92294
$$ 321639 -680325 -872475 -650897 -531238 -465275 -374040 -492790 -752645 -644540 -152246
36596a52246J83748l07898L3658Q41025P63688k85363r15887m76592J16839J30592
$$ -152246 31502 -276396 -242738 598287 1361975 1076612 160725 -315867 -199028 -68436
36586f8436J5553J12973j11647p64130q55126Q6814R51409P03767P3000L38925
$$ -68436 -52883 60090 -51557 -815687 -1670813 -1583999 -632590 71177 144177 483102
36576D83102J221519J340773L55041o48330p83916l11588J05564K16596R2903
$$ 483102 1704621 3045394 3400435 2752105 1968189 1656601 1762165 1978761 2071664
36567B071664j42769l17845l33201l26931m15120l83792j4463M05685L47555j88739
$$ 2071664 1928895 1611050 1277849 950918 535798 152006 137543 543228 890783 702044
36557G02044n58594k30834N72961J093320P97943q1944p65394p26280k27125R5893
$$ 702044 143450 -87384 485577 1578897 2376840 2294896 1529502 803222 576097 671990
36547F71990N0755k9060N5825Q9636r2350k89459k70484r3425N9406Q8784l6555
$$ 671990 722745 693685 749510 839146 746796 457337 186853 93428 152834 241618 205063
36536B05063j97511o7437M46038P92658M04377l18315m15514J49175L39682k89513
$$ 205063 7552 -59885 386153 1178811 1583188 1264873 849359 998534 1338216 1048703
36526A048703p70324k20759O93047P32255n4861n08126j29935L67671L37037P8919
$$ 1048703 278379 57620 750667 1482922 1428061 919935 790000 1157671 1494708 1573627
36516A573627J13976K49568q2294q31660j200769o24765M02314Q21226L36917
$$ 1573627 1687603 1937171 1854877 1023217 -177552 -802317 -400003 421223 758140
36507G58140j77742Q4898O74219N73164k00646o09624k28879J59085p5233m44864
$$ 758140 580398 665296 1339515 1912679 1712033 1102409 873530 1032615 957382 512518
36497E12518l27070m0429j64123m55240l15789J29894K87560J05424K4178J29204
$$ 512518 185448 145019 -19104 -474344 -790133 -660239 -372679 -267255 -243077 -113873
36487a13873J03103j04968k29694k28222k97203m16932l47531l550M93591R35897
$$ -113873 -10770 -115738 -345432 -573654 -870857 -1287789 -1635320 -1638870 -1145279 -209382
36477b09382R60626K83718o71706r38707k57125M59737M58021J96284L12454L72787
$$ -209382 751244 1034962 363256 -575451 -832576 -372839 85182 281466 593920 966707
36467I66707k33599q34634l25036Q57184J090521p5837j285910j313387m39957
$$ 966707 733108 -101526 -426562 430622 1521143 1445306 159396 -1153991 -1593948
36458a593948M01358P73713O49402J33768l03382j08644N09113P31537L35218
$$ -1593948 -1192590 -418877 230525 364293 60911 -47733 461380 1192917 1528135
36449A528135m2567j4728O5878l3662j0400J91211R4886l95569o71117m48185
$$ 1528135 1485568 1470840 1536718 1503056 1492656 1683867 1778753 1383184 712067 263882
36439B63882k61071m25988l77682L37913J163438J292528P26471j5070o48571
$$ 263882 2811 -423177 -800859 -462946 700492 1993020 2719491 2704421 2055850
36430B055850j040067r66294n37140l02940m16042k83838L98886R31241N95538
$$ 2055850 1015783 49489 -487651 -790591 -1206633 -1490471 -1091585 -160344 435194
36421D35194k09223n60810k96004R942J186j59412j88361R5498O37919R16547
$$ 435194 225971 -334839 -630843 -620901 -619715 -779127 -967488 -871990 -234071 682476
36411F82476L55676o68914r31415L916R68481P23455l44513q83615m02681M18235
$$ 682476 1038152 369238 -562177 -558261 410220 1133675 789162 -94453 -497134 -78899
36401g8899Q36981O59417O1699m99273n19572j37798r6825n14702m84629L72042
$$ -78899 758082 1417499 1479198 979925 460353 322555 225730 -288972 -773601 -401559
36391d01559R17699J71947r06767p32820M60842J066635N74250n8484k84286m87908
$$ -401559 516140 688087 -218680 -951500 -490658 575977 1150227 1091743 807457 319549
36381C19549o34362j58144N70094M02669n43325p23062L40943J114130M90322
$$ 319549 -314813 -472957 97137 499806 -43519 -766581 -425638 688492 1178814
36372A178814m50671l23644L36882J93729o18373r09216m27426P5637L31727O75871
$$ 1178814 728143 404499 741381 935110 316737 -592479 -1019905 -944268 -612541 63330
36362F3330R41921O00957p4470k33472J37162J93562k57297m04671J15830N26999
$$ 63330 1005251 1606208 1531738 1298266 1435428 1628990 1371693 967022 1082852 1609851
36352A609851J77116m24598m85983j20805N5231k4992R49J07633k9725k88910
$$ 1609851 1786967 1362369 876386 755581 810812 785820 786769 894402 864677 575767
36342E75767k19575O9683r0714q02380j168527m86598O38943J025615M60408j96344
$$ 575767 356192 425875 335161 -467219 -1635746 -2122344 -1483401 -457786 2622 -193722
36332a93722l23586j50937J8851L22336O98339N47160l35883j097433q53631M4772
$$ -193722 -517308 -668245 -649394 -327058 371281 918441 582558 -514875 -1368506 -1323734
36322a323734N44899L50247L3447m2504l0865K7419K53037M17065K42706J25348
$$ -1323734 -778835 -428588 -395141 -437645 -468510 -441091 -188054 229011 471717 597065
36312E97065N96761J156908P85745l12519p58588q3650N63064L09504j80380j18989
$$ 597065 1193826 2350734 3136479 2823960 2065372 1981722 2544786 2854290 2673910 2554921
36302B554921K6131l71232p34215k95377L80435K42073m98672q08183n34016l05023
$$ 2554921 2581052 2209820 1475605 1180228 1560663 1802736 1304064 495881 -38135 -343158
36292c43158j24512M66909J024497N47509p01789j192225k88829Q52015J017601
$$ -343158 -467670 -761 1023736 1571245 869456 -322769 -611598 240417 1258018
36283A258018M36778j8916j43016k32096l57401m27586m54514l29260J45979P11041
$$ 1258018 1694796 1675880 1532864 1300768 943367 515781 61267 -267993 -122014 589027
36273E89027P61382L00935P3870L90085N74745O1283o86967r09906n72374q4654
$$ 589027 1350409 1651344 1725214 2115299 2690044 2751327 2064360 1154454 582080 497426
36263D97426L84165P00842M71846l44826j022025r51867m97135k70981r2742M75424
$$ 497426 881591 1582433 2054279 1709453 687428 -264439 -761574 -1032555 -1125297 -649873
36253f49873J003535O84595k18599n24266J38918P28204K62887q47332j400037
$$ -649873 353662 1038257 819658 295392 434310 1162514 1425401 578069 -821968
36244h21968q28777L65954J271570J320055O28412j49557m20163j92575Q0478
$$ -821968 -1650745 -1284791 -13221 1306834 1935246 1785689 1365526 1172951 1253429
36235A253429J22533L4196m1446q5428l8904J55296L19039K16581l439N0729L63706
$$ 1253429 1375962 1410158 1368712 1283284 1244380 1399676 1718715 1935296 1931857 1982586 2346292
36224B346292M41939L6017m80678o42659m17134r049M34295O60947L07978n21697
$$ 2346292 2788231 2824248 2343570 1700911 1283777 1274728 1709023 2369970 2677948 2156251
36214B156251j029527n94771L20030O83414K40536k26480o7017L82380M28096
$$ 2156251 1126724 531953 851983 1535397 1775933 1549453 1482436 1864816 2292912
36205B292912O3568j40837j3467l4150m60128p40242k74257N26856N91185l35177
$$ 2292912 2356480 2215643 2202176 2168026 1707898 967656 693399 1220255 1811440 1476263
36195A476263j180054q78650K37696R14718N82540j12854l35843l0260K81062
$$ 1476263 296209 -582441 -344745 569973 1152513 1039659 703816 673556 954618
36186I54618K09759k01382n94779n64613o0578M23658L71834m7623k13514K163
$$ 954618 1164377 962995 368216 -196397 -256975 166683 538517 490894 277380 279543
36176B79543Q4732k07664m45831l42062k71016n03109n78654j01614M23771L64036
$$ 279543 364275 156611 -289220 -631282 -902298 -1405407 -1984061 -2085675 -1661904 -1297868
36166a297868R5686M06513J059198J049430K42244l76503k72497j08867n08043
$$ -1297868 -1202182 -795669 263529 1312959 1555203 1178700 906203 797336 289293
36157B89293j021577r24181k92934L12253O37471O53911L02568j03287J28758
$$ 289293 -732284 -1656465 -1949399 -1637146 -999675 -345764 -43196 -146483 -17725
36148a7725R80462J277214K18386j189931j304283j22393P68166M37226l74373
$$ -17725 962737 2239951 2458337 1268406 -35877 -158270 609896 1047122 672749
36139F72749o62106m45842k04074K6029L44205M63502J50667k66012l83400l20538
$$ 672749 10643 -435199 -639273 -613244 -269039 194463 345130 79118 -304282 -624820
36129f24820l21692j77757L52885Q62413P14302J9064m50914l30271n7275p1205
$$ -624820 -946512 -1124269 -771384 91029 805331 824395 373481 43210 -14065 -85270
36119h5270j56186Q3976M61374L94182k01001o66826m78744l2362q4837n05880
$$ -85270 -241456 -157480 303894 698076 497075 -169751 -648495 -680857 -765694 -1271574
36109a271574k75360R49599J941796J350304l37318j282853p21155J87637K39844
$$ -1271574 -1546934 -597335 1344461 2694765 2357447 1074594 353439 541076 780920
36100G80920j74013m3415N28969O25519Q5655l19421j78663P5115Q3426J01627
$$ 780920 606907 563492 1092461 1717980 1803635 1484214 1305551 1380666 1464092 1565719
36090A565719L28418L93819m7148o66697q62532n57636k08053j06915k7018L38627
$$ 1565719 1894137 2287956 2240808 1574111 711579 153943 -54110 -161025 -188043 150584
36080A50584P81439P15834J5848n96445m14515J80715J79761m93316p58578q5875
$$ 150584 932023 1647857 1663705 1067260 652745 833460 1013221 519905 -238673 -324548
36070c24548N51607K10081m27349j67920O08745M91321n54404r60927j0120J041677
$$ -324548 227059 437140 9791 -158129 450616 941937 387533 -573394 -583514 458163
36060D58163R35112J63664j38321N1197Q9036J3980K33553M18024n6164q28643
$$ 458163 1393275 1556939 1418618 1469815 1558851 1572831 1806384 2224408 2168244 1339601
36050A339601q96533j96352K30680j76437o89034m38999L32716O96863L22843
$$ 1339601 443068 246716 477396 300959 -388075 -827074 -494358 202505 525348
36041E25348j68417r7367L78524N12551P8402j89556L15470R02607L83886r72174
$$ 525348 356931 259564 638088 1150639 1229041 1039485 1354955 2257562 2641448 1669274
36031A669274j442327k64525J107809J032043q2613p44773p07237p96824r95245
$$ 1669274 226947 -37578 1070231 2102274 2019661 1274888 567651 -229173 -1224418
36022a224418m70857N86541R32712L11273j12475K16644L93122j17024l81685
$$ -1224418 -1695275 -1108734 -176022 135251 22776 239420 632542 515518 133833
36013A33833K88233R37683M89146m63891o94874k67833o7279j39654Q1184M27378
$$ 133833 422066 1359749 1848895 1385004 690130 422297 355018 215364 296548 723926
36003G23926K94783p0011N5281M72022L86616q0700j14978K01905K8090n01136
$$ 723926 1018709 948698 1003979 1476001 1862617 1781917 1666939 1868844 1896934 1395798
35993A395798l13593N55443O77588l76683j014459k4780J386573J309655j05817
$$ 1395798 1082205 1637648 2315236 1938553 924094 899314 2285887 3595542 3489725
35984C489725j050123o53536J95254M17354m9395o22472p61188k47461N45936
$$ 3489725 2439602 1786066 1981320 2398674 2349279 1726807 965619 718158 1264094
35975A264094P46696l5822r89654j026697k38773L22794J80082j08220l6510J50268
$$ 1264094 2010790 1974968 985314 -41383 -280156 42638 222720 114500 77990 228258
35965B28258Q0480j21255j63217m4895R0701J83556J47086j13948m34863m85373
$$ 228258 308738 187483 24266 -20629 70072 253628 400714 286766 -148097 -633470
35955f33470k48382o6251j08886j34772J07186N42388R28585J074614Q51380K67051
$$ -633470 -881852 -948103 -1056989 -1191761 -1084575 -542187 386398 1461012 2312392 2579443
35945B579443m10895q30786q57828n55111m3389L94441L78556k0777j58959K49238
$$ 2579443 2168548 1337762 479934 -75177 -118566 275875 654431 633654 474695 723933
35935G23933M91299j19166r76668r29117o1080M26619J10668j37735K36187O19441
$$ 723933 1215232 1096066 119398 -809719 -870799 -444180 -333512 -471247 -235060 384381
35925C84381M67873J89645J55231k9578m88188m34642M60799J099955N01592n68279
$$ 384381 852254 1041899 1197130 1167552 679364 244722 705521 1805476 2307068 1738789
35915A738789p85189l22104k93935p40798p39294k02781L4850j43867J9195N77786
$$ 1738789 953600 631496 337561 -403237 -1142531 -1345312 -1310462 -1454329 -1435134 -857348
35905h57348O63513J21111j04645L58234O61013L30527J41813O21582R42190K95376
$$ -857348 -193835 -72724 -177369 180865 841878 1172405 1314218 1935800 2877990 3173366
35895C173366o63850q22097k54768J78351K11274J15211j41911o21117p95581
$$ 3173366 2509516 1687419 1432651 1611002 1822276 1937487 1795576 1174459 378878
35886C78878k83078K31762p1156o64860l86813N67800P73339j75404r38271m47014
$$ 378878 95800 327562 256406 -408454 -795267 -227467 545872 370468 -567803 -1014817
35876a014817N71923Q56941M27451J76124L02101K37701j40309k85638l1132N0951
$$ -1014817 -442894 414047 841498 1017622 1319723 1557424 1417115 1131477 1100345 1151296
35866A151296l51397o66570l17008L21556M83381J92686J12649L40382K47394
$$ 1151296 799899 133329 -183679 137877 621258 813944 926593 1266975 1514369
35857A514369l00528n10060K0564M22564j28485r21283p13662K17325M71021j39300
$$ 1514369 1213841 703781 724345 1146909 1018424 97141 -616521 -399196 71825 -67475
35847f7475k89568M76454Q06208j37588j018534m07813P41117N21102p98151j129304
$$ -67475 -357043 119411 925619 788031 -230503 -638316 102801 623903 -174248 -1303552
35837a303552J11456J096684M36141q40942j022350j02472O21531M70345j25927
$$ -1303552 -1192096 -95412 340729 -500213 -1522563 -1625035 -1003504 -533159 -659086
35828f59086n41594n05515l7616N35023P29717M83642K61691L02924K55689q7455
$$ -659086 -1200680 -1706195 -1743811 -1208788 -479071 4571 266262 569186 824875 737420
35818G37420l00128p2953J45786r5890l94595j55576L02206J73849n26871r49836
$$ 737420 437292 364339 510125 414235 19640 -135936 166270 340119 -186752 -1136588
35808a136588o28977M9319N83451Q26545O96020J71166k90789p2540O34031Q59806
$$ -1136588 -1765565 -1716246 -1132795 -306250 389770 560936 270147 197607 831638 1691444
35798A691444J82404o13986o31000o0757K39483k4815l86807m38427k65644q1775
$$ 1691444 1873848 1259862 628862 568105 807588 782773 395966 -42461 -308105 -389880
35788c89880J07249L58235N80751N80669K34890l20432o23983k50510N58934R03027
$$ -389880 -282631 75604 656355 1237024 1471914 1151482 527499 276989 835923 1738950
35778A738950K35469q06073j070810l49836L87448L45177p6248o598N55869P52063
$$ 1738950 1974419 1168346 97536 -252300 135148 480325 404077 397479 953348 1705411
35768A705411J42622o23907o84614j11972K43334o5207n35960n19704j63663j21820
$$ 1705411 1848033 1224126 539512 427540 670874 605667 69707 -449997 -613660 -735480
35758g35480m81381n59749M5481P19486N99451k16491p82910n25267K08321Q10563
$$ -735480 -1216861 -1776610 -1731129 -1011643 -412192 -628683 -1411593 -1936860 -1728539 -917976
35748i17976J038820Q55739K75760l31791l67310J46911L65510j98376p95580
$$ -917976 120844 976583 1252343 920552 553242 700153 1065663 867287 71707
35739G1707m67052M28601O22871k21408j001600p01955L34940J003698P50793
$$ 71707 -395345 33256 656127 434719 -566881 -1268836 -933896 69802 820595
35730H20595m1708n87804l67129M08114Q75996M23415n05193r58670p32238l83298
$$ 820595 778887 191083 -176046 232068 1108064 1531479 1026286 67616 -664622 -1047920
35720a047920r2645M88378J111124Q58452k68608q76338j40558Q26369O67880
$$ -1047920 -1140565 -652187 458937 1317389 1048781 172443 31885 858254 1526134
35711A526134j18597j71604L90211L10713m57152n80330L38224J014026N78079
$$ 1526134 1407537 1235933 1626144 1936857 1479705 899375 1237599 2251625 2829704
35702B829704j17868p7679K91096K10836R760L47378P49760K60749q37723j261993
$$ 2829704 2711836 2634157 2925253 3136089 3145849 3493227 4242987 4503736 3666013 2404020
35692B404020o34749M926j85616p12423o64005m2186M24811L80176J22738o2083
$$ 2404020 1769271 1774197 1588581 876158 212153 169967 594778 974954 1097692 1035609
35682A035609k57868m79884l82608K09344P65776N90386j50831n47711k45661
$$ 1035609 777741 297857 -84751 124593 890369 1480755 1329924 782213 536552
35673E36552N2110k04738m02722K61655J301610J455998N01966m98889p94654
$$ 536552 588662 383924 -18798 242857 1544467 3000465 3502431 3003542 2208888
35664B208888p25250p06367n17332o5009J17990k17349m34415k5712M70278L44700
$$ 2208888 1483638 777271 259939 194930 312920 95571 -338844 -364556 105722 450422
35654D50422r1081o2839L63866M66021J01561j38815K9360J88320l4512m38122
$$ 450422 359341 296502 660368 1126389 1227950 1089135 1118495 1306815 1272303 834181
35644H34181o28691n00772k08362N3418J63785J46829J17174R5992L7567M3351
$$ 834181 205490 -295282 -503644 -450226 -286441 -139612 -22438 73554 111121 154472
35634A54472K17436K93493q3743o13293n43296J50326N66804K46420j23781O1725
$$ 154472 371908 665401 581658 -31635 -574931 -424605 142199 388619 264838 326563
35624C26563L06578K8742k89141j7280L32735m360n06208j67335N80948L90858
$$ 326563 633141 661883 372742 355462 688197 683837 177629 10294 591242 982100
35614I82100o74669j037378p2778R30372Q25078J83384M7397L07823K64809q0671
$$ 982100 307431 -729947 -802725 127647 952725 1136109 1183506 1491329 1756138 1675467
35604A675467k40676j60075j32649k11417k82707l40356k74609J49939P61450
$$ 1675467 1434791 1274716 1142067 930650 647943 307587 32978 182917 944367
35595I44367R52385N03755j08749m67836o20235n42200l8628N54333N29579L8494
$$ 944367 1896752 2400507 2291758 1823922 1203687 661487 622859 1177192 1706771 1745265
35585A745265P1927P23637P46920l69385j230238o22542M38224K72397p92021
$$ 1745265 1817192 2540829 3287749 2918364 1688126 1065584 1503808 1776205 984184
35576I84184j065828k31806M13025K31523k4167J63050L58302L43908N33115Q77127
$$ 984184 -81644 -313450 99575 331098 306931 469981 828283 1172191 1705306 2582433
35566B582433P15886P2992k27221r1019l86958j175571j237423j23933Q09288
$$ 2582433 3298319 3371311 3144090 3053071 2666113 1490542 253119 129186 938474
35557I38474M48184l47990l01852J91668R637o08183n74393M2197K26724p2934
$$ 938474 1386658 1038668 736816 928484 938121 329938 -244455 -202258 24466 -48468
35547d8468O5573O74906O79661j78545p23996k14383M70228K51543n58022r21512
$$ -48468 17105 692011 1371672 1193127 469131 254748 724976 976519 418497 -503015
35537e03015n80256o8653K54876M41180N31644N04643M43003L69711J52977j69752
$$ -503015 -1083271 -1151924 -897048 -455868 75776 580419 1023422 1393133 1546110 1376358
35527A376358l08650j82460o1759o8998l2782p350k84367o42684l85931M61767
$$ 1376358 1067708 885248 823489 754491 721709 714359 429992 -212692 -598623 -136856
35517a36856Q78019L61487j94845K0105L24378k33320j034745p58757L72474Q35322
$$ -136856 741163 1102650 907805 927910 1252288 1018968 -15777 -774534 -402060 433262
35507D33262J85045m32178l27355k16469o12512p55665K2291J029332J223178
$$ 433262 618307 186129 -141226 -357695 -970207 -1725872 -1703581 -674249 548929
35498E48929O17259j23443o78951q94502m28902N38693R69641K62259p05100p27064
$$ 548929 1166188 1042745 363794 -530708 -959610 -420917 548724 810983 105883 -621181
35488f21181P3669O41532N32554J47398j33940j62426J92326O12026K41692j008096
$$ -621181 -547512 94020 626574 773972 640032 477606 669932 1281958 1523650 515554
35478E15554j715654p16535R55477J341678L67949k65395J57591N43897J60383
$$ 515554 -1200100 -1916635 -961158 380520 748469 483074 640665 1184562 1344945
35469A344945j97052J33588M42382P408n86883n11756n1528J12316J11302L71962
$$ 1344945 1147893 1281481 1723863 1731271 1144388 632632 581104 693420 804722 1176684
35459A176684O14506L86956K0223O9928K79723M6206m74196o42879m14296k48670
$$ 1176684 1791190 2178146 2198369 2268297 2548020 2594226 2120030 1477151 1062855 814185
35449H14185j92161Q1463M49174L93012j29636n60248n14945j45633K42380M49178
$$ 814185 622024 703487 1152661 1545673 1416037 855789 340844 195211 437591 886769
35439H86769L34187k8561k42258m5070K67624K61556j3587k21731k82000k59114
$$ 886769 1220956 1192395 950137 905067 1172691 1434247 1420660 1198929 916929 657815
35429F57815k4459M49518P53783N53657J36125j03454l19810o85438o75966J53109
$$ 657815 633356 1082874 1836657 2390314 2526439 2422985 2103175 1417737 741771 894880
35419H94880J006173O44201o83236j316222m64926P10183Q01424l2700o46097
$$ 894880 1901053 2545254 1862018 545796 80870 791053 1592477 1559777 913680
35410I13680n39057j01589K88997N87414P01129M80819O5593k31364l46245m13528
$$ 913680 374623 273034 562031 1149445 1850574 2331393 2396986 2165622 1819377 1405849
35400A405849l93341j46110J75158K23313j072p9651K05650M93453L30245j61774
$$ 1405849 1012508 866398 1041556 1264869 1263797 1184146 1389796 1883249 2213494 2051720
35390B051720m35692k93011j30653k76725m51277k56584N6478j09557o52222o99934
$$ 2051720 1616028 1323017 1192364 915639 464362 207778 264256 154699 -497523 -1197457
35380a197457J21334R42484P17104l25464r33393m34214N14882Q83902N12423
$$ -1197457 -1076123 -133639 583465 258001 -675392 -1109606 -594724 289178 801601
35371H01601J23689L05978P78009P83877J28285m94282m49484j25233l51675j001902
$$ 801601 925290 1231268 2009277 2793154 2921439 2427157 1977673 1852440 1500765 498863
35361D98863j037774j32507P17716P05977L78199M76734N27785k24447j121557
$$ 498863 -538911 -671418 46298 752275 1130474 1607208 2134993 1910546 788989
35352G88989q21586M74095J054517J65073r60373j017050l30811Q5325J36184
$$ 788989 -32597 441498 1496015 1661088 700715 -316335 -647146 -561821 -425637
35343d25637L58126P26478P46213L88321Q5978m3664k72180o10975o80736k94627
$$ -425637 -67511 658967 1405180 1793501 1879479 1835815 1563635 952660 271924 -22703
35333b2703K37089M89003L86099K28944L25737N76633M99516j19363p15193n29170
$$ -22703 214386 703389 1089488 1318432 1644169 2220802 2720318 2600955 1885762 1356592
35323A356592K76918O58117N2856q47830j058524n14515J48511N65940P56423
$$ 1356592 1633510 2291627 2344483 1496653 438129 -76386 72125 638065 1394488
35314A394488N82832j19714r16223j011867l18673L02106J73443k94440k62077
$$ 1394488 1977320 1857606 941383 -70484 -389157 -87051 86392 -208048 -470125
35305d70125L16168O86200M14015o1084j28020K19730N72840O66065M03837k74342
$$ -470125 -153957 532243 946258 885174 757154 976884 1549724 2215789 2619626 2345284
35295B345284j061522j188301l47304N61552M73675k23459k21456N31710N91332
$$ 2345284 1283762 95461 -251843 309709 783384 559925 338469 870179 1461511
35286A461511n58336j343058m32914J042930J117626p4630p19435j93318L25381
$$ 1461511 903175 -439883 -872797 170133 1287759 1213129 493694 300376 625757
35277F25757N8313l23700j54457K45500M77508O37415N69023j51059j032159q36568
$$ 625757 684070 360370 205913 451413 928921 1566336 2135359 1984300 952141 115573
35267A15573M54491J185052L41980r19855j034720j83407M20899M54283M46289
$$ 115573 570064 1755116 2097096 1177241 142521 -40886 380013 834296 1280585
35258A280585M98247K75191j09889k47671j91081k32844k60526p6849M0585j71005
$$ 1280585 1778832 2054023 1944134 1696463 1505382 1272538 1012012 935163 975748 804743
35248H04743l53711j32604J72106J76116K02312N88012Q21629L41187l48772m20602
$$ 804743 451032 318428 490534 666650 868962 1456974 2278603 2619790 2271018 1850416
35238A850416j01872j63604m52865k17179L81046M53653J6503J2936N56923N76599
$$ 1850416 1748544 1584940 1132075 914896 1295942 1749595 1766098 1779034 2335957 2912556
35228B912556l31140r87469l46434Q46262J045288P113r88145q39754J37145P71443
$$ 2912556 2581416 1593947 1247513 2093775 3139063 3146176 2158031 1318277 1455422 2226865
35218B226865M33168l76539p74576n67762k76645k05930o4518L17118N42608L46574
$$ 2226865 2660033 2283494 1508918 941156 664511 458581 394063 711181 1253789 1600363
35208A600363J34697K64938L51144m0385n11007m10327J36872N47523O77898O21301
$$ 1600363 1735060 1999998 2351142 2310757 1799750 1389423 1526295 2073818 2751716 3373017
35198C373017J47265p21396j117818m17480N78680P61267M97619Q35801J362726
$$ 3373017 3520282 2798886 1681068 1263588 1842268 2603535 3101154 3936955 5299681
35189E299681O94169r44759j620670o13867M26866M8002r39666j019198k39444
$$ 5299681 5993850 5049091 3428421 2814554 3241420 3289422 2349756 1330558 1091114
35180A091114K96081K23176J18j30530k45133k99446l32209n61159p15885n8292
$$ 1091114 1387195 1610371 1610489 1479959 1234826 935380 603171 42012 -673873 -732165
35170g32165J276390J870108Q39422p42705j222388m64696M22806P90297P47919
$$ -732165 544225 2414333 3253755 2511050 1288662 823966 1246772 2037069 2784988
35161B784988L29054m22379q69728m58230K46401K72423k30280l02364J61136
$$ 2784988 3114042 2691663 1821935 1363705 1610106 1882529 1652249 1349885 1511021
35152A511021L01256j27123l25167J40022O36131N88644K94603J18983j87344
$$ 1511021 1812277 1685154 1359987 1500009 2136140 2724784 3019387 3138370 2951026
35143B951026p43228r44585l95079K22145P8168m64913m13665K22513M20439j84598
$$ 2951026 2207798 1263213 868134 1090279 1168447 703534 289869 512382 932821 748223
35133G48223o80599l33274K74701K64630j03038J6500M99304M19705k98838o29014
$$ 748223 67624 -265650 9051 273681 170643 187143 686447 1106152 807314 178300
35123A78300j23089L43824J04495j62363K74578P76434M01581l88923m87376l8929
$$ 178300 55211 399035 503530 341167 615745 1392179 1793760 1404837 917461 878532
35113H78532m6798m48195k99108K37928k3770r94132j047566K98860J341275Q25169
$$ 878532 831734 383539 84431 322359 298589 -695543 -1743109 -1444249 -102974 722195
35103G22195j12125M3960P43640N55917l75144q10564n62559m30372m90488r9090
$$ 722195 610070 654030 1397670 1953587 1578443 767879 205320 -225052 -715540 -814630
35093h14630O52216R65486P00834M34312L06337J0183k82914k01901j31749o02722
$$ -814630 -162414 803072 1503906 1938218 2244555 2254738 1971824 1769923 1638174 1035452
35083A035452r77432k08423J191252J502949K92503r48630r94465l39811l663
$$ 1035452 58020 -150403 1040849 2543798 2836301 1887671 893206 553395 549732
35074E49732j15805k45857j32040L51077J045538J139024L0365j311028j224319
$$ 549732 433927 188070 56030 407107 1452645 2591669 2622034 1311006 86687
35065H6687J30275P37090k31508j078005k98600J026082J049937N6709k58457
$$ 86687 216962 954052 722544 -355461 -654061 372021 1421958 1478667 1220210
35056A220210M18101P97783K29746n12584o81101m04761J4212M90199P14685L42331
$$ 1220210 1638311 2436094 2665840 2153256 1472155 1067394 1081606 1571805 2286490 2628821
35046B628821k83559n04917m35368o76582r82555m27031Q64829J417310M21003
$$ 2628821 2345262 1840345 1404977 728395 -254160 -681191 183638 1600948 2021951
35037B021951r99170j284543l85628O03647J050102J067914O97127j13300q39226
$$ 2021951 1022781 -261762 -647390 -43743 1006359 2074273 2771400 2658100 1818874
35028A818874p25623N2915M36966j4916m42456L956Q22146Q77791R0352m98663
$$ 1818874 1093251 1146166 1583132 1568216 1125760 1129716 1951862 2829653 2920005 2421342
35018B421342l24419n6027m05229r51929q31330j08892L56657K40988R4835K87537
$$ 2421342 2096923 2040896 1635667 683738 -147592 -256484 100173 341161 435996 723533
35008G23533M34201J96191n9240Q7454L33630J54933k82982l91048j40179p4075
$$ 723533 1157734 1353925 1294685 1382139 1715769 1870702 1587720 1196672 1056493 982418
34998I82418l57566n05613k30479P3309M3865L5548N45688J245848J238871L19611
$$ 982418 624852 119239 -111240 -37931 5934 41482 587170 1833018 3071889 3391500
34988C391500n95107n83553J25691N32339J78996m17535o17884l98489o8528K34179
$$ 3391500 2796393 2212840 2338531 2870870 3049866 2632331 2014447 1615958 1547430 1781609
34978A781609M17047K50330j98339l14653K48496P81172L35735p58384j129269
$$ 1781609 2198656 2448986 2250647 1935994 2184490 2965662 3301397 2543013 1413744
34969A413744k88925O28710N21109j66931l18927J55995M59444L16588J76991
$$ 1413744 1124819 1753529 2274638 2107707 1788780 1944775 2404219 2720807 2897798
34960B897798J12779l78299j214849j355445j86513J334605J648864M69672r22756
$$ 2897798 3010577 2632278 1417429 61984 -124529 1210076 2858940 3328612 2405856
34951B405856j236681n26935J46576P1221m19692n36819k7023O17432Q22906N18698
$$ 2405856 1169175 642240 788816 860037 440345 -96474 -123497 493935 1316841 1835539
34941A835539Q581m36576o57202n28541j16532K24472K12209R182l4097J15852
$$ 1835539 1844120 1407544 750342 221801 105269 329741 541950 551132 517035 632887
34931F32887K50285L67599O26959R04363Q53077M36422m2405m70112r60815j276483
$$ 632887 883172 1250771 1877730 2782093 3635170 4071592 4029187 3559075 2598260 1321777
34921A321777q58748K42458J066841Q66015Q1862l36744k06116n4035q6263J4042
$$ 1321777 463029 705487 1772328 2638343 2720205 2383461 2177345 2123310 2037047 2051089
34911B051089L11253M06569J48921r3568j06681j89236n12856o50100k11471M10352
$$ 2051089 2362342 2768911 2917832 2824264 2717583 2528347 2015491 1365391 1153920 1564272
34901A564272M69671j12570o38215n38745k1837K78007O0925l45642l78959J22253
$$ 1564272 2033943 1921373 1283158 744413 722576 1000583 1061508 715866 336907 459160
34891D59160O94713P46760K62250j72258r3087L04171M69882J40265m73771r52130
$$ 459160 1153873 1900633 2162883 1990625 1897538 2201709 2671591 2811856 2338085 1385955
34881A385955r62264m66378J95355N61207M99655K54438K2112k02482l01458l3423
$$ 1385955 423691 -42687 152668 713875 1213530 1467968 1490080 1287598 986140 952717
34871I52717M06735L58256l35292q13625k92433O83124Q57925R674p40903m73875
$$ 952717 1359452 1717708 1382416 568791 276358 959482 1817407 1827081 1086178 612303
34861F12303L91769P99565L73996l33326o28789l87169l9899J5645q2281O6904
$$ 612303 1004072 1803637 2177633 1844307 1215518 828349 788450 804095 721814 788718
34851G88718L74522K77831k69144m82933L1917M60008L9888n06316m6374R08179
$$ 788718 1163240 1441071 1171927 688994 720911 1180919 1220807 714491 668117 1576296
34841A576296P84711m81516j172798m36831M86899M10839l2516J62462N67327
$$ 1576296 2361007 1879491 706693 269862 756761 1167600 1135084 1297546 1864873
34832A864873L31669j01304J60414O65089K80283p86255j187803n15902K22476
$$ 1864873 2196542 2095238 2255652 2920741 3201024 2414769 1226966 711064 933540
34823I33540K31858j87112m77649m78140j20596N60097J031637P76783K17193
$$ 933540 1165398 978286 500637 22497 -98099 461998 1493635 2270418 2487611
34814B487611K00065N92096M51443l19776o74056j04160M75481J06654q25596
$$ 2487611 2687676 3279772 3731215 3411439 2737383 2633223 3108704 3215358 2389762
34805B389762j252503q60800k36642N3455M563k9733K13728N85403O50068K95901
$$ 2389762 1137259 276459 39817 93272 97835 68102 281830 867233 1517301 1813202
34795A813202n180J16381L21903J79880q934K35999N59062K83350l00376l03420
$$ 1813202 1808022 1924403 2246306 2426186 2417252 2653251 3212313 3495663 3195287 2891867
34785B891867J76623J10108o70943j044193l85920M26062M23533p7513k33771
$$ 2891867 3068490 3178598 2507655 1463462 1077542 1503604 1927137 1849624 1615853
34776A615853N3555L55814M95317M26171l1695p05103q98786l17209L75862M57290
$$ 1615853 1669408 2025222 2520539 2946710 2915015 2209912 1311126 993917 1369779 1827069
34766A827069P8604j79176j20115J61956N87330Q22694L59134o13687j068773
$$ 1827069 1905673 1726497 1606382 1768338 2355668 3178362 3537496 2923809 1855036
34757A855036m62812M33533O33401K30182o8761j00224j89081m08704o02566p53832
$$ 1855036 1392224 1825757 2459158 2689340 2620579 2520355 2331274 1922570 1320004 566172
34747E66172p55540k74800N97050J101175Q24358L80104M21140N96040K74507
$$ 566172 -189368 -464168 132882 1234057 2058415 2438519 2859659 3455699 3730206
34738C730206k80977l94941j80021k86158p27347q75204m80659P2589M14433M45962
$$ 3730206 3449229 3054288 2874267 2588109 1860762 985558 504899 577488 991921 1437883
34728A437883J41296l14865m41538p5364K54128J12738j20837M3559L17632K18960
$$ 1437883 1579179 1264314 822776 747412 1001540 1114278 993441 1037000 1354632 1573592
34718A573592O152J06614J08946n75526j403630j275821k80073L78017K46658
$$ 1573592 1579744 1686358 1795304 1219778 -183852 -1459673 -1739746 -1361729 -1115071
34709a115071K03933Q61318J510508J242492L07256l28202l25882k48551n97329
$$ -1115071 -911138 -49820 1460688 2703180 3010436 2682234 2356352 2107801 1510472
34700A510472j027070p50261K96118J020400M17058q66827j067847K99428J570342
$$ 1510472 483402 -266859 29259 1049659 1466717 599890 -467957 -168529 1401813
34691A401813J155291k81601r17824l30750L31362L14948j25k32935n25372p54025
$$ 1401813 2557104 2275503 1357679 1026929 1358291 1673239 1673114 1440179 914807 160782
34681A60782l98350M57324R51251O49185J28126J8068J83414K15291J00679l121
$$ 160782 -237568 219756 1171007 1820192 1948318 1966386 2149800 2365091 2465770 2462649
34671B462649j79140n36326q63961p96405k35136M73041P72965M62023P169m5676
$$ 2462649 2283509 1747183 883222 86817 -148319 324722 1097687 1559710 1566879 1521203
34661A521203N9839l34123r99629q91256J28909Q00188L78179j88143L5606L68247
$$ 1521203 1581042 1246919 247290 -643966 -515057 285131 663310 475167 510773 879020
34651H79020n2831m78178J01489Q65841M51878m70389j86436R78067J023549l45491
$$ 879020 826189 348011 449500 1315341 1767219 1296830 1110394 2088461 3112010 2766519
34641B766519j195687n24566M26926N73826M30818M08725j39189j188981j397032
$$ 2766519 1570832 1046266 1473192 2047018 2477836 2886561 2747372 1558391 161359
34632A61359l12223O04626L19779k15820n7742L7550o27022r94552n7488J135764
$$ 161359 -150864 453762 773541 557721 499979 537529 -89493 -1084045 -1141533 -5769
34622e769J121635M09253L43131O81420L05572n08940n78172j85R9157l64641
$$ -5769 1115866 1525119 1868250 2549670 2855242 2346302 1768130 1767945 1867102 1502461
34612A502461m85487k24593l70962p55887l55034P07377J032892J92910n09170
$$ 1502461 1016974 792381 421419 -334468 -689502 17875 1050767 1243677 734507
34603G34507q1619P42223Q37787K84834j68280l43999m90615n00229j07642M09021
$$ 734507 652888 1395111 2232898 2517732 2349452 2005453 1514838 1014609 906967 1315988
34593A315988M29483j12701n12860j51762O46362Q95917J67272p56391p80913
$$ 1315988 1745471 1632770 1119910 968148 1614510 2510427 2677699 1921308 1140395
34584A140395J21441R53959J029559N88525M9275n28904r81873q82743k80863
$$ 1140395 1261836 2215795 3245354 3833879 3883154 3354250 2372377 1489634 1208771
34575A208771J39365P1372J0730K45287K89890j24017m12907j87544k7990m02079
$$ 1208771 1348136 1419508 1430238 1675525 1965415 1841398 1428491 1240947 1212957 810878
34565H10878o99484k90781K78521K12268j55557m4027L46695K89374j01580j59030
$$ 810878 111394 -179387 99134 311402 155845 111818 458513 747887 646307 487277
34555D87277R2717J55404J48159N04459Q93450O23902j14672n40158n61261o53630
$$ 487277 579994 735398 883557 1388016 2281466 2905368 2790696 2250538 1689277 1035647
34545A035647p28183l26854K57649L00373l8293N3948N68972O97589L06769J06373
$$ 1035647 307464 -19390 238259 538632 500339 554287 1123259 1820848 2127617 2233990
34535B233990K53460R8393m50726n89896l1923M05819J28018l23315k32308K37370
$$ 2233990 2487450 2585843 2135117 1545221 1513298 1919117 2047135 1723820 1491512 1728882
34525A728882N02736M28246K42357O5536j10579k94890m85069n09000l7900Q07893
$$ 1728882 2231618 2659864 2902221 2967757 2857178 2562288 2077219 1568219 1530319 2338212
34515B338212J195807N90595l16082n12673j50203r8508l31023k3374Q02162J089741
$$ 2338212 3534019 4124614 3808532 3295859 3145656 3047148 2716125 2692751 3494913 4584654
34505D584654M26538l40526n18693m56469n80505o08203k64388J10335K02223
$$ 4584654 5011192 4670666 4151973 3695504 3114999 2506796 2242408 2352743 2554966
34496B554966K19393L02052J63585k82989o40161p08154p46095p71880l92161
$$ 2554966 2774359 3076411 3239996 2957007 2316846 1608692 862597 90717 -301444
34487c01444L42073P33287M94165K23963L99737O49873M89372N2919l67667p90000
$$ -301444 40629 773916 1268081 1492044 1891781 2541654 3031026 3083945 2716278 1926278
34477A926278j053015o20240M91586J233950P18530n32610j204392p83132M1847
$$ 1926278 873263 253023 744609 1978559 2697089 2164479 960087 176955 218802
34468B18802L97149J57757j12326J25438P55749J097823P26341L6141k95089j72738
$$ 218802 615951 773708 661382 786820 1542569 2640392 3366733 3402874 3107785 2935047
34458B935047K3413J39158K20454L2610o00825j095707o38136N17176J139452
$$ 2935047 2958460 3097618 3318072 3350682 2749857 1654150 1016014 1533190 2672642
34449B672642O02782l70151p39844k65376N45958R66593M65712p33238j506036
$$ 2672642 3275424 2905273 2165429 1900053 2446011 3412604 3878316 3145078 1639042
34440A639042r66503K75758Q00027K64597l20536k18488J85630L35425K84958
$$ 1639042 672539 948297 1748324 2012921 1692385 1473897 1659527 1994952 2279910
34431B279910K31819J45810J23658L18368L87154j27634q11996p64668m1972L63348
$$ 2279910 2511729 2657539 2781197 3099565 3486719 3359085 2547089 1782421 1740449 2103797
34421B103797R7138j70574r1031r4582k41836L7872O53257O46358j78580p21509
$$ 2103797 2200935 2030361 1939330 1844748 1602912 1640784 2294041 2940399 2761819 2040310
34411B040310l08281K96367K74715m3011r0340m5360j57235j41661P5607M3726
$$ 2040310 1732029 2028396 2303111 2260100 2169760 2124400 1967165 1825504 1901111 1944837
34401A944837k29153j24933K63058L8229o90971n31230Q11936J581858N92002
$$ 1944837 1715684 1590751 1853809 1892038 1201067 669837 1481773 3063631 3655633
34392C655633q27431r45889k02613r069k98531j16647L69078L30110k6795j767
$$ 3655633 2828202 1882313 1679700 1670631 1372100 1255453 1624531 1954641 1927846 1926079
34382A926079N4718n01551r67496k63109R64105J107635J56770l95769k8128K99796
$$ 1926079 1980797 1479246 511750 248641 1212746 2320381 2477151 2081382 2053254 2353050
34372B353050J06899J3770J90705p4290q36272j066596l03384N76321P56264M96561
$$ 2353050 2459949 2473719 2664424 2590134 1753862 687266 383882 960203 1716467 2213028
34362B213028K75542K9652k27571o7852M61389N09919l36061j199468r96417J04806
$$ 2213028 2488570 2518222 2290651 2222799 2684188 3194107 2858046 1658578 662161 766967
34352G66967R41014P92116M1081m96610n01543l02627k62334k66948l2766K77839
$$ 766967 1707981 2500097 2541178 2044568 1543025 1240398 978064 711116 678350 956189
34342I56189K32788j10993k49612j06253j01966j86365K38639J036459J070633
$$ 956189 1188977 1077984 828372 722119 620153 433788 672427 1708886 2779519
34333B779519o3207j069560o80483N13242J041198O47500K42599K99295M60228
$$ 2779519 2716312 1646752 966269 1479511 2520709 3168209 3410808 3710103 4170331
34324D170331M01761Q4662n39800j224518j264776m63447K98561L04797J09578
$$ 4170331 4572092 4656754 4116954 2892436 1627660 1164213 1462774 1767571 1877149
34315A877149M16220O76654R6603o82135m30158N84291R22330J97859m95058l66981
$$ 1877149 2293369 2970023 3066626 2384491 1954333 2538624 3460954 3658813 3163755 2796774
34305B796774J64869M49012L69519M8893l41079m98890m07008n21174q94039p47279
$$ 2796774 2961643 3410655 3780174 3829067 3487988 2989098 2582090 2060916 1166877 419598
34295D19598K28409R70059N60787k17855k04434J58617k07956q67051n85720L54985
$$ 419598 648007 1618066 2178853 1960998 1756564 1915181 1707225 840174 254454 609439
34285F09439O07940J77117K83192R51789R02569k5665m63843J00877N11503N1992
$$ 609439 1217379 1394496 1677688 2629477 3532046 3506381 3042538 3143415 3654918 3706910
34275C706910m44919k51867J05879M9427r8537J2469J28678J02319J54898K02208
$$ 3706910 3261991 3010124 3116003 3165430 3066893 3079362 3208040 3310359 3465257 3667465
34265C667465O995k9159N03542Q22614l1319j209721j001854L05300O71089m13906
$$ 3667465 3674460 3645301 4148843 4971457 4940138 3730417 2728563 3033863 3704952 3291046
34255C291046j182348n94351K44954M04687N53831J069047R34948k15711r77329
$$ 3291046 2108698 1514347 1759301 2163988 2717819 3786866 4721814 4506103 3528774
34246C528774m44566K39425m085l41647J67731O38239j4284r55710p83466J45725
$$ 3528774 3084208 3323633 3319548 2977901 3145632 3783871 3769587 2813877 2030411 2176136
34236B176136M99513J54447m8561N2036O2578J16662M52164N65422N9484l51085
$$ 2176136 2675649 2830096 2781535 2833571 2896149 3012811 3464975 4030397 4089881 3738796
34226C738796P4109P02012M66686m16745r01262p14908l64377m5990L58411O54350
$$ 3738796 3812905 4514917 4981603 4564858 3663596 2948688 2584311 2538321 2896732 3551082
34216C551082O60754O82975Q34174N07758o04001j617524j500036m36919O32272
$$ 3551082 4211836 4894811 5728985 6236743 5632742 4015218 2515182 2078263 2710535
34207B710535J205217J219562O44533j26774k71084K64926L97881m28927j160131
$$ 2710535 3915752 5135314 5779847 5653073 5381989 5646915 6044796 5615869 4455738
34198D455738o93153L75434O84090M4334o42944p78259l89844L19455Q76257O37070
$$ 4455738 3762585 4138019 4822109 4866443 4223499 3445240 3055396 3374851 4251108 4888178
34188D888178k36737o53181j45682L81499K09128m5705K19985L49293k38592o56595
$$ 4888178 4651441 3998260 3852578 4234077 4443205 4397500 4617485 4966778 4728186 4071591
34178D071591L0292R87970Q14767k09171o84403l17618P449j9429J47148O09878
$$ 4071591 4101883 5089853 5904620 5695449 5011046 4693428 4700877 4681448 4828596 5438474
34168E438474P74076L62701k88351p99824q75002k63342O84499R99879L61085
$$ 5438474 6212550 6575251 6286900 5487076 4612074 4348732 5033231 6033110 6394195
34159F394195l30681l46351j64962k97863k36227L29794M58673m72822j262904
$$ 6394195 6063514 5717163 5552201 5254338 5018111 5347905 5806578 5333756 4070852
34150D070852n75449P92741J078553K38200l30348j62355R534l9228J39394L71165
$$ 4070852 3495403 4288144 5366697 5604897 5274549 5112194 5121728 5082500 5221894 5593059
34140E593059J14342j76511L72937J249994J057511j58073q19165k81352K94509
$$ 5593059 5707401 5530890 5903827 7153821 8211332 8053259 7234094 6952742 7247251
34131G247251p399m91515k79683J68882m1835o40977n59911L61455R62584L11827
$$ 7247251 7239852 6748337 6468654 6637536 6595701 5954724 5394813 5756268 6718852 7030679
34121G030679r01430j167932k49257M33481n9488o88485j46511Q71694P80880
$$ 7030679 6129249 4961317 4712060 5145541 5086053 4397568 4251057 5122751 5903631
34112E903631j57473l16993L61766L67714l55008j15068J216270J497339K41j092020
$$ 5903631 5746158 5429165 5790931 6158645 5803637 5688569 6904839 8402178 8402419 7310399
34102G310399l82069M00332l29641j158058m32070O51636L70845l47077R6611
$$ 7310399 6928330 7328662 6999021 5840963 5408893 6060529 6431374 6084297 6180908
34093F180908Q17794K42409p10799k91613P88129P82039J91769N12118J053859
$$ 6180908 6998702 7241111 6530312 6238699 7026828 7808867 8000636 8512754 9566613
34084I566613K55731j026699q44542K68644L35379m26186l38330K99214l1921
$$ 9566613 9822344 8795645 7951103 8219747 8555126 8128940 7790610 8089824 8057903
34075H057903p21355l5672J240201Q82738n89394o28737P83616J166226R545o43575
$$ 8057903 7336548 7300876 8541077 9423815 8834421 8205684 8989300 10155526 10165071 9521496
34065I521496j70173j05327o81493l91401O46459N83407m99954n07441O69966
$$ 9521496 9351323 9245996 8564503 8173102 8819561 9402968 8903014 8395573 9065539
34056I065539P98600n22933j099385j90270M29775J38904L60205J042491K59421
$$ 9065539 9864139 9341206 8241821 8051551 8481326 8620230 8980435 10022926 10282347
34047A0282347j695279j900038K45783J706695Q98607L6744O79509R84351m25515
$$ 10282347 8587068 6687030 6932813 8639508 9538115 9574859 10254368 11238719 10813204
34038A0813204j620487q42207M80787O14687M04361R32507J127385N1511r58701
$$ 10813204 9192717 8350510 8831297 9445984 9850345 10782852 11910237 11961748 11003047
34029A1003047o14815J69632K87188K85018O24554N16564r7021M7633R15618P66713
$$ 11003047 10388232 10557864 10845052 11130070 11754624 12271188 12174167 12221800 13137418 13904131
34019A3904131m83273o38507P82257J351625L3459r02415m9910O66817k22976
$$ 13904131 13420858 12782351 13564608 14916233 14949692 14047277 13997367 14664184 14441208
34010A4441208j001014j14486J013957Q63580M13959O53142N37633m46235p47583
$$ 14441208 13440194 13325708 14339665 15203245 15617204 16270346 16807979 16361744 15614161
34001A5614161K18985O32417k89851p09894K02732O30105j22730n5163J431216
$$ 15614161 15833146 16465563 16175712 15465818 15668550 16298655 16175925 16120762 17551978
33992A7551978J907990M22043n69020J61375M56586n92725o18366J086955J625260
$$ 17551978 19459968 19882011 19312991 19474366 19930952 19338227 18719861 19806816 21432076
33983B1432076L1348n43496J078547J521018n48120j309605J096380K637161P21547
$$ 21432076 21463424 20919928 21998475 23519493 22971373 21661768 22758148 25395309 26116856
33974B6116856r16928O87404K209810P17774o05603J036646K321189M68758r22302
$$ 26116856 25199928 25887332 28097142 28814916 28209313 29245959 31567148 32035906 31113604
33965C1113604J069622K551843L52694j299704J263669L750979K064266K96381
$$ 31113604 32183226 34735069 35087763 33788059 35051728 38802707 40866973 41163354
33957D1163354K430845M078865J387336l63552L156094N833945K567990K24324
$$ 41163354 43594199 47673064 49060400 48696848 51852942 57686887 60254877 60479201
33949F0479201M803318Q541472M232000P29251P133227J3871819R821083N204869
$$ 60479201 65282519 73823991 78055991 78785242 85918469 99790288 109611371 114816240
33941A14816240J2809818K0272420J2512796P960754K9135577M3816908p916090
$$ 114816240 127626058 147898478 160411274 168372028 197507605 241324513 233408423
33934B33408423j14625585j78179773j31181920k5880352L6245013K9191778P094803
$$ 233408423 118782838 -59396935 -190578855 -216459207 -180214194 -151022416 -143927613
33927a43927613Q697596J6885880J0730832K370454O420488J2442517P905374
$$ -143927613 -135230017 -118344137 -107613305 -105242851 -98822363 -86379846 -78474472
33920g8474472J054262K796507O890414M330041L22049K275615N214161K565077
$$ -78474472 -77420210 -74623703 -67733289 -63403248 -63081199 -60805584 -55591423 -53026346
33912e3026346p78048J470893M616223K283572j367273J96776L744082K882707
$$ -53026346 -53804394 -52333501 -47717278 -45433706 -46800979 -46604203 -42860121 -39977414
33904c9977414k50441O9310K497684K275529M72826R35530K376832J455287j61904
$$ -39977414 -40227855 -40158545 -37660861 -35385332 -34912506 -33976976 -31600144 -30144857 -30306761
33895c0306761Q59827K705926J763331n29015n66221Q17604O69326j72584O66029
$$ -30306761 -29446934 -26741008 -24977677 -25506692 -26072913 -25255309 -24585983 -24758567 -24092538
33886b4092538J761555N29417j367796p73852J117902J011367n12774m79844Q51891
$$ -24092538 -22330983 -21801566 -23169362 -23943214 -22825312 -21813945 -22326719 -22806563 -21954672
33877b1954672R23974o0034J50957J260346J077372j59638k79993P69784J157943
$$ -21954672 -21030698 -21090732 -20939775 -19679429 -18602057 -18761695 -19041688 -18271904 -17113961
33868a7113961O98229O45864P41186j82115j321760q30952R03738J770029J220371
$$ -17113961 -16415732 -15769868 -15028682 -15210797 -16532557 -17363509 -16459771 -14689742 -13469371
33859a3469371N12846K49431K7613n5385L19101N43287K9819n26652m23798l30247
$$ -13469371 -12956525 -12707094 -12679481 -12734866 -12415765 -11872478 -11842659 -12369311 -12793109 -13123356
33849a3123356q08117q73011K27894J253830Q28053l08325o65838k76097N6403
$$ -13123356 -13931473 -14804484 -14576590 -13322760 -12494707 -12803032 -13468870 -13744967 -13688564
33840a3688564L54463P58950O87975J13594P7177P15131O97279k03404l30577
$$ -13688564 -13334101 -12575151 -11887176 -11773582 -11696405 -10981274 -10283995 -10487399 -10817976
33831a0817976P47852J069984j60392q33924K29647Q80804m16210j444631r3546
$$ -10817976 -10070124 -9000140 -9160532 -9994456 -9764809 -8884005 -9300215 -10744846 -10838392
33822a0838392J673014J209326j96664M2986J001668K45393j347683j167524K45994
$$ -10838392 -9165378 -7956052 -8152716 -8109730 -7108062 -6862669 -8210352 -9377876 -9131882
33813i131882L22286o80935l81047R54509Q19036p01654r24815N29711J096084
$$ -9131882 -8809596 -9490531 -9871578 -8917069 -8098033 -8799687 -9724502 -9194791 -8098707
33804h098707l0445o10939L81801J016344R6766p91288l54165K39549j91232p21873
$$ -8098707 -8129152 -8740091 -8358290 -7341946 -7245180 -8036468 -8390633 -8151084 -8342316 -9064189
33794i064189k32420N98176O81552K88332J80583K81067J83579o9763l40093n60393
$$ -9064189 -9296609 -8698433 -8016881 -7728549 -7547966 -7266899 -7083320 -7153083 -7493176 -8053569
33784h053569l31812N61362J247272O69973o44783j106592l02465O56246R26524
$$ -8053569 -8385381 -7824019 -6576747 -5906774 -6551557 -7658149 -7960614 -7304368 -6377844
33775f377844O66025J25569n47500p68524j90284L52941j1756n76978j68758O95709
$$ -6377844 -5711819 -5586250 -6133750 -6902274 -7092558 -6739617 -6751373 -7328351 -7497109 -6801400
33765f801400O33980j22524j84382L77780J47932r17201j169171L005J165379
$$ -6801400 -6167420 -6289944 -6474326 -6096546 -5948614 -6865815 -8034986 -8031981 -6866602
33756f866602J050003P4437p32514q38090q2669J099522J399990J18886j305843
$$ -6866602 -5816599 -5742162 -6474676 -7312766 -7395435 -6295913 -4895923 -4777037 -6082880
33747f082880r93287M74699Q78815j32791o95537K8328O91680L27489k07927r5045
$$ -6082880 -7076167 -6601468 -5722653 -5855444 -6550981 -6522653 -5830973 -5503484 -5711411 -5806456
33737e806456J47325K0966m8207J01138j15153o85045p18521m5752M08380K63843
$$ -5806456 -5659131 -5638165 -5686372 -5585234 -5700387 -6385432 -7103953 -7149705 -6741325 -6477482
33727f477482J44322J81809k24099p99077m00466Q59208J369031N59669j42573
$$ -6477482 -6333160 -6151351 -6375450 -7174527 -7574993 -6715785 -5346754 -4787085 -4929658
33718d929658L08530R92453P36918j21313o31470n77476j52994M98678Q32207
$$ -4929658 -4621128 -3628675 -2891757 -3013070 -3644540 -4222016 -4375010 -3876332 -3044125
33709c044125K25328q02844j002753l15243Q6401j21903k5829N33432N04560l19253
$$ -3044125 -2818797 -3621641 -4624394 -4939637 -4853236 -4975139 -5000968 -4467536 -3962976 -4282229
33699d282229p34250k50595J45452N153J55807O88697M04746p67728j070595J40911
$$ -4282229 -5016479 -5267074 -5121622 -5116469 -4960662 -4271965 -3867219 -4634947 -5705542 -5564631
33689e564631J018958K95631m86765L11149J494369J039281n37806j164240m83753
$$ -5564631 -4545673 -4250042 -4736807 -4425658 -2931289 -1892008 -2429814 -3594054 -4077807
33680d077807Q5109j30316m58679l82290k6923M67963Q29186M73987m67083p76486
$$ -4077807 -3992698 -4123014 -4581693 -4963983 -4990906 -4522943 -3693757 -3219770 -3686853 -4463339
33670d463339Q5461Q47838L31587n92406m39179M84219P71006K34016j62800j21888
$$ -4463339 -4377878 -3530040 -3198453 -3790859 -4230038 -3745819 -2974813 -2740797 -2903597 -3025485
33660c025485j42254k59141j39855o2887m34691p31766k48806N19578N67049L4151
$$ -3025485 -3167739 -3426880 -3566735 -3629622 -4064313 -4796079 -5044885 -4525307 -3958258 -3924107
33650c924107j40578J61781K94761J66119J83047J86845k43014o78331l48048
$$ -3924107 -4064685 -3902904 -3608143 -3442024 -3258977 -3072132 -3315146 -3993477 -4341525
33641d341525M25224N70809n1713n34559m34621k39931k75524k00041K42694P72851
$$ -4341525 -3916301 -3345492 -3397205 -3931764 -4366385 -4606316 -4881840 -5081881 -4839187 -4066336
33631d066336R89510P00171k4575o64386n22033K75643O25955m0779q04496o36088
$$ -4066336 -3076826 -2376655 -2401230 -3065616 -3587649 -3312006 -2686051 -2726830 -3531326 -4167414
33621d167414L0772J49087k32906l31623j31591k24585n25233m14546Q1192M02627
$$ -4167414 -4136642 -3987555 -4220461 -4552084 -4683675 -4908260 -5433493 -5848039 -5766847 -5364220
33611e364220N01466O95392P81232L86881j04886r4603J02478j88469o63222n00506
$$ -5364220 -4862754 -4167362 -3386130 -2999249 -3104135 -3198738 -3096260 -3284729 -3947951 -4448457
33601d448457J17858K57947j61646l18958L1879K97397K50688K66778L02154j52470
$$ -4448457 -4330599 -4072652 -4234298 -4553256 -4521377 -4223980 -3973292 -3706514 -3404360 -3556830
33591c556830r38239j143595l98518O13508J079026P77629m3012p86795p35583
$$ -3556830 -4495069 -5638664 -6037182 -5423674 -4344648 -3567019 -3610031 -4396826 -5132409
33582e132409N9358M91286j04160p10464n3518J279240J595011O15674l49965
$$ -5132409 -5073051 -4581765 -4685925 -5396389 -5449907 -4170667 -2575656 -1959982 -2309947
33573b309947n85045o24340o78180j48040Q80484J232090L62138p44423r72509
$$ -2309947 -2894992 -3519332 -4197512 -4345552 -3465068 -2232978 -1870840 -2615263 -3587772
33564c587772l69877L58230O73844K44081q37865j633423j175604J29172R66029
$$ -3587772 -3957649 -3599419 -2925575 -2681494 -3519359 -5152782 -6328386 -6199214 -5233185
33555e233185J017286J140160J552888J344164J92189q56583r23777m08539k4588
$$ -5233185 -4215899 -3075739 -1522851 -178687 13502 -843081 -1766858 -2175397 -2199985
33546b199985J37577J25159j57790l43295J12146P33119M69135l84259l30125
$$ -2199985 -2062408 -1937249 -2095039 -2438334 -2326188 -1593069 -1123934 -1508193 -1838318
33537a838318Q03721J310393L31700p71014q38363p50138j383874j626584l70572
$$ -1838318 -1034597 275796 607496 -163518 -1001881 -1752019 -3135893 -4762477 -5133049
33528e133049J058448P50056n98450p41079N18178J224738N54974j80888m6362
$$ -5133049 -4074601 -3324545 -3922995 -4664074 -4145896 -2921158 -2366184 -2547072 -2593434
33519b593434J82148k12075o03192l34028J27971J81422P7923J53769J06711k06501
$$ -2593434 -2411286 -2623361 -3226553 -3560581 -3432610 -3251188 -3173265 -3019496 -2912785 -3119286
33509c119286k01107L99267Q11491L79391k12913M9724P94050P12234m02583j213995
$$ -3119286 -3320393 -2921126 -2109635 -1730244 -1943157 -1893433 -1099383 -387149 -789732 -2003727
33499b003727p06970M12097P42338M2828o47913n32052L6037K97455J41014j0353
$$ -2003727 -2710697 -2298600 -1556262 -1513434 -2161347 -2693399 -2657362 -2359907 -2218893 -2229246
33489b229246J1092j940r4573n5886R4257M6688k12876k48382J39837N06372L84267
$$ -2229246 -2218154 -2220094 -2314667 -2370553 -2276296 -2229608 -2442484 -2690866 -2551029 -2044657 -1660390
33478a660390m1529k91049l31198m68527o51749m31935K92103R28729Q59898K27229
$$ -1660390 -1701919 -1992968 -2324166 -2792693 -3444442 -3876377 -3584274 -2655545 -1795647 -1568418
33468a568418k55462k23933o1704k19737m63810k48887K92715L95434j45125n34049
$$ -1568418 -1823880 -2047813 -2109517 -2329254 -2793064 -3041951 -2749236 -2353802 -2498927 -3032976
33458c032976j81107L33394K05694k43568j05472N97095R77489P02597K59928
$$ -3032976 -3214083 -2880689 -2674995 -2918563 -3024035 -2426940 -1449451 -746854 -486926
33449d86926j23310o56079j018979n24928M57591N81286m24283j073877l06208
$$ -486926 -610236 -1266315 -2285294 -2810222 -2352631 -1771345 -2195628 -3269505 -3575713
33440c575713Q61476R11004N1649l62917P8299O17087P19380M80614o0237q69311
$$ -3575713 -2714237 -1803233 -1751584 -2114501 -2036202 -1419115 -699735 -219121 -279358 -1148669
33430a148669j354685r05659Q8892O72911O35975M96425L78283m8931n86728n66095
$$ -1148669 -2503354 -3409013 -3320121 -2647210 -2011235 -1514810 -1136527 -1185458 -1772186 -2338281
33420b338281N294L72218K71392K41167M66570L63594k69945o75967l00114L02884
$$ -2338281 -2332987 -1960769 -1689377 -1448210 -981640 -618046 -887991 -1563958 -1864072 -1561188
33410a561188M06274K23877K93533L53284j95302j017160j067278j29283P58804
$$ -1561188 -1154914 -931037 -637504 -284220 -479522 -1496682 -2563960 -2693243 -1934439
33401a934439P08938J07342j34356P5491R0679k59745l32171K37528P57557L70519
$$ -1934439 -1225501 -1118159 -1252515 -1177024 -1086345 -1346090 -1678261 -1440733 -683176 -312657
33391c12657o19030j024943l79884M45016M84933m6978k24859K20873O06811L22289
$$ -312657 -931687 -1956630 -2336514 -1891498 -1406565 -1453543 -1678402 -1457529 -850718 -528429
33381e28429l39118n66209n4001N69673M51233l82638r27874m80066L30682L78008
$$ -528429 -867547 -1433756 -1487757 -918084 -466851 -849489 -1777363 -2257429 -1926747 -1548739
33371a548739l05392n99107p3647L71435O4785l27857l5927M29640K06833l26918
$$ -1548739 -1854131 -2453238 -2526885 -2155450 -2090665 -2418522 -2454449 -2024809 -1817976 -2144894
33361b144894j90684M16222L84621l76147p18108j52046L90384J48918l15551
$$ -2144894 -2335578 -1919356 -1534735 -1910882 -2628990 -2781036 -2390652 -2241734 -2557285
33352b557285k29895J44107J91875R0845L58803P78466O82855M9172m77340n29276
$$ -2557285 -2787180 -2643073 -2451198 -2360353 -2001550 -1223084 -540229 -491057 -968397 -1497673
33342a497673l43301k18915k09498l06656m41373l43641J31483N74208M11714
$$ -1497673 -1840974 -2059889 -2269387 -2576043 -3017416 -3361057 -3229574 -2655366 -2243652
33333b243652k35055n87860k46711K76763L15461o3563l01756k01230n2981j5575
$$ -2243652 -2478707 -3066567 -3313278 -3036515 -2721054 -2784617 -3086373 -3287603 -3340584 -3356159
33323c356159J01257L22617K90521j21747m04617j22692K77166N1222n71321n59581
$$ -3356159 -3254902 -2932285 -2641764 -2763511 -3168128 -3290820 -3013654 -2962432 -3533753 -4093334
33313d093334K94703Q35514J85274q38659q06996L14057J229545J167154O27429
$$ -4093334 -3798631 -2963117 -2777843 -3616502 -4423498 -4109441 -2879896 -1712742 -1085313
33304a085313K62169M2120j56241n2818M30276P53981N04127J2392k64365m42262
$$ -1085313 -823144 -781024 -937265 -990083 -559807 194174 698301 710693 446328 4066
33294D066p21026p46219k03700L71912K52995k71985l00206J59688J38620o11021
$$ 4066 -716960 -1463179 -1666879 -1294967 -1041972 -1313957 -1614163 -1454475 -1315855 -1926876
33284a926876r98262k53964P42449P14047j04329m36567L047K32105j89631l93939
$$ -1926876 -2925138 -3179102 -2436653 -1722606 -1826935 -2263502 -2260455 -2028350 -2217981 -2611920
33274b611920K18649P76341K47834q15452r85996m6803P65051N67091j46719m87725
$$ -2611920 -2393271 -1616930 -1369096 -2184548 -3170544 -3217347 -2452296 -1885205 -2031924 -2519649
33264b519649k95013P0199L53838M32804K29868n6950p1271J30382J00527k23817
$$ -2519649 -2814662 -2744463 -2390625 -1957821 -1727953 -1784903 -1856174 -1725792 -1625265 -1849082
33254a849082l37572N690L93589M65914L81922K52075j73946q01881r16816k08352
$$ -1849082 -2186654 -2180964 -1787375 -1321461 -939539 -687464 -861410 -1663291 -2580107 -2788459
33244b788459N88035P02379L35380J0649l25529p38767o16028L81444J288759
$$ -2788459 -2200424 -1498045 -1162665 -1152016 -1477545 -2216312 -2832340 -2450896 -1162137
33235a162137R82205p1362m78601l3461J86547k80927o91733n30732k25379j26442
$$ -1162137 -179932 -251294 -729895 -763356 -576809 -857736 -1549469 -2080201 -2305580 -2432022
33225b432022O0744M62793O79829N77667M93501M04867r7755p72280p74341p3150
$$ -2432022 -2371278 -1908485 -1228656 -650989 -157488 247379 149624 -622656 -1396997 -1470147
33215a470147L37912N3001j36645K38630M79366R9185k05311J34736M56702J08809
$$ -1470147 -1132235 -1079234 -1215879 -977249 -497883 -398698 -604009 -469273 -12571 96238
33205I6238l05521r6235J35857l56192q52981k62645Q40030R53118M3210n14127
$$ 96238 -209283 -305518 -169661 -525853 -1378834 -1641479 -801449 151669 194879 -319248
33195c19248k61439j81273p00428q77784j77238M07264r9938j043401j087078
$$ -319248 -580687 -761960 -1462388 -2340172 -2517410 -2110146 -2210084 -3253485 -4340563
33186d340563j27232P09488O73182J74394j2135K75310N88832N48670K47513k8622
$$ -4340563 -4467795 -3758307 -3085125 -2910731 -2922866 -2647556 -2058724 -1510054 -1262541 -1291163
33176a291163k36205m43766m17028J09238O90938M58785n22541j014646l40604
$$ -1291163 -1527368 -1971134 -2388162 -2278924 -1587986 -1129201 -1651742 -2666388 -3006992
33167c006992N00605L74885j58601J44995R98701R98113J9027n68268k44437r8116
$$ -3006992 -2506387 -2131502 -2290103 -2145108 -1146407 -148294 -129267 -697535 -941972 -1040088
33157a040088o76708q40688K06035J246266Q15444m43852p70962K0931M67897
$$ -1040088 -1716796 -2557484 -2351449 -1105183 -289739 -733591 -1504553 -1483622 -1015725
33148a015725j41082q21280n75349K25328O27250L90121m2586k88877k44164P2805
$$ -1015725 -1156807 -1978087 -2553436 -2328108 -1700858 -1310737 -1353323 -1642200 -1886364 -1813559
33138a813559M40647M10681k39543j058378j218857l93825P72398J239174O64197
$$ -1813559 -1372912 -962231 -1201774 -2260152 -3479009 -3872834 -3100436 -1861262 -1197065
33129a197065k41029n83106k92343M0634R7492O2105Q397k39282m93796j90872
$$ -1197065 -1438094 -2021200 -2313543 -2272909 -2175417 -2113312 -2104915 -2344197 -2837993 -3028865
33119c028865O53495J145590O84399j55432n07752m32135n02526o46799l47538
$$ -3028865 -2375370 -1229780 -545381 -700813 -1208565 -1640700 -2143226 -2790025 -3137563
33110c137563K14073K50387k93878m56098K97558J105237Q23527l16587q97125
$$ -3137563 -2923490 -2673103 -2966981 -3423079 -3125521 -2020284 -1196757 -1513344 -2410469
33101b410469j61950R20222Q43800m23646j256491m72586R78066J220281O3948
$$ -2410469 -2572419 -1652197 -808397 -1232043 -2488534 -2961120 -1983054 -762773 -698825
33092f98825p57245j69033P31591N42921k44831k48225M09546L66730n69644j014580
$$ -698825 -1456070 -1625103 -893512 -350591 -595422 -843647 -434101 -67371 -637015 -1651595
33082a651595k45134P08501P70068K71381m0534k63124o75768p99980k00436M86053
$$ -1651595 -1896729 -1188228 -418160 -146779 -187313 -450437 -1126205 -1926185 -2126621 -1640568
33072a640568M11087j17743k00109J39133J30901k73171l08267J94361M33073
$$ -1640568 -1229481 -1347224 -1547333 -1408200 -1277299 -1550470 -1858737 -1664376 -1231303
33063a231303l1155n23015l23034K35057L40750o9519k85522J34197P88007R61865
$$ -1231303 -1262458 -1785473 -2108507 -1873450 -1532700 -1602219 -1887741 -1753544 -965537 -3672
33053c672M49550l12163q27183j031645j063801p67067J16340J220407J607773
$$ -3672 445878 133715 -693468 -1725113 -2788914 -3555981 -3439641 -2219234 -611461
33044f11461Q97565j26046n03472k94446k06520l92768l90174j04354j8571l11919
$$ -611461 286104 160058 -343414 -637860 -844380 -1237148 -1627322 -1731676 -1750247 -2062166
33034b062166m88723j36660M98490R51196J082833R29897M18306m40499j294327
$$ -2062166 -2550889 -2687549 -2189059 -1237863 -155030 774867 1193173 752674 -541653
33025e41653j644234j240187k95338N60887P06531J93427j87253J33183P11808
$$ -541653 -2185887 -3426074 -3721412 -3160525 -2453994 -2260567 -2447820 -2314637 -1602829
33016a602829P57153L08784O0266J81256J63773j60030l44976k34455k55076n42774
$$ -1602829 -845676 -536892 -476626 -295370 -131597 -291627 -636603 -871058 -1126134 -1668908
33006a668908o23975l12472r3443k10561k08811J37956L08923L4987n5315M65256
$$ -1668908 -2292883 -2605355 -2698798 -2909359 -3118170 -2980214 -2671291 -2636304 -2691619 -2226363
32996b226363Q92206M64269l09655m01575J72055N55953M29767J61413j02334
$$ -2226363 -1334157 -869888 -1179543 -1581118 -1409063 -853110 -423343 -261930 -364264
32987c64264m65097o06664j13203O02304O84253J22625k60179j18417L6164j51398
$$ -364264 -829361 -1436025 -1549228 -946924 -262671 -140046 -400225 -518642 -482478 -633876
32977f33876l54325k30631J05197M06130M81458J10181n59472p03988K05159J279742
$$ -633876 -988201 -1218832 -1113635 -707505 -226047 -115866 -675338 -1379326 -1174167 105575
32967A05575J124457j60542j061896q48304l94195m81811o28274k46926K40267
$$ 105575 1230032 1069490 7594 -840710 -1234905 -1716716 -2344990 -2591916 -2351649
32958b351649L07200L26112P14978R21208K76400p59907j188981q29806k27926
$$ -2351649 -2044449 -1718337 -1003359 -82151 194249 -565658 -1754639 -2584445 -2812371
32949b812371L10457P35285P80009L80314J45933M88241O96079p0485j204260
$$ -2812371 -2501914 -1766629 -986620 -606306 -460373 27868 723947 653462 -550798
32940e50798j288736k25624N32548R1068o98757o40367J45615O20465K95121l54664
$$ -550798 -1839534 -2065158 -1532610 -1441542 -2140299 -2780666 -2635051 -2014586 -1719465 -2074129
32930b074129o45241l62997J79543M63597K35457j93251k41728K77201R37878
$$ -2074129 -2719370 -3082367 -2902824 -2439227 -2203770 -2397021 -2638749 -2361548 -1423670
32921a423670J148338O61281k58489r37260p29855K64124J046999P52286k51550
$$ -1423670 -275332 385949 127460 -809800 -1539655 -1275531 -228532 523754 272204
32912B72204q27112n94853k96465m91888o90770k63244M33762N74354J62405J8821
$$ 272204 -554908 -1149761 -1446226 -1938114 -2628884 -2892128 -2458366 -1884012 -1721607 -1702786
32902a702786N15354J031690Q54881P7386o70705r66042p57653j54635N25086
$$ -1702786 -1187432 -155742 699139 776525 105820 -860222 -1617875 -1772510 -1247424
32893a247424P24319J62367o58905q96517l48182L80152O95530N59697J63448
$$ -1247424 -523105 -360738 -1019643 -1916160 -2264342 -1884190 -1188660 -628963 -465515
32884d65515l68362p35287n27469R2008L47555k5584k29393L63306J039817P40981
$$ -465515 -833877 -1569164 -2096633 -2004625 -1657070 -1682654 -1912047 -1548741 -508924 232057
32874B32057k55783p77058n72109l96269m01475M2188P13757L87345j015533j692205
$$ 232057 -23726 -800784 -1372893 -1769162 -2170637 -2128449 -1414692 -1027347 -2042880 -3735085
32864c735085m88028J148691J156161j68908q00628J752J001731J138119P42150
$$ -3735085 -4223113 -3074422 -1918261 -2087169 -2887797 -2886045 -1884314 -746195 -4045
32855d045L80467r7840q13054j204196p85140R1671P26721Q61159O34878K05407
$$ -4045 376422 278582 -534472 -1738668 -2523808 -2432137 -1705416 -844257 -209379 -3972
32845c972k58052n21620m83469k35158J20298M68777N65899K63198j90353m10394
$$ -3972 -262024 -783644 -1267113 -1502271 -1381973 -913196 -347297 -84099 -274452 -684846
32835f84846l56504k12908K8784M15988O31600K92966m00839q26423p15694l34532
$$ -684846 -1041350 -1254258 -1225474 -809486 -177886 115080 -285759 -1112182 -1827876 -2162408
32825b162408M2306L63197N59711N23434L01851j653l73840o59792n25515k3949
$$ -2162408 -2120102 -1756905 -1197194 -673760 -371909 -373562 -747402 -1407194 -1932709 -1956658
32815a956658K62720J21839J52781O54515P90744j54273j335264j402928n13777
$$ -1956658 -1693938 -1572099 -1419318 -764803 25941 -128332 -1463596 -2866524 -3380301
32806c380301J15100K68303O92249J159455N07747j064376j662916m37287J020853
$$ -3380301 -3265201 -2996898 -2304649 -1145194 -637447 -1701823 -3364739 -3802026 -2781173
32797b781173J038249J62453j11644L10688M66701J65365K2490J42523N8218k29193
$$ -2781173 -1742924 -1580471 -1692115 -1381427 -914726 -749361 -726871 -584348 -526130 -755323
32787g55323k10220K12142N64406N04932J25545k88549m05046p9506K24003k31372
$$ -755323 -965543 -753401 -188995 315937 441482 152933 -252113 -331619 -107616 -338988
32777c38988j304204j808599j025863K72039Q97807O76891J71143k86207n08798
$$ -338988 -1643192 -3451791 -4477654 -4205615 -3307808 -2630917 -2459774 -2745981 -3254779
32768c254779j19826Q08303J367191R50940K19626N6621K07505l5418m32437k82657
$$ -3254779 -3374605 -2566302 -1199111 -248171 -28545 28076 235581 200163 -232274 -514931
32758e14931J73270J25649l33253l95489j2600R8348j44027p1372L54633K99756
$$ -514931 -341661 -216012 -549265 -944754 -957354 -859006 -1003033 -1074405 -719772 -420016
32748d20016n18062j234968j046584j69415O76472J005903O43222j74887o63794
$$ -420016 -938078 -2173046 -3219630 -3389045 -2712573 -1706670 -1063448 -1238335 -1902129
32739a902129k33134N81766P50813K94184J97678P07189Q65145J05061p77372
$$ -1902129 -2135263 -1553497 -802684 -508500 -310822 396367 1261512 1366573 589201
32730E89201q20390j98175K80319K82525q339l90593o57834n72871k32530m5761
$$ 589201 -231189 -429364 -149045 133480 125141 -265452 -923286 -1496157 -1728687 -1774448
32720a774448r5660k3582K48111K88889q1478m31178m11701k08721j9620K68735
$$ -1774448 -1870108 -1893690 -1645579 -1356690 -1438168 -1869346 -2281047 -2489768 -2509388 -2240653
32710b240653N75877M96838M8506j42701J84348M58046K49202p07J99049N13122
$$ -2240653 -1664776 -1167938 -1119432 -1262133 -1077785 -619739 -370537 -371244 -172195 340927
32700C40927M09314R2524O7481K17713Q4724k52765l23235r7979q385k00697l24975
$$ 340927 750241 842765 910246 1127959 1212683 959918 636683 538704 530319 329622 4647
32689D647p4823M24110P39352M66729l71373j136654j123466m39267J15333J88544
$$ 4647 -70176 353934 1093286 1560015 1188642 51988 -1071478 -1510745 -1395412 -1206868
32679a206868K50360N50581N33592j19405o54459l18389L25501J76109o64670
$$ -1206868 -956508 -405927 127665 8260 -646199 -964588 -639087 -462978 -1127648
32670a127648j004577l27359N48293O96904J56380m31249o01983k94792J94353
$$ -1127648 -2132225 -2459584 -1911291 -1214387 -1058007 -1489256 -2091239 -2386031 -2191678
32661b191678L56486P902l09196L0222P24542Q23077J05278n04000j89325O53168
$$ -2191678 -1835192 -1827290 -2136486 -2106264 -1381722 -558645 -453367 -957367 -1146692 -493524
32651d93524R87646M52062l21974n49879j42070K90155J66019l71764o26111k77031
$$ -493524 494122 946184 624210 74331 -67739 222416 388435 16671 -609440 -886471
32641h86471J62243J19475j47461L366M73981M98118j24517o43095m78053l0527
$$ -886471 -724228 -604753 -752214 -748848 -274867 223251 98734 -544361 -1022414 -1052941
32631a052941P2641m8267R4647M22992M32990P9771j56173p3067K308j13683j17592
$$ -1052941 -980300 -1028567 -933920 -510928 -77938 1833 -154340 -227407 -225099 -338782 -456374
32620d56374J76571L71991N9376m59543n28425q6600K61313J53324p5369l8374
$$ -456374 -279803 92188 151564 -307979 -836404 -923004 -661691 -508367 -583736 -622110
32610f22110Q8983k0125j89139q171M22158N59676K15614k12514l69775l52696
$$ -622110 -533127 -553252 -742391 -750562 -328404 231272 446886 234372 -135403 -488099
32600d88099l63915l77814l31574k94841k74203j70723n4859j04504j57233J76345
$$ -488099 -852014 -1229828 -1561402 -1856243 -2130446 -2301169 -2356028 -2460532 -2617765 -2441420
32590b441420P43165P85796O3333n29053q9757R30282J242908M46100m93233n51122
$$ -2441420 -1698255 -912459 -849126 -1378179 -1467936 -537654 705254 1151354 658121 106999
32580A06999J43808O27467K70765n82950j028738n89513K17103M88727J09114
$$ 106999 250807 878274 1149039 566089 -462649 -1052162 -835059 -346332 -237218
32571b37218j55928Q8898J95255m07964j074217q15127J11776N79532L64046L02524
$$ -237218 -393146 -304248 -108993 -516957 -1591174 -2406301 -2294525 -1714993 -1350947 -1048423
32561a048423N85420K58871j001287j855942j045524O68631J462630Q83380J44875
$$ -1048423 -463003 -204132 -1205419 -3061361 -4106885 -3438254 -1975624 -1092244 -947369
32552i47369J54516M29275K03009l86240p21341o31840l25198J31912O55282P78233
$$ -947369 -792853 -363578 -160569 -546809 -1268150 -1899990 -2225188 -2093276 -1437994 -659761
32542f59761J36016p43835q15414J18377R79834P64219j11579m17349J27992M79968
$$ -659761 -523745 -1267580 -2082994 -1964617 -984783 -220564 -332143 -749492 -621500 -141532
32532a41532j50949j069012j021990O4150J007132R20525J52322m34074m90993
$$ -141532 -292481 -1361493 -2383483 -2319333 -1312201 -391676 -239354 -673428 -1164421
32523a164421k10566J81796N32803O46576M57024J57771j11972m93944j023229
$$ -1164421 -1374987 -1193191 -660388 -13812 443212 600983 489011 -4933 -1028162
32514a028162j281258q84114j52334K22763J22966N2090K05892J61122k41500
$$ -1028162 -2309420 -3193534 -3345868 -3123105 -3000139 -2948049 -2742157 -2581035 -2822535
32505b822535l86124J78268Q10203N95609j65089k44251O68447J393284R63692
$$ -2822535 -3208659 -3030391 -2220188 -1624579 -1789668 -2033919 -1365472 27812 991504
32496I91504K9586j99984K17411K00197n54238j096362o91336J78525O57125O16751
$$ 991504 1021090 821106 1038517 1238714 684476 -411886 -1103222 -924697 -267572 349179
32486C49179M13706J25941l41247p31166o35388j15389L11866K68696j62230n82142
$$ 349179 762885 888826 547579 -183587 -818975 -934364 -622498 -353802 -516032 -1098174
32476a098174n40577R9507Q10419P28926k97995j291132j223385k99380L73772
$$ -1098174 -1638751 -1539244 -728825 101 -297894 -1589026 -2812411 -3111791 -2738019
32467b738019K48484j30896q0151L29549N71068M58745L06426M06885N93027M12083
$$ -2738019 -2489535 -2620431 -2700582 -2371033 -1799965 -1341220 -1034794 -627909 -34882 377201
32457C77201k54509q70304p92070j26256L51047K52692O7696K79734N25432J97049
$$ 377201 122692 -747612 -1539682 -1665938 -1314891 -1062199 -994503 -714769 -189337 7712
32447G712m93328p48718l24434K18490L45188P0102l09720m85966k04755M37321
$$ 7712 -485616 -1234334 -1558768 -1340278 -995090 -924988 -1234708 -1720674 -1925429 -1488108
32437a488108Q64204O92683L40827L59440M27537j39481j043373j204652l93882
$$ -1488108 -623904 68779 409606 769046 1196583 1057102 13729 -1190923 -1584805
32428a584805L86182M05006P4441m1287m1305j2940L89006R88276P74481m94761
$$ -1584805 -1198623 -793617 -719176 -760463 -801768 -814708 -425702 562574 1337055 842294
32418H42294j341010m70083J082687J194472l01115j385676p50286N81299R95653
$$ 842294 -498716 -968799 113888 1308360 1007245 -378431 -1128717 -547418 448235
32409D48235L79224l02254n50652n24798k94195J26715K86467k67494j100953
$$ 448235 827459 525205 -25447 -550245 -844440 -717725 -431258 -698752 -1799705
32400a799705j203208l09783P03347R49915N14845K1871k56450l82276k44151
$$ -1799705 -3002913 -3312696 -2609349 -1659434 -1144589 -1122718 -1379168 -1761444 -2005595
32391b005595K76636P81649O96773J88159L4004L80400L95785l72113j053059
$$ -2005595 -1728959 -947310 -250537 -62378 -28374 352026 747811 375698 -677361
32382f77361o55589L55590O98031J74672k14156j7571O1690l81412o15357m9448
$$ -677361 -1332950 -977360 -279329 -104657 -318813 -336384 -274694 -656106 -1271463 -1320911
32372a320911O53889O19722J43188L9234J83248j67536q73292r14431M201Q64251
$$ -1320911 -667022 -47300 95888 135122 318370 150834 -722458 -1636889 -1632688 -768437
32362g68437P16201q3822m90741j48697L46355L50419r4426m62545m28824j68324
$$ -768437 -52236 -136058 -626799 -775496 -429141 -78722 -173148 -635693 -1064517 -1232841
32352a232841N849P9013J99914K74759Q2356k50840l63272k79781l57934n07669
$$ -1232841 -1226992 -1147979 -948065 -673306 -590950 -841790 -1205062 -1484843 -1842777 -2350446
32342b350446j75179O05499R36329L57210l33852k78179J37373R7082j36192K83386
$$ -2350446 -2525625 -1920126 -983797 -626587 -960439 -1238618 -1101245 -1004163 -1140355 -856969
32332h56969J116553J171975J33740r29780j103695o24472n0592N30248R94903
$$ -856969 259584 1431559 1565299 635519 -468176 -1092648 -1143240 -612992 381911
32323C81911Q24435o9910q30284o63945P5286M43358K04926m6346R6706K92329
$$ 381911 1206346 1136436 306152 -357793 -282507 160851 365777 319431 416137 708466
32313G08466M4p10138j099870n78047M70078R55705L84426m80929o63590k80355
$$ 708466 708510 -1628 -1101498 -1679545 -1209467 -253762 130664 -350265 -1013855 -1294210
32303a294210j45093l95153m22726n8242J94148J86701L45173O13051K73709p07902
$$ -1294210 -1439303 -1834456 -2257182 -2315424 -2121276 -1934575 -1589402 -976351 -702642 -1410544
32293a410544j223494n87225L55519N02312Q8662P0480N31915P53587N15799L24908
$$ -1410544 -2634038 -3221263 -2865744 -2363432 -2274770 -2204290 -1672375 -918788 -402989 -78081
32283g8081M40859N08561K01367l35834o99273n46260J18266P18821N70634j33927
$$ -78081 362778 871339 1072706 736872 37599 -508661 -390395 328426 899060 765133
32273G65133l91416J23370M02686l33257j206207q83235L48570R55781L39159
$$ 765133 373717 497087 899773 566516 -639691 -1522926 -1174356 -218575 120584
32264A20584n84080q90483n72495O0451P46616R18768J23646r68642j051182J7369
$$ 120584 -463496 -1353979 -1926474 -1866023 -1119407 -200639 -76993 -1045635 -2096817 -2079448
32254b079448R26069P66424J24547j12475K3094J42515K97029N12159M01619l1889
$$ -2079448 -1153379 -386955 -262408 -374883 -351789 -209274 87755 599914 1001533 969644
32244I69644o4385N04717O75599k12961j126033p54206L63730N97871k38575p03732
$$ 969644 905259 1409976 2085575 1872614 746581 -7625 356105 953976 715401 11669
32234A1669j30064L88449o7805p28027m82732K77600L58724k72358m82778J58775
$$ 11669 -118395 270054 202249 -525778 -1008510 -730910 -372186 -644544 -1127322 -968547
32224i68547O85918K50607n87120p41306j87235J59826q2653l10693q0378J44740
$$ -968547 -282629 -32022 -619142 -1360448 -1547683 -1387857 -1470510 -1781203 -1861581 -1716841
32214a716841j31262m80208j82273N91011J016343Q23566M43633O7006n12644
$$ -1716841 -1848103 -2328311 -2510584 -1919573 -903230 -79664 363969 430975 -81669
32205h1669j028449p16625M56833J410718J304643N52752l2889l47230n88587
$$ -81669 -1110118 -1826743 -1369910 40808 1345451 1898203 1865314 1518084 929497
32196I29497n15403L780K82995l20944j201313j180899k12124N94447N80055K08957
$$ 929497 414094 417874 700869 379925 -821388 -2002287 -2214411 -1619964 -1039909 -830952
32186h30952O4595J04185J40818K70055M90295N00562J67118k62052n66760p46062
$$ -830952 -766357 -662172 -521354 -251299 238996 739558 906676 644624 77864 -668198
32176f68198p46305m72878r2754J49291L42160O01777N49856j56495r37048q58810
$$ -668198 -1414503 -1887381 -1980135 -1830844 -1488684 -886907 -337051 -493546 -1430594 -2289404
32166b289404n8449M28367L13773L61399Q05096P65557j76709j027870q20108
$$ -2289404 -2347853 -1919486 -1605713 -1244314 -439218 326339 149630 -878240 -1698348
32157a698348j9382L77663K88705J83411P2418j78133k18560J37199K96993j27705
$$ -1698348 -1717730 -1340067 -1051362 -867951 -795533 -973666 -1192226 -1055027 -758034 -885739
32147h85739m49784o6380K93649k46965j015415p89236P8716K64515j48899J61743
$$ -885739 -1335523 -1401903 -1108254 -1355219 -2370634 -3159870 -3081154 -2816639 -2965538 -2803795
32137b803795J205114J330621o7468j376806j137527N640P05228Q55131R84944
$$ -2803795 -1598681 -268060 -335528 -1712334 -2849861 -2844221 -2138993 -1283862 -298918
32128b98918R02913K45460m71560n84988m08218n08344n15120J57048R45915P95890
$$ -298918 603995 849455 377895 -207093 -615311 -1123655 -1638775 -1481727 -535812 260078
32118B60078j31217o51641l41406N1965l960j42426n523J17811r0634m17861n02783
$$ 260078 128861 -522780 -864186 -812221 -816181 -958607 -964130 -846319 -936953 -1354814 -1857597
32107a857597k95790N4205L63660L95452Q5079k08731r2966K70117L99436K31616
$$ -1857597 -2153387 -2099182 -1735522 -1340070 -1254991 -1463722 -1556688 -1286571 -887135 -655519
32097f55519J37484K84382M78488N69201N32777K63360k41997o56426p61184q19412
$$ -655519 -518035 -233653 244835 814036 1346813 1610173 1368176 711750 -49434 -868846
32087h68846r52853o24648L92984J036347K04764j248664j316764K43645J437562
$$ -868846 -1821699 -2446347 -2053363 -1017016 -812252 -2060916 -3377680 -3134035 -1696473
32078a696473R85581O6042J27236N37593n4903j170943j187385l8658O62640J88616
$$ -1696473 -710892 -644850 -517614 19979 -34924 -1205867 -2393252 -2431910 -1769270 -1580654
32068a580654l58772m1958N03216L86346j1676J81711P87281Q47332J12376o27428
$$ -1580654 -1939426 -1981384 -1478168 -1091822 -1103498 -921787 -134506 712826 825202 197774
32058A97774o53405j15716L57884M02373J32857j06848q2417J30969K30177n33
$$ 197774 -455631 -571347 -213463 188910 321767 214919 132502 263471 493648 493115
32048D93115m67201q48501q34298l45102L18937O03793K49322k68913j77715N87576
$$ 493115 25914 -822587 -1656885 -2001987 -1683050 -1079257 -829935 -1098848 -1276563 -688987
32038f88987J155637P48206l32462j063148q69152j07589M85477M68592j15404
$$ -688987 466650 1214856 882394 -180754 -1049906 -1157495 -672018 -203426 -318830
32029c18830q15747r89761l31497O52401J007179L83843n17591p84432l27214
$$ -318830 -1134577 -2124338 -2455835 -1803434 -796255 -412412 -930003 -1714435 -2041649
32020b041649K22172M26340L99201K93548l9372o39043j047191p17788K70324
$$ -2041649 -1819477 -1393137 -993936 -700388 -739760 -1378803 -2425994 -3143782 -2873458
32011b873458J187234J352809P28717j38399o11493m38858R2050M39142L26676
$$ -2873458 -1686224 -333415 395302 256903 -354590 -793448 -701398 -262256 64420
32002F4420j6387j82928p8460K3555j26947m31716n25476j45881N42475R99029
$$ 64420 48033 -134895 -213355 -189800 -316747 -748463 -1273939 -1419820 -877345 121684
31992A21684Q11785J83308k67510k48851q2075j09608j63655M8156L21649K07390
$$ 121684 933469 1116777 849267 600416 518341 408733 245078 293234 614883 822273
31982H22273k51964n55241n04063m20446n16937n42736k56857J53034L70950L66465
$$ 822273 570309 15068 -488995 -909441 -1426378 -1969114 -2225971 -2072937 -1701987 -1335522
31972a335522K97573K67599L51025N89323Q00377O64656J48499m16997p46826
$$ -1335522 -1037949 -770350 -419325 169998 970375 1635031 1783530 1366533 619707
31963F19707p61187l49396M74087J094394P20634l82591q72330j13419P63727
$$ 619707 -141480 -490876 -16789 1077605 1798239 1415648 543318 429899 1193626
31954A193626M22605p02639j091312m12654J65969p2104m37025j84057L16163
$$ 1193626 1616231 913592 -177720 -590374 -424405 -496509 -933534 -1117591 -801428
31945h01428L88072J54954Q5842Q0272k05215n46562m50433k5964J56242k3278
$$ -801428 -413356 -258402 -172560 -92288 -297503 -844065 -1294498 -1320462 -1164220 -1187498
31935a187498j11044R3558J54496l50315j122622j336192n08013Q65638J625150
$$ -1187498 -1298542 -1204984 -1050488 -1400803 -2523425 -3859617 -4367630 -3501992 -1876842
31926a876842J091666j28135p92150m83519M8000J08444k8619J85246N99190P00114
$$ -1876842 -785176 -913311 -1705461 -2188980 -2140980 -2032536 -2061155 -1875909 -1276719 -576605
31916e76605M51639J13010l66666r94786j153234l36592P31254P98003q5842n43532
$$ -576605 -124966 -11956 -378622 -1373408 -2526642 -2863234 -2131980 -1333977 -1419819 -1963351
31906a963351J16860R90835J093222O84830M23660J90253l33825o99384l64692
$$ -1963351 -1846491 -855656 237566 922396 1346056 1536309 1202484 503100 138408
31897A38408J74847K8686n86600n61381M11705J299004J052322k05974j458993
$$ 138408 313255 341941 -244659 -806040 -394335 904669 1956991 1751017 292024
31888B92024j738958p98853O31267J313209P55500j24810j60606M91261P08340
$$ 292024 -1446934 -2245787 -1614520 -301311 454189 329379 168773 660034 1368374
31879A368374J31914m47875m43909j74861k3209J07417J82786j37790o59187n88369
$$ 1368374 1500288 1052413 608504 433643 410434 517851 700637 562847 -96340 -684709
31869f84709J80910O57597K28348l78230l13927J03773J77941N1543J37425Q7019
$$ -684709 -503799 153798 382146 3916 -310011 -206238 -28297 23246 160671 247690
31859B47690n11489j001276m95587N38031Q26818K17765k32487l8025J32876j91743
$$ 247690 -263799 -1265075 -1760662 -1222631 -395813 -178048 -410535 -448560 -315684 -507427
31849e07427n42488m44569j15082J25972L10914L99936J78071j67700j10957L53956
$$ -507427 -1049915 -1494484 -1609566 -1483594 -1172680 -772744 -594673 -762373 -873330 -519374
31839e19374O33632M72557K12756J9243k91766n39473k79001J87076k2552q52460
$$ -519374 114258 586815 799571 818814 527048 -12425 -291426 -104350 -126902 -979362
31829i79362j088811j51538R88748J299357J008265P05514K22105o17969j077337
$$ -979362 -2068173 -2219711 -1230963 68394 1076659 1782173 2004278 1386309 308972
31820C08972n00820M32575N86176R527l44174j35371J54715K30191K26546J57866
$$ 308972 -191848 240727 826903 836430 492256 356885 511600 741791 968337 1126203
31810A126203m4037j45289J4517O7379k65923n25967k52164J23837J7519j86850
$$ 1126203 1082166 936877 951394 1018773 752850 226883 -25281 98556 116075 -70775
31800g0775J86107P41766N46097k43253n36887k9297M51554L53812L8463j00479
$$ -70775 115332 857098 1403195 1159942 623055 593758 1045312 1399124 1437587 1337108
31790A337108j28883q6668M7790q9479p46968j205636n74862O28559J007150M12724
$$ 1337108 1208225 1121557 1169347 1079868 332900 -872736 -1447598 -819039 188111 600835
31780F00835P3312M03332L53672n12828r88827k25270O91064L88066o90861j139084
$$ 600835 674147 1077479 1431151 918323 -70504 -295774 395290 783356 92495 -1046589
31770a046589o88245j54566R3306L37701N65357M61671J40286m5164j94569n60753
$$ -1046589 -1734834 -1889400 -1796094 -1458393 -893036 -431365 -291079 -336243 -530812 -1091565
31760a091565q45134n99967n4756K43758L27633N49813P31051M33844j20114k84731
$$ -1091565 -1936699 -2536666 -2591422 -2347664 -2020031 -1470218 -739167 -305323 -425437 -710168
31750g10168l7178L2143k69924n05246l77861n4905K73509N21135M45806r1563
$$ -710168 -747346 -715203 -985127 -1490373 -1868234 -1923139 -1649630 -1128495 -682689 -774252
31740g74252o55771o61993k13845J22806K76501O39208J102731R91852J72031
$$ -774252 -1430023 -2092016 -2305861 -2183055 -1906554 -1267346 -164615 827237 999268
31731I99268n41866m58202P0243K00046k92140q07554o73047Q7044O80807L51975
$$ 999268 457402 -800 69443 269489 -22651 -830205 -1503252 -1416208 -735401 -383426
31721c83426o18760j036625k65378Q19221R49561K01973k20068K04747O84609
$$ -383426 -1002186 -2038811 -2304189 -1484968 -535407 -333434 -553502 -348755 335854
31712C35854M36049k60839o84084o25675l00831J30437N20523O34064M37913J52987
$$ 335854 771903 511064 -173020 -798695 -1099526 -969089 -448566 185498 623411 776398
31702G76398j60652o18896r78174p15895O3433M68077K1456n73023m26486K99862
$$ 776398 615746 -3150 -981324 -1697219 -1633786 -1165709 -1144253 -1717276 -2143762 -1843900
31692a843900P91792P68572N53501L09144K235r0769K91317O36228J44973q98645
$$ -1843900 -1052108 -283536 269965 579109 581344 490575 781892 1418120 1563093 664448
31682F64448j187802k08085Q67777P42301k32824o93213k33671K58393J30172
$$ 664448 -523354 -731439 136338 878639 645815 -47398 -281069 -22676 107496
31673A07496k09293k28066j28066k65670m23112k85635j11053k32447l19233R1823
$$ 107496 -101797 -329863 -457929 -723599 -1146711 -1432346 -1543399 -1775846 -2095079 -2003256
31663b003256O45387O11478R7798j08440J44159K03248j55452l71080k08573j47743
$$ -2003256 -1357869 -746391 -648593 -757033 -612874 -409626 -565078 -936158 -1144731 -1292474
31653a292474k86169m992O95023P47115k22337q91051j99663P67693M09415p22203
$$ -1292474 -1578643 -1583635 -888612 -141497 -363834 -1254885 -1454548 -686855 -277440 -999643
31643i99643p48564M53110J044291K00272p12566m96517J47713J79414k3017L14883
$$ -999643 -1748207 -1295097 -250806 -50534 -763100 -1259617 -1111904 -932490 -955507 -640624
31633f40624P24193K61147p57365j094876l79359N21408P99206N32384K20635
$$ -640624 83569 344716 -412649 -1507525 -1886884 -1365476 -566270 -33886 186749
31624A86749J30538J68082N7789l03266n54116k61316K92894L00704l33689o73403
$$ 186749 317287 485369 543158 239892 -314224 -575540 -282646 18058 -315631 -989034
31614i89034j38192N37319M27714j72670l38481q022Q7574k96520o61629o72829
$$ -989034 -1127226 -589907 -162193 -334863 -673344 -681366 -593792 -890312 -1551941 -2224770
31604b224770m79776j78641K86516P00426P34694N00290L30350J40730l08601
$$ -2224770 -2704546 -2883187 -2596671 -1896245 -1161551 -661261 -330911 -190181 -498782
31595d98782o77005l97454K83108M95380M6065l51049k84562j70305k91367k46971
$$ -498782 -1175787 -1573241 -1290133 -794753 -748688 -1099737 -1384299 -1554604 -1845971 -2092942
31585b092942J62979L53509q4382n23707j86862N90953Q33854L99179J01339L55834
$$ -2092942 -1929963 -1576454 -1660836 -2184543 -2371405 -1780452 -946598 -547419 -446080 -90246
31575i0246N28044k9351q71601r55357n0531Q90544R33384L30957P6734M58323
$$ -90246 437798 408447 -463154 -1418511 -1469042 -578498 354886 685843 762577 1220900
31565A220900O70132O7474p89847q91825k03710L62991K70933q8044k28014k45277
$$ 1220900 1891032 1958506 1168659 276834 73124 436115 707048 619004 390990 145713
31555A45713l86923n23563m34035k15479n6286R1045L01844M13320K57913m2042
$$ 145713 -241210 -764773 -1198808 -1414287 -1470573 -1379528 -1077684 -664364 -406451 -448493
31545d48493k37292k31552p5623Q5039J867l90760o27264j40753P93854J122052
$$ -448493 -685785 -917337 -992960 -907921 -906054 -1296814 -1924078 -2064831 -1270977 -148925
31535a48925L60931o42355p75124m5161O26114O33627J33763m61287q14730o40424
$$ -148925 212006 -430349 -1205473 -1250634 -624520 9107 142870 -318417 -1133147 -1773571
31525a773571O9253Q19147J041174O77584L2751o69699j152710r11475J33094
$$ -1773571 -1704318 -885171 156003 833587 866338 196639 -956071 -1867546 -1734452
31516a734452J079748R59596Q0218l77782m3009L04244J27546j78556k73123m61196
$$ -1734452 -654704 304892 385110 7328 -35681 268563 396109 217553 -55570 -516766
31506e16766p82052n46496M34462J068517M42909o28457o93445J54957M89349
$$ -516766 -1298818 -1845314 -1410852 -342335 100574 -527883 -1221328 -1066371 -577022
31497e77022j93232p78709l63010M40638O14389K38930J16872M62039P30692N04151
$$ -577022 -770254 -1548963 -1911973 -1471335 -856946 -618016 -501144 -39105 691587 1195738
31487A195738n5076n10731n15789j7801N64724N62089j94591j004996j045501
$$ 1195738 1140662 629931 114142 96341 661065 1223154 1028563 23567 -1021934
31478a021934l59468K56614K65864r1536k91889j74282M3546J78246L18770O39399
$$ -1021934 -1381402 -1124788 -858924 -950460 -1242349 -1416631 -1373085 -1194839 -876069 -236670
31468b36670J025522J020655L37680o28099j113365q78546m21622j66761Q4866
$$ -236670 788852 1809507 2147187 1519088 405723 -472823 -894445 -1061206 -976340
31459i76340N59231Q46339M29583l92275p87095n26089j98432k40457l78667k42036
$$ -976340 -417109 429230 858813 466538 -320557 -846646 -1045078 -1285535 -1664202 -1906238
31449a906238J8900N9866q1463q3216J88916N49661P06012M94325O0850j85221
$$ -1906238 -1887338 -1827472 -1908935 -1992151 -1803235 -1253574 -547562 -53237 7613 -177608
31439a77608k9743J91014M3390k73754j83437K72298L77116j13436n26267l89138
$$ -177608 -207351 -16337 27053 -246701 -430138 -157840 219276 105840 -420427 -809565
31429h09565k21905n31397p23086j0224J039621J066506m6082q96518n67916K10633
$$ -809565 -1031470 -1562867 -2285953 -2296177 -1256556 -190050 -236132 -1132650 -1700566 -1489933
31419a489933M01768J40677J01359J97918n7469l83469l6550Q43928J253779Q00521
$$ -1489933 -1088165 -947488 -846129 -648211 -705680 -1089149 -1125699 -281771 972008 1772529
31409A772529K00331K2096j29013o50482j003803n48474K45801L67793k18778
$$ 1772529 1972860 1994956 1865943 1215461 211658 -336816 -91015 276778 58000
31400E8000n79980k83073R7779J18696J58784N33279P39840K62562m68590o79212
$$ 58000 -521980 -805053 -707274 -588578 -429794 103485 843325 1105887 637297 -41915
31390d1915l98685k25737k46715m7372L28222L36268p0836k57497N2124L08357
$$ -41915 -440600 -666337 -913052 -960424 -632202 -295934 -366770 -624267 -572143 -263786
31380b63786M8563m09797n95584n77489n53800l26073K40855P10602O55975L64070
$$ -263786 -215223 -625020 -1220604 -1798093 -2351893 -2677966 -2437111 -1726509 -1070534 -706464
31370g06464L16293L19640r7615o80761o89927q3880L77136K96944R7444R6162
$$ -706464 -390171 -70531 -168146 -848907 -1538834 -1622714 -1245578 -948634 -851190 -755028
31360g55028m8511n38084p93282k60504N94076P96808J71769m88697n00460J1722
$$ -755028 -803539 -1341623 -2134905 -2395409 -1801333 -1004525 -832756 -1321453 -1821913 -1810191
31350a810191N30221P67000P05361M03639J4065k09665j46294M1704J07331k5037
$$ -1810191 -1279970 -512970 192391 596030 610095 400430 254136 295840 403171 378134
31340C78134k58937m19466k76394K79876Q93688Q40027j50426j283070j402031
$$ 378134 119197 -300269 -576663 -296787 596901 1436928 1286502 3432 -1398599
31331a398599l80019O60662P31219J24340k02584J0335J84331m2285k83399m2282
$$ -1398599 -1778618 -1117956 -386737 -262397 -464981 -454646 -270315 -312600 -595999 -638281
31321f38281O19574J218500J283266N79538o50700j562623j351155k65048N20635
$$ -638281 -18707 1199793 2483059 3062597 2411897 849274 -501881 -766929 -246294
31312b46294L44930j59354j37601K18845J55686l11802m20176Q7890N65525M62792
$$ -246294 98636 -60718 -198319 20526 176212 -135590 -555766 -467876 97649 560441
31302E60441L9711j82917j38749o3509n0342r7010k85603n86715p08410m42049
$$ 560441 600152 417235 278486 214977 164635 67625 -217978 -804693 -1513103 -1955152
31292a955152k624K32424J97796J24839J62196K38872K35119Q8704k10530n39130
$$ -1955152 -1957776 -1725352 -1527556 -1402717 -1240521 -1001649 -766530 -677826 -888356 -1427486
31282a427486o11385k60593K58298M84797L12685Q3003L0209m4914l06215m16491
$$ -1427486 -2038871 -2299464 -2041166 -1556369 -1243684 -1160681 -1130472 -1175386 -1481601 -1898092
31272a898092k2658M78342L31097l54932n35611K53894J060079Q40186K576k90443
$$ -1898092 -1920750 -1442408 -1111311 -1466243 -2001854 -1747960 -687881 152305 154881 -135562
31262a35562Q2184K28543j06702j89616K32035L59132k62475q70356o90719j02235
$$ -135562 -53378 175165 68463 -121153 110882 470014 207539 -662817 -1353536 -1455771
31252a455771J48167Q9071R7943O6127j73375k50668N8885K19917j08742k29834
$$ -1455771 -1307604 -1218533 -1120590 -1054463 -1227838 -1478506 -1419621 -1199704 -1308446 -1538280
31242a538280M34702J060081N63846n38721q37115j82643L40513L30099L69074
$$ -1538280 -1103578 -43497 520349 -18372 -855487 -1038130 -697617 -367518 1556
31233A556N14475J46479n45414n71542P2363K49625k90444m08448L22723P43369
$$ 1556 516031 662510 117096 -454446 -382083 -132458 -422902 -831350 -508627 234742
31223B34742J84035k84257J80652N62935k21854j269979j116279j69501J11336
$$ 234742 418777 134520 315172 878107 656253 -613726 -1730005 -1899506 -1788170
31214a788170k61021n0588P79661Q67751j81767r78929m20375P63340J204223
$$ -1788170 -2049191 -2099779 -1320118 -452367 -634134 -1613063 -2033438 -1270098 -65875
31205f5875O80341K9503q7807K47172N37983L75640k12779p68847q73929n52617
$$ -65875 614466 643969 556162 803334 1341317 1716957 1504178 735331 -138598 -691215
31195f91215p8648L52893N29685K06564m21782o57445j99828L18900K57352l8813
$$ -691215 -769863 -416970 112715 319279 -102503 -759948 -959776 -640876 -383524 -422337
31185d22337J51541P35007J002627P02780J53448m22974r20938j018929o04162
$$ -422337 -270796 464211 1466838 2169618 2323066 1900092 979154 -39775 -643937
31176f43937k06636k36400k26508K71831N93789m9999r45150o86439N65809J171837
$$ -643937 -850573 -1086973 -1313481 -1041650 -447861 -497860 -1443010 -2129449 -1563640 -391803
31166c91803M19298o48723j018811q34298m10906L48284J036020P47829k86076
$$ -391803 27495 -621228 -1640039 -2474337 -2885243 -2536959 -1500939 -753110 -1039186
31157a039186n25011N59142J399020O60844o63618q38809L8860N72358L49314
$$ -1039186 -1564197 -1005055 393965 1054809 391191 -447618 -408758 163600 512914
31148E12914O8364r8559o02003j144474p88193M12917J208971Q82936J10393k27303
$$ 512914 581278 482719 -119284 -1263758 -2051951 -1639034 -430063 452873 563266 335963
31138C35963j47963j11025k38312m04162n31398m80616j05676L82052N47662L52582
$$ 335963 188000 76975 -161337 -565499 -1096897 -1577513 -1683189 -1301137 -753475 -400893
$$ [...]
##END NTUPLES=NMR SPECTRUM
##END=
