##TITLE=31Pdec_LY-TMF-7.100
 D2O, 24 sc
 2.3.2020
##JCAMPDX= 6.0         $$ Bruker NMR JCAMP-DX V2.0
##DATA TYPE= NMR SPECTRUM
##DATA CLASS= NTUPLES
##ORIGIN= UXNMR, Bruker Analytische Messtechnik GmbH
##OWNER= root
$$ XWIN-NMR		Version 3.5
$$ Mon Mar  2 16:33:42 2020 Russian Standard Time (UT+4h)  she@DPX200
##.OBSERVE FREQUENCY= 81.013821
##.OBSERVE NUCLEUS= ^31P
##.ACQUISITION MODE= SIMULTANEOUS
##.ACQUISITION SCHEME= undefined
##.AVERAGES= 24
##.DIGITISER RES= 17
##SPECTROMETER/DATA SYSTEM= spect
##.PULSE SEQUENCE= zgpg30
##.SOLVENT NAME= D2O
##.SHIFT REFERENCE= (INTERNAL, D2O, 0, 182.463)
##AUDIT TRAIL= $$ (NUMBER, WHEN, WHO, WHERE, WHAT)
$$ ##TITLE= Audit trail, XWIN-NMR		Version 3.5
$$ ##JCAMPDX= 5.01
$$ ##ORIGIN= Bruker BioSpin GmbH
$$ ##OWNER= she
$$ F:/spectra/data/she/nmr/P31/1/pdata/1/auditp.txt
$$ ##AUDIT TRAIL=  $$ (NUMBER, WHEN, WHO, WHERE, WHAT)
(   1,<2020-03-02 16:32:54.45 +0400>,<she>,<DPX200>,
      <created by zg, POWCHK disabled, PULCHK disabled
       configuration hash MD5:
       00 E9 B6 7A A2 85 ED C7 34 08 36 98 17 FE 4E 26
       data hash MD5: 32K
       0C 75 7F FE F3 33 4E 65 F1 A4 0F FA 2A 95 8F 6A>)
(   2,<2020-03-02 16:32:56.93 +0400>,<she>,<DPX200>,
      <Start of raw data processing
       efp BC_mod = 2 LB = 1 FT_mod = 6 PKNL = 1 PHC0 = -1460.879 PHC1 = 359.6017 SI = 64K 
       data hash MD5: 64K
       F5 7B 26 79 4B FD 6E 32 E8 09 6C 9B BB 60 8D 2D>)
(   3,<2020-03-02 16:33:11.78 +0400>,<she>,<DPX200>,
      <pk PHC0 = -3.198832 PHC1 = 0 
       data hash MD5: 64K
       5D CE D6 12 52 07 11 90 C9 FC 9D 5C CD B7 11 39>)
(   4,<2020-03-02 16:33:17.48 +0400>,<she>,<DPX200>,
      <abs ABSG = 5 
       data hash MD5: 64K
       18 05 15 DE A4 41 69 D3 0A C1 A5 81 CE 7B 26 10>)
$$ ##END=
$$ 
$$ hash MD5
$$ 5E BD F1 63 0C 6D 74 A2 37 D5 3E D0 5A CE 7D 72
##$RELAX= 
##$RELAX= 
##$RELAX= 
##$RELAX= 
##$RELAX= 
##$RELAX= 
##$RELAX= 
##$RELAX= 
$$ Bruker specific parameters
$$ --------------------------
##$DU= <F:/spectra>
##$EXPNO= 1
##$NAME= <P31>
##$PROCNO= 1
##$TYPE= <nmr>
##$USER= <she>
##$AMP= (0..31)
100 100 100 100 100 100 100 100 100 100 100 100 100 100 100 100 100 100 
100 100 100 100 100 100 100 100 100 100 100 100 100 100 
##$AQSEQ= 0
##$AQ_mod= 1
##$AUNM= <au_zg>
##$AUTOPOS= <>
##$BF1= 81.014009
##$BF2= 200.13
##$BF3= 200.13
##$BF4= 200.13
##$BF5= 200.13
##$BF6= 200.13
##$BF7= 200.13
##$BF8= 200.13
##$BYTORDA= 1
##$CFDGTYP= 0
##$CFRGTYP= 5
##$CHEMSTR= <none>
##$CNST= (0..31)
1 1 145 1 1 1 1 1 1 1 1 1 1 1 1 1 1 1 1 1 1 1 1 1 1 1 1 1 1 1 1 1 
##$CPDPRG= <waltz16>
##$CPDPRG1= <>
##$CPDPRG2= <waltz16>
##$CPDPRG3= <>
##$CPDPRG4= <mlev>
##$CPDPRG5= <mlev>
##$CPDPRG6= <mlev>
##$CPDPRG7= <mlev>
##$CPDPRG8= <mlev>
##$CPDPRGB= <>
##$CPDPRGT= <>
##$D= (0..31)
0 1 0 0 0 0 0 0 0 0 0 0.03 2e-05 3e-06 0 0 0 0 0 0 0 0 0 0 0 0 0 0 0 0 
0 0 
##$DATE= 1583152373
##$DBL= (0..7)
120 120 120 11 120 120 24 19 
##$DBP= (0..7)
150 150 150 150 150 150 150 150 
##$DBP07= 0
##$DBPNAM0= <>
##$DBPNAM1= <>
##$DBPNAM2= <>
$$ [...]
##$SUBNAM3= <"">
##$SUBNAM4= <"">
##$SUBNAM5= <"">
##$SUBNAM6= <"">
##$SUBNAM7= <"">
##$SUBNAM8= <"">
##$SUBNAM9= <"">
##$SW= 369.568048894756
##$SWIBOX= (0..15)
0 1 3 0 0 0 0 0 0 0 0 0 0 0 0 0 
##$SW_h= 29940.119760479
##$TD= 32768
##$TD0= 1
##$TE= 0
##$TE2= 300
##$TE3= 300
##$TEG= 300
##$TL= (0..7)
0 120 53 12 22 120 120 120 
##$TP= (0..7)
150 150 150 150 150 150 150 150 
##$TP07= 0
##$TPNAME0= <>
##$TPNAME1= <>
##$TPNAME2= <>
##$TPNAME3= <>
##$TPNAME4= <>
##$TPNAME5= <>
##$TPNAME6= <>
##$TPNAME7= <>
##$TPOAL= (0..7)
0.5 0.5 0.5 0.5 0.5 0.5 0.5 0.5 
##$TPOFFS= (0..7)
0 0 0 0 0 0 0 0 
##$TUNHIN= 0
##$TUNHOUT= 0
##$TUNXOUT= 0
##$USERA1= <user>
##$USERA2= <user>
##$USERA3= <user>
##$USERA4= <user>
##$USERA5= <user>
##$V9= 5
##$VALIST= <valist>
##$VCLIST= <CCCCCCCCCCCCCCC>
##$VD= 0
##$VDLIST= <DDDDDDDDDDDDDDD>
##$VPLIST= <PPPPPPPPPPPPPPP>
##$VTLIST= <TTTTTTTTTTTTTTT>
##$WBST= 1024
##$WBSW= 4
##$XGAIN= (0..3)
0 0 0 0 
##$XL= 0
##$YL= 0
##$YMAX_a= 18704
##$YMIN_a= -17829
##$ZGOPTNS= <>
##$ZL1= 120
##$ZL2= 120
##$ZL3= 120
##$ZL4= 120
##$ABSF1= 182.463
##$ABSF2= -187.1042
##$ABSG= 5
##$ABSL= 3
##$ALPHA= 0
##$AQORDER= 0
##$ASSFAC= 0
##$ASSFACI= 0
##$ASSFACX= 0
##$ASSWID= 0
##$AUNMP= <proc_1d>
##$AZFE= 0.1
##$AZFW= 0.5
##$BCFW= 0
##$BC_mod= 2
##$BYTORDP= 0
##$COROFFS= 0
##$CY= -3
##$DATMOD= 1
##$DC= 0
##$DFILT= <>
##$DTYPP= 0
##$F1P= 0
##$F2P= 0
##$FCOR= 1
##$FTSIZE= 65536
##$FT_mod= 6
##$GAMMA= 0
##$GB= 0
##$INTBC= 1
##$INTSCL= 5.30512e-09
##$ISEN= 30
##$LB= 1
##$LEV0= 0
##$LPBIN= 0
##$MAXI= 10000
##$MC2= 0
##$MEAN= 0
##$ME_mod= 0
##$MI= 50
##$NCOEF= 0
##$NC_proc= -4
##$NLEV= 6
##$NOISF1= 182.463
##$NOISF2= 159.3651
##$NSP= 0
##$NTH_PI= 0
##$NZP= 0
##$OFFSET= 182.463
##$PC= 4
##$PHC0= -1464.078
##$PHC1= 359.6017
##$PH_mod= 1
##$PKNL= yes
##$PPARMOD= 0
##$PSCAL= 0
##$PSIGN= 0
##$REVERSE= no
##$SF= 81.0140089999434
##$SI= 65536
##$SIGF1= 159.3651
##$SIGF2= -187.1042
##$SINO= 113.3802
##$SIOLD= 16384
##$SREGLST= <1H.CDCl3>
##$SSB= 0
##$STSI= 65536
##$STSR= 0
##$SW_p= 29940.119760479
##$SYMM= 0
##$S_DEV= 0
##$TDeff= 32768
##$TDoff= 0
##$TI= <>
##$TILT= no
##$TM1= 0
##$TM2= 0
##$TOPLEV= 0
##$USERP1= <user>
##$USERP2= <user>
##$USERP3= <user>
##$USERP4= <user>
##$USERP5= <user>
##$WDW= 1
##$XDIM= 65536
##$YMAX_p= 434121438
##$YMIN_p= -7735670
$$ End of Bruker specific parameters
$$ ---------------------------------
##NTUPLES= NMR SPECTRUM
##VAR_NAME=  FREQUENCY,     SPECTRUM/REAL,   SPECTRUM/IMAG
##SYMBOL=    X,             R,               I
##VAR_TYPE=  INDEPENDENT,   DEPENDENT,       DEPENDENT
##VAR_FORM=  AFFN,          ASDF,            ASDF
##VAR_DIM=   65536,         65536,           65536
##UNITS=     HZ,            ARBITRARY UNITS, ARBITRARY UNITS
##FACTOR=    0.456856943014862, 1,           1
##FIRST=     14782.0589164792, 0,            0
##LAST=      -15158.0608439998, 0,           0
##MIN=       -15158.0608439998, -7735670,    0
##MAX=       14782.0589164792, 434121438,    0
$$ Real data points
##PAGE= N=1
##DATA TABLE= (X++(R..R)), XYDATA
$$ [...]
##PAGE= N=2
##DATA TABLE= (X++(I..I)), XYDATA
39054 1387411 1380210 949771 246669 -159196 -51147 147954 25156 -273264 -379654 -281829
39044 -281829 -253014 -386788 -516323 -537491 -536449 -549767 -398931 97393 802494 1291850
39034 1291850 1283843 979069 822775 918545 892326 473753 -11213 -14627 487427 974671
39024 974671 1099619 1058488 1145546 1279865 1191838 848570 459467 201321 135481 283861
39014 283861 598858 925051 1127669 1191582 1106435 787565 247255 -275819 -515714 -425405
39004 -425405 -111076 340151 799053 1004873 799012 420011 329228 688557 1160175 1274945
38994 1274945 898872 303202 -142538 -301452 -325233 -408190 -526019 -486162 -214002 135133
38984 135133 363740 395369 239403 -16867 -140892 69122 422652 421470 -88025 -595583
38974 -595583 -537993 -20771 407205 537256 645500 905113 1085878 932084 505906 29069
38964 29069 -355735 -555513 -510801 -347109 -334642 -554468 -768497 -734938 -486479 -184092
38954 -184092 123887 444672 694134 785053 768932 731277 619415 342410 13259 -80086
38944 -80086 195868 614999 807575 673656 499462 598658 896598 1012273 757732 362486
38934 362486 113519 -2871 -95840 -10041 485993 1208459 1613361 1425253 948075 647693
38924 647693 641124 711039 641233 402267 115595 -70895 -133397 -205325 -371839 -491726 -391781
38913 -391781 -175558 -102040 -183849 -177902 11795 206507 262947 213942 50106 -307373 -726512
38902 -726512 -907344 -832715 -805951 -872268 -629810 88973 744129 709894 93787 -484708
38892 -484708 -706062 -689206 -500750 -64406 451235 644846 403713 67628 -41400 26120
38882 26120 62991 27073 21845 118963 285734 388275 273845 -27039 -239400 -148040 116866
38871 116866 290208 347582 400085 336977 -35926 -516890 -596041 -136422 398707 553082
38861 553082 377358 146181 -74053 -305615 -408218 -298607 -224763 -450159 -773283 -733977
38851 -733977 -267083 216490 440697 579648 807604 887812 535718 -8177 -178232 141963
38841 141963 419359 192006 -316785 -559577 -410774 -195704 -91179 68273 337222 441524
38831 441524 209950 -128776 -341609 -566841 -952006 -1191218 -882748 -205711 250680 306974
38821 306974 354670 630428 823360 616758 204675 -42063 -128571 -310719 -600312 -733468
38811 -733468 -561884 -206123 151972 410354 490331 335025 10521 -295271 -404042 -255081
38801 -255081 52044 273930 190208 -143869 -398081 -329864 -66272 91413 59700 21618
38791 21618 133645 336449 451465 351660 48567 -286699 -411665 -240970 15144 53934
38781 53934 -167916 -393536 -396264 -231878 -98888 -46083 65830 328312 608164 655530
38771 655530 369182 -69990 -331888 -213471 183786 535159 581534 365570 149970 80527
38761 80527 20771 -179480 -356644 -204801 227804 499450 359392 108310 158069 461424
38751 461424 676139 708952 711481 643474 305519 -161807 -284201 65896 391489 221644
38741 221644 -276453 -601929 -551879 -246155 214308 724915 984733 761288 310008 138733
38731 138733 322966 411164 96396 -353148 -500693 -309363 -77122 26251 103107 253637
38721 253637 367826 254936 -102280 -482428 -625468 -505671 -377869 -495943 -799601 -962234
38711 -962234 -753378 -258042 276309 671011 819542 622419 130930 -285739 -171425 499000
38701 499000 1190444 1357964 1029983 667338 530131 449446 231079 -33214 -202217 -346834
38691 -346834 -524017 -513654 -122237 375072 480751 151375 -141442 -85507 93798 60503
38681 60503 -152197 -282203 -195881 92992 514765 834798 702607 104550 -417884 -334912
38671 -334912 186357 484033 243255 -177348 -278907 7463 377670 568723 581398 585501
38661 585501 691197 800524 711392 408299 156197 194993 426424 548629 433223 211259
38651 211259 45106 -8851 51449 184983 287197 318337 414839 694221 990335 1003398
38641 1003398 713856 419498 323639 311344 212632 80061 82760 275095 580887 881202
38631 881202 1029143 922474 676445 585297 763208 935009 757675 272601 -159668 -338658
38621 -338658 -402229 -476126 -393869 38043 636617 963978 846232 544333 359540 291440
38611 291440 190325 21823 -192527 -484371 -755869 -697934 -208497 288559 350476 209044
38601 209044 447686 1034208 1297390 982190 658287 774274 957446 751376 484413 725985
38591 725985 1256967 1335904 816723 284013 123988 133528 100947 149634 355658 539269
38581 539269 602712 653037 672766 478663 105883 -170009 -266366 -332569 -322487 -25960 396240
38570 396240 463756 122922 -109507 44097 235445 182362 158766 406850 599791 377370
38560 377370 -11301 -102659 90394 261977 368569 513445 562928 380766 206487 304856
38550 304856 449696 251538 -187815 -443656 -425152 -367207 -313680 -116242 163038 337202
38540 337202 472494 703116 814740 545913 159301 104247 218271 -45438 -624066 -841286
38530 -841286 -498212 -184082 -248851 -229809 282985 880398 982651 744223 709320 915588
38520 915588 945527 670782 391225 308219 311453 275322 221933 195695 228063 377923 598846
38509 598846 669120 466079 180376 37217 -36009 -210674 -401465 -426330 -384380 -520076
38499 -520076 -786543 -894396 -754223 -521044 -221319 275097 860012 1161309 1068096 948703
38489 948703 1135113 1462197 1569473 1444461 1362939 1409890 1384421 1177413 950379 841998
38479 841998 725658 433201 84324 -19359 201977 503890 651460 671742 680098 629954
38469 629954 417807 132601 -22827 -35319 -93697 -275181 -416809 -355170 -122684 152391
38459 152391 373834 452119 339778 162433 114094 146490 9703 -279668 -315305 116285
38449 116285 602905 595784 149990 -196374 -170777 3744 87877 119198 166582 174597 185191
38438 185191 384062 749301 932566 701970 294798 123505 288830 562118 702946 620255
38428 620255 350100 46915 -98818 -57155 40011 160840 413206 695330 611571 20512
38418 20512 -586989 -643673 -280274 -118468 -379052 -671694 -685971 -595886 -645690 -794892
38408 -794892 -977849 -1268254 -1503414 -1197287 -257934 574776 552930 -50198 -331000 -50590
38398 -50590 141817 -163407 -508437 -390320 -101428 -206061 -553395 -447728 299596 1059046
38388 1059046 1206533 815683 360184 81597 -81495 -158071 -64174 173337 363130 394593
38378 394593 386650 488387 632683 640130 528005 506395 600656 512950 72527 -358492 -271210
38367 -271210 254177 590604 407527 69859 23059 185528 255472 264556 401909 538025
38357 538025 407549 124849 26994 79764 -45854 -315664 -304431 77541 379397 327557
38347 327557 225513 356544 491077 376451 264183 450700 653305 434115 15160 28185
38337 28185 533393 930940 897425 770193 800267 632660 -64096 -888327 -1133715 -708954
38327 -708954 -159165 124916 252414 368752 309657 -59190 -456608 -449135 -813 487943
38317 487943 678026 629079 602240 695424 778115 700415 470915 268145 323150 709623 1177065
38306 1177065 1292763 879693 243134 -182719 -334525 -460458 -618351 -538191 -66596 535579
38296 535579 916959 1038012 1042147 926790 635287 362997 431005 827596 1154681 1125651
38286 1125651 902426 807762 867696 827049 567707 330127 434580 844681 1133243 954676
38276 954676 479780 213158 372835 628310 541232 100595 -332594 -487722 -397540 -217573
38266 -217573 -42567 82142 116742 41670 -134149 -349293 -442205 -254812 108905 274770
38256 274770 30997 -345867 -413293 -123700 176640 248047 188953 178074 247859 348590
38246 348590 414927 339311 86776 -149999 -123087 136825 370697 448292 426056 299873
38236 299873 28926 -211529 -184688 -22782 -72923 -254942 -95495 427608 661067 247981
38226 247981 -216128 -5978 679264 1072124 934250 663192 515246 401412 373352 629987
38216 629987 996488 1022791 709839 557583 757417 929655 859000 875936 1192919 1437327
38206 1437327 1263964 929906 772726 568699 4761 -555675 -468302 190910 692319 695339
38196 695339 591877 729443 900414 831476 679842 720013 883996 929681 820981 659696
38186 659696 439018 134859 -113849 -177571 -174367 -289715 -447123 -414088 -201201 -103755
38176 -103755 -302777 -617522 -735952 -561501 -237241 93717 429152 791110 1060331 1050241
38166 1050241 778066 538244 575850 760752 761185 503647 240030 144879 107034 15255 -13448
38155 -13448 128931 292788 283979 161760 92772 56761 -35917 -50041 242058 768560 1178038
38144 1178038 1253720 1075193 793805 506760 341672 382927 489244 450655 335983 381913
38134 381913 523942 420216 42229 -168365 55052 371592 334858 21034 -176735 -131196
38124 -131196 6580 183719 439884 641797 613469 480465 521083 690774 651054 306609
38114 306609 -19450 -36951 154548 266190 172060 -26988 -138974 -41733 157906 151439
38104 151439 -219193 -691950 -865320 -670747 -331984 25619 390698 589526 433341 144280
38094 144280 173413 526514 755388 737613 899784 1391842 1609105 1018767 50876 -400254
38084 -400254 -128531 266136 273208 -30496 -329713 -441666 -297736 61236 404028 510043
38074 510043 467386 514345 633675 611955 458250 412685 527574 570964 378032 2996
38064 2996 -469132 -933486 -1115117 -813652 -332542 -235037 -583390 -859485 -765230 -609900
38054 -609900 -675218 -701484 -382757 42724 161432 42395 32017 100550 -76070 -458907
38044 -458907 -580079 -190962 423832 868111 1037615 1007109 824649 576723 439681 496953
38034 496953 614716 595793 381092 67634 -190872 -306561 -359063 -507279 -684238 -513105
38024 -513105 231967 1160560 1577628 1292440 822335 702637 876321 925153 664095 281127
38014 281127 27527 -15373 78479 170637 171239 160652 333519 727816 1092639 1147078 915571
38003 915571 686804 668863 787661 812557 597448 201975 -162871 -308569 -226195 -68204
37993 -68204 28899 63116 98540 138649 107877 -60629 -320020 -475484 -320548 101473 438763
37982 438763 391766 101201 -24544 126769 233752 49249 -227265 -265128 -51032 229324
37972 229324 558366 996978 1332534 1212085 677701 230074 218932 430568 451631 222237
37962 222237 5646 -34041 43523 185539 416524 629581 559387 132345 -296357 -270827
37952 -270827 213703 669492 684632 383862 206987 342227 568723 642965 634923 780098
37942 780098 1120476 1427994 1460580 1215430 930518 861439 1033060 1205093 1125227 807498
37932 807498 495620 379497 461115 675744 965541 1194460 1183047 927564 632708 442924
37922 442924 316867 260035 448420 940225 1467350 1732904 1749339 1670947 1489252 1159184
37912 1159184 835041 672971 584164 521526 773999 1494530 2124306 1919444 1028269 383756
37902 383756 424927 607190 405987 96296 121247 323682 368561 412011 695282 878390
37892 878390 521850 -21758 17313 648212 1076480 875394 475940 346759 383389 378543
37882 378543 459888 670604 647837 194875 -227549 -90706 402419 618403 409152 206005
37872 206005 278246 421397 442367 474807 610758 588796 157614 -444739 -687640 -379660
37862 -379660 139144 453551 502298 456626 367400 158720 -90441 -125256 135733 430187
37852 430187 481499 359845 346573 549221 838045 1074249 1189966 1107662 814149 486726
37842 486726 321602 264238 142161 14416 85454 287587 320117 172366 208615 562501
37832 562501 838315 702040 448084 596103 1109615 1407989 1110857 465673 22242 85238
37822 85238 487206 767483 617639 235582 114742 397856 674903 606139 462292 705622
37812 705622 1243553 1535089 1353965 998564 741533 531123 350416 430467 852107 1248194
37802 1248194 1198598 745171 274285 32871 -2160 117914 418623 856517 1252624 1427340
37792 1427340 1329505 1040121 720957 533361 513215 519104 378969 109869 -66607 29878
37782 29878 309962 493762 422731 215682 64829 -24559 -150788 -242615 -113551 167172
37772 167172 232242 -81866 -416787 -331774 94293 398464 379317 273395 295226 345699
37762 345699 279276 179919 209450 366885 541099 667241 726960 725671 755085 928448 1150872
37751 1150872 1106131 618953 -63048 -484995 -443501 -158964 -40943 -317871 -821187 -1108608
37741 -1108608 -895286 -377240 -8861 34639 -12647 60974 139577 46442 -110882 -91041
37731 -91041 121737 343938 496868 646695 773984 748072 572107 444157 481668 547570
37721 547570 477831 364826 445235 745607 1018365 1074498 1023412 1068034 1181800 1168676 984500
37710 984500 781297 636745 489653 389847 505184 734044 643372 71630 -495824 -530001
37700 -530001 -205572 -88639 -250811 -255167 27026 209535 101865 13267 120869 117790
37690 117790 -166152 -323414 219 468306 557655 352462 289829 393959 366073 249797
37680 249797 352022 544375 290198 -517509 -1285041 -1467310 -1157584 -746681 -382797 -2327
37670 -2327 389209 691657 796218 599426 124440 -339509 -475978 -354680 -322710 -468120
37660 -468120 -549481 -502571 -571202 -784578 -777062 -402556 -90662 -209219 -437683 -243525
37650 -243525 277025 553782 408383 249422 405672 725053 925346 964383 929295 861045
37640 861045 834821 972455 1228706 1353191 1190630 865011 574776 368438 211711 101591
37630 101591 2490 -161656 -322042 -245004 124060 445846 361410 16716 -59013 350906
37620 350906 815190 776422 272467 -85605 136480 669158 896365 622004 253043 199916
37610 199916 349435 323182 84388 -25998 159089 372748 327474 116675 44 4174
37600 4174 2844 34353 203886 340964 135194 -334858 -571976 -307243 142041 366756
37590 366756 416303 559821 752136 740333 574599 577041 803863 952824 892305 889168 1124325
37579 1124325 1313142 1077187 481476 -57653 -263435 -184952 -18260 60973 284 -20296
37569 -20296 275956 830845 1140554 845349 270809 42540 264591 476316 399240 269000
37559 269000 302534 278709 -53984 -454887 -448317 28576 572267 873253 1023555 1204973
37549 1204973 1336349 1218471 912990 760590 969726 1307088 1315744 827601 160253 -216786
37539 -216786 -115784 300538 739253 946554 781141 326732 -82605 -126860 173238 501424
37529 501424 607654 501849 320133 177114 163573 305212 467754 458363 277521 126343
37519 126343 121680 172811 202749 302752 551113 836482 1004220 1071997 1175821 1380252
37509 1380252 1625294 1769099 1630768 1141114 538766 241177 375232 587604 491136 161144
37499 161144 -14171 134774 410609 570983 564995 466713 395111 511474 881757 1295137
37489 1295137 1413583 1171560 854380 702583 623444 423338 154992 29177 73534 109936
37479 109936 59332 37870 88532 46654 -169447 -322864 -164301 133385 164900 -86062
37469 -86062 -172493 148343 532168 580673 432316 446024 546234 377896 -2686 -147940
37459 -147940 37622 129209 -85180 -237040 -20337 278965 272191 78272 6587 -8824
37449 -8824 -130625 -69303 530886 1280148 1325460 543637 -173580 -64459 593544 1037115
37439 1037115 1032707 900330 811628 576518 89727 -407915 -607815 -454724 -130199 128332
37429 128332 163266 9232 -77371 156777 621956 894068 705778 352458 393110 911965
37419 911965 1325707 1119250 579409 458329 968192 1526508 1597242 1348027 1204048 1143486
37409 1143486 877319 481064 327478 468166 568332 465948 340972 272314 85847 -222429
37399 -222429 -342185 -123403 180938 348272 481841 639108 585423 274942 191909 708977
37389 708977 1342705 1218578 238647 -721009 -862957 -311665 235264 362701 229710 206351
37379 206351 437545 726450 758655 448740 38675 -200702 -276833 -358556 -452849 -402358
37369 -402358 -160633 145331 414075 616739 647801 371845 -118479 -488951 -479031 -89478
37359 -89478 530204 1162709 1502692 1366895 1009028 910318 1114157 1105903 587920 32398
37349 32398 82958 645950 1041245 945838 690099 600322 558488 393100 262712 345653 470235
37338 470235 403300 271874 309065 341308 -8041 -610781 -793905 -176878 798459 1406820
37328 1406820 1438631 1181544 830880 332599 -212924 -407817 -20503 630382 989063 876395
37318 876395 606979 535223 673207 791710 735925 535257 294436 102015 11243 -4533
37308 -4533 -64421 -224770 -311515 -78142 398878 673696 459257 59541 8833 335138
37298 335138 509057 201082 -232112 -226409 260139 765012 915686 715127 332553 -54139
37288 -54139 -212582 -258 339552 321709 -165641 -619189 -504728 85830 591877 681816
37278 681816 543295 520998 704718 910534 903400 607188 220386 112939 452019 938556
37268 938556 1104720 883987 654837 667009 720856 593278 492711 760208 1282586 1587443
37258 1587443 1478027 1196848 942588 639434 307424 231909 499615 728839 613834 440386
37248 440386 635883 1046457 1177919 1011009 975081 1112431 921257 224258 -405773 -432278
37238 -432278 -75576 166785 291647 563974 836131 701872 206751 -159783 -177278 -112776
37228 -112776 -192838 -316823 -383928 -473233 -549217 -376960 62402 390894 306739 4596
37218 4596 -98434 128572 501230 837213 1071501 1137088 952368 564266 201080 114548
37208 114548 340012 630165 727543 724814 962246 1458678 1719647 1388450 840040 714973
37198 714973 1030808 1251117 1142738 987388 933027 773099 510205 485071 681626 558339
37188 558339 -32291 -389948 16468 630457 601258 80929 -69720 363094 728661 622915
37178 622915 413280 491745 687333 707704 643252 710563 864401 940761 907271 775126 528986
37167 528986 292972 276695 416847 390703 142235 37139 267213 462929 240365 -141840
37157 -141840 -82176 544773 1256572 1608562 1620894 1521890 1377053 1126055 806405 552559
37147 552559 408512 272077 67861 -99542 -71773 84640 79964 -209171 -493916 -425467
37137 -425467 -107229 30298 -124325 -167247 221985 754832 867335 455519 23554 97877
37127 97877 657787 1189899 1231281 819849 404074 312341 401611 342858 159800 227152 692035
37116 692035 1172231 1210641 848868 527003 507686 622749 577817 316748 23693 -123740
37106 -123740 -113164 -26055 121435 379590 678659 764173 480497 74756 11100 439574
37096 439574 1024703 1355850 1345447 1145973 879681 596055 337499 85600 -245477 -637329
37086 -637329 -921196 -1025157 -1095496 -1202439 -1114010 -619874 50498 432992 399043 234635
37076 234635 175306 174922 176293 283601 517504 660463 550754 349859 303466 369276 324429
37065 324429 183489 251694 704007 1293461 1594188 1454702 1116064 913130 936710 1002767
37055 1002767 911310 691310 564706 675765 905488 1001141 872216 695712 707889 935969
37045 935969 1167542 1155984 829426 341076 -26037 -31289 345533 851495 1146553 1114036
37035 1114036 970090 1003053 1209783 1281197 1012556 657674 718702 1330735 2008321 2178077
37025 2178077 1881301 1682543 1848621 1948329 1492930 712046 318304 602493 1155891 1491660
37015 1491660 1535399 1395284 1051613 522961 53446 -143281 -147247 -131666 -93125 17750
37005 17750 113197 143794 239121 429937 470910 227506 -19351 -10230 14362 -270165 -590419
36994 -590419 -367688 390460 1057724 1260797 1241852 1286803 1337835 1317910 1327386 1321773 1067912
36983 1067912 641367 508913 858751 1279580 1377627 1278653 1211331 1051931 693743 458781
36973 458781 639953 932656 843286 458509 296787 526105 825061 960882 1036439 1145257
36963 1145257 1179928 1046391 776356 414200 58050 -22774 374637 1013699 1364039 1172138
36953 1172138 686741 321517 294226 565164 899925 993499 735911 362370 193187 275998
36943 275998 433848 561531 672159 743462 736240 696720 658945 551934 377938 308800 376015
36932 376015 278259 -177601 -627820 -545681 14955 473741 479749 233735 78627 146308
36922 146308 422545 805539 1060748 1018056 815766 672488 502404 118352 -275732 -254247
36912 -254247 183675 609733 834918 1088109 1452723 1650309 1555952 1442786 1488803 1478187
36902 1478187 1239152 969461 852620 719525 381877 -13553 -227575 -230916 -46417 370752
36892 370752 859443 1032821 819581 651372 781452 808376 311191 -373883 -531721 -30433
36882 -30433 582924 830678 701802 386713 61190 -66495 127940 473373 672852 674151
36872 674151 639760 620426 527974 371092 248983 165276 95567 147497 374243 528975 333141
36861 333141 -70311 -264521 -120889 120607 290735 420946 424908 97248 -423841 -598028
36851 -598028 -156237 443076 534839 71980 -362192 -318749 3675 90071 -209014 -494781
36841 -494781 -323912 250800 774226 945243 867024 740838 593050 440060 455464 731150
36831 731150 1060819 1212116 1240811 1264193 1121644 634405 66839 -111906 109864 301932
36821 301932 281229 307961 496342 545488 311026 181009 489860 902675 860623 438734
36811 438734 248199 536499 891380 936340 850459 938131 1050361 838935 406587 251988
36801 251988 554107 923099 1007605 971685 1077597 1101046 621188 -214213 -710675 -505972
36791 -505972 -16646 171348 9809 -153576 -135941 -39170 12275 -11161 -62776 33538 468736
36780 468736 1067837 1253112 693950 -175793 -614291 -419560 -7739 223109 242261 170278
36770 170278 85381 63060 134259 208257 232315 305248 403990 234050 -276917 -587322 -173824
36759 -173824 604090 889132 518950 168997 270852 512657 587176 693410 960919 1061464
36749 1061464 843865 742745 1018667 1143476 590104 -209849 -438208 -129897 -57975 -488981
36739 -488981 -814963 -508226 191940 721535 830485 605023 264155 112520 349939 746428
36729 746428 779189 243243 -494721 -937687 -918532 -561197 -68374 324466 421582 251687
36719 251687 45903 -30255 23134 194971 478487 708750 662640 407143 290872 476807
36709 476807 719346 726308 516787 292814 179595 229156 446775 644737 504900 10739
36699 10739 -376929 -233849 267818 562777 363644 -110806 -505418 -661035 -573833 -264629
36689 -264629 210942 725749 1110948 1206127 958706 566091 417878 723720 1236606 1511776
36679 1511776 1419254 1224532 1162463 1138169 935629 567670 278840 243646 353542 327282
36669 327282 45334 -227125 -55131 618505 1239678 1178249 494266 -81740 -23825 383292
36659 383292 498512 162823 -225769 -368444 -407369 -529393 -579085 -325447 79223 223755
36649 223755 -4585 -252956 -157063 240381 626941 803386 774964 589530 301270 60259
36639 60259 14774 77003 -13569 -288440 -400161 -63321 487462 744416 596255 450563
36629 450563 606322 810643 675738 316370 215685 509311 772920 626825 248867 81679
36619 81679 239548 457179 505386 389404 181587 -65389 -201589 -37552 355556 601975
36609 601975 452001 127049 39813 245748 398384 258372 17020 -2679 206030 383997
36599 383997 432415 552777 903999 1312476 1468323 1302092 1011531 786588 681497 710368
36589 710368 854370 972079 941397 936007 1275003 1863900 2105269 1653804 1003454 906085
36579 906085 1336290 1528662 1074361 464517 326812 574853 697371 574225 509346 579508
36569 579508 477959 95674 -184868 -19368 375670 543115 459411 531961 938595 1321283
36559 1321283 1293651 998251 891194 1092197 1263168 1151266 937374 883084 882258 639802
36549 639802 174459 -157775 -134297 103494 337157 546616 786683 975865 969565 767676
36539 767676 542724 481660 605408 694556 465499 -41058 -346154 -64940 499517 654804
36529 654804 258393 -67775 153585 576649 619619 350076 268084 430388 390121 -14193
36519 -14193 -374300 -339597 -59688 179200 345857 465863 411456 187250 114057 380802
36509 380802 653208 512960 117843 -2578 259954 454009 283639 37897 106077 389443
36499 389443 486657 277847 20378 -62741 -10322 67235 156309 234373 185872 -40325 -293123
36488 -293123 -363923 -217535 8565 180817 263627 296917 366019 525438 660903 539402
36478 539402 160875 -55502 285962 952824 1257615 930420 477234 452813 696049 654401
36468 654401 259725 2789 149663 354824 222693 -108785 -212941 24646 335406 481657
36458 481657 477449 431113 391567 378392 406182 434042 386247 238229 7929 -307457 -668358
36447 -668358 -890460 -777252 -404053 -106229 -73042 -84046 187198 685579 994286 848670
36437 848670 439632 138558 87784 174684 265300 301909 267718 233900 373109 731327 1039438
36426 1039438 988521 682334 544936 734567 956854 984826 1021566 1271969 1445203 1114507
36416 1114507 456665 159359 511686 984617 921655 360672 -103104 -100387 178656 406317
36406 406317 575003 887876 1347968 1673223 1642802 1368480 1115261 961974 811460 675457
36396 675457 693664 818977 761731 422276 147828 302778 747422 1038105 1027151 921985
36386 921985 809865 532064 100674 -150709 -27000 211860 232848 120546 231891 677075
36376 677075 1171133 1362519 1165236 804438 621499 765578 1015296 1006316 680322 351075
36366 351075 260847 290118 249557 228674 408055 682624 759686 569249 326497 221826
36356 221826 279651 492093 833705 1116553 1076098 695913 279134 110024 170742 262583
36346 262583 291885 345740 533058 804671 948050 820322 595854 621807 924528 1070488
36336 1070488 747085 277278 193209 441092 506114 311812 384588 910653 1235751 769866
36326 769866 -52448 -310531 155903 659247 707891 495113 313733 121128 -108896 -145610
36316 -145610 81208 248507 146655 52022 252298 538833 566144 431280 458687 634303
36306 634303 720470 762049 974358 1227721 1170563 848714 684551 799875 874280 761952
36296 761952 707922 782638 656191 228226 -19508 301201 847687 1015915 751262 462636
36286 462636 361812 321767 237756 132357 1762 -120180 -64051 228079 525302 649686
36276 649686 753599 935068 892728 418567 -70915 -82927 108634 -133158 -689234 -764521
36266 -764521 -134984 492655 578573 431079 436042 343669 -123047 -525750 -258676 492092
36256 492092 989576 992224 987477 1404377 2052092 2410402 2188657 1550270 952033 738899
36246 738899 806276 782751 595467 575824 860967 1046277 731858 126018 -246245 -207812
36236 -207812 47253 368770 691395 840159 715671 557038 635039 809778 787721 662216
36226 662216 716435 799210 470691 -203149 -574334 -296222 201263 345690 123671 -117042
36216 -117042 -230802 -324982 -449454 -507617 -388257 -49108 420670 763492 759751 526983
36206 526983 392077 407704 277609 -125433 -486364 -502334 -326533 -267717 -256490 34182
36196 34182 610507 1036772 959369 542857 280298 452314 837605 955192 596472 85113
36186 85113 -68266 261444 728819 994998 1070028 1100204 1057871 850537 586997 487178
36176 487178 574129 661366 638130 592817 640416 778600 942218 1067450 1065355 861849 533398
36165 533398 301655 306261 453133 578100 698318 972036 1419334 1823412 1963569 1840221
36155 1840221 1599057 1337251 1089144 905230 792415 633869 330951 -14100 -220421
36146 -220421 -277253 -273369 -164496 87480 193795 -221151 -978066 -1395070 -1181081 -818147
36136 -818147 -746281 -650075 -53821 765220 1112768 920201 762473 887992 919283 614173
36126 614173 283166 230864 321693 359966 427550 560722 525769 237710 26423 153957
36116 153957 402108 474388 483462 665886 901910 932532 826489 809072 812194 641028 460496
36105 460496 640156 1133862 1447486 1284158 869611 566920 486175 566758 752079 939861
36095 939861 974463 830180 658680 563844 472746 319964 225448 364929 721329 1057576
36085 1057576 1137189 952214 732405 707477 866626 1025798 1127315 1310978 1606812 1742114
36075 1742114 1447565 851822 361948 197564 237291 299890 368999 507020 721075 985463
36065 985463 1281989 1548926 1660783 1525371 1201553 919217 954558 1391408 1965539 2239637
36055 2239637 2003803 1442465 890632 556371 508548 716589 969719 965594 679992 480560
36045 480560 651052 965079 1004587 762778 593947 635484 657678 520249 416615 533808
36035 533808 752505 850220 797241 701492 632129 639706 798282 1077870 1291822 1307555 1217156
36024 1217156 1184405 1216576 1205464 1108304 957776 753466 480766 220819 123024 238206
36014 238206 436342 517936 400116 195898 97824 156374 204301 71831 -141465 -121965
36004 -121965 293868 906566 1369794 1547149 1571471 1592659 1569666 1343515 869768 325911
35994 325911 -36295 -133518 -104238 -104859 -113484 -3923 223272 390780 351389 162097 -4905
35983 -4905 -72115 -102896 -158137 -201622 -190449 -179774 -232127 -254794 -80889 247171 454477
35972 454477 431238 489616 975853 1702480 2070528 1794886 1226477 857659 780090 788930
35962 788930 764837 711398 589992 372915 158103 23525 -120595 -326645 -387865 -82814
35952 -82814 443499 815945 905869 914446 1011364 1159495 1296781 1416760 1430672 1211237 843142
35941 843142 601684 617847 783510 1027502 1401534 1793031 1872109 1543507 1194527 1202404
35931 1202404 1367929 1174191 535519 -64765 -228021 -102538 -33554 -26571 148031 452299
35921 452299 553516 359764 250281 558135 1067052 1339513 1396146 1652455 2178794 2485578
35911 2485578 2235739 1766135 1566729 1545378 1253698 693406 412299 753273 1394253 1770968
35901 1770968 1690473 1379742 1112757 943640 744863 450201 262676 506993 1159156 1690849
35891 1690849 1632386 1168488 853328 819226 688339 295800 23951 210896 622718 825356
35881 825356 798581 828003 970613 1008791 878504 790504 869084 946683 850800 714337 813805
35870 813805 1141799 1307278 952611 217635 -334051 -296932 159665 534396 563560 417434
35860 417434 385434 538872 731303 806637 753553 699935 748372 803395 673359 417440 408278
35849 408278 845240 1350719 1344156 767483 146855 -61106 107924 380260 608772 775551
35839 775551 874502 917195 905044 770053 528345 456778 828584 1465550 1880776 1905568
35829 1905568 1808345 1732493 1484943 1077211 984790 1492313 2151067 2329460 2040333 1762337
35819 1762337 1640178 1387031 920328 568172 535213 576780 398704 107057 56685 397317
35809 397317 902311 1156822 876732 188210 -358075 -232842 482803 1081134 961289 315037
35799 315037 -90008 200648 856161 1257424 1249184 1148813 1130319 999268 671851 464882
35789 464882 606563 768488 508230 -10048 -219675 4014 219513 167163 113809 307554
35779 307554 581852 732122 849482 1005252 999355 733784 482333 463466 484980 362699
35769 362699 340470 662215 1037016 1041129 827427 877193 1171677 1198123 790086 408942
35759 408942 455751 760719 951194 954168 890210 745818 435586 56649 -163686 -156514 -93132
35748 -93132 -144073 -243315 -187349 21206 67456 -280571 -758407 -848221 -440042 43201 241279
35737 241279 246547 279183 342562 413068 610657 896042 928480 543861 61692 -206890 -391030
35726 -391030 -603923 -474715 288315 1196359 1525689 1359771 1360090 1611955 1507243 841609
35716 841609 227215 158145 344782 317851 119901 2540 -87273 -277807 -371920 -98502
35706 -98502 446928 929742 1159718 1120319 859446 604078 742058 1388991 2126111 2413849
35696 2413849 2138095 1570684 980273 509627 275413 325759 554972 827250 1121314 1443746
35686 1443746 1705860 1804053 1735652 1560368 1352083 1237623 1347713 1666391 2028656 2268848
35676 2268848 2269820 1973925 1561980 1482233 1946384 2482511 2437271 1904429 1617813 1835840
35666 1835840 1948436 1461163 778834 568685 813151 1019296 1020009 1000037 954176 697777
35656 697777 323374 136906 167105 177271 142550 286681 628435 896765 949763 911531
35646 911531 837105 617094 321010 269977 580659 921618 937262 709032 589551 729470
35636 729470 973592 1143444 1239346 1364834 1554035 1702632 1672334 1486075 1361368 1445381
35626 1445381 1573214 1473447 1207176 1153915 1461749 1766297 1681827 1382363 1364378 1700612
35616 1700612 1923168 1742124 1487886 1567670 1799090 1717708 1382035 1332249 1705885 1951086
35606 1951086 1677330 1312654 1476126 2012021 2178762 1682776 1021338 768174 936041
35597 936041 1151746 1137155 884085 579793 460403 586163 751934 771275 759876 899227
35587 899227 1041096 903322 596207 534334 805823 1064585 1132175 1253013 1573125 1786860
35577 1786860 1575596 1090100 730245 671343 812287 966743 920893 528919 -63547 -487445
35567 -487445 -575044 -497907 -387611 -120784 359217 807221 975274 912311 793099 680979
35557 680979 600626 584859 515997 213975 -176909 -215083 246351 801380 994200 785992
35547 785992 413625 155431 330250 1038207 1732982 1613833 717047 37792 216313 721878
35537 721878 808922 638853 792383 1205985 1378419 1267349 1197562 1151232 926736 784222
35527 784222 1124012 1653711 1693290 1271025 1113877 1505923 1936660 2001445 1894705 1804432
35517 1804432 1530934 1013255 626587 602642 637702 407097 63813 -67152 70611 383684
35507 383684 833804 1266460 1358551 1011158 554622 351310 407194 518400 555332 470074
35497 470074 284106 204377 491410 1071533 1524421 1588543 1446057 1383804 1405503 1321182
35487 1321182 1030132 588158 137361 -150308 -174703 16914 326658 692263 978454 984431
35477 984431 761170 680852 912878 1110436 973487 780279 860918 911233 532501 164028
35467 164028 582162 1563209 2017797 1563476 997572 955215 1073174 915949 789584 1000992
35457 1000992 1116862 731802 338870 599036 1214679 1385571 1056824 851663 955822
35448 955822 936491 654940 552497 874735 1273818 1412451 1417911 1453155 1295096 727670
35438 727670 78569 -57533 423475 989043 1163870 1112744 1300448 1708017 1781074 1277166
35428 1277166 760831 888101 1479514 1809366 1662114 1499717 1588169 1620684 1393812 1247398
35418 1247398 1498933 1908522 2055359 1881421 1571575 1248039 1039046 1075085 1176563 961279
35408 961279 502461 388532 826207 1228973 1101817 778823 763461 872358 689707 428468
35398 428468 575404 961791 966925 514313 139887 110517 147238 56573 17843 127828 174371
35387 174371 17107 -184712 -229548 -72481 242403 579007 702183 556369 436176 576600
35377 576600 746598 619580 363327 417894 816306 1166924 1203207 944593 478301 32622
35367 32622 60541 703019 1342732 1295617 795959 622366 879201 966072 756899 879849
35357 879849 1569967 2119780 1953526 1547711 1678583 2244110 2476099 2061858 1485802 1330406
35347 1330406 1635877 1957496 1853868 1350996 972180 1145819 1591715 1622415 1115077 745929
35337 745929 1035958 1584456 1628406 1078638 569715 605357 1043485 1426154 1511413 1379726
35327 1379726 1186754 958218 643903 304990 116927 133153 205263 271763 531330 1085038
35317 1085038 1592660 1643188 1354877 1196432 1261991 1181191 789085 423415 420137 706039
35307 706039 1041768 1314923 1450012 1372911 1211136 1206197 1315550 1253386 1018503 954971
35297 954971 1147738 1235285 1048519 945057 1179884 1399673 1190133 762314 621241 812021
35287 812021 965346 915088 819698 768702 674495 527041 445291 498901 693704 1029868 1358999
35276 1358999 1349544 879816 334048 207573 510900 841322 941909 890494 812811 727128
35266 727128 663945 670316 680003 586913 442975 411835 559466 831988 1147968 1356989 1260348
35255 1260348 901693 685477 914766 1328727 1429279 1178714 986535 1029190 1029725 822891
35245 822891 708672 984815 1439277 1631457 1495872 1343425 1358643 1424359 1444541 1514206
35235 1514206 1644185 1582520 1139709 540738 189496 147361 135360 64196 214904 725064
35225 725064 1205551 1181661 736944 375520 343680 457310 572408 808014 1189695 1441381
35215 1441381 1353100 1108305 1024543 1141898 1259838 1235937 1073087 846674 720225 901447
35205 901447 1376320 1772863 1708887 1259270 885753 866578 961048 754884 251227 -67379
35195 -67379 166276 705765 988050 847065 624063 548158 429748 185892 221553 825257
35185 825257 1496016 1477316 847290 458248 759064 1268418 1362677 1045873 696979 501457
35175 501457 421829 411413 426401 475856 755537 1395365 2015868 1999819 1348839 773160
35165 773160 721795 847667 720244 519513 604984 873121 1035618 1158814 1426818 1678204
35155 1678204 1667803 1527936 1507324 1501974 1297535 1021365 887175 754069 445767 246657
35145 246657 494221 873823 766710 228019 -13777 430668 1158691 1618098 1697059 1541624
35135 1541624 1233060 853074 575547 526374 709754 1078935 1494513 1691685 1544269 1289357
35125 1289357 1238112 1368194 1461746 1484447 1510073 1457896 1296791 1325453 1771940 2244176
35115 2244176 2118788 1445338 928981 970137 1226398 1228019 966385 725574 713166 989438
35105 989438 1431840 1682782 1458531 971775 721702 834529 972260 926007 891366 1054113
35095 1054113 1276118 1336249 1206297 1007678 932435 1182797 1700211 2038447 1869697 1502144
35085 1502144 1441907 1572643 1365821 846265 627887 887509 1049002 748133 411729 500809
35075 500809 807616 968723 1126682 1539637 1967969 2024461 1827160 1761676 1831633 1770437
35065 1770437 1622756 1683515 1920646 1934735 1541209 1046419 861261 1048006 1302378 1286622
35055 1286622 994588 798321 1012575 1444894 1631519 1511733 1490373 1750783 1958212 1846564
35045 1846564 1639718 1587077 1516215 1230721 955489 936133 946071 702780 480762 733782
35035 733782 1297770 1558982 1321863 952261 710591 514623 390932 590111 1106126 1556577
35025 1556577 1717267 1765601 1822504 1676484 1227248 850911 977387 1496975 1884799 1806575
35015 1806575 1368361 856881 470051 297391 381214 717983 1231111 1753423 2064450 2037648
35005 2037648 1783911 1560470 1484268 1420490 1228348 1029759 1092085 1444928 1757166 1696519
34995 1696519 1348050 1140996 1346976 1779317 2050976 2005650 1787756 1605462 1583068 1753341
34985 1753341 1996337 2044356 1767239 1415674 1333061 1439118 1298563 768458 280530 330787
34975 330787 909627 1582663 1947868 1887025 1558743 1285097 1283432 1401113 1289174 916806
34965 916806 676403 856624 1264696 1535926 1570465 1469756 1287025 1083937 1032104 1205756
34955 1205756 1430176 1545347 1638624 1810680 1936429 1912489 1904088 2028547 2017076 1586916
34945 1586916 993806 774173 1003912 1253859 1284540 1331300 1581877 1782473 1610697 1179775
34935 1179775 903729 977418 1200962 1288308 1202390 1146303 1274330 1479480 1533967 1418012
34925 1418012 1364979 1521509 1732243 1805448 1842339 2078459 2464006 2644511 2398727 1925643
34915 1925643 1614228 1608375 1677884 1532785 1233426 1177247 1576173 2074599 2144972 1819907
34905 1819907 1670128 1964124 2253373 2055923 1608806 1531040 1916206 2197970 1917636 1286589
34895 1286589 900600 1099365 1685646 2173947 2281341 2188154 2257631 2531923 2699992 2576772
34885 2576772 2327359 2127126 1938643 1792366 1903648 2231756 2303107 1858322 1335766 1246612
34875 1246612 1374167 1170895 735152 701052 1175772 1472916 1085336 372640 12950 184428
34865 184428 580645 934328 1217272 1468828 1663786 1742011 1718987 1775098 2103644 2535894
34855 2535894 2531500 1845205 1024966 828223 1242109 1567198 1453335 1303970 1540022 2006689
34845 2006689 2358982 2569901 2730327 2725099 2486125 2287737 2394054 2587997 2429633 1899580
34835 1899580 1449111 1415758 1658156 1815846 1732716 1539734 1431947 1469185 1597075 1789276
34825 1789276 2055518 2284652 2247397 1906490 1586487 1606985 1841213 1913651 1771718 1719449
34815 1719449 1872873 1963206 1801732 1588274 1554819 1594185 1496233 1334814 1345958 1562149
34805 1562149 1825120 2068868 2340231 2579873 2624509 2462321 2298545 2279969 2275044 2054346
34795 2054346 1655215 1419493 1582516 1926846 2028416 1830294 1723914 1958599 2226649
34786 2226649 2062295 1466299 848798 468925 245038 77074 45733 255171 708718 1356512
34776 1356512 2065551 2568491 2670487 2493057 2306791 2182716 2044296 1954696 2013806 2035457
34766 2035457 1732194 1243730 1077104 1433934 1969200 2316469 2465954 2489518 2315893 2024033
34756 2024033 1984729 2370359 2774160 2664366 2080183 1583045 1591304 1998524 2411656 2578930
34746 2578930 2569773 2616333 2780027 2808767 2441901 1828552 1443615 1548017 1921039 2183328
34736 2183328 2200603 2100246 2057632 2135474 2207304 2038031 1594538 1220336 1261355 1562525
34726 1562525 1650804 1428891 1325177 1648296 2129543 2289086 2009482 1575882 1340537 1477159
34716 1477159 1889482 2258575 2331240 2202381 2150156 2229472 2273257 2242628 2244883 2222881 2008871
34705 2008871 1711677 1639687 1778630 1782438 1575553 1484065 1609397 1583999 1225886 975401
34695 975401 1316629 2099610 2767082 2970478 2687890 2054514 1401741 1192195 1576300 2181999
34685 2181999 2557308 2604018 2427226 2094493 1764408 1703188 1906365 2023107 1893089 1793042
34675 1793042 1903704 1973203 1843570 1846858 2232991 2628806 2598648 2393129 2553390 3029619
34665 3029619 3299337 3193769 3010541 2897127 2699468 2414910 2273765 2314930 2310259 2167092
34655 2167092 2038248 1996313 1942631 1877476 1940144 2121706 2203734 2046310 1750425 1513989
34645 1513989 1454977 1531395 1545535 1360453 1192405 1437064 2055920 2460353 2263999 1825437
34635 1825437 1705189 1893560 1996741 1929685 1934858 2063249 2112490 2023359 1948939 1981312 2128939
34624 2128939 2463438 2965702 3332272 3246683 2759275 2183323 1797623 1832103 2397661 3133868
34614 3133868 3338672 2861389 2441801 2661871 3035701 2820901 2300516 2368370 3070160 3514930
34604 3514930 3226261 2684797 2408464 2313841 2199938 2137523 2123536 1978433 1814500 2004304
34594 2004304 2471443 2627014 2249705 1811914 1660214 1512068 1126389 851480 1026205
34585 1026205 1352039 1397772 1329644 1580948 2076346 2342906 2248788 2130747 2220618 2363894
34575 2363894 2372337 2356823 2574009 3062576 3534993 3652317 3396913 3084835 2946886 2851415
34565 2851415 2608673 2370168 2432128 2756516 3025173 3106684 3121032 3082747 2855418 2470768
34555 2470768 2144789 1956010 1816213 1731648 1765434 1804391 1729890 1731380 2028157 2382573
34545 2382573 2392271 2188730 2268709 2654369 2853293 2700948 2572830 2629369 2542715 2209933
34535 2209933 2066999 2353702 2656772 2572116 2319028 2311721 2559854 2845558 3076130 3139332
34525 3139332 2843158 2326319 2093213 2317042 2558413 2493857 2408004 2574662 2700116 2492047
34515 2492047 2279635 2460600 2737280 2560898 2045954 1790867 1984146 2295816 2500567
34506 2500567 2616491 2546518 2184554 1824809 1881019 2191944 2169896 1709000 1403177 1706544
34496 1706544 2360246 2875489 3165527 3391242 3491113 3252884 2748296 2370754 2392862 2666581
34486 2666581 2826117 2676911 2315884 1962532 1794427 1900620 2218562 2483844 2425892 2094796
34476 2094796 1810870 1710849 1612430 1480356 1667431 2360904 3100656 3293590 2984827 2652024
34466 2652024 2453325 2223606 2025083 2061347 2157591 2009507 1878655 2281983 2987953 3161046
34456 3161046 2631529 2157033 2188155 2266647 2015885 1828957 2034527 2205678 1975919 1835290
34446 1835290 2339881 3084160 3270099 2898674 2619192 2697854 2885941 3090355 3431075 3722633
34436 3722633 3567258 2996451 2515393 2456545 2642268 2700336 2474624 2165380 2170056 2607774
34426 2607774 2978048 2677834 1925023 1610387 2048631 2551829 2582593 2580114 3074366 3669122
34416 3669122 3660606 3163474 2844241 2911117 3103062 3340383 3641083 3680490 3185655 2553038
34406 2553038 2374825 2553454 2556330 2332505 2284641 2516076 2785438 3039724 3336658 3432300
34396 3432300 3131045 2861053 3188237 3904306 4302801 4223840 4110637 4155663 4133650 4005202
34386 4005202 3954925 3871578 3489318 3008029 2894330 3109124 3197073 3076797 3063358 3182722
34376 3182722 3165500 3051109 3094018 3165780 2988024 2831043 3150279 3628847 3509047 2872310
34366 2872310 2623746 3104180 3672809 3835798 3829118 3832460 3566337 3042105 2829622 3135145
34356 3135145 3389679 3196440 2961230 3125754 3455946 3569876 3555822 3590842 3506363 3195177
34346 3195177 2947472 2967321 3034934 3003621 3107960 3417016 3538658 3279111 3056152 3210885
34336 3210885 3425240 3307376 3081917 3174658 3500423 3674868 3617471 3477383 3240872 2852858
34326 2852858 2503067 2412592 2524055 2680458 2881011 3130344 3312300 3426592 3641908 3926236
34316 3926236 3990484 3794636 3689488 3827735 3902671 3761976 3777514 4196234 4571080 4336505
34306 4336505 3630604 3058921 2878252 2872091 2855584 2858462 2892887 2911031 2968017 3162110 3439182
34295 3439182 3648192 3760468 3902756 4186595 4533915 4643069 4238855 3501229 3069611
34286 3069611 3341144 3929402 4179725 4047528 3998607 4190295 4343516 4379177 4534017 4769151
34276 4769151 4684520 4179333 3660008 3450780 3497092 3729732 4166286 4570081 4603123 4412469
34266 4412469 4451751 4658752 4526787 4097378 4052482 4572351 4944101 4687890 4278217 4267283
34256 4267283 4417588 4265286 3925617 3744420 3646100 3396868 3129918 3122906 3368695 3714684
34246 3714684 4081028 4293972 4141971 3820555 3815353 4138342 4269026 4064560 4032393 4409455
34236 4409455 4720193 4633508 4507441 4632905 4688584 4466086 4399253 4778554 5116309 4914115
34226 4914115 4447892 4203407 4151429 4154178 4416831 4910385 5044713 4616684 4392391 4963894
34216 4963894 5683840 5607396 4920260 4510818 4599584 4730796 4751402 4875981 5041782 5033701
34206 5033701 5030283 5290605 5552425 5434587 5139994 5069443 5079431 4857293 4681366 4997180
34196 4997180 5519333 5589668 5240138 5101541 5379729 5664953 5682268 5562670 5416036 5209852
34186 5209852 5029765 5012518 5128620 5359442 5812264 6327703 6396168 5883801 5370096 5306050
34176 5306050 5380227 5240307 5209344 5608553 5978182 5768660 5290575 5159085 5269975 5178205
34166 5178205 5054843 5360182 5893587 6040696 5724729 5358692 5127330 5006870 5151328
34157 5151328 5566631 5784836 5545026 5359217 5717920 6252823 6417420 6405030 6572973 6589817
34147 6589817 6090903 5574241 5628587 5830203 5466076 4835535 4751490 5229269 5729472 6181793
34137 6181793 6682370 6761723 6149049 5684566 6188342 6984909 6922781 6306278 6304132 6907835
34127 6907835 7104483 6756714 6653015 6890162 6855365 6686926 7084523 7717970 7518934 6613449
34117 6613449 6283123 6854382 7284513 7072619 6928733 7204399 7268219 6906448 6853646 7401280
34107 7401280 7820666 7676577 7480324 7593388 7665520 7551391 7632703 7892177 7792740 7337332
34097 7337332 7122623 7184309 6995158 6703552 7039096 7867697 8259868 8150775 8435560 9206036
34087 9206036 9465532 8902929 8368135 8232527 7900712 7359918 7510289 8392819 8773934
34078 8773934 8186361 7779227 8380992 9254565 9576728 9667084 9902885 9846431 9349587 9190441
34068 9190441 9709561 10048096 9588388 8962659 8837541 8876107 8679375 8612135 8955659 9326497
34058 9326497 9555388 10033041 10684340 10815406 10426158 10350591 10684897 10556309 9900281 9833257
34048 9833257 10673776 11265862 10959751 10601802 10825867 11053385 10974204 11294731 12151562 12492637
34038 12492637 11936571 11557912 11950472 12263579 12046843 12186629 13017144 13410817 12853903
34029 12853903 12531536 13178452 13746433 13436805 13155543 13654214 14110669 13885460 13809294
34020 13809294 14392389 14668399 14160928 14021314 14847744 15451234 15204817 15393525 16658065
34011 16658065 17415911 16607173 15707561 16090104 16692493 16366723 16208021 17257379 18135064
34002 18135064 17428765 16372171 16661003 17580123 17772749 17867982 18799440 19497815 18907016
33993 18907016 18384393 19420358 20846518 20977452 20604266 21142398 21789301 21353451 20921913
33984 20921913 21796567 22762625 22368303 21887720 22983536 24511068 24759452 24703956 25815388
33975 25815388 26904052 26508911 26090969 27353010 28807072 28632162 28371489 29967136 31838594
33966 31838594 31960532 31965705 33875907 35812173 35604495 35437111 37860836 40567613 40607672
33957 40607672 40265784 42773158 45872526 46190627 46160865 49395361 53168025 53476171 53468767
33948 53468767 57981095 63883610 65731276 66717083 72926256 81064880 84481584 87033837
33940 87033837 96585319 109050572 115606812 121435949 137254569 156443760 166225616 178683985
33932 178683985 214318097 246288317 203839122 61019985 -108295748 -201771716 -198062254
33925 -198062254 -159325813 -139295465 -133487329 -119891384 -102308904 -94269266 -91301337
33918 -91301337 -82510784 -71555849 -67107836 -65510403 -58946662 -50514052 -47137520 -46030545
33910 -46030545 -40801124 -33776764 -30738196 -29580108 -24783238 -17858439 -13879596 -12824315
33902 -12824315 -13342157 -19712625 -35275533 -53075089 -62652712 -63323796 -62219417 -62109372
33894 -62109372 -59970214 -55537326 -52421441 -51256625 -49218989 -46124609 -44535643 -44206638
33886 -44206638 -42454597 -39643347 -38615847 -39072389 -37971560 -35222028 -33743363 -34038405
33878 -34038405 -33692352 -32202016 -31536014 -31836757 -31089148 -29227378 -28334406 -28583980 -27997297
33869 -27997297 -26380773 -25631382 -25966822 -25601006 -24354851 -23955045 -24512573 -24219135 -22825156
33860 -22825156 -22053405 -22274279 -22020901 -21068815 -20801664 -21230837 -20786827 -19404728 -18778813
33851 -18778813 -19214735 -19192586 -18364524 -18023261 -18274185 -17746133 -16520737 -16334904 -17330906
33842 -17330906 -17575163 -16468134 -15716609 -16128924 -16301699 -15452564 -14829565 -15181526 -15351830
33833 -15351830 -14606088 -14064202 -14572502 -15210259 -15094425 -14783953 -14811810 -14622454 -13983438
33824 -13983438 -13721202 -14091886 -14094878 -13304714 -12715544 -12878218 -12877180 -12110378 -11468832 -11727521
33814 -11727521 -12242019 -12254102 -12139485 -12391871 -12607542 -12376870 -12064595 -11966704 -11794256 -11561809
33804 -11561809 -11773360 -12219548 -11947322 -10982343 -10631637 -11408473 -12137250 -11909195 -11445306
33795 -11445306 -11551945 -11614054 -10785830 -9562870 -8993193 -9153400 -9411333 -9496398 -9467528 -9268239
33785 -9268239 -9008960 -9070668 -9413403 -9479383 -9178450 -9132891 -9552424 -9798121 -9497013 -9120903
33775 -9120903 -9001816 -8784367 -8356593 -8279484 -8711572 -8928006 -8539375 -8198980 -8427201 -8694729
33765 -8694729 -8414730 -7971566 -7988143 -8313932 -8460324 -8383385 -8206027 -7798236 -7197620 -6838413
33755 -6838413 -6887585 -6963782 -6869335 -6892025 -7073097 -7004251 -6684580 -6663935 -6955701 -6810613
33745 -6810613 -6058243 -5634755 -6147808 -6895284 -7025416 -6773217 -6778587 -6991889 -7064039 -7132859
33735 -7132859 -7441811 -7748988 -7782740 -7742375 -7795782 -7687401 -7363940 -7315891 -7741401 -8040989
33725 -8040989 -7713346 -7112943 -6787661 -6724841 -6755828 -6986489 -7294761 -7155722 -6540549 -6226398
33715 -6226398 -6606268 -6971509 -6639147 -6009302 -5765143 -5772772 -5590520 -5396634 -5542135 -5735722
33705 -5735722 -5526345 -5153327 -5143937 -5459976 -5730715 -5935843 -6222923 -6450769 -6498286 -6599839
33695 -6599839 -6835209 -6771589 -6163411 -5505141 -5333255 -5482373 -5558592 -5595425 -5699370 -5634662
33685 -5634662 -5330325 -5205653 -5435680 -5545674 -5309697 -5301578 -5860928 -6291562 -5933143 -5318175
33675 -5318175 -5315736 -5735619 -5791898 -5459470 -5337589 -5524347 -5611444 -5532438 -5515528 -5430646 -5029604
33664 -5029604 -4615871 -4676180 -5049206 -5192928 -5042380 -4901443 -4775567 -4549661 -4533277 -5047030
33654 -5047030 -5700416 -5829173 -5442244 -5048553 -4806242 -4551087 -4393671 -4540844 -4741943
33645 -4741943 -4608207 -4263026 -4054151 -3942074 -3815859 -3990339 -4630114 -5115549 -4845345
33636 -4845345 -4268315 -4184865 -4411007 -4189036 -3618832 -3513422 -3967038 -4244402 -4108567 -4120487
33626 -4120487 -4483176 -4666422 -4422336 -4193599 -4217727 -4124849 -3757251 -3555456 -3748221 -3898320
33616 -3898320 -3659645 -3348718 -3365204 -3590610 -3734152 -3805263 -3906416 -3958225 -3916289 -3918222
33606 -3918222 -4002244 -3999692 -3856373 -3744395 -3754548 -3792066 -3828351 -3928999 -4020877 -3980417 -3942332
33595 -3942332 -4156704 -4561765 -4851324 -4898399 -4753260 -4370173 -3786968 -3423790 -3666485 -4239503
33585 -4239503 -4525757 -4426563 -4351664 -4452146 -4494356 -4460377 -4597843 -4809880 -4654740 -4102360
33575 -4102360 -3697092 -3774289 -4035981 -4106213 -4039034 -4054028 -4153081 -4213091 -4189901 -4109788 -4056055
33564 -4056055 -4137545 -4261419 -4113403 -3673965 -3486331 -3949321 -4610186 -4748704 -4441765 -4352439
33554 -4352439 -4600737 -4622239 -4152032 -3590037 -3289119 -3180007 -3227941 -3572260 -4034262 -4140029
33544 -4140029 -3853614 -3696966 -3930006 -4183850 -4126833 -3936003 -3865896 -3872567 -3911166 -4113511
33534 -4113511 -4424491 -4520152 -4312153 -4094069 -3993585 -3744944 -3222785 -2750474 -2640695 -2830233
33524 -2830233 -3161025 -3599785 -3984405 -3997894 -3647254 -3389409 -3544075 -3914845 -4181822 -4323451
33514 -4323451 -4451261 -4545677 -4553883 -4497206 -4354039 -4075344 -3776204 -3658881 -3728602 -3826920
33504 -3826920 -3877136 -3832620 -3565640 -3169269 -3111164 -3592042 -4038432 -3874859 -3514262 -3754532
33494 -3754532 -4398589 -4492610 -3921823 -3644248 -4099977 -4505831 -4214855 -3763361 -3873425 -4229636
33484 -4229636 -4063889 -3401283 -2923134 -2921309 -3078071 -3098454 -3013875 -2958656 -3021496 -3219874
33474 -3219874 -3398940 -3323731 -3004935 -2692155 -2483770 -2293892 -2248573 -2641237 -3369201 -3893609
33464 -3893609 -3915013 -3642621 -3312086 -2968155 -2795039 -3016022 -3326460 -3132390 -2560052 -2468637
33454 -2468637 -3153531 -3820256 -3775456 -3387452 -3320034 -3483118 -3379526 -2977507 -2618609 -2434186
33444 -2434186 -2353702 -2354055 -2330859 -2115182 -1895128 -2100993 -2598221 -2648657 -2036835 -1515014
33434 -1515014 -1663903 -2060005 -2147489 -2179123 -2575153 -3030944 -3077021 -2964669 -3165740 -3468479
33424 -3468479 -3387294 -3041582 -2814647 -2543726 -1896096 -1219407 -1172802 -1749270 -2409836 -2914056
33414 -2914056 -3288340 -3305182 -2817570 -2342928 -2475094 -2922003 -2939220 -2515281 -2288644 -2456004
33404 -2456004 -2627566 -2666868 -2819090 -3035343 -2977148 -2700718 -2595962 -2656120 -2525657 -2238391
33394 -2238391 -2174568 -2314096 -2279217 -2107458 -2226394 -2643310 -2906473 -2903463 -2961299 -3126259
33384 -3126259 -3098781 -2920232 -2943585 -3067910 -2826612 -2337527 -2294257 -2815686 -3171739 -2943610
33374 -2943610 -2621102 -2671973 -2806149 -2631733 -2350626 -2282679 -2270358 -2070021 -1861535 -1895202
33364 -1895202 -2040926 -2106968 -2217312 -2484261 -2688334 -2662338 -2626386 -2773075 -2883754 -2732723
33354 -2732723 -2515435 -2474391 -2438493 -2181488 -1954860 -2165313 -2679696 -2925207 -2649452 -2205340
33344 -2205340 -2050085 -2236064 -2464800 -2481885 -2345306 -2330891 -2569084 -2824969 -2752672 -2333959
33334 -2333959 -1901956 -1743303 -1851141 -2057485 -2215478 -2242033 -2147096 -2020939 -1886423 -1666129
33324 -1666129 -1422847 -1425135 -1746616 -2035192 -1988306 -1813974 -1849847 -1997508 -2005425 -2036253 -2351641
33313 -2351641 -2653495 -2453426 -1981977 -1948338 -2397143 -2623116 -2336749 -2075235 -2205744 -2341760
33303 -2341760 -2140222 -1932901 -2068427 -2261874 -2145973 -1931762 -1948109 -1983444 -1698363 -1343542
33293 -1343542 -1439695 -1948604 -2321028 -2258133 -1969634 -1762737 -1762598 -1970879 -2276178 -2461333
33283 -2461333 -2438812 -2385245 -2463300 -2582159 -2627418 -2712367 -2957169 -3211149 -3247628 -3075956
33273 -3075956 -2840936 -2582674 -2311400 -2151215 -2191892 -2334312 -2445608 -2508370 -2493113 -2304668
33263 -2304668 -2001905 -1830962 -1883034 -1973695 -2014533 -2191476 -2558051 -2779321 -2586483 -2224161
33253 -2224161 -2112544 -2266217 -2382774 -2351095 -2321290 -2345734 -2282020 -2084656 -1962369 -2149633
33243 -2149633 -2594734 -2934537 -2831257 -2361191 -1944787 -1790664 -1632012 -1259608 -1029538
33234 -1029538 -1361278 -1924716 -1978631 -1503194 -1283231 -1710526 -2213782 -2182969 -1798888 -1525634
33224 -1525634 -1369424 -1150845 -1017185 -1118965 -1165758 -877056 -570974 -733923 -1228641 -1484526
33214 -1484526 -1335251 -1158210 -1246985 -1471691 -1542492 -1309550 -862541 -538637 -668704 -1131629
33204 -1131629 -1428956 -1416146 -1584065 -2278473 -3031842 -3141671 -2615225 -2039571 -1748519 -1632927
33194 -1632927 -1594449 -1648600 -1659121 -1453164 -1179728 -1168178 -1463100 -1804801 -1973904 -1880031
33184 -1880031 -1493092 -1006650 -853351 -1192291 -1595321 -1618595 -1434557 -1464303 -1647467 -1600427
33174 -1600427 -1300032 -1061883 -984636 -957145 -1086621 -1551675 -2112718 -2328013 -2202524 -2089174
33164 -2089174 -2032787 -1802936 -1513120 -1540769 -1797601 -1752835 -1311232 -1025125 -1224071 -1523743
33154 -1523743 -1476751 -1203310 -1062239 -1102741 -1140627 -1062901 -837999 -525288 -420045 -824583
33144 -824583 -1513009 -1823553 -1504630 -1089309 -1164822 -1615261 -1897477 -1792826 -1560675 -1523036
33134 -1523036 -1764343 -2117660 -2264860 -1995245 -1508012 -1276519 -1467064 -1700499 -1570982
33125 -1570982 -1193546 -990757 -1074285 -1125887 -893761 -579471 -606204 -1073145 -1583765 -1690450
33115 -1690450 -1407407 -1102619 -945286 -779061 -592176 -678457 -1074545 -1256196 -826226 -184014
33105 -184014 6559 -231122 -361537 -296980 -493766 -1089951 -1624565 -1755661 -1664347 -1563896
33095 -1563896 -1374736 -1132396 -1185481 -1652606 -2103760 -2127341 -1887172 -1802379 -1947916 -2068076
33085 -2068076 -1984688 -1760078 -1596328 -1673987 -1910474 -1891443 -1353128 -701551 -605684 -1047062
33075 -1047062 -1319090 -1091889 -854192 -1023077 -1244970 -1036562 -606501 -493980 -755090
33066 -755090 -1039780 -1194823 -1279345 -1211272 -900662 -569159 -485938 -542878 -510571 -519810 -812332
33055 -812332 -1182198 -1203238 -932856 -845565 -1060414 -1163805 -900021 -559667 -497573 -648380
33045 -648380 -743475 -721554 -688359 -650493 -502326 -214330 70220 104655 -265783 -885993
33035 -885993 -1338461 -1362747 -1159642 -1094959 -1193715 -1194018 -1049886 -1038324 -1304219 -1627306 -1798460
33024 -1798460 -1951782 -2289020 -2655286 -2655410 -2135926 -1353128 -691300 -379026 -453732 -806993
33014 -806993 -1210933 -1450292 -1516148 -1573974 -1678191 -1648966 -1360414 -1041165 -1078465 -1526880
33004 -1526880 -2001278 -2110249 -1850511 -1525345 -1419409 -1602085 -1892670 -1970912 -1705666 -1415956
32994 -1415956 -1557369 -2079669 -2428897 -2338134 -2204041 -2375534 -2501387 -2091210 -1398222 -1099792
32984 -1099792 -1270029 -1375439 -1264861 -1400693 -1924993 -2217546 -1772521 -970677 -528086
32975 -528086 -576102 -745232 -859352 -1061991 -1404462 -1729343 -1924156 -2000703 -1959416 -1791265
32965 -1791265 -1569263 -1377546 -1209694 -1048720 -953338 -970246 -1065316 -1205160 -1385324 -1551652
32955 -1551652 -1646716 -1725043 -1829871 -1814695 -1568491 -1345948 -1478436 -1781455 -1737008 -1320019
32945 -1320019 -1083637 -1256557 -1359457 -1039620 -713826 -909390 -1419075 -1656394 -1538102
32936 -1538102 -1467347 -1631315 -1817164 -1838883 -1754943 -1715855 -1852654 -2184897 -2440526 -2216724
32926 -2216724 -1569050 -1142090 -1395528 -1983760 -2244579 -2017719 -1609832 -1234519 -906888
32917 -906888 -669179 -532574 -395986 -321396 -577210 -1088976 -1280061 -904693 -573322 -869358
32907 -869358 -1397004 -1429232 -1110419 -1144871 -1535163 -1587859 -1130903 -796026 -972522 -1309630
32897 -1309630 -1444044 -1464018 -1426732 -1134183 -678697 -568157 -985205 -1470423 -1626526 -1603883
32887 -1603883 -1609219 -1485357 -1132030 -862174 -958529 -1255952 -1485577 -1670654 -1880325 -1941577
32877 -1941577 -1706472 -1326131 -1019568 -832116 -768196 -835548 -843063 -553192 -154901 -127899
32867 -127899 -502190 -776096 -736842 -751773 -990906 -1045868 -727479 -551093 -853698 -1055734
32857 -1055734 -542164 197650 152020 -753113 -1583115 -1665220 -1194285 -621387 -163716 4225
32847 4225 -276223 -804386 -1144047 -1227909 -1393443 -1718445 -1814374 -1471641 -1062467 -1022366
32837 -1022366 -1257186 -1354626 -1168852 -934218 -912793 -1114722 -1323531 -1333209 -1212259 -1283673
32827 -1283673 -1700280 -2128189 -2103787 -1656470 -1259301 -1157023 -1123905 -991889 -1004336 -1377778
32817 -1377778 -1832968 -1918808 -1614561 -1257533 -998756 -720081 -463700 -524671 -974127 -1410188
32807 -1410188 -1412470 -1054420 -747127 -710435 -819615 -883448 -848161 -777906 -843727 -1264331 -1991444
32796 -1991444 -2498951 -2243465 -1409901 -833403 -998124 -1448824 -1460442 -988161 -588197 -605521
32786 -605521 -855844 -1022851 -986201 -783568 -585401 -686101 -1190868 -1724774 -1789419 -1414379
32776 -1414379 -1114806 -1183268 -1386704 -1433208 -1381851 -1462317 -1775689 -2279648 -2811402 -3061294
32766 -3061294 -2801779 -2201083 -1644775 -1257002 -933275 -789992 -1077676 -1586276 -1707197
32757 -1707197 -1302566 -985159 -1236242 -1735066 -1932438 -1839466 -1793531 -1800186 -1608628 -1217007
32747 -1217007 -861852 -671026 -685026 -1016958 -1617842 -2082101 -2081197 -1837808 -1805462 -2028710
32737 -2028710 -2176027 -2057140 -1754309 -1383233 -1065839 -992589 -1181703 -1347154 -1326138 -1390232
32727 -1390232 -1730967 -1925184 -1480607 -736854 -565702 -1169726 -1794631 -1764319 -1264076 -878796
32717 -878796 -790399 -726294 -449150 -53632 121843 -200218 -922481 -1597031 -1893679 -1927408
32707 -1927408 -1943553 -1892408 -1628923 -1323332 -1240659 -1247652 -1015942 -634426 -503250 -634721
32697 -634721 -601095 -245099 79491 95590 -66354 -273529 -626352 -1074557 -1268639 -1083173
32687 -1083173 -907145 -1116321 -1560528 -1835881 -1791898 -1533302 -1178986 -848028 -667649 -622203
32677 -622203 -605001 -704811 -1130080 -1742847 -2046585 -1817389 -1384648 -1098571 -916271 -742121
32667 -742121 -736808 -953063 -1061027 -837337 -601170 -742350 -1090099 -1188392 -983272 -804877
32657 -804877 -827662 -944240 -1034799 -1009415 -752753 -375275 -299911 -691866 -1038930 -804809
32647 -804809 -308567 -345060 -996012 -1470621 -1232075 -689083 -536652 -889042 -1361820 -1660207
32637 -1660207 -1774538 -1804991 -1836105 -1872018 -1803508 -1593245 -1487105 -1754279 -2184155 -2209370
32627 -2209370 -1662436 -1047629 -858657 -971353 -985917 -864573 -878543 -1128581 -1475491 -1819706
32617 -1819706 -2117298 -2205445 -1945158 -1519555 -1298655 -1379689 -1485896 -1341178 -959476 -569974
32607 -569974 -432880 -691410 -1200774 -1542350 -1440611 -1137623 -1092352 -1329181 -1412160 -1115250
32597 -1115250 -757072 -717856 -956467 -1228116 -1475424 -1701247 -1703303 -1322412 -833008 -706413
32587 -706413 -1002990 -1307629 -1266258 -911842 -474120 -162907 -155347 -498578 -969281 -1285229
32577 -1285229 -1471878 -1732052 -1967958 -1836641 -1357432 -1014163 -1061392 -1165443 -1014108 -861295
32567 -861295 -1077402 -1509206 -1743579 -1739784 -1713886 -1608558 -1215761 -707165 -496620 -607397
32557 -607397 -688406 -653625 -777561 -1105261 -1301561 -1205808 -1030402 -865926 -520309 -66230
32547 -66230 -11818 -594224 -1349885 -1740637 -1804047 -1822289 -1769012 -1540764 -1369217 -1472106
32537 -1472106 -1568933 -1296472 -892807 -874538 -1164675 -1176778 -762781 -453776 -633264 -1026780
32527 -1026780 -1228212 -1263535 -1355190 -1489376 -1510486 -1400856 -1244268 -1121214 -1183419 -1561455
32517 -1561455 -2039435 -2134915 -1725635 -1293437 -1274338 -1462377 -1396159 -1066312 -813486 -714644
32507 -714644 -555307 -330605 -279405 -403870 -433341 -352882 -490106 -902544 -1146981 -943579
32497 -943579 -656740 -738088 -1026257 -1050192 -787998 -627971 -711871 -822374 -866156 -956559
32487 -956559 -1004601 -757969 -344884 -251630 -580476 -845697 -749088 -621800 -746584 -787561
32477 -787561 -413618 -29195 -224989 -806215 -1079817 -931193 -864883 -1027670 -986268 -604006
32467 -604006 -378455 -612317 -900317 -826551 -619051 -661016 -809907 -707157 -422095 -271998
32457 -271998 -240612 -71861 220396 406071 494507 684813 909347 860705 505865 200594
32447 200594 204464 365657 376181 119847 -308618 -750727 -1070736 -1204768 -1175365 -1033924
32437 -1033924 -846096 -754486 -890086 -1124014 -1103148 -695735 -215585 -15829 -60926 -129555
32427 -129555 -225228 -482111 -835593 -1115947 -1329383 -1513929 -1475201 -1073096 -657356 -744521
32417 -744521 -1270859 -1623600 -1463006 -1070543 -793794 -607044 -404594 -308431 -412822 -536712
32407 -536712 -504598 -434771 -498149 -594939 -520068 -302742 -169277 -275802 -610059 -1000771
32397 -1000771 -1109960 -658722 123888 493480 -62782 -1159576 -1856374 -1637848 -856883
32388 -856883 -252109 -241480 -685873 -1132285 -1205286 -874094 -420323 -132746 -49880 -33204
32378 -33204 -24680 -119878 -384981 -697385 -829672 -682501 -402091 -240698 -306935 -500057
32368 -500057 -690488 -861196 -1008904 -1031448 -860706 -629131 -528072 -538176 -479438 -311412
32358 -311412 -196784 -256695 -435170 -621208 -747896 -776648 -751438 -839714 -1118438 -1362721
32348 -1362721 -1301144 -1042640 -929719 -979983 -881987 -616875 -599176 -970064 -1223504 -927334
32338 -927334 -441384 -418412 -833850 -1072022 -885949 -700616 -889106 -1261319 -1485610 -1612672
32328 -1612672 -1860695 -2122612 -2040445 -1523150 -935675 -717625 -935235 -1264255 -1364435 -1217953
32318 -1217953 -1082027 -1142413 -1305185 -1374986 -1335490 -1324500 -1377013 -1355676 -1178356 -996169
32308 -996169 -1048341 -1358799 -1639364 -1545334 -1055593 -556539 -452940 -695375 -826260 -548019
32298 -548019 -98517 56763 -215389 -629170 -879937 -939065 -942165 -942592 -851973 -577790 -190092
32287 -190092 58634 -58398 -491745 -964373 -1303314 -1583126 -1872269 -2037440 -1972522 -1843596
32277 -1843596 -1854667 -1892262 -1699236 -1334424 -1119121 -1109439 -978673 -553895 -163283 -232379
32267 -232379 -728288 -1215704 -1345754 -1125288 -811995 -696412 -888656 -1172366 -1155803 -705531
32257 -705531 -148007 83814 -96371 -456765 -786718 -1002288 -1022664 -814883 -559600 -533508
32247 -533508 -773149 -1027638 -1076991 -933583 -714900 -511290 -416051 -477611 -556050 -440495
32237 -440495 -199727 -189482 -577020 -1081250 -1358021 -1421717 -1462690 -1465619 -1311168 -1095593
32227 -1095593 -1009436 -1006551 -947682 -973309 -1299210 -1671436 -1540037 -892952 -410765 -550087
32217 -550087 -937155 -1014391 -862918 -900727 -1070845 -921220 -396890 6194 -54267 -355566
32207 -355566 -540330 -607234 -785705 -1148407 -1520116 -1665402 -1501011 -1205868 -1091310 -1245467
32197 -1245467 -1399013 -1314695 -1165502 -1251936 -1472230 -1441164 -1081142 -697765 -471202 -298174
32187 -298174 -184533 -320820 -617017 -623537 -167078 318248 367424 52613 -295406 -581569
32177 -581569 -832535 -917121 -780825 -706089 -921708 -1159613 -1042650 -746225 -765733 -1078595
32167 -1078595 -1068437 -401849 443457 733445 282194 -490700 -1098148 -1367422 -1387736 -1288118
32157 -1288118 -1130524 -963640 -880007 -924571 -976797 -869741 -642965 -510539 -552099 -649042
32147 -649042 -765716 -998212 -1235250 -1128518 -634398 -253900 -418933 -918291 -1266540 -1357182
32137 -1357182 -1357715 -1246130 -947784 -707039 -761099 -799184 -361554 298589 422222 -137421
32127 -137421 -669361 -638142 -332346 -233597 -336589 -451116 -660363 -1037973 -1297952 -1167261
32117 -1167261 -820814 -565723 -377300 -138396 -59678 -398795 -935832 -1179430 -1011272 -745551
32107 -745551 -626338 -634469 -735600 -941498 -1116082 -1056825 -818580 -678772 -726852 -732080 -486115
32096 -486115 -79344 226689 253516 7417 -333384 -528565 -507405 -480067 -687781 -1076524
32086 -1076524 -1364196 -1385672 -1201744 -913017 -578456 -319028 -284750 -458441 -653850 -757992
32076 -757992 -821281 -855083 -712947 -300537 190997 401570 160560 -328341 -678978 -686692
32066 -686692 -480455 -305815 -227952 -161275 -150291 -397237 -909374 -1319214 -1262111 -834614
32056 -834614 -476936 -451335 -625053 -745549 -744644 -744101 -888755 -1197680 -1510921 -1620991 -1521311
32045 -1521311 -1420404 -1411990 -1306600 -993434 -779657 -1016675 -1472099 -1505825 -941806 -349004
32035 -349004 -268685 -540208 -693508 -698212 -889548 -1290329 -1477020 -1184899 -681025 -379883
32025 -379883 -356137 -434785 -556465 -785188 -1044075 -1131401 -1042150 -1037084 -1261665 -1468444 -1318586
32014 -1318586 -877112 -571808 -636905 -822966 -773688 -506117 -324964 -369475 -478698 -490039
32004 -490039 -445868 -443634 -467006 -472704 -508236 -618380 -728923 -748926 -721563 -748543 -812373
31993 -812373 -802280 -692027 -567943 -492232 -462022 -497447 -628779 -778664 -807419 -716365 -648203
31982 -648203 -631202 -525510 -341650 -375242 -779420 -1186173 -1101616 -610118 -307707 -505619
31972 -505619 -879731 -1014932 -901887 -691282 -352994 79438 246201 -114719 -671456 -876707
31962 -876707 -728365 -695388 -948918 -1168809 -1153559 -1119035 -1241637 -1350829 -1283395 -1154363
31952 -1154363 -1046516 -794523 -342373 15806 44700 -76224 -102706 -135787 -335055 -493271
31942 -493271 -317414 38706 140915 -114812 -419477 -515177 -432558 -339064 -419627 -779165
31932 -779165 -1183521 -1095064 -336052 476103 599925 112610 -316966 -439158 -583585 -873028
31922 -873028 -1010527 -980195 -1241168 -1925547 -2465312 -2396583 -2003808 -1763629 -1653716 -1472910
31912 -1472910 -1370685 -1504813 -1559148 -1202541 -734358 -666376 -901692 -955068 -781870 -694924
31902 -694924 -598736 -99313 599816 722879 53375 -683167 -874244 -792437 -912784 -1080293
31892 -1080293 -909997 -545302 -391884 -395244 -196771 166269 297844 99804 -138313 -282761
31882 -282761 -492873 -789975 -964074 -998150 -1149565 -1468706 -1624113 -1391142 -995611 -777612
31872 -777612 -772217 -799409 -745652 -603748 -435758 -404112 -612413 -836562 -711267 -296812
31862 -296812 -107568 -390631 -754242 -792265 -702709 -887507 -1237401 -1291073 -921930 -402177
31852 -402177 74453 449956 497519 24788 -604126 -714699 -234314 134567 -135584 -703326
31842 -703326 -877701 -481385 91183 409352 328128 -18107 -305471 -260766 26997 205688
31832 205688 154568 103340 147282 20194 -409542 -781191 -729749 -454511 -420737 -701879
31822 -701879 -997130 -1135165 -1175559 -1135790 -999827 -911337 -997212 -1077981 -919394 -703920
31812 -703920 -853777 -1388245 -1838013 -1854145 -1582480 -1369467 -1364250 -1461215 -1422762 -1078943
31802 -1078943 -617723 -561244 -1139355 -1809659 -1821138 -1196009 -672840 -664659 -811531 -698667
31792 -698667 -475299 -476710 -668903 -817307 -889427 -951168 -906861 -662148 -361933 -185050
31782 -185050 -55593 191938 495333 636991 522126 211238 -195379 -554906 -717888 -718847
31772 -718847 -773025 -944902 -1004949 -773954 -428649 -298113 -506074 -922931 -1277181 -1237998
31762 -1237998 -679567 2593 172661 -255915 -666016 -609189 -422291 -611092 -1013537 -1081653
31752 -1081653 -722428 -312051 -49426 150585 225524 -452 -356496 -435398 -223499 -130071
31742 -130071 -298533 -370034 -92545 264766 316842 41674 -341239 -678359 -891356 -938096
31732 -938096 -913358 -949185 -919629 -541534 107396 499162 281614 -275855 -656217 -662244
31722 -662244 -423798 -112360 103196 38071 -300410 -633728 -760633 -833008 -1069837 -1353238
31712 -1353238 -1361182 -1007897 -526906 -176302 -47660 -114471 -298656 -494964 -612961 -572400
31702 -572400 -284078 205407 565734 455697 17328 -216188 -47960 95137 -170939 -602131
31692 -602131 -753964 -662834 -647914 -692790 -566999 -410396 -590998 -993630 -1059131 -647176
31682 -647176 -279544 -299626 -340344 7104 454580 439176 420 -285831 -138507 138268
31672 138268 203441 105649 50795 56523 13048 -98741 -214176 -309989 -394770 -425529 -338943
31661 -338943 -169099 -72267 -190670 -488343 -764885 -873192 -873049 -884890 -863231 -697538 -511591
31650 -511591 -587178 -896477 -1002432 -640726 -154030 -44795 -279620 -404269 -241556 -61253
31640 -61253 -72158 -173109 -278223 -463057 -638848 -503678 -63920 172303 -160356 -761071
31630 -761071 -1127619 -1237853 -1343019 -1362378 -1052944 -651594 -711564 -1227022 -1494921 -1052507
31620 -1052507 -281834 168056 145711 -109824 -459705 -859842 -1122963 -1093113 -929220 -887130
31610 -887130 -930573 -855759 -683554 -606953 -634417 -618066 -593603 -751214 -1041125 -1112123 -729524
31599 -729524 -51375 551299 782045 564272 124634 -103612 80988 332529 169587 -326327
31589 -326327 -596663 -433904 -291126 -579454 -1053477 -1201509 -954849 -657536 -528393 -522839
31579 -522839 -626323 -913055 -1286692 -1441690 -1174450 -600602 -45469 188637 5291 -398627
31569 -398627 -674932 -673743 -581882 -601978 -631742 -458326 -152658 -8533 -135914 -369739
31559 -369739 -566831 -736770 -865442 -867105 -759842 -652595 -516449 -232335 66628 7283
31549 7283 -508006 -1065454 -1231399 -1055385 -844512 -651794 -318699 91173 271256 108904
31539 108904 -154584 -283822 -338845 -498285 -770612 -1004741 -1076739 -971487 -765066 -595074
31529 -595074 -563557 -607359 -546720 -321967 -102034 -95137 -319945 -614081 -787970 -712307 -352273
31518 -352273 171043 587740 642602 270729 -387241 -1078985 -1524663 -1516497 -1053903 -375948
31508 -375948 194840 452946 394197 194835 106068 240115 427172 422304 277178 284884 463300
31497 463300 387779 -209541 -927417 -1169285 -983249 -955027 -1269491 -1407620 -976135 -376140
31487 -376140 -277363 -720505 -1156691 -1230622 -1117613 -1107029 -1209244 -1253444 -1122035 -795217
31477 -795217 -344754 37930 151059 -14288 -287618 -552873 -826257 -1073588 -1133513 -936890
31467 -936890 -679695 -633213 -824954 -1021142 -1018001 -857203 -719603 -661999 -533604 -181812
31457 -181812 302527 621017 565138 221659 -135094 -286519 -185561 59254 231285 124829
31447 124829 -258236 -655390 -780165 -599972 -320350 -140574 -106924 -165441 -257442 -361605
31437 -361605 -495048 -653361 -728686 -575265 -227937 34823 -45122 -432501 -872004 -1156619
31427 -1156619 -1229303 -1119036 -918740 -764596 -705609 -647241 -531715 -480483 -617959 -851565
31417 -851565 -994591 -1021675 -1026433 -1016765 -952119 -899980 -938892 -985213 -942747 -923657 -1038776
31406 -1038776 -1059586 -649554 72974 566184 520991 165725 -142010 -286404 -268292 -75869
31396 -75869 151317 146907 -101736 -270624 -168162 -116 16279 -17004 19045 -58119 -415467
31385 -415467 -807293 -862272 -615391 -407610 -366120 -326369 -208981 -142289 -206793 -329423
31375 -329423 -449724 -568896 -631422 -568035 -461189 -470127 -580766 -618532 -537503 -523647 -745398
31364 -745398 -1108765 -1320305 -1164635 -731076 -377981 -400095 -706342 -936667 -924584 -872635
31354 -872635 -997007 -1205317 -1272225 -1152815 -943885 -682549 -362749 -31329 277063 563847
31344 563847 714931 534957 79741 -297517 -429148 -581457 -960858 -1273070 -1135204 -674730
31334 -674730 -306699 -126950 18827 42060 -287061 -826454 -1168934 -1242289 -1309226 -1379162
31324 -1379162 -1154148 -624798 -196120 -97713 -155195 -267205 -580971 -1009134 -1124192 -831119
31314 -831119 -643305 -914514 -1233390 -1021454 -387353 80160 111018 -116257 -434845 -781728
31304 -781728 -927954 -611515 4828 373719 159862 -435984 -983820 -1232420 -1176531 -941380
31294 -941380 -712298 -666428 -865578 -1195805 -1401934 -1229393 -659827 -21536 283719 201788
31284 201788 15215 -103138 -280384 -608225 -902996 -979313 -922332 -878839 -796111 -605508
31274 -605508 -467125 -556413 -751687 -806014 -723578 -709305 -825410 -928588 -880764 -635978
31264 -635978 -222634 179520 295217 104384 -31311 144948 348147 135061 -410371 -767808
31254 -767808 -707199 -529719 -554366 -727688 -832359 -778288 -579787 -299767 -116462 -209708
31244 -209708 -470212 -523815 -159658 412819 799814 773005 363087 -201954 -588591 -563146
31234 -563146 -202155 188824 373776 302613 -2981 -475124 -914258 -1075483 -878360 -423363
31224 -423363 125861 521835 458528 -74065 -563944 -491025 -45145 79705 -355295 -821991
31214 -821991 -793236 -386546 -40879 49354 -73135 -338003 -558608 -452030 -54047 170842
31204 170842 -59806 -412054 -444351 -259553 -255165 -479755 -685392 -825288 -1029517 -1222430
31194 -1222430 -1225531 -1124882 -1075566 -886122 -352168 101953 -205032 -1138034 -1728554 -1433724
31184 -1433724 -781112 -474433 -478637 -412916 -301293 -377217 -523613 -473790 -321181 -325657 -427631
31173 -427631 -430383 -441734 -625799 -732462 -456737 -110778 -294595 -955571 -1432558 -1446416
31163 -1446416 -1355134 -1329499 -1031774 -389740 31279 -122004 -364472 -130324 322224 360630
31153 360630 -24168 -301650 -259712 -151144 -81682 151052 569615 852658 762855 403065
31143 403065 -7982 -342443 -544867 -654289 -806437 -1001315 -994410 -662267 -278453 -114154
31133 -114154 -11777 234936 352088 -9303 -561376 -743676 -670819 -956191 -1601778 -1896438
31123 -1896438 -1565235 -1168758 -1056650 -767043 43190 817728 883929 436677 78564 -143729
31113 -143729 -545112 -1016988 -1161157 -980208 -784944 -601520 -282773 -21083 -100348 -265406
31103 -265406 -8103 556873 747193 283240 -379466 -755441 -818665 -692305 -382981 319
31093 319 190642 98563 -118245 -385827 -765671 -1145328 -1265731 -1109713 -896259 -675092
31083 -675092 -330925 13676 79642 -32577 110563 582275 933933 864959 576597 306552
31073 306552 11577 -287242 -349599 -171565 -129950 -380833 -553565 -352466 -31994 69338
31063 69338 48813 101901 47939 -362924 -962848 -1404868 -1632284 -1729060 -1589621 -1169968
31053 -1169968 -808245 -814676 -931278 -682322 -124410 239817 215332 96293 102579 101064 -22335
31042 -22335 -101221 37990 288351 392127 232795 -61847 -239201 -172733 -38309 -118228
31032 -118228 -378939 -473408 -281325 -139183 -301894 -504155 -415988 -246671 -418451 -816937
31022 -816937 -905392 -557439 -260582 -387220 -688639 -701251 -364196 -38195 -69966 -466697
31012 -466697 -925756 -1146046 -1131507 -1105219 -1110906 -941805 -579002 -361881 -462614 -551927
31002 -551927 -384720 -355274 -887151 -1531474 -1411880 -516252 213021 200160 -74169 38053
30992 38053 449669 736589 870570 1013648 971991 447138 -352282 -873716 -934441 -841368
30982 -841368 -813820 -698845 -361626 -33567 -63019 -461900 -880516 -1004846 -848868 -614543
30972 -614543 -377723 -69660 255641 375054 231874 86161 118999 107504 -191657 -521705
30962 -521705 -425514 4591 170771 -164909 -536202 -487563 -219978 -226140 -562385 -802167
30952 -802167 -583922 16827 584092 711225 342465 -193146 -596127 -971517 -1552169 -2145847
30942 -2145847 -2265181 -1830848 -1297847 -974540 -685060 -293066 -66157 -209316 -467977
30933 -467977 -565663 -661057 -960414 -1208059 -1034523 -587253 -363547 -561159 -964922 -1308640
30923 -1308640 -1395370 -1065596 -443825 -26446 -112849 -341812 -229833 51761 -22251 -423632
30913 -423632 -603507 -397829 -243180 -389016 -522369 -407629 -353074 -696917 -1215072 -1389681
30903 -1389681 -1028829 -364258 265642 637649 746090 838233 1158160 1561816 1630009 1246422
30893 1246422 750659 391187 -3029 -572462 -1005939 -925494 -459340 -62084 95532 207176
30883 207176 383113 466982 316799 10163 -273874 -408738 -368513 -288523 -430091 -865953
30873 -865953 -1214455 -951900 -85434 697927 719720 28480 -734595 -1104296 -1200752 -1342516
30863 -1342516 -1503675 -1393401 -992330 -705730 -859495 -1250092 -1404545 -1190314 -947424
30854 -947424 -1027850 -1391347 -1696495 -1663769 -1312843 -929744 -811460 -977374 -1160038 -1140792
30844 -1140792 -1005164 -955721 -989192 -948997 -822062 -757965 -805427 -825842 -680625 -368694
30834 -368694 -16276 157171 -981 -280558 -192187 355009 702422 234484 -651049 -973371
30824 -973371 -531141 -137296 -363430 -794429 -875068 -791173 -948855 -1130529 -860712 -267250
30814 -267250 115635 203279 359157 645942 722023 482268 209266 17904 -308602 -802328
30804 -802328 -1116692 -1028966 -744824 -539187 -445041 -442608 -600577 -850218 -940015 -811574
30794 -811574 -743985 -931031 -1163726 -1136028 -865935 -620914 -567018 -632913 -616700 -372334
30784 -372334 -10117 126380 -113012 -371241 -225204 138679 159145 -184794 -290011 57263
30774 57263 222705 -318108 -1111727 -1371772 -1082633 -827967 -803311 -703708 -475710 -454257
30764 -454257 -670222 -666642 -229507 204314 149211 -296970 -695034 -834824 -793123 -665556
30754 -665556 -521213 -471162 -549338 -631199 -635278 -671069 -817099 -895953 -688172 -290425 -45533
30743 -45533 -125291 -346831 -426358 -305000 -185721 -293601 -615918 -881696 -829188 -481447
30733 -481447 -96298 128347 184453 103840 -141008 -508887 -817086 -933077 -955634 -1073435
30723 -1073435 -1274202 -1297277 -894483 -126608 578875 712755 153641 -632424 -999019 -768586
30713 -768586 -340347 -123712 -81135 37895 225852 235797 -14693 -306683 -400964 -287135
30703 -287135 -129820 -90434 -216360 -412919 -528052 -530153 -546767 -643546 -669641 -479600 -216463
30692 -216463 -152705 -289288 -364575 -276328 -219677 -315983 -377373 -222080 -11860 -44767 -352146
30681 -352146 -734205 -1079742 -1377308 -1482802 -1221685 -778707 -651839 -1036679 -1511247 -1573281
30671 -1573281 -1287809 -1084074 -1042921 -815933 -301882 43454 -159909 -595692 -654133 -287324
30661 -287324 -16511 -107997 -224441 -63247 100951 -127335 -554703 -610753 -176148 258711
30651 258711 306383 118322 -58290 -344698 -903895 -1427916 -1424290 -961318 -676121 -925503
30641 -925503 -1311174 -1287955 -945472 -826949 -1121271 -1443081 -1423645 -1127330 -746114 -251556
30631 -251556 353974 703214 401788 -358892 -912684 -902128 -627562 -513130 -555152 -513327
30621 -513327 -376924 -327473 -381118 -391296 -368384 -499978 -810355 -1046992 -1012395 -844033
30611 -844033 -840687 -1085462 -1325757 -1217295 -695197 -128978 -29922 -508848 -1108627 -1310571
30601 -1310571 -1105651 -863479 -747016 -588246 -338940 -245585 -417325 -569952 -462292 -310461
30591 -310461 -442726 -753592 -886990 -830727 -883006 -1042786 -914075 -365400 146825 201801
30581 201801 38424 180990 638915 910356 737467 427483 316834 293853 100034 -156682
30571 -156682 -132751 186685 370908 51541 -660254 -1343764 -1696545 -1706371 -1546880 -1438033
30561 -1438033 -1512615 -1666968 -1592201 -1111728 -480805 -181431 -358757 -609175 -460547 23216
30551 23216 301789 42753 -432581 -525716 -90296 409011 475920 121025 -277973 -467300
30541 -467300 -462163 -312765 -8653 353411 546689 462178 217705 -53835 -348305 -634675
30531 -634675 -758950 -658266 -514966 -541868 -750116 -1055312 -1419480 -1717353 -1698314 -1346387
30521 -1346387 -1062191 -1149912 -1312472 -1075621 -574144 -399297 -688244 -929045 -780807 -524806
30511 -524806 -462789 -400610 -104171 173461 87140 -195880 -274247 -167371 -192738 -345769
30501 -345769 -328250 -135689 -91146 -257150 -317990 -176349 -195469 -607996 -1065490 -1093229
30491 -1093229 -740236 -447272 -407694 -375458 -91718 336899 554052 341364 -160647 -597208
30481 -597208 -753885 -731341 -722202 -699683 -491154 -131137 91338 17370 -153667 -162837 -60512
30470 -60512 -91363 -303113 -472604 -417823 -226620 -130474 -239779 -443508 -518516 -309669
30460 -309669 158136 697564 1072118 1120937 842926 409275 53496 -120755 -203514 -291872
30450 -291872 -295768 -58257 343242 578605 417111 -10109 -368611 -449134 -274154 10333
30440 10333 232090 253763 77591 -119519 -166948 -130040 -262440 -685957 -1185606 -1390833
30430 -1390833 -1146131 -657268 -274964 -180699 -298395 -451587 -531043 -523480 -473405 -462839
30420 -462839 -562657 -740645 -854861 -793907 -598827 -409448 -333385 -408921 -629069 -915473
30410 -915473 -1102992 -1043539 -737026 -325411 19435 179866 134981 -17319 -133503 -172570
30400 -172570 -207402 -255846 -231098 -144895 -194459 -473431 -731193 -655891 -322069 -98183 -132272
30389 -132272 -199624 -91432 114945 261669 342824 398221 373471 239871 101987 38258
30379 38258 -36873 -210173 -391055 -450623 -439334 -505626 -675114 -868050 -1059763 -1235923
30369 -1235923 -1239991 -905203 -383525 -118876 -350581 -788639 -960810 -796239 -646266 -739065
30359 -739065 -879068 -808139 -624280 -590181 -671216 -586986 -285627 -19934 105172 305414
30349 305414 682741 943932 788593 323492 -145924 -489618 -674042 -598229 -336144 -270683
30339 -270683 -593013 -915594 -829452 -593804 -708427 -998519 -822946 -152015 300747 141346
30329 141346 -206296 -273360 -147653 -10986 268615 673166 747662 273120 -248965 -296431
30319 -296431 -99094 -187309 -536576 -721314 -622175 -416182 -112391 329388 617036 443546
30309 443546 50579 -69128 91799 157022 78341 153890 393555 470258 327970 270665
30299 270665 374494 338739 22370 -349635 -604747 -783490 -810276 -501586 -21212 156894
30289 156894 -106675 -449077 -602859 -694281 -818018 -824881 -713475 -717987 -796856 -584267 -121753
30278 -121753 -44313 -631760 -1226538 -1115518 -524182 -144566 -78346 50855 207396 -34371
30268 -34371 -617220 -906948 -635957 -319129 -453446 -803326 -851511 -603647 -496949 -661990
30258 -661990 -716956 -362595 136851 274715 -40319 -400186 -479399 -436822 -562181 -732409
30248 -732409 -556331 -14149 421479 408397 158418 58651 143171 180444 76645 -78705
30238 -78705 -232700 -374867 -410806 -271008 -102986 -152871 -469284 -861305 -1109938 -1117215
30228 -1117215 -929438 -725407 -685866 -769800 -740033 -507388 -277279 -223278 -221835 -100429
30218 -100429 60793 117986 153257 274134 295876 -2791 -394548 -378906 121857 582677
30208 582677 491886 -93012 -684131 -864069 -597491 -210623 -86490 -250606 -315002 3338
30198 3338 442632 554538 377380 342328 528206 496067 16101 -491104 -529848 -215316
30188 -215316 -49995 -242227 -582100 -835607 -925613 -819478 -571308 -441102 -655140 -1029408
30178 -1029408 -1121379 -805883 -412812 -201295 -13598 331980 574507 301367 -386784 -892489
30168 -892489 -883811 -706070 -829684 -1155471 -1207986 -901188 -701912 -941229 -1305518 -1248434
30158 -1248434 -709718 -157539 -1027 -197961 -415624 -366579 17508 539503 823058 632380
30148 632380 171533 -107366 -69687 -68621 -400000 -793338 -741936 -264808 24967 -273851
30138 -273851 -791501 -893281 -526612 -186656 -117203 -16842 319504 522563 181797 -439105
30128 -439105 -695385 -444504 -145765 -95822 -94607 4811 -42644 -361915 -577578 -393097
30118 -393097 -200138 -552759 -1223525 -1404663 -860169 -277810 -275115 -566417 -480136 49348
30108 49348 467827 429256 172971 27799 -65350 -319292 -632883 -665514 -337936 -1950
30098 -1950 -38503 -455766 -968263 -1310304 -1344561 -1025307 -473258 -11116 94423 -95302
30088 -95302 -340143 -552608 -747294 -768040 -433626 37003 144264 -228222 -624354 -641032
30078 -641032 -393975 -182989 -76977 -92754 -402425 -985527 -1370230 -1144673 -539191 -128587
30068 -128587 -137198 -396660 -770671 -1175682 -1337572 -1008606 -369015 187212 569543 888763
30058 888763 996328 659492 126646 -63330 125891 181618 -126177 -428735 -433580 -371786
30048 -371786 -531894 -830593 -1116382 -1447586 -1756569 -1660943 -998638 -238977 20580 -254231
30038 -254231 -652354 -884099 -902489 -677225 -226570 218452 387592 280129 116670 53821
30028 53821 79127 76839 -108745 -525813 -945876 -1043377 -830968 -664200 -709016 -716056 -489203
30017 -489203 -238687 -217992 -317212 -318183 -293178 -424284 -631441 -693593 -571620 -338971 17052
30006 17052 441808 654251 441505 -45378 -538171 -980244 -1348972 -1433289 -1151122 -840094
29996 -840094 -822586 -897161 -699184 -355121 -264646 -380735 -274451 129104 437554 441129
29986 441129 346491 288241 125258 -142855 -247420 -126793 -86721 -269488 -381441 -207524
29976 -207524 -8712 -88026 -284978 -268839 -98421 -89676 -236977 -148376 405186 1132215
29966 1132215 1502576 1265515 626129 -30865 -514531 -873647 -1111498 -1054234 -652311 -239345
29956 -239345 -207489 -492024 -678895 -597116 -466512 -442223 -413082 -367902 -535371 -902515
29946 -902515 -970661 -388348 398963 573232 -41653 -777231 -970218 -677039 -407575 -419030
29936 -419030 -530564 -539271 -532471 -672681 -845784 -766342 -438025 -252517 -469627 -797472
29926 -797472 -757718 -361590 -91644 -205171 -398034 -284016 82180 356826 367131 193556
29916 193556 -66236 -380708 -685621 -888699 -967793 -954036 -845677 -628912 -345946 -63617
29906 -63617 183001 351824 362225 186761 -67692 -248753 -311115 -334572 -406382 -506427
29896 -506427 -499377 -274007 66419 232896 92923 -87214 61161 493178 775325 672419
29886 672419 438750 380486 381453 126408 -344185 -612692 -434446 -67571 61939 -106585
29876 -106585 -222447 -1639 385124 519760 290310 50927 141656 429673 533953 390503
29866 390503 314978 522032 871537 1148698 1321887 1410263 1346314 1133234 940739 874103
29856 874103 811487 627758 412807 296899 230392 145070 179090 481894 888159 1058614
29846 1058614 919114 707524 574021 391901 51020 -285353 -389026 -307118 -289626 -389887
29836 -389887 -336468 77137 592485 687169 197721 -461664 -806277 -803502 -702936 -556307
29826 -556307 -240273 153577 367341 430717 632022 917869 781424 24847 -761889 -881304
29816 -881304 -418017 -17650 34777 30116 194113 335262 234785 -19776 -270435 -544979
29806 -544979 -863029 -1021559 -822796 -394357 -74835 -40921 -193689 -342077 -345140 -134028
29796 -134028 216352 433158 256648 -203750 -464557 -162918 509354 1009056 1042262 795159
29786 795159 566823 392542 147286 -150911 -326195 -260074 6416 302061 361583 -3002
29776 -3002 -600153 -913823 -710129 -418241 -581919 -1074195 -1272368 -954019 -554988 -494584
29766 -494584 -700699 -913072 -1013881 -902952 -488775 -12901 46392 -356536 -678721 -570296
29756 -570296 -356267 -385255 -375975 69558 666549 769104 300516 -202438 -377450 -358889
29746 -358889 -353763 -352132 -273577 -57507 356715 852053 1067624 828909 455819 275291
29736 275291 79896 -438977 -962289 -877994 -222770 365046 579679 651141 620912 191856
29726 191856 -536377 -936165 -756272 -496825 -545703 -593567 -340989 -163339 -488927 -996197
29716 -996197 -1077750 -779614 -635122 -769730 -811247 -622470 -525923 -720288 -946342 -894282
29706 -894282 -620711 -392444 -311061 -234258 3402 348971 512945 263904 -239037 -550462
29696 -550462 -437309 -112996 91420 80363 -82830 -358941 -661939 -807584 -721845 -543528
29686 -543528 -388280 -211498 -22498 40087 11927 163663 524838 689306 422145 126488
29676 126488 261532 556335 351908 -382584 -946955 -888216 -588219 -673494 -1178734 -1550193
29666 -1550193 -1326076 -627687 -7624 122259 -103765 -222112 -41095 159621 86631 -172497
29656 -172497 -373131 -457632 -436752 -206453 190567 373069 96226 -275156 -215726 186611
29646 186611 404197 326604 374272 707155 880295 490630 -264276 -901071 -1184779 -1147018
29636 -1147018 -891488 -618967 -597369 -866073 -1123339 -1068627 -717745 -282046 87424 332109
29626 332109 428813 397184 248552 -69306 -502888 -729022 -455432 111847 435253 340108
29616 340108 201773 340621 588604 630456 454723 247860 96116 3059 -5730 29461
29606 29461 -1921 -81439 -78649 -46952 -209996 -543899 -700443 -487790 -89525 323007 770147
29595 770147 1068782 781244 -74070 -732128 -586483 -21765 160892 -180687 -583116 -804569
29585 -804569 -940493 -897979 -468768 91038 215634 -146727 -428447 -267467 79722 261709
29575 261709 262537 164289 -45820 -270605 -340746 -383720 -692759 -1113305 -1102712 -590027 -195487
29564 -195487 -305892 -507671 -316738 90187 342146 528654 799031 785853 149734 -630696
29554 -630696 -782747 -359479 -71711 -123859 -40731 334515 534906 367332 311643 660149
29544 660149 952486 730845 274286 53357 -53520 -398354 -795560 -774118 -383828 -116702
29534 -116702 -116690 -49266 253433 547045 623047 543186 370574 95651 -118597 -62381 73693
29523 73693 -153377 -714646 -1022954 -780080 -418244 -384685 -450899 -174308 314539 512317
29513 512317 321086 104843 55735 -13632 -231608 -427994 -415538 -238746 -107725 -272657
29503 -272657 -860036 -1574160 -1732350 -993070 69830 580231 463295 394861 684133 888965
29493 888965 690300 421084 364477 201143 -304681 -648042 -321986 195239 15467 -780057
29483 -780057 -1180261 -702608 -29925 38523 -386154 -667726 -565497 -340510 -241311 -284820
29473 -284820 -411860 -567473 -682929 -736670 -768286 -777464 -740738 -738942 -862665 -983427 -884008
29462 -884008 -630826 -483584 -396255 -38989 544260 787163 403464 -103385 -137171 149750
29452 149750 193690 -79519 -241090 -105041 61973 65573 34827 77107 71338 -90451 -333659
29441 -333659 -525810 -551683 -307109 127193 390581 223989 -150927 -367510 -484130 -781364
29431 -781364 -1122896 -1086764 -708229 -466895 -456577 -233575 313053 628150 371209 -14236
29421 -14236 -75712 -102226 -500533 -918483 -733239 -120555 131622 -221309 -613967 -588173
29411 -588173 -354206 -304070 -473660 -679160 -817142 -858434 -803653 -734890 -700514 -564761
29401 -564761 -219014 137695 249718 240894 398126 587021 369811 -261601 -762647 -760617
29391 -760617 -454671 -162708 74716 258189 245453 48456 -69541 -31377 -113083 -450205
29381 -450205 -780340 -939661 -1175714 -1611947 -1835072 -1492554 -960571 -878010 -1245651 -1533590
29371 -1533590 -1523479 -1468792 -1477771 -1327760 -984546 -794939 -962639 -1203026 -1128531 -714114
29361 -714114 -211855 172369 355854 315749 119536 -67775 -105307 37036 306879 591604
29351 591604 742062 693770 533319 340735 60492 -315036 -561052 -464789 -174843 -32458
29341 -32458 -104105 -182637 -225800 -431709 -814730 -1071636 -1033261 -943583 -1070607 -1274413 -1209171
29330 -1209171 -803268 -308277 34819 175526 159744 41613 -111177 -243037 -354888 -475133
29320 -475133 -606970 -723641 -772692 -702491 -576425 -616328 -940042 -1240168 -987127 -102893
29310 -102893 790762 1042847 755474 600497 896884 1212510 1008111 388822 -64045 -77972
29300 -77972 28342 -117293 -433715 -597749 -525328 -366437 -173777 74013 178619 -131188
29290 -131188 -677465 -870248 -471011 40949 131977 -99858 -254380 -324092 -571981 -911077
29280 -911077 -962005 -702736 -549202 -710957 -903599 -826765 -560111 -347628 -296587 -403011
29270 -403011 -594770 -671908 -489429 -244386 -266667 -507311 -618037 -563258 -669832 -955903
29260 -955903 -948429 -417998 197928 423683 347355 242838 46191 -336540 -590826 -400560
29250 -400560 -26096 50069 -139394 -164103 108358 424072 618976 698281 552790 96104
29240 96104 -386183 -512929 -376562 -356924 -456948 -387343 -261176 -533534 -1156889 -1480726
29230 -1480726 -1226153 -917757 -1001068 -1129645 -809987 -262837 -54300 -199250 -249906 -92328
29220 -92328 -32778 -129626 -38616 352146 642309 522647 274158 327162 557957 425873
29210 425873 -216859 -816965 -798867 -351710 -266045 -978271 -1999652 -2422836 -1868537 -785050
29200 -785050 85829 336716 40042 -467393 -837732 -899344 -718576 -457657 -188253 77031
29190 77031 243290 212835 86137 55262 65200 -164751 -681783 -1112016 -1109441 -802817 -594861
29179 -594861 -656164 -817300 -852548 -674964 -342703 -61970 -85930 -395825 -574974 -265386
29169 -265386 297121 508188 181832 -207654 -188878 109090 247278 115435 -49533 -154552
29159 -154552 -371522 -729790 -937560 -782658 -469696 -345187 -454394 -596545 -684989 -780044
29149 -780044 -836325 -722879 -508881 -439860 -561365 -632771 -504892 -307481 -141316 102474
29139 102474 410761 454850 54550 -401047 -385111 53133 394935 384321 247146 211195
29129 211195 239662 298085 469464 668179 606199 221853 -174342 -367682 -548402 -931147
29119 -931147 -1345454 -1479703 -1325449 -1108234 -940048 -800408 -721677 -727911 -695127 -527126
29109 -527126 -384649 -484923 -734137 -818026 -637800 -410267 -316072 -274598 -139498 48056
29099 48056 100987 -85426 -394776 -570274 -475454 -293695 -359884 -730823 -1069991 -1077672 -868924
29088 -868924 -735123 -692980 -556519 -368772 -413435 -755447 -1083007 -1129054 -990849 -862216
29078 -862216 -678639 -295161 94718 37414 -586843 -1237149 -1174071 -259079 826061 1248574
29068 1248574 876690 353608 308799 645749 742428 266399 -418429 -703517 -439964 -71276
29058 -71276 -111685 -600148 -1103372 -1205901 -917115 -557878 -318937 -72728 344165 810601
29048 810601 1022317 850572 448333 9005 -422461 -844624 -1148583 -1208699 -1077653 -953318
29038 -953318 -927406 -887426 -752055 -701696 -994190 -1544714 -1892074 -1713043 -1232254 -938544
29028 -938544 -974135 -1019613 -767092 -282269 152051 351249 298406 69560 -187728 -312173
29018 -312173 -270775 -175808 -123032 -122452 -210245 -457552 -797162 -1017538 -1034035 -1001083 -1036703
29007 -1036703 -1009612 -761159 -390851 -132358 -43926 4929 113806 268893 408876 442468
28997 442468 280042 -26948 -262089 -277819 -166476 -99153 -109663 -143610 -186998 -228022 -225737
28986 -225737 -214290 -272096 -317518 -194727 -67028 -353964 -1040664 -1456674 -1140756 -572493
28976 -572493 -519304 -913278 -991794 -428609 320101 793510 1010775 1069601 864577 436433
28966 436433 122811 121005 276205 443948 630369 650636 191736 -549848 -853395 -446122
28956 -446122 27468 -71808 -484428 -603507 -462461 -498664 -635792 -372216 280171 663339
28946 663339 408012 -60127 -153057 157258 462447 460724 180722 -137613 -249830 -124545
28936 -124545 3898 -77951 -267933 -305028 -128656 141406 469144 847245 1072768 946449
28926 946449 666049 629370 820243 795009 360760 -143851 -389854 -479174 -606904 -667234
28916 -667234 -496013 -239776 -164778 -263146 -319332 -246964 -133913 -55602 -29285 -54005 -53846
28905 -53846 88822 319812 403660 259090 95447 60541 6717 -179407 -298439 -199034
28895 -199034 -156439 -485124 -957360 -1069947 -797864 -597574 -667898 -710538 -529603 -389449
28885 -389449 -551291 -833353 -904730 -741623 -538128 -394181 -338740 -460158 -751028 -969204
28875 -969204 -896942 -638205 -466590 -486917 -612694 -734265 -726754 -461430 -41826 131998
28865 131998 -178633 -640945 -708769 -332108 3179 -70692 -418924 -693811 -695522 -375914
28855 -375914 193461 690240 642500 -82463 -995948 -1396118 -1042911 -335121 135346 123476
28845 123476 -132886 -233311 -42683 217143 292449 204114 144441 187655 268024 360806 477699
28834 477699 528223 410251 223511 162935 196061 86524 -234859 -559659 -695420 -631939
28824 -631939 -394130 -11194 312021 293920 -50050 -400850 -582922 -720124 -871642 -881484
28814 -881484 -732967 -671445 -783732 -840120 -764168 -821089 -1058487 -1046571 -581651 -171776
28804 -171776 -287669 -554919 -344820 170748 314680 36077 -94242 41624 -74854 -570811
28794 -570811 -825302 -474364 -43914 -124539 -494980 -580431 -345236 -201473 -334762 -616601
$$ [...]
##END NTUPLES=NMR SPECTRUM
##END=
