##TITLE=31Pdec_LY-TMF-7.100+TMF
 D2O, 24 sc
 4.3.2020
##JCAMPDX= 6.0         $$ Bruker NMR JCAMP-DX V2.0
##DATA TYPE= NMR SPECTRUM
##DATA CLASS= NTUPLES
##ORIGIN= UXNMR, Bruker Analytische Messtechnik GmbH
##OWNER= root
$$ XWIN-NMR		Version 3.5
$$ Wed Mar  4 13:53:38 2020 Russian Standard Time (UT+4h)  she@DPX200
##.OBSERVE FREQUENCY= 81.013821
##.OBSERVE NUCLEUS= ^31P
##.ACQUISITION MODE= SIMULTANEOUS
##.ACQUISITION SCHEME= undefined
##.AVERAGES= 24
##.DIGITISER RES= 17
##SPECTROMETER/DATA SYSTEM= spect
##.PULSE SEQUENCE= zgpg30
##.SOLVENT NAME= D2O
##.SHIFT REFERENCE= (INTERNAL, D2O, 0, 182.463)
##AUDIT TRAIL= $$ (NUMBER, WHEN, WHO, WHERE, WHAT)
$$ ##TITLE= Audit trail, XWIN-NMR		Version 3.5
$$ ##JCAMPDX= 5.01
$$ ##ORIGIN= Bruker BioSpin GmbH
$$ ##OWNER= she
$$ F:/spectra/data/she/nmr/P31/1/pdata/1/auditp.txt
$$ ##AUDIT TRAIL=  $$ (NUMBER, WHEN, WHO, WHERE, WHAT)
(   1,<2020-03-04 13:52:17.17 +0400>,<she>,<DPX200>,
      <created by zg, POWCHK disabled, PULCHK disabled
       configuration hash MD5:
       00 E9 B6 7A A2 85 ED C7 34 08 36 98 17 FE 4E 26
       data hash MD5: 32K
       BA DE EB 76 13 2B AF D4 9C AA 35 98 11 F7 9D CF>)
(   2,<2020-03-04 13:52:23.03 +0400>,<she>,<DPX200>,
      <Start of raw data processing
       efp BC_mod = 2 LB = 1 FT_mod = 6 PKNL = 1 PHC0 = -1336.011 PHC1 = 126.4017 SI = 64K 
       data hash MD5: 64K
       F6 CB B4 52 1C 26 51 EF 38 B2 67 52 43 15 6E 11>)
(   3,<2020-03-04 13:53:05.78 +0400>,<she>,<DPX200>,
      <pk PHC0 = 10.91582 PHC1 = -52.6 
       data hash MD5: 64K
       E5 D9 F1 C1 09 94 4C 40 57 DC 62 50 9D 70 86 95>)
$$ ##END=
$$ 
$$ hash MD5
$$ F5 B9 33 8F AC 98 F0 E9 62 16 06 10 17 76 39 FC
##$RELAX= 
##$RELAX= 
##$RELAX= 
##$RELAX= 
##$RELAX= 
##$RELAX= 
##$RELAX= 
##$RELAX= 
$$ Bruker specific parameters
$$ --------------------------
##$DU= <F:/spectra>
##$EXPNO= 1
##$NAME= <P31>
##$PROCNO= 1
##$TYPE= <nmr>
##$USER= <she>
##$AMP= (0..31)
100 100 100 100 100 100 100 100 100 100 100 100 100 100 100 100 100 100 
100 100 100 100 100 100 100 100 100 100 100 100 100 100 
##$AQSEQ= 0
##$AQ_mod= 1
##$AUNM= <au_zg>
##$AUTOPOS= <>
##$BF1= 81.014009
##$BF2= 200.13
##$BF3= 200.13
##$BF4= 200.13
##$BF5= 200.13
##$BF6= 200.13
##$BF7= 200.13
##$BF8= 200.13
##$BYTORDA= 1
##$CFDGTYP= 0
##$CFRGTYP= 5
##$CHEMSTR= <none>
##$CNST= (0..31)
1 1 145 1 1 1 1 1 1 1 1 1 1 1 1 1 1 1 1 1 1 1 1 1 1 1 1 1 1 1 1 1 
##$CPDPRG= <waltz16>
##$CPDPRG1= <>
##$CPDPRG2= <waltz16>
##$CPDPRG3= <>
##$CPDPRG4= <mlev>
##$CPDPRG5= <mlev>
##$CPDPRG6= <mlev>
##$CPDPRG7= <mlev>
##$CPDPRG8= <mlev>
##$CPDPRGB= <>
##$CPDPRGT= <>
##$D= (0..31)
0 1 0 0 0 0 0 0 0 0 0 0.03 2e-05 3e-06 0 0 0 0 0 0 0 0 0 0 0 0 0 0 0 0 
0 0 
##$DATE= 1583315536
##$DBL= (0..7)
120 120 120 11 120 120 24 19 
##$DBP= (0..7)
150 150 150 150 150 150 150 150 
##$DBP07= 0
##$DBPNAM0= <>
##$DBPNAM1= <>
##$DBPNAM2= <>
##$DBPNAM3= <>
##$DBPNAM4= <>
##$DBPNAM5= <>
##$DBPNAM6= <>
##$DBPNAM7= <>
##$DBPOAL= (0..7)
0.5 0.5 0.5 0.5 0.5 0.5 0.5 0.5 
##$DBPOFFS= (0..7)
$$ [...]
##$SUBNAM2= <"">
##$SUBNAM3= <"">
##$SUBNAM4= <"">
##$SUBNAM5= <"">
##$SUBNAM6= <"">
##$SUBNAM7= <"">
##$SUBNAM8= <"">
##$SUBNAM9= <"">
##$SW= 369.568048894756
##$SWIBOX= (0..15)
0 1 3 0 0 0 0 0 0 0 0 0 0 0 0 0 
##$SW_h= 29940.119760479
##$TD= 32768
##$TD0= 1
##$TE= 0
##$TE2= 300
##$TE3= 300
##$TEG= 300
##$TL= (0..7)
0 120 53 12 22 120 120 120 
##$TP= (0..7)
150 150 150 150 150 150 150 150 
##$TP07= 0
##$TPNAME0= <>
##$TPNAME1= <>
##$TPNAME2= <>
##$TPNAME3= <>
##$TPNAME4= <>
##$TPNAME5= <>
##$TPNAME6= <>
##$TPNAME7= <>
##$TPOAL= (0..7)
0.5 0.5 0.5 0.5 0.5 0.5 0.5 0.5 
##$TPOFFS= (0..7)
0 0 0 0 0 0 0 0 
##$TUNHIN= 0
##$TUNHOUT= 0
##$TUNXOUT= 0
##$USERA1= <user>
##$USERA2= <user>
##$USERA3= <user>
##$USERA4= <user>
##$USERA5= <user>
##$V9= 5
##$VALIST= <valist>
##$VCLIST= <CCCCCCCCCCCCCCC>
##$VD= 0
##$VDLIST= <DDDDDDDDDDDDDDD>
##$VPLIST= <PPPPPPPPPPPPPPP>
##$VTLIST= <TTTTTTTTTTTTTTT>
##$WBST= 1024
##$WBSW= 4
##$XGAIN= (0..3)
0 0 0 0 
##$XL= 0
##$YL= 0
##$YMAX_a= 45410
##$YMIN_a= -49377
##$ZGOPTNS= <>
##$ZL1= 120
##$ZL2= 120
##$ZL3= 120
##$ZL4= 120
##$ABSF1= 0
##$ABSF2= 0
##$ABSG= 0
##$ABSL= 0
##$ALPHA= 0
##$AQORDER= 0
##$ASSFAC= 0
##$ASSFACI= 0
##$ASSFACX= 0
##$ASSWID= 0
##$AUNMP= <proc_1d>
##$AZFE= 0.1
##$AZFW= 0.5
##$BCFW= 0
##$BC_mod= 2
##$BYTORDP= 0
##$COROFFS= 0
##$CY= -3
##$DATMOD= 1
##$DC= 0
##$DFILT= <>
##$DTYPP= 0
##$F1P= 0
##$F2P= 0
##$FCOR= 1
##$FTSIZE= 65536
##$FT_mod= 6
##$GAMMA= 0
##$GB= 0
##$INTBC= 1
##$INTSCL= 5.30512e-09
##$ISEN= 30
##$LB= 1
##$LEV0= 0
##$LPBIN= 0
##$MAXI= 10000
##$MC2= 0
##$MEAN= 0
##$ME_mod= 0
##$MI= 50
##$NCOEF= 0
##$NC_proc= -2
##$NLEV= 6
##$NOISF1= 182.463
##$NOISF2= 159.3651
##$NSP= 0
##$NTH_PI= 0
##$NZP= 0
##$OFFSET= 182.463
##$PC= 4
##$PHC0= -1325.095
##$PHC1= 73.8017
##$PH_mod= 1
##$PKNL= yes
##$PPARMOD= 0
##$PSCAL= 0
##$PSIGN= 0
##$REVERSE= no
##$SF= 81.0140089999434
##$SI= 65536
##$SIGF1= 159.3651
##$SIGF2= -187.1042
##$SINO= 113.3802
##$SIOLD= 16384
##$SREGLST= <1H.CDCl3>
##$SSB= 0
##$STSI= 65536
##$STSR= 0
##$SW_p= 29940.119760479
##$SYMM= 0
##$S_DEV= 0
##$TDeff= 32768
##$TDoff= 0
##$TI= <>
##$TILT= no
##$TM1= 0
##$TM2= 0
##$TOPLEV= 0
##$USERP1= <user>
##$USERP2= <user>
##$USERP3= <user>
##$USERP4= <user>
##$USERP5= <user>
##$WDW= 1
##$XDIM= 65536
##$YMAX_p= 351302874
##$YMIN_p= -1751205
$$ End of Bruker specific parameters
$$ ---------------------------------
##NTUPLES= NMR SPECTRUM
##VAR_NAME=  FREQUENCY,     SPECTRUM/REAL,   SPECTRUM/IMAG
##SYMBOL=    X,             R,               I
##VAR_TYPE=  INDEPENDENT,   DEPENDENT,       DEPENDENT
##VAR_FORM=  AFFN,          ASDF,            ASDF
##VAR_DIM=   65536,         65536,           65536
##UNITS=     HZ,            ARBITRARY UNITS, ARBITRARY UNITS
##FACTOR=    0.456856943014862, 1,           1
##FIRST=     14782.0589164792, 0,            0
##LAST=      -15158.0608439998, 0,           0
##MIN=       -15158.0608439998, -1751205,    0
##MAX=       14782.0589164792, 351302874,    0
$$ Real data points
##PAGE= N=1
##DATA TABLE= (X++(R..R)), XYDATA
$$ [...]
37195a3212J04183N5184o062k1321j0607j6854l6614l2648J3213P1266Q0527J2749
$$ -13212 90971 146155 140093 118772 108165 91311 54697 22049 35262 106528 187055 199804
37183A99804p3406q6483k6434R056k7264n8369j2014O0632P4955M6403L7806L5398
$$ 199804 126398 39915 13481 22537 -4727 -63096 -75110 -14478 60477 106880 144686 180084
37171A80084j4888r0139j15632p9252k6624K8879R8814J50037J34480O7769O8
$$ 180084 165196 75057 -40575 -119827 -146451 -117572 -18758 131279 265759 333528 333596
37160C33596n8613j06856r5871j218R3874Q9035J423q5727j51662k00744j65141
$$ 333596 274983 168127 72256 71038 164912 253947 255370 169643 17981 -182763 -347904
37149c47904k4J67380J60270J4651n7842J5595P3592q782j24887j05335M4718
$$ -347904 -347928 -180548 -20278 -5627 -63469 -47874 25718 16936 -107951 -213286 -168568
37138a68568J79388J97992J09922k0146j13598j11848l4176K8025J5109l4451
$$ -168568 10820 208812 318734 298588 184990 73142 38966 66991 82100 47649
37128D7649m8533j4849J8752J0833k7335m1377N897P5656Q7426L1094j2761j028
$$ 47649 -884 -15733 3019 13852 -13483 -54860 -48963 26693 114119 145213 132452 131424
37116A31424L802m0369n7381J0087N8370k8142j52796j19874N3680J42877N0827
$$ 131424 135226 94857 37476 47563 105933 77791 -75005 -194879 -141199 1678 52505
37105E2505n9942l4161O0969Q6022M4438K4192L0540M491n0795o9865k6735L3597
$$ 52505 -7437 -41598 19371 105393 149831 174023 204563 209054 158259 88394 61659 95256
37093I5256N2136J0762m9466n8120K404N8104L8880j7531l3283k0072l1464k8100
$$ 95256 147392 158154 108688 50568 52972 111076 149956 132425 99142 79070 47606 19506
37081A9506N9311J53526J00166o9584j40623l3366P3304K7419p6337q6533l3376
$$ 19506 78817 232343 332509 262925 122302 88936 162240 189659 113322 26789 -6587
37070f587k1394k5702K7371Q1307L4067o7181q8595k1340K7702K1046J3890J8331
$$ -6587 -27981 -53683 -26312 54995 89062 21881 -66714 -88054 -60352 -39306 -25416 -7085
37058g085m770l0137R854Q5554R0061J0953m6880k8272P422J3847K3700M6331
$$ -7085 -11855 -41992 -32138 53416 143477 154430 107550 79278 86700 100547 124247 170578
37046A70578K2749n4389q6345j5128O7449N2708j6778k4011K5321J2446r1776
$$ 170578 193327 138938 52593 37465 104914 157622 140844 116833 142154 154600 62824
37035F2824j62915j05587O022M7986K8973M5885R8477P9345l7099j23014p8242
$$ 62824 -100091 -205678 -199656 -151670 -122697 -76812 21665 101010 63911 -59103 -137345
37024a37345J9559M0358j006M399N7445M5376n7163j23930o5063L6193N2632o199
$$ -137345 -117786 -77428 -78434 -74035 -16590 28786 -28377 -152307 -217370 -181177 -128545 -134744
37012a34744l4813m06K7242r38m4747m3119O435O0536Q6414P8439L7645l0400
$$ -134744 -169557 -169963 -142721 -143659 -188406 -231525 -225090 -164554 -78140 299 37944 7544
37000G544r1451r0266j7286N0007K6293n9721r0240k6596K9605l488n1903k392
$$ 7544 -83907 -174173 -191459 -141452 -115159 -174880 -265120 -291716 -262111 -265599 -317502 -319894
36988c19894J09535J46966P5341m706k2722j7641l6685o3209p3671p4431n2638
$$ -319894 -210359 -63393 11948 7242 -15480 -33121 -69806 -133015 -206686 -281117 -333755
36977c33755K5360J35487J90506J43481L7325o0209j07081p5898K3844J06994
$$ -333755 -308395 -172908 17598 161079 198404 138195 31114 -44784 -20940 86054
36967H6054Q3500j9445q5522o2520m191L3421M0162O300n9981p9900N613J03546
$$ 86054 169554 150109 64587 2067 -2124 31297 71459 77759 17778 -62122 -56509 47037
36955D7037P3885l9029n6751L7951O2544n3442j36158n3099P1479P1300n582k1111
$$ 47037 120922 81893 25142 63093 125637 72195 -63963 -117062 -45583 25717 20135 -976
36943i76J7261K2093P663K6980K8446m2199q5500J2693J53253J37911k5154j29995
$$ -976 16285 38378 46041 73021 101467 59268 -26232 -13539 139714 277625 252471 122476
36931A22476p9481P716J6504j4458j2552K951j5468n1942o0210k7376K8835P9635
$$ 122476 42995 50711 67215 52757 40205 43156 27688 -24254 -84464 -111840 -83005 -3370
36919c370R2812O4713L4882K5342l347p9372j46787j38962q1774m0736j0656M5223
$$ -3370 89442 154155 189037 214379 211032 131660 -15127 -154089 -235863 -276599 -287255 -242032
36907b42032Q8680N3983k2191l5515K9306Q5548Q3140N1671O794o9622j40672
$$ -242032 -153352 -99369 -121560 -157075 -127769 -42221 40919 92590 99384 29762 -110910
36896a10910j19778j009J09246J29483R2559O2210L7322j1435o5828p4571k1130
$$ -110910 -230688 -231697 -122451 7032 99591 161801 199123 187688 121860 47289 26159
36885B6159N1267P3147J0160q9992j30094p3072P111K3403r485j3455L1146P0498
$$ 26159 77426 150573 160733 70741 -59353 -132425 -125314 -101911 -111396 -124851 -93705 -23207
36873b3207O5859K9525j6742n5722n6741n900N0982N2255K973l4299k0588L0235
$$ -23207 42652 72177 55435 -287 -57028 -62928 -11946 40309 43282 8983 -11605 18630
36861A8630Q2534R5731M1441m6029p4664r138O2270M3843l2003p0691p0652j01803
$$ 18630 101164 196895 238336 192307 117643 108505 170775 214618 182615 111924 41272 -60531
36849f0531j52878j24474J1448J49904J80765J00586k2193j16361j22664k1038
$$ -60531 -213409 -337883 -326435 -176531 4234 104820 82627 -33734 -156398 -177436
36839a77436J18459J74844J06846q60n1680m9666n8901q9476q1602k694Q6355
$$ -177436 -58977 115867 222713 221853 170173 120507 61606 -27870 -109472 -112166 -25811
36828b5811R5534K2063m3966m4139k4374l5633k8206N4597J25087M5540j23758
$$ -25811 69723 91786 47820 3681 -20693 -56326 -84532 -29935 95152 140692 16934
36817A6934j48889L9263K02858J16213j13625k07310r7548L0175L7104j1184o92
$$ 16934 -131955 -92692 110166 226379 112754 -94556 -192104 -161929 -124825 -136009 -136701
36806a36701O5321J08356R2911N1248K7327K0211j8969j13543j91915j57669l7802
$$ -136701 -71380 36976 129887 181135 208462 228673 209704 96161 -95754 -253423 -291225
36795b91225L3920J1495m14O7857J29828R1619m42o1137r6322j21611p5454N6428
$$ -291225 -257305 -245810 -246224 -178367 -48539 43080 42638 -18499 -114821 -236432 -311886 -255458
36783b55458J48266J08669L4374M1128O3397n109r1244o3086K9164M4475j009
$$ -255458 -107192 1477 35851 76979 140376 135267 44023 -19063 10101 54576 53567
36772E3567N674M2410Q707n1747k4651L3620j9561j28481j06474L0652P5341j9895
$$ 53567 59241 101651 110358 58611 33960 67580 48019 -80462 -186936 -156284 -80943 -100838
36760a00838p9233k3152K5107O573K6742J09402J14247M901m8981L6655R5539
$$ -100838 -180071 -203223 -178116 -171543 -144801 -35399 78848 83749 34768 71423 166962
36749A66962j4113j68217j72143m1489O6533Q2679N2703K6947K7204N1919N4363
$$ 166962 152849 -15368 -187511 -229000 -162467 -79788 -27085 -138 27066 78985 133348
36738A33348q718q7808r8976o2543n3222l9384N5393J55454J08701m6474j18671
$$ 133348 124630 36822 -62154 -124697 -177919 -217303 -161910 -6456 102245 55771 -62900
36727f2900p1411m3945n5854K0228J52894J38446k4377p6562N9920J20203n0126
$$ -62900 -134311 -178256 -234110 -213882 -60988 77458 53081 -23481 36439 156642 106516
36716A06516k10036j20880O6796R0573j0258l9144Q479J9779J3183M6744L6791
$$ 106516 -103520 -224400 -157604 -67031 -77289 -116433 -107954 -88175 -74992 -28248 8543
36705H543p7875j45086k6056J35037J22492j0833o8866l8551k9638k1319N9852
$$ 8543 -69332 -214418 -240474 -105437 17055 6222 -62644 -101195 -130833 -152152 -92300
36694i2300J26498O3509l5559k6279J4636n1253j25878m3416Q4647L4510j14086
$$ -92300 34198 97707 62148 35869 50505 -748 -126626 -170042 -85395 -50885 -164971
36683a64971r2829Q2461J36523J6463m1235M2342O1767o6365j35246k2104R0609
$$ -164971 -257800 -175339 -38816 -22353 -63588 -21246 40521 -25844 -161090 -183194 -92585
36672i2585L3559q1521q5646j5360J6964J8366K2145k2540j13349j08997N9995
$$ -92585 -59026 -140547 -226193 -241553 -224589 -206223 -184078 -206618 -319967 -428964 -368969
36661c68969K28904K02654K1777j09321q0594M5008J41549J24196N128j01156
$$ -368969 -140065 62589 84366 -24955 -105549 -60541 81008 205204 210332 109176
36651A09176r5559l5297n6653j51307j65639n3063M3444K9333Q155Q6450J79560
$$ 109176 13617 -21680 -78333 -229640 -395279 -448342 -404898 -375565 -367410 -280960 -101400
36640a01400J49815K8093m6195l3830j1197k1095k6959N37M2225P2546Q1811O1332
$$ -101400 48415 76508 30313 -3517 -14714 -35809 -62768 -62231 -20006 52540 134351 195683
36628A95683R396n0949q3259o4303k025N7493N9905R403k2477N631L9937J9229
$$ 195683 205079 154130 70871 6568 4543 62036 121941 131344 108867 114498 154435 173664
36616A73664k4105k7250q240j7871k9130J2192O6150N2538m611j8166K566k2739
$$ 173664 149559 122309 114069 96198 67068 79260 145410 197948 193337 175171 177737 154998
36604A54998p8568p0363o433M819m2210k5620P8715J18615m906j72256k09158
$$ 154998 76430 6067 -366 4453 -37757 -63377 15338 133953 129047 -43209 -252367
36593b52367j09015L935N0172M2317J5599o909o113K5321P6605J26633J38735
$$ -252367 -361382 -357447 -307275 -264958 -249359 -256268 -262381 -237060 -160455 -33822 104913
36582A04913P5457l5912r4879n2320N643j7050p5167o4366L117L4639J8721R220
$$ 104913 180370 144458 49579 -2741 2902 -14148 -89315 -153681 -150564 -115925 -97204 -87984
36570h7984k872m6414n0751N1385J48727Q6333n7398o3964O4110R8758k6480j05315
$$ -87984 -90856 -137270 -188021 -136636 12091 98424 41026 -22938 41172 139930 113450 8135
36558H135j8787O8775J1097p0405j7974Q4679O8355l8797q5095m4458p095K182
$$ 8135 -10652 58123 69220 -1185 -19159 65520 133875 95078 9983 -34475 -41570 -39388
36546c9388L0295O9619O2360J752o5250j00405q0482k581P1682O1280o143j6186
$$ -39388 -9093 60526 122886 124638 59388 -41017 -121499 -124080 -52398 8882 2739 -13447
36534a3447M6247O4677q381p1518o0031m4911o1692j9191J07753J73619R1189
$$ -13447 32800 97477 89096 17578 -42453 -87364 -149056 -168247 -60494 113125 204314
36523B04314m831J6686N9495j1535j11536q4360J2625J1728o3423m8926N2938
$$ 204314 199483 216169 275664 264129 152593 68233 80858 92586 29163 -19763 33175
36512C3175O9008m2831j20844o9305K153j9512p2637l7902P5330J49830J14027
$$ 33175 102183 59352 -61492 -130797 -128644 -148156 -220793 -258695 -183365 -33535 80492
36501H0492J6286l5325P583O9620L9416o5887j01582q172P7381J7733j09517j24095
$$ 80492 96778 61453 69036 138656 178072 112185 10603 2431 79812 97545 -11972 -136067
36489a36067p801Q9414P6966J3206k6427l8288l4439r386J7706J6512Q899L5265
$$ -136067 -143868 -54454 22512 35718 9291 -28997 -63436 -72822 -55116 -38604 -29705 5560
36477E560O1617J5926p7394j00251n389J06176J11142P536j02060j27905o6308
$$ 5560 67177 83103 5709 -94542 -99931 6245 117387 124923 22863 -105042 -171350
36466a71350J5279M6415J9036j4147j1256J1053J5453k932k5847m3785n2765m6828
$$ -171350 -156071 -109656 -90620 -104767 -116023 -104970 -89517 -92449 -118296 -162081 -214846 -261674
36454b61674l1133j1177L4602J20313J88803J57493M5105l2477k2374K665j6720
$$ -261674 -292807 -303984 -269382 -149069 39734 197227 242332 209855 187481 190146 173426
36443A73426l1384L087K1373m3210j23772j07019p884N2681K2772k4150p759N7433
$$ 173426 142042 145129 166502 123292 -480 -107499 -115383 -62702 -39930 -64080 -71839 -14406
36431a4406R2755M9743l5403p6941m1142M209j7985p9907r6590n9455k4591P683
$$ -14406 78349 128092 92689 15748 -25394 -21185 -39170 -119077 -215667 -275122 -299713 -292030
36419b92030P4852J25754O5859n8533q8257L799P1241M4834L1973R3190J23685
$$ -292030 -217178 -91424 -25565 -84098 -172355 -168556 -97315 -52481 -20508 72682 196367
36408A96367O3342K0734N4632L6492j02679j87760p0120R0195N4326j14473j55623
$$ 196367 259709 280443 335075 371567 268888 81128 11008 101203 155529 41056 -114567
36397a14567j1867J24680J21470L4213m9320r5327p2637J0714M7494l3542j21016
$$ -114567 -126434 -1754 119716 153929 104609 9282 -63355 -52641 -5147 -38689 -159705
36386a59705p2457N3280R7398O4162P3074J08167N1884o0103o5940L4492O0620
$$ -159705 -232162 -178882 -81484 -17322 55752 163919 215803 155700 89760 124252 184872
36375A84872m4925j23013o9235J1846M617m9060p0162p3203q0863m1008P2200
$$ 184872 139947 16934 -52301 -40455 -35838 -84898 -155060 -228263 -309126 -350134 -277934
36364b77934J73632J69555P5709k1166n7641k1001M9989P5584J4552o5242o7393
$$ -277934 -104302 65253 140962 119796 62155 41154 91143 166727 181279 116037 48644
36353D8644m121L2068J4034k892L496l757l0999l6602j1520K240k2288o8856j00396
$$ 48644 44523 76591 90625 87733 91229 87472 56473 19871 8351 10591 -11697 -80553 -180949
36340a80949p2295K5805J09185P2910k8528j6340J21794J57595k6596k08818j49678
$$ -180949 -253244 -227439 -118254 -45344 -73872 -90212 31582 189177 162581 -46237 -195915
36329a95915L8040R2104J4996p571K5825k2068r8496l2854J01461O3777j13114
$$ -195915 -157875 -65771 -50775 -58346 -32521 -54589 -153085 -185939 -84478 -20701 -133815
36318a33815j34144N9305J79585P8202k8022L5916J15498M2820o2363l6974K9519
$$ -133815 -267959 -208654 -29069 49133 21111 57027 172525 215345 152982 116008 145527
36307A45527j7286j13106j10808l8611p298M103O8941J34898J10171L0710j8206
$$ 145527 128241 15135 -95673 -134284 -141582 -137479 -68538 66360 176531 207241 189035
36296A89035n1121j07419j27071m7467O2987J01129P7675N4584K4546l3010o5802
$$ 189035 137914 30495 -96576 -144043 -81056 20073 97748 152332 176878 143868 78066
36285G8066l2751O064j5448o1756o8201l8364J447N0389P6300K4403n8746m3366
$$ 78066 45315 51379 35931 -25825 -94026 -132390 -130943 -80554 -4254 20149 -38597 -81963
36273h1963P4825J31859M2205o7930p1191k6096l9306q8508j04570r5913p6182
$$ -81963 -7138 124721 166926 98996 27805 1709 -37597 -126105 -230675 -326588 -402770
36262d02770l003J03485J28023N4659L0312J15128J52636L5922q7263n7804K7605
$$ -402770 -405773 -302288 -174265 -119606 -89294 25834 178470 214392 127129 69325 96930
36251I6930N183o3952l0971M8426K0932o7499n4110K8737K313j25560j51984k0272
$$ 96930 102113 38161 7190 55616 76548 9049 -45061 -16324 -14011 -139571 -291555 -311827
36239c11827Q6978N2303n946M3996J39140J45608N8996k4838n3439m6198l4506
$$ -311827 -224849 -172546 -178492 -134496 4644 150252 209248 184410 130971 84773 50267
36228E0267l6218n5354o9992m6235J7863Q3705J11263Q9784L7877j1996m1094
$$ 50267 14049 -41305 -111297 -157532 -139669 -55964 55299 145083 182960 170964 129870
36217A29870n9305p3138n9309j5553l095n6475q5715J0628J54002J61357K0700
$$ 129870 70565 -2573 -61882 -77435 -80530 -137005 -222720 -212092 -58090 103267 123967
36206A23967q3573n9293k9657q9909j34321n1197P5385J07652O5094M3388L6299
$$ 123967 40394 -18899 -48556 -138465 -272786 -323983 -248598 -140946 -75852 -32464 3835
36195C835r346n5127l6711N967j23k4484P598P3936Q5103J4752p8883j17376m7807
$$ 3835 -5511 -60638 -97349 -91382 -91505 -115989 -108391 -34455 50648 65400 -13483 -130859 -178666
36182a78666R8448J71846N0559j54254j95744l3592J07876Q3601J3024K6371N8204
$$ -178666 -80218 91628 142187 -12067 -207811 -241403 -133527 -49926 -36902 -10531 47673
36171D7673L1857K3293P4315N9258p5913j53106m5497Q5474O0138j6920K5075
$$ 47673 79530 102823 177138 236396 160483 7377 -38120 47354 107492 90572 115647
36160A15647R6697K2251j23022j43240n6059j0937N73O4483R7888j3541j40368
$$ 115647 212344 234595 111573 -31667 -87726 -98663 -98090 -33607 64281 50740 -89628
36149h9628q4009O7983P8892l1130m7622M0616N2960k0428j9861M3012J211j11206
$$ -89628 -173637 -105654 -26762 -57892 -105514 -64898 -11938 -32366 -52227 -9215 -8004 -119210
36137a19210p7906R7015J61298M5256k8401M9852R7638j1807j28449r7054O831
$$ -119210 -197116 -100101 61197 106453 78052 127904 225542 213735 85286 -11768 -4937
36126d937N2799M7462L0755j7831o9637l5996N4232O0243k8376o4427j0298k61
$$ -4937 47862 95324 126079 108248 38611 2615 56847 117090 88714 24287 13989 13728
36114A3728p0968p5902L9258J14897M4123n5607n4681J116K6164L5944N1306L1797
$$ 13728 -57240 -133142 -93884 21013 65136 9529 -45152 -44036 -17872 18072 69378 101175
36102A01175j2059n760L2789M780o4269m3153M4807K8393q8998r1123P3478J64046
$$ 101175 89116 83356 116145 120925 56656 13503 58310 86703 -2295 -93418 -19940 144106
36090A44106L5877j20575j01780K259K2293K053N4345J14299O6339k6490l3806
$$ 144106 179983 59408 -42372 -40113 -17820 -15767 38578 152877 219216 192726 158920
36079A58920J6261J3393l1651l3210K171M116l5013p5335r7102p4823J6423J07871
$$ 158920 175181 188574 156923 123713 125884 130000 94987 19652 -77450 -152273 -135850 -27979
36067b7979Q0782l7462p7656O469O1709N294l5586L0873Q7530L0018l5129J0372
$$ -27979 52803 15341 -62315 -55846 5863 11157 -24429 6444 93974 123992 88863 99235
36055I9235P2906J3781j02211j16912k8536M1497M0962p18o4336j18758r7919
$$ 99235 172141 185922 83711 -33201 -61737 -20240 20722 20004 -44332 -163090 -261009
36044b61009p369M6052J9562P724O6465J07728O3743O256M966K0421K5805O4661
$$ -261009 -268378 -222326 -202764 -195040 -128575 -20847 42896 49152 54118 74539 100344 165005
36032A65005J03858K8353j23812j48002q451O2607n5243j59600p8388L9243J5532
$$ 165005 268863 297216 173404 25402 16951 79558 24315 -135285 -213673 -174430 -158898
36021a58898l4652N0617J48360P1418p4881p6428J3254M132o4574k2627Q2556
$$ -158898 -193550 -142933 5427 76845 1964 -74464 -61210 -57078 -121652 -144279 -61723
36010f1723P3796o877K3442J22492P6513j06481j88050r0378J2443K0340L4328
$$ -61723 12073 5196 28638 151130 227643 121162 -66888 -157266 -144823 -124483 -90155
35999i0155J07970J34524N4914l4971n0080j9567Q669J7087k4793j05305j11038
$$ -90155 17815 152339 207253 172282 122202 102635 111304 128391 103598 -1707 -112745
35988a12745J4182J17261L9021j06587r0805N8229J10239J9731l3134J3969K0287
$$ -112745 -98563 18698 57719 -48868 -139673 -81444 28795 48526 15392 29361 49648
35977D9648o0043q2443J0931P8806L6764r176K0382M7096J9236J7278O8365N4947
$$ 49648 -10395 -92838 -81907 -3101 33663 24487 44869 91965 111201 128479 196844 251791
35965B51791p0055j58369q9272L7732O6344O436l8003m9219o8033o9920l83J09417
$$ 251791 181736 23367 -65905 -28173 38171 44607 6604 -42615 -110648 -180568 -180951 -71534
35953g1534J64383J23655L4779l2098m7023l2907l0022m0243k9777l794j7505
$$ -71534 92849 216504 251283 219185 172162 139255 109233 68990 39213 35419 17914
35942A7914o8908o4213L2747J08137O2277k3766j7216N4402P1205K5927m536k4704
$$ 17914 -50994 -115207 -82460 25677 87954 64188 46972 101374 172579 198506 193970 169266
35930A69266p7976r8345o77J25246J15570k836n6465j1123M597m8755p4908n4855
$$ 169266 91290 -7055 -7732 117514 233084 230248 173783 162660 167257 118502 43594 -11261
35918a1261p2238j00430p059J73310K11733K3875j75941j72660k3165Q3703Q3390
$$ -11261 -83499 -183929 -190988 -17678 194055 217930 41989 -130671 -153836 -70133 13257
35907A3257L3443j8218n0026m2516j8552l0960o5652m6266L6779J01854R9451
$$ 13257 46700 28482 -21544 -64060 -82612 -113572 -179224 -225490 -188711 -86857 12594
35896A2594N5501j1290r4657j27191m2134Q6655J11556K4170m5728m3018l6347
$$ 12594 68095 56805 -37852 -165043 -207177 -120522 -8966 15204 -30524 -73542 -109889
35885a09889n1295k9698K6971M4721K5405M0023O8188K6243m3204j3013Q9029
$$ -109889 -161184 -190882 -163911 -119190 -93785 -53762 14426 40669 -2535 -15548 73481
35874G3481J02454J4725j6467M5254N3420l5055p3750r610R802q1456j35450o6922
$$ 73481 175935 190660 174193 219447 272867 237812 164062 154452 164254 82798 -52652 -119574
35862a19574r559n0305n6603O0547J49704Q0039k1324n226L2506m4531j26583
$$ -119574 -129133 -179438 -236041 -175494 -25790 54249 32925 27699 60205 15674 -110909
35851a10909m1242J16129J13636l9458j10920n381J27143J41171O3596n458j8714
$$ -110909 -152151 -36022 77614 38156 -72764 -78145 48998 190169 253765 248307 229593
35840B29593O491J1576n4063j46133j44713k2764R0922R1486L7222K1071J9374
$$ 229593 236084 247660 193597 47464 -97249 -120013 -29091 62395 99617 120688 140062
35829A40062k0587n3791k4360J6442R02l5898l8314l3007m1853p529P5260Q4221
$$ 140062 119475 65684 41324 57766 58668 22770 -15544 -48551 -90404 -97933 -22673 61548
35817F1548l2596j17377l3643Q8503M4829j02782j14168M7902J64154R7522k9142
$$ 61548 28952 -88425 -122068 -33565 11264 -91518 -205686 -157784 6370 103892 74750
35806G4750n1302J0624L0190k7817q0132n2700K5894O4251K6817j8332n436J7852
$$ 74750 23448 34072 64262 36445 -43687 -96387 -70493 -6242 20575 2243 -3193 14659
35794A4659k3291o7965P748J52551J62962Q3j17508m2936P4339M4911n9605n7718
$$ 14659 -8632 -76597 -68849 83702 246664 246747 129239 86303 160642 205553 145948 88230
35782H8230L1090M7590k5190n7935n964M6004M3446Q484m3528r6829q8758j142
$$ 88230 119320 166910 141720 83785 77821 123825 167271 175755 132227 35398 -53360 -54502
35770e4502O0934J6095m2023P742R6076P3148k9805n2287J9275L8977l7894q6933
$$ -54502 6432 22527 -19496 -11754 84322 157470 127665 75378 94653 133630 95736 8803
35758H803l6798K3895J2023l2219m9298n1745n5380k9138L1571P0128N3979K3386
$$ 8803 -27995 -4100 7923 -24296 -73594 -125339 -180719 -209857 -178286 -108158 -54179 -30793
35746c0793K0390K8710J0277m1667r4092q9500O131J32883J61569M7708q9841
$$ -30793 -10403 18307 28584 -13083 -107175 -196675 -190544 -57661 103908 151616 61775
35735F1775j14662m3376J1018J0873R915L8078P1133R0146Q5845L4506n0746q6597
$$ 61775 -52887 -96263 -85245 -74372 -64457 -26379 44754 134900 220745 255251 204505 117908
35723A17908k5673M6311J5341r3139j46395q0539L8923J09226P5063m2718j40105
$$ 117908 92235 138546 153887 60748 -85647 -166186 -127263 -18037 57026 14308 -125797
35712a25797j01840N4681J68032J30852K2792k7725j8028q632J1987O7434Q1016
$$ -125797 -227637 -172956 -4924 125928 148720 120995 102967 94335 106322 173756 254772
35701B54772k4711j67096j90090q3600J5947K4474j0431j7125J7621O7500R0922
$$ 254772 230061 62965 -127125 -210725 -194778 -170304 -180735 -197860 -180239 -112739 -21817
35690b1817N5635n757j2511M2486O5893J7767j2574L3408O5609k703r8477j10140
$$ -21817 33818 28061 15550 58036 123929 141696 129122 162530 228139 225436 126959 16819
35678A6819n9546k3579O669N0753L9253n5447j03244j785J29802J21714J1395
$$ 16819 -42727 -66306 -59637 -8884 30369 -25078 -128322 -130107 -305 121409 132804
35667A32804n7871q3037j32446j39629j2668J30537R7600n7321j07501j6298L8819
$$ 132804 74933 -8104 -140550 -280179 -292847 -162310 -64710 -122031 -229532 -245830 -207011
35656b07011o180k0117N4395J04581O8108K4290J4823j9171p5920o8702l825J3455
$$ -207011 -213191 -233308 -178913 -74332 -6224 18066 32889 13718 -62202 -130904 -134729 -121274
35644a21274j4342K9949J37751J44765N349j13524r4426k8739k1255k2670L1147
$$ -121274 -135616 -105667 32084 176849 182198 68674 -25752 -54491 -75746 -98416 -67269
35633f7269P5079L2932m4919p0978m7690j8892J2718M6583M7606R020k2376k3073
$$ -67269 7810 40742 -4177 -75155 -122845 -141737 -129019 -82436 -34830 -25810 -48186 -71259
35621g1259k0562k2669l05M5335P7136Q4116P3904K7932m9852q4997l7812L709
$$ -71259 -91821 -114490 -114795 -69460 7676 91792 165696 193628 143776 58779 20967 24676
35609B4676l9286q2862k0722O2071J4759j00931q8123N6719J33950O6971n5K9661
$$ 24676 -14610 -97472 -118194 -56123 -41364 -142295 -230418 -173699 -39749 27222 27167 56828
35597E6828O1344k75r8363j30903p2637M1004J30744R3158n8480j31359n101J39136
$$ 56828 118172 117897 19534 -111369 -184006 -143002 -12258 80900 22420 -108939 -114040 25096
35585B5096O9261j09826j11754N2700J01136k6425p8286M6352J22709Q305j21012
$$ 25096 94357 -15469 -127223 -74523 26613 188 -78098 -31746 90963 99268 -21744
35574b1744r9329k5068j7547k978P7750J07628K0383m8462o166L2690j5773m2914
$$ -21744 -121073 -146141 -163688 -166666 -88916 18712 39095 -9367 -15533 17157 1384 -41530
35562d1530J3426J8262r1987j39886o706J35178J02046j2107m2289k9859o6575
$$ -41530 -28104 -9842 -101829 -241715 -248421 -113243 -11197 -23304 -65593 -95452 -162027
35551a62027p1935L1990J13628M2877o4918n0734J5208k874m4949k227M5375p790
$$ -162027 -233962 -201972 -88344 -45467 -110385 -161119 -145911 -148785 -193734 -195961 -150586 -158376
35539a58376n8748J4150R2626K5998o7845j1166Q0520o522j63497j08952J13107
$$ -158376 -217124 -202974 -110348 -84350 -152195 -163361 -82841 -89363 -252860 -361812 -248705
35528b48705J75901M298j14192j0350J25029R4917p695j5002L4992J0523p3272
$$ -248705 -72804 -68506 -182698 -193048 -68019 26898 19203 4201 39193 49716 -23556
35517b3556r1117n731R1816J04954K8038o0374p8344l0587o39l0700o0420k8521
$$ -23556 -114673 -120404 -28588 76366 104404 44030 -34314 -64901 -65540 -96240 -156660 -185181
35505a85181L1246N6900N1975M5263K8836L918J0592M5994M1367j5405l9039L736
$$ -185181 -153935 -97035 -45060 203 29039 32957 43549 89543 130910 115505 76466 80202
35493H0202K5566k2035n3678o009M9707M9829M7591P4844N1099n2112j17804p7869
$$ 80202 105768 83733 30055 24046 73753 123582 171173 246017 297116 245004 127200 49331
35481D9331l0368l8707j0341Q2137Q3222o2159j43096k1208J02395K1247j07552
$$ 49331 18963 -19744 -30085 52052 135274 73115 -69981 -91189 11206 32453 -75099
35470g5099m1221J11239Q8422n5509p2315J5267j7054j35224q4544J25744J97215
$$ -75099 -116320 -5081 83341 27832 -44483 -29216 -46270 -181494 -266038 -140294 56921
35459E6921M6443o1720K6555J27906Q0587l15J5858M0091l5457j26141j13171
$$ 56921 103364 41644 68199 196105 276692 276377 292235 332326 296869 170728 57557
35448E7557l7994M115J6946L2351J9012l6560p0292l8842J7994N3505N6527J3553
$$ 57557 19563 23678 40624 72975 91987 55427 -14865 -53707 -35713 17792 74319 87872
35436H7872n6969n5534O6581J59936M8176j71216k13612j2012J84434J65604P154
$$ 87872 30903 -24631 41950 201886 250062 78846 -134766 -146778 37656 203260 210414
35425B10414j09663j36257j20119q0428k0283L3223O4124P5706N7547K0580K7640
$$ 210414 100751 -35506 -155625 -236053 -256336 -223113 -158989 -83283 -25736 -5156 22484
35414B2484Q7316Q6039l5948j28021l2840J37016J51158K2743m0705l561k7475
$$ 22484 109800 195839 159891 31870 -970 136046 287204 309947 269242 265681 238206
35403B38206j32446j39920o234P8660J3261n9475k2949K8699n573o2226o6281
$$ 238206 105760 -34160 -40394 38266 51527 -7948 -30897 -2198 -7771 -69997 -136278
35392a36278o4523r2780q3435n502O2977Q0335R7144J10559M4852o8932r2252
$$ -136278 -200801 -293581 -377016 -382518 -319541 -239206 -142062 -31503 13349 -55583 -147835
35381a47835j5126J7826k4275P06J21552J61750M5889n3488j4193L5489k1511
$$ -147835 -162961 -145135 -169410 -168704 -47152 114598 160487 106999 92806 128295 106784
35370A06784o9233K575N7474n3278j91083j23804R5525J95151P2198j03213j50228
$$ 106784 37551 40126 97600 44322 -146761 -270565 -175040 20111 92309 -10904 -161132
35359a61132o8630L2274O7755L0909j6329j3078J8517J4142j2519L046K8205l3171
$$ -161132 -229762 -197488 -129733 -98824 -115153 -128231 -109714 -95572 -108091 -105045 -76840 -110011
35347a10011j32836r2763J03052K27382J29700m5627r3717l0987J0448J4509L3180
$$ -110011 -242847 -335610 -232558 -5176 124524 78897 -14820 -45807 -35359 -20850 12330
35336A2330L4139k4119o5500j6091L9132j0779r6397p4621K5015N2759j342k21
$$ 12330 46469 22350 -43150 -59241 -20109 -30888 -127285 -201906 -176891 -124132 -125474 -125695
35324a25695Q4552J06762o465j06628l3861J30911J63011J1749j20195o0310Q8096
$$ -125695 -41143 65619 59154 -47474 -81335 49576 212587 224336 104141 43831 131927
35313A31927J00213l7744j21490n6747N475n6747j23995n1566O9498P1145O92
$$ 131927 232140 194396 72906 16159 21634 -35113 -159108 -210674 -141176 -70031 -69339
35302f9339K3961J26608J54522R0146M3003J2613q2830j75546j17022L4517P1366
$$ -69339 -45378 81230 235752 325898 368901 381514 298684 123138 6116 40633 111999
35291A11999j6609l5259N9073R6767K5696k559N4805L8296r8871j73836q6669
$$ 111999 95390 60131 119204 215971 241667 239108 293913 332209 233338 59502 -27167
35280b7167K1275L5902L4155O7372M5436m7237q1741l8852o0061j42559q9051
$$ -27167 -5892 30010 64165 131537 176973 129736 47995 9143 -50918 -193477 -282528
35269b82528J12932J90607K8576j18336n1062O1418K4552m4644J0972P1777j0803
$$ -282528 -169596 21011 49587 -68749 -119811 -58393 -33841 -78485 -67513 4264 -6539
35258f539j04107l3635Q8101O8964k2618j1717O7422Q1010N0252M4258j67j07443
$$ -6539 -110646 -144281 -56180 12784 -9834 -21551 45871 126881 177133 221391 221224 113781
35246A13781j14739M6894J39289k8206k42811k01306J4870J09777M6645O839K0466
$$ 113781 -958 45936 185225 157019 -85792 -287098 -272228 -162451 -115806 -108967 -88501
35235h8501j2543m5166L5729J41211J04701j3774l9657J959k5521q1219m4378
$$ -88501 -101044 -146210 -110481 30730 135431 121657 82000 83959 58438 -22781 -67159
35224f7159J5885k6137p2379K7332J50780R2530m5129j9875R8406M1901j59191
$$ -67159 -51274 -77411 -149790 -122458 28322 120852 75723 55848 154254 196155 36964
35213C6964k08313m6172P8644N1124K0183N8894N7322K9J3948R2925Q9165R667
$$ 36964 -171349 -217521 -138877 -87753 -67570 -8676 48646 48675 62623 155548 244713 254380
35201B54380O001N2277k8358j89323j74111L5357J46890L0126r0479m0777L9867
$$ 254380 260381 312658 284300 94977 -79134 -43777 103113 133239 42760 1983 41850
35190D1850K412m6565K3362J14475P7815m2581j11747j03014o1794o00O1742O7619
$$ 41850 44262 -2303 21059 135534 213349 170768 59021 -43993 -105787 -106387 -44645 22974
35178B2974O054o1276r0552p9127j4938Q1374J11880L8133j5792L5067M8464j03034
$$ 22974 29028 -32248 -122800 -201927 -216865 -135491 -23611 14522 -1270 33797 82261 -20773
35166b0773k30611p7806K20804K88624P8617q4006m1489J0478n3845p5752L9604
$$ -20773 -251384 -329190 -108386 180238 258855 174849 133360 143838 89993 14241 53845
35155E3845J12557Q504j22546j10750k5594J779j112L3263O1728M0023J8873K3921
$$ 53845 166402 174906 52360 -58390 -83984 -82205 -83317 -50054 11674 51697 70570 94491
35143I4491J873l8462r643O9846O9453k0991o0943j1932K117n9772q4868l9555
$$ 94491 96364 57902 48259 118105 187558 166567 105624 93692 95809 36037 -48831 -88386
35131h8386k9483o4787j9842J00110J15060j9358j16056o4262K0981M5970P3278
$$ -88386 -117869 -182656 -202498 -102388 12672 -6686 -122742 -187004 -166023 -120053 -46775
35120d6775J18703Q3718j3704j7690O2976K8859j32631j71579q939R9456K772
$$ -46775 71928 155646 141942 124252 187228 216087 83456 -88123 -97062 2394 5166
35109E166r1278j5404N2815n0189j35754Q77J81359J25422q2502j51608m6659
$$ 5166 -86112 -101516 -48701 -98890 -234644 -233767 -52408 73014 -9488 -161096 -207755
35098b07755L6521L1163K4761K0251l9574q0816O194J37009J34076O900q1215
$$ -207755 -171234 -140071 -115310 -95059 -134633 -215449 -209255 -72246 61830 68730 -12485
35087a2485p3982m8617l0352K5682R7716J09939N9893M806l8260o9658m8669L3355
$$ -12485 -86467 -135084 -165436 -139754 -42038 67901 127794 132600 94340 24682 -23987 9368
35075I368R0960N7690j1243l6842l1818l8587m5846l8020k8486M397R0644J48860
$$ 9368 100328 158018 146775 109933 78115 39528 -6318 -44338 -72824 -68427 22217 171077
35063A71077O0800r9713j21526N092M9568o9370j30744N976J43491P8498n8500
$$ 171077 231877 132164 10638 15730 65298 -4072 -134816 -128840 14651 93149 34649
35052C4649m3660O4562N9963n3661j04207m5367K6420O6124Q8236O0273l1735
$$ 34649 -9011 55551 115514 61853 -42354 -87721 -61301 4823 93059 153332 121597
35041A21597r2134m8525J4425l748n2099m2295r733j7469k2239K2180N3804K7752
$$ 121597 29463 -19062 -4637 -8385 -60484 -102779 -112512 -129981 -152220 -130040 -76236 -48484
35029d8484J5741N3928M8324l7219p4956J408N6090n323n6216N976M9476m2151
$$ -48484 -32743 21185 69509 32290 -42666 -41258 14832 9509 -46707 -40731 8745 -33406
35017c3406j19433j7102J29481R3031o7247j14393r937Q4004R3629P9520O1086
$$ -33406 -152839 -169941 -40460 52571 -14676 -129069 -139006 -55002 38627 118147 179233
35006A79233J1590l0828k5746k7168o7334n7765M3842J11545N6511r927R098P434
$$ 179233 190823 159995 134249 107081 39747 -18018 25824 137369 193880 183953 193051 200485
34994B00485r8288j57532l8752R9277N2840q5175j04556l4379l2395o9016k1151
$$ 200485 102197 -55335 -94087 5190 58030 -27145 -131701 -166080 -198475 -267491 -288642
34983b88642N1017K1775k6178N3695J66327J19270k8099o4339J4310M3541O989
$$ -288642 -237625 -215850 -242028 -188333 -22006 97264 69165 4826 19136 62677 69666
34972F9666J5806M9104M863o3721m0689J0757k5334n9004M0041J38606L5662j44880
$$ 69666 85472 134576 139439 75718 35029 45786 20452 -38552 1489 140095 175757 30877
34960C0877j20595O7700J19793k0378j05449k4230O2523M7669O851k3363q8784
$$ 30877 -89718 -22018 97775 77397 -28052 -52282 10241 57910 64761 41398 -47386
34949d7386j24566j7468J34671J23297j6489n6673L0486N2502l2663o2445m168
$$ -47386 -171952 -189420 -54749 68548 52059 -4614 25872 78374 45711 -16734 -20902
34938b0902o220p8305n3305P7518J13733j357q1656k5653M4213M0105L2116M7197
$$ -20902 -27122 -105427 -158732 -81214 32519 31162 -50494 -76147 -31934 8171 40287 87484
34926H7484Q720o5357n7120J8971L2070q07N7299J62028J20465m8498j07134P69
$$ 87484 96204 30847 -26273 -7302 24768 23961 81260 243288 363753 315255 208121 208890
34914B08890O5693q213o4713j9565l348p7826j12152n1575k1738n8802k1597J16020
$$ 208890 274583 266370 201657 182092 178744 100918 -11234 -62809 -84547 -143349 -164946 -48926
34902d8926J69361O2167k9806J6770Q1245M2274k7148l6369l0676n5055o4634
$$ -48926 120435 182602 152796 169566 250811 293085 265937 229568 198892 143837 79203
34891G9203n4819q1068r8196r20J42659J46724K3537l0339J3440j3139j12736
$$ 79203 24384 -56684 -154880 -155800 -13141 133583 157120 126781 140221 127082 14346
34880A4346q0773R5990J57202N379j21609n8722M0511K8458P507O6642Q3256j2834
$$ 14346 -66427 29563 186765 192144 70535 11813 52324 80782 88289 154931 238187 225353
34868B25353o4171K2873Q1358j8230j31417j05496l3485l5725k7834P7448J59280
$$ 225353 161182 184055 265413 247183 115766 10270 -23215 -58940 -86774 -9326 149954
34857A49954R9159M329J2108N3441R358o6724o9527l0320k0748j5089J5567K2800
$$ 149954 249113 253442 265550 318991 328349 261625 192098 161778 141030 125941 141508 164308
34845A64308J982K4134O1769j2948j70561j98794l8001J00852O7519k5617m9039
$$ 164308 166290 190424 252193 239245 68684 -130110 -168111 -67259 260 -25357 -74396
34834g4396m4650m6082J9448J17580P5542r4591j36004L3232J50471M1165r6761
$$ -74396 -119046 -165128 -145680 -28100 47442 -47149 -183153 -149921 550 41715 -55046
34823e5046n8202L1663l081o4117j2220L7064n3407j41002l5802J53171J90677
$$ -55046 -113248 -81585 -84666 -148783 -161003 -123939 -177346 -318348 -354150 -200979 -10302
34812a0302P6968k2112o0251q7936q2782j8012L0351K1910M6145J26850J23501
$$ -10302 66666 44554 -15697 -103633 -186415 -204427 -174076 -152166 -106021 20829 144330
34801A44330j3345j03565k8110O7774M5610R722P0610J12650J8575j00169j14551
$$ 144330 130985 27420 -690 67084 112694 122416 193026 305676 324251 224082 109531
34790A09531r6129j18734q3815M5367R4082j3951o9110N8524J52579K4638j31615
$$ 109531 13402 -105332 -189147 -143780 -49698 -63649 -132759 -74235 78344 102982 -28633
34779b8633p0896Q7063J02550K9198L7919N8802m4045j47882q0464L6338N377
$$ -28633 -99529 -12466 90084 119282 157201 216003 171958 24076 -56388 -20050 -14673
34768a4673p0558O162J27378O2928j06627j20581K0698J04640Q3492O0725J9998
$$ -14673 -85231 -79069 48309 111237 4610 -115971 -95273 9367 92859 153584 173582
34757A73582r1909j33192L3655K23892J62971o4774j48943m1287L9150J0531j0181
$$ 173582 81673 -51519 -17864 206028 368999 304225 155282 113995 153145 163676 153495
34746A53495M947k6931p3623l4243L5955J2299n7660m9376j226j2743k7525L0621
$$ 153495 158442 131511 57888 23645 59600 71899 14239 -35137 -36363 -49106 -76631 -46010
34734d6010N6436l5729q7423L4936J42990K7858j41190q7942Q7902R8301k9058
$$ -46010 10426 -25303 -112726 -77790 65200 93058 -48132 -136074 -48172 50129 21071
34723B1071n4744P981l0855j14633l6412J30219J32116n376m5259J3693j4038
$$ 21071 -33673 -25692 -56547 -171180 -207592 -77373 54743 49367 4108 17801 3763
34712C763q3299J594J54473J16024n3628o0551P9745P0307j06036j52294j2479
$$ 3763 -79536 -77942 76531 192555 138927 78376 158121 228428 122392 -29902 -42381
34701d2381L4397r8088j57956l0882Q3943P7004Q4702J40127P9732r3455j50701
$$ -42381 -7984 -106072 -264028 -294910 -210967 -133963 -49261 90866 170598 77143 -73558
34690g3558m6857q25p1980n6078R0202J30457j2492r6749O167R7802L7601j9319
$$ -73558 -120415 -121240 -193220 -249298 -159096 -28639 -41131 -137880 -131713 -33911 3690 -15629
34678a5629N1451J12617M4868m1138m2512l7616p3435m8860N4326Q6392k120o2488
$$ -15629 35822 148439 193307 152169 109657 72041 -1394 -50254 4072 90464 88344 25856
34666B5856k1561M937l8438m9767q96N086k6774K8362J31329R3740o0912q4068
$$ 25856 4295 9232 -29206 -78973 -79869 -74783 -101557 -73195 58134 151874 90962 6894
34654F894O6671J29464j4264j36228n2521R5396J13498L3481l3493p4415p9255
$$ 6894 73565 203029 188765 52537 16 95412 208910 242391 208898 134483 55228
34643E5228k170Q5245L8617r1208q9075O8623J63090R4265N456j2077m3058j12202
$$ 55228 53058 138303 176920 85712 -3363 65260 228350 322615 328071 315994 272936 160734
34631A60734j17916o1978n7747p4339J9909J44535Q6617q7012q5038R7625J41691
$$ 160734 42818 -19160 -76907 -151246 -131337 13198 99815 12803 -72235 25390 167081
34620A67081m2435j52559j5312J45464J22000K2312j1259k8691n9211r759Q3908
$$ 167081 124646 -27913 -43225 102239 224239 246551 235292 206601 147390 137631 221539
34609B21539L9696j20123j49835j2839M3905n2126p5957M2680P7261m0771o9014
$$ 221539 261235 141112 -8723 -21562 22343 -29783 -105740 -63060 14201 -26570 -95584
34598i5584P2667J22962k9331j18692J0431J23039L7628o7672l6659j2385q7834
$$ -95584 -22917 100045 70714 -47978 -37547 85492 123120 55448 18789 6404 -81430
34587h1430q8856M5968Q2063o2645j11366O4744J72602K1297j23012k8404R3019
$$ -81430 -170286 -124318 -42255 -104900 -216266 -151522 21080 42377 -80635 -109039 -16020
34576a6020J7517p1465K4583J09785k2845j69296q3934P1394N1711k4786M2442
$$ -16020 1497 -69968 -45385 64400 41555 -127741 -211675 -140281 -88570 -113356 -70914
34565g0914J25197M2430n3740K7446J24912L2672q6817m058J35664Q3638n6212
$$ -70914 54283 96713 42973 70419 195331 228003 141186 137128 272792 356430 300218
34554C00218n1228K5095j4879q3334j7211O3829q506r0992O364J29449N1464r4931
$$ 300218 248990 274085 259206 175872 158661 222490 213984 122992 129356 258805 310269 215338
34542B15338o1882N7807K8985p9008n3378M6655L4850k7665R965M7988o1515j69149
$$ 215338 153456 211263 240248 161240 107862 154517 189367 161702 171667 219655 158140 -11009
34530a1009p5508P3576L5017q6050m5394P7902M8850o7199m1148P6610O5578m3236
$$ -11009 -86517 -12941 22076 -63974 -109368 -31466 17384 -49815 -90963 -14353 51225 7989
34518G989n2982J4151m016o6067k0369Q1966R9926Q3238J23249J02755p7851k24476
$$ 7989 -44993 -30842 -34858 -100925 -121294 -39328 60598 143836 267085 369840 291989 67513
34506F7513j42371K785l2376j45427j09398J4220N8121R9298K33835K62340K4855
$$ 67513 -74858 -72073 -104449 -249876 -359274 -345054 -286933 -187635 46200 308540 333395
34495C33395k10441j44546K6788l5209j96600j16283J05244J11948n2702n4927
$$ 333395 122954 -21592 5196 -30013 -226613 -342896 -237652 -125704 -178406 -233333
34485b33333R7938J06237l5730n6140N5561N5412n5354m0741R4489J14373K976
$$ -233333 -135395 -29158 -64888 -121028 -65467 -10055 -65409 -106150 -11661 102712 105688
34474A05688l7771P883q529m6796L4808J32773N4966r0572p9405K835n0441j29306
$$ 105688 67917 75800 67271 20475 55283 188056 243022 152450 73045 75880 25439 -103867
34462a03867k7206R5840j7076j79981n2137K11033J93187m3954q3911R3556J29945
$$ -103867 -131073 -35233 -52309 -232290 -284427 -73394 119793 75839 -8072 85484 215429
34451B15429j4707l2224R8067Q4110p3876p7608O5053M8026j11098q2078J21231
$$ 215429 200722 168498 266565 350675 276799 199191 264244 312270 201172 119094 240325
34440B40325J29498q8127j54270J7111Q2450o7054j22324L0636J10411L664l6697
$$ 240325 369823 281696 127426 144537 226987 159933 37609 68245 178656 182320 145623
34429A45623Q6291J29996L200p0787j7964m0677j62692j47939J6857N9601n7861
$$ 145623 231914 361910 365110 294323 276359 235682 72990 -74949 -58092 1509 -56352
34418e6352o4089Q6388J18261k9838r4868n613J1079p6673l8113J16919J12923
$$ -56352 -120441 -34053 84208 54370 -40498 -46111 -35032 -111705 -149818 -32899 80024
34407H0024l8329k4614J53069J45750p8228j50712N863M3606j20189j33287R5828
$$ 80024 41695 17081 170150 315900 237672 86960 92823 136429 16240 -117047 -21219
34396b1219J89721L718j06983L6262J19963l3099j27270K2902J45122M0913p1549
$$ -21219 168502 172220 65237 101499 221462 188363 61093 83995 229117 270030 198481
34385A98481k4871M621p4461o2721P5717Q0162p2482n4676J80811K43887P418
$$ 198481 173610 178231 103770 41049 116766 196928 124446 69770 250581 494468 501886
34374E01886j45648k3954N3220q3258j18420R5785J94283l0432k21623j05695
$$ 501886 356238 332284 385504 302246 183826 279611 473894 443462 221839 116144
34364A16144M0768l8761j19031j899P5986m6712q9509J11146K21477J5296j75504
$$ 116144 156912 118151 -880 -2779 73207 26495 -63014 48132 269609 284905 109401
34353A09401n4870J13003K2531j31424q4963J572o8436j07943M8659J69957P1805
$$ 109401 54531 167534 190065 58641 -26322 -24750 -93186 -201129 -152470 17487 89292
34342H9292j7270P2316R7198q6615j69834L3916J84500L0233j10542M3268J88875
$$ 89292 72022 144338 241536 154921 -14913 19003 203503 233736 123194 166462 355337
34331C55337J7990j85180q1929Q1172m1586k25116r8956J58471J56803k3368o2025
$$ 355337 373327 188147 106218 187390 145804 -79312 -178268 -19797 137006 113638 51613
34320E1613K714m4568j13605j9918J00593N6584o898Q9374J78454P7922l7737
$$ 51613 54327 9759 -103846 -123764 -23171 33413 26515 115889 294343 372265 334528
34309C34528R518M2390q8488j60007r901J05885j2229j20369k1098M1065j02513
$$ 334528 344046 386436 297948 137941 128040 233925 221696 101327 80229 121294 18781
34298A8781j47153J00735K72360P4190j54120n4550J10810O220j26399K3614J88499
$$ 18781 -128372 -27637 244723 318913 164793 110243 221053 227273 100874 124488 312987
34287C12987L0457j84106p7899J27438N8442r8024q54J59894O0928r4231P485
$$ 312987 343444 159338 81439 208877 267319 169295 168441 328335 389263 295032 302517
34276C02517J36349k4252k00238k4453K11617N6796k47292j91657Q4371R5951
$$ 302517 438866 414614 214376 189923 401540 458336 211044 19387 103758 199709
34266A99709q8745m6800J73261J90618K3916k9040m501r7320j47159M3349J86934
$$ 199709 110964 64164 237425 428043 451959 422919 418418 321098 173939 217288 404222
34255D04222k7655k90822j68592J15668J02131p6417k5006J26239L1422j35213
$$ 404222 376567 85745 -82847 32821 134952 58535 33529 159768 191190 55977
34245E5977k9272J38091Q680j65486J4779K64787J03018k13821j38304J52155
$$ 55977 26705 164796 173476 7990 22769 287556 390574 176753 38449 190604
34235A90604J18572j08473k9665K07878R6386k06614j52612J34894R1269k02169
$$ 190604 309176 200703 171038 378916 475302 268688 116076 250970 342239 140070
34225A40070j85971R8850J21653r8940q0070J37389R2569j33829o8337J76624
$$ 140070 -45901 52949 174602 75662 -4408 132981 225550 91721 23384 200008
34215B00008R2705j87914r5656K53286K20572j47844j87028J45926K11388j07085
$$ 200008 292713 104799 9143 262429 483001 335157 148129 294055 505443 398358
34205C98358k35083j7050O9265r6282r6338J11514R5358j44724j38671J15892
$$ 398358 163275 146225 215490 119208 22870 134384 229742 85018 -53653 62239
34195F2239J39433o7216k9198K09404J19026k48496k69586J04457K52228J9287
$$ 62239 201672 134456 105258 314662 433688 185192 -84394 20063 272291 291578
34185B91578q6308P1984O6176j53264j45501R4376J07226p5109K1292K88656J54274
$$ 291578 205270 277254 343430 190166 44665 139041 246267 171158 192450 481106 635380
34174F35380k61436k56213J46302K05941j47076j94958J73282K49143j16956k30451
$$ 635380 373944 117731 264033 469974 322898 127940 301222 550365 433409 202958
34164B02958R3978J88938j45947k57755P6202K27607m9001j83533L7963Q2812
$$ 202958 296936 485874 339927 82172 158374 385981 336980 153447 191410 274222
34154B74222j82397j80419J75920K18499j64377k29910K02931L52309o1476k83421
$$ 274222 91825 -88594 87326 305825 141448 -88462 114469 466778 405302 121881
34144A21881L7440K16216r5033k34329J41897L57632J9610k35022J0568J77337
$$ 121881 159321 375537 280504 46175 188072 545704 565314 330292 340860 518197
34134E18197j22660l17269j8449K20729J3688j26838J30334K46884q9971k99999
$$ 518197 395537 78268 59819 280548 294236 167398 297732 544616 454645 154646
34124A54646k9168J72419m1055j50485J27772K34916q6171k21146R3406K00228
$$ 154646 125478 297897 256842 106357 234129 469045 382874 161728 255134 455362
34114D55362j69802k96118J31804L35699q1815l36202O0477L72455N6630k36757
$$ 455362 285560 -10558 121246 456945 375130 38928 99405 471860 528490 291733
34104B91733J4771K15808q2968k58363R1469K58954j84688m54101j4817L66508
$$ 291733 306504 522312 439344 180981 272450 531404 346716 -107385 -122202 244306
34094B44306P7750k01236J03790L19100q2390l44113J11234M69858L8333m05934
$$ 244306 322056 120820 224610 543710 461320 117207 228441 698299 736632 330698
34084C30698q5977L11342P661l64945n0794L34351M3889l18563k0731L28750O526
$$ 330698 244721 556063 563724 198779 147985 482336 526225 207662 186931 515681 522207
34073E22207l53066l687M12728J22228k45679Q1732M51493N9039m26640j33700
$$ 522207 169141 165454 578182 700410 454731 536463 987956 1046995 620355 486655
34063D86655L19957N4816l49487m8021L51371m092m67038j24165L86035R2157
$$ 486655 806612 861428 511941 463920 815291 811199 344161 219996 606031 698188
34053F98188m21489j77033K86388L0768l84038k7284M94731J93586l40955r2178
$$ 698188 276699 99666 386054 416822 32784 5500 500231 693817 352862 260684
34043B60684L81237Q6428l80847n387N65544K14098m58973k73076K78653Q1045
$$ 260684 641921 728349 347502 342115 907659 1121757 662784 389708 668361 749406
34033G49406l77087m4905M93628J29107n18275k42340M00913J98474l44038q4312
$$ 749406 372319 327414 821042 950149 431874 189534 590447 788921 444883 360571
34023C60571M11775K5794n51915j10733N91873K06059n34285j86249N61223K18106
$$ 360571 772346 798140 246225 135492 727365 933424 399139 212890 774113 992219
34013I92219n45811j98213N86296K08190o56039l07383O24616L65141n27945k57727
$$ 992219 446408 248195 834491 1042681 386642 79259 703875 1069016 541071 283344
34003B83344O46544L54343o22151m02082N36263K87338o64626l49319P53840N69647
$$ 283344 929888 1284231 662080 259998 796261 1083599 418973 69654 823494 1393141
33993A393141n08477l78497O30696M45098n81391l54760P15280M48494p16217
$$ 1393141 884664 506167 1136863 1581961 1000570 645810 1361090 1809584 1093367
33984A093367m79076P37509N25924p25867n22011P72861N68467p93300o19843
$$ 1093367 614291 1351800 1877724 1151857 629846 1402707 1971174 1177874 558031
33975E58031P77056O08285q32253o45856Q88456P49542p95916n93421J080651
$$ 558031 1335087 1943372 1111119 465263 1353719 2103261 1307345 713924 1794575
33966A794575Q79701r48278q44169J016398Q88465j097700r61378J247925J286960
$$ 1794575 2674276 1725998 881829 1898227 2786692 1688992 727614 1975539 3262499
33957C262499r49444j028803J262270J306558j138692j169006J506139J623077
$$ 3262499 2313055 1284252 2546522 3853080 2714388 1545382 3051521 4674598
33949D674598j193378j272278J865562K082737j207117j298698K517077K818594
$$ 4674598 3481220 2208942 4074504 6157241 4950124 3651426 6168503 8987097
33941H987097j275159j419845L600248M425161m82582l81757O784640Q625446
$$ 8987097 7711938 6292093 9892341 14317502 13834920 13453163 20237803 28863249
33933B8863249K705513M043463J5552827J8026931R548356K3817437P4796364
$$ 28863249 31568762 35612225 51165052 69191983 78740339 102557776 177354140
33926A77354140J09369962O4578772l7626165j04923215q8788596l5682097j0336159
$$ 177354140 286724102 351302874 313676709 208753494 119964898 84282801 73946642
33919G3946642j5618381j6702828n628034j439616p523366q354891j077292J416306
$$ 73946642 58328261 41625433 35997399 34557783 27034417 18679526 17602234 19018540
33911A9018540l528157m897523j9792J739766k098013l352703L18786J716603
$$ 19018540 15490383 10592860 10573068 12312834 10214821 6862118 7180904 8897507
33903H897507j312006k298412P75407K048365l86553j191379J457001K767568
$$ 8897507 7585501 5287089 6062496 8110861 7724308 6532929 7989930 10757498
33895A0757498J143216Q65483K833233K317622j683380l920339k200057p80556
$$ 10757498 11900714 12766197 15599430 17917052 16233672 12313333 10113276 9332720
33887I332720j996990k524250o24696M39038r49026j642073m6486Q72751m30610
$$ 9332720 7335730 4811480 4186784 4625822 3676796 2034723 1988237 2860988 2430378
33878B430378j167765J33869Q28458m56116j121143J90441R29635l09508j083758
$$ 2430378 1262613 1396482 2224940 1768824 647681 838122 1767757 1458249 374491
33869C74491O6488Q59600j68143r04054O7290P71220j27907p40041J95057Q15622
$$ 374491 440979 1300579 1132436 228382 295672 1066892 938985 198944 394001 1209623
33859A209623j26219q18988p883N86895k43075q13414P0799P47527k4538o85730
$$ 1209623 1083404 264416 256533 843428 600353 -213061 -142262 605265 580727 -105003
33849a05003p516N52952j51005o65213J35884P74936M9508o39252m1654N70366
$$ -105003 -112519 440433 289428 -375785 -239901 535035 584543 -54709 -96363 474003
33839D74003k0616o34210r9179M81348N396m70752O7907N47805n401m84427R1036
$$ 474003 453387 -180823 -280002 201346 206742 -264010 -196103 351702 346301 -138126 -47090
33828d7090N89226k1617o30411j33299M68459Q6958l80989M1803M38560j08184
$$ -47090 542136 520519 -109892 -243191 225268 312226 -68763 -26960 411600 303416
33818C03416n95242l9217N46359P9577n14743j25730M25700O9522m24692l1736
$$ 303416 -291826 -331043 215316 294893 -219850 -345580 80120 149642 -275050 -306786
33808c06786M87967J13366m22285r7553M04113R4032l70090m0119M11772L6369
$$ -306786 181181 294547 -127738 -225291 178822 272854 -97236 -137355 274417 310786
33798C10786m83915j54698L93056J49958l30660q2465L80394J41993k94316n5508
$$ 310786 -173129 -327827 65229 215187 -115473 -197938 182456 324449 30133 -25375
33788b5375L45107N9615l79547j25447K86165J8055l73232m0897M26207J15129
$$ -25375 319732 379347 -200 -125647 160518 178573 -194659 -235556 190651 305780
33778C05780m19308k16563K54851P5187l11983l6595M09201J17614m09730j91157
$$ 305780 -113528 -330091 -75240 -53 -312036 -348631 60570 178184 -231546 -422703
33768d22703L40473J84121l03740j52282L16972J58540l18418j68052L25515K10497
$$ -422703 -82230 101891 -201849 -354131 -37159 121381 -197037 -365089 -39574 170923
33758A70923k72235j78642L01283K52796j80917j46316K17779J14149k75159j49792
$$ 170923 -101312 -279954 21329 274125 93208 -53108 164671 278820 3661 -146131
33748a46131K80642J73390k84719k20125K32118J94456k56845k62277J63435K07464
$$ -146131 134511 307901 23182 -196943 35175 229631 -27214 -289491 -126056 81408
33738H1408j64993k16343J04815J47916j09803q9005J63804R4252j72380n4092
$$ 81408 -83585 -299928 -195113 -47197 -157000 -246005 -82201 12051 -160329 -214421
33728b14421K71228J61425j99362j12053K67818K05865j86869j65812J99229J61861
$$ -214421 56807 218232 18870 -93183 174635 380500 193631 27819 227048 388909
33718C88909k56713l24001L754P2105j58656r9799K26455K15016j02656j14888
$$ 388909 132196 -191805 -188051 -115946 -274602 -374401 -147946 67070 -35586 -150474
33708a50474J52826J09555j84542j14771K41953K15832j60325j99273J30930J83421
$$ -150474 2352 111907 -72635 -187406 54547 270379 110054 -89219 41711 225132
33698B25132j02625j45030Q5411M0172k37759j50221K34889K28233j76044k59560
$$ 225132 122507 -22523 62888 103060 -134699 -284920 -50031 178202 2158 -257402
33688b57402R6469K48928K5302o6011O9895j5252k76741j81355J85070J85362
$$ -257402 -160933 87995 113297 47286 117181 101929 -174812 -356167 -171097 14265
33678A4265j42135j22879K38445K30808j87795k73737R6172J99501j41917k42531
$$ 14265 -127870 -250749 -12304 218504 30709 -243028 -146856 52645 -89272 -331803
33668c31803J02271K29258r5967k34522Q1332K47328l8046k26656p48J67784q603
$$ -331803 -229532 -274 -96241 -330763 -249431 -2103 -40149 -266805 -267553 -99769 -108372
33657a08372j15688O4196J13817j32969k15731L5594J41476q1254j47512J36235
$$ -108372 -224060 -159864 -46047 -179016 -394747 -359153 -217677 -298931 -446443 -310208
33647c10208K73327L3522j13076P9715J83604k4954j28678P8829J81220j7780
$$ -310208 -36881 -3359 -116435 -36720 146884 121930 -6748 72081 253301 235521
33637B35521j04905R5402J51229j04980k05593M7169J74398o4838k15541j3623
$$ 235521 130616 226018 377247 272267 66674 113843 288241 223403 7862 -5761
33627e761J22378o9394j98582j7351J04179n4970j24297R4134K10987K5248p9533
$$ -5761 116617 47223 -151359 -168710 -64531 -119501 -243798 -149664 61323 86571 7038
33616G038P5043R3629j58890k03991J26985K80104k8082k66233n4425J77826N1647
$$ 7038 82081 175710 16820 -187171 -60186 219918 191836 -74397 -128822 49004 100651
33605A00651q0431R6380K15825k4548k36926q3558Q5181n4295j65750M4555K02014
$$ 100651 20220 116600 332425 307877 70951 -12607 72574 18279 -147471 -102916 99098
33594I9098j9901k40359p7419J41897K8072j48672l6978J05900l9484k00105n1634
$$ 99098 79197 -161162 -238581 -96684 -68612 -217284 -254262 -148362 -187846 -387951 -439585
33583d39585J41778N9364n1903R7332K34935O4430j31956l5296J01808j1554j13784
$$ -439585 -297807 -238443 -290346 -193014 41921 106351 -25605 -60901 40907 29353 -84431
33572h4431N6766J79169m5149k60304q7889J53080M2116j56246j9858K12649R9223
$$ -84431 -27665 151504 106355 -153949 -241838 -88758 -46642 -202888 -222746 -10097 89126
33561H9126j68199j36135Q0674P5930p6054l2354J28154R3974o3898p8016k0643
$$ 89126 -79073 -215208 -134534 -58604 -134658 -167012 -38858 55116 -8782 -86798 -107441
33550a07441q9720j46164k610J37714N1816l8316J05440K22481K0616k26131j32173
$$ -107441 -197161 -343325 -345935 -208221 -156405 -194721 -89281 133200 153816 -72315 -204488
33539b04488J11501J01311o9317o3208N9009M0807l0020M7410J16095k9570j75182
$$ -204488 -92987 8324 -60993 -124201 -65192 -24385 -54405 -6995 109100 79530 -95652
33528i5652o4307Q5669j5378j64401n7151J12945K8273j32145m2061J39552Q9528
$$ -95652 -159959 -74290 -89668 -254069 -311220 -198275 -170002 -302147 -344208 -204656 -115128
33517a15128n1560K0215J58561O1949j21483q5045M1992j5717j07402K7057J88048
$$ -115128 -166688 -146473 12088 74037 -47446 -132491 -90499 -106216 -213618 -186561 1487
33506A487P5590j04285j5640J51916M7730j46153n7895J46963P4741j43858j12569
$$ 1487 77077 -27208 -42848 109068 156798 10645 -47250 99713 174454 30596 -81973
33495h1973P8082N9000r6668n6533R4384M5466r7173l7703Q0369m0917j97023
$$ -81973 -3891 55109 -41559 -98092 -3708 41758 -55415 -93118 -12749 -53666 -250689
33484b50689k8147K32875J19881j92655j68062J36323K03999k369n5243R4795
$$ -250689 -278836 -45961 73920 -118735 -286797 -150474 53525 51156 -4087 90708
33474I0708R6656n6662m4195Q6424N386j84254q9722J79195J50717j26754j53315
$$ 90708 187364 130702 86507 172931 178317 -5937 -95659 83536 234253 107499 -45816
33463d5816R4818J36498r4813j40554R7067J79430l2407j50228k1143L0461j07718
$$ -45816 49002 185500 90687 -49867 47200 226630 194223 43995 22852 53313 -54405
33452e4405j21899P2446J44767l525o3112N0427M1496j31215j26028J05837J73597
$$ -54405 -176304 -103858 40909 37384 -25728 24699 66195 -65020 -191048 -85211 88386
33441H8386l7255j51043l313Q4691m8916j14272L7418J27425N028p6584J9208
$$ 88386 51131 -99912 -103225 -18534 -67450 -181722 -144304 -16879 -11851 -88435 -69227
33430f9227O1772m9603p6563N1255N8998j23960j76869K1344J46615J4429j08752
$$ -69227 -7455 -57058 -133621 -82366 -23368 -147328 -324197 -302853 -156238 -141809 -250561
33419b50561k3955P1275J8063j9907N5518O7391m1787o1861N0305N8465o3410
$$ -250561 -274516 -203241 -185178 -205085 -149567 -82176 -123963 -185824 -135519 -77054 -140464
33408a40464l4678J67152J87947n4355j66340K9007J62193k4373k29726j45063
$$ -140464 -175142 -7990 179957 125602 -40738 -11731 150462 126089 -103637 -248700
33398b48700M4096O2273M281L9017N7704m4819j04428p327P2687J9075k324R9648
$$ -248700 -204604 -142331 -138050 -99033 -41329 -86148 -190576 -197903 -125216 -106141 -108465 -8817
33386h817J34826J3293n2738M4612R6355o036n0440P0585J32978J4303p0910o173
$$ -8817 126009 139302 86564 131176 227531 221495 171055 241640 374618 388921 318011 311838
33374C11838n187j59946k08700k8674R2308k7420j23079K2600J82737J21954R085
$$ 311838 306651 146705 -61995 -90669 1639 -25781 -148860 -126260 56477 178431 187516
33363A87516M2976O8118p1237j72362m2479J22031Q6337k2073q103K2656o8342
$$ 187516 230492 298610 227373 55011 12532 134563 220900 198827 190724 213380 145038
33352A45038j36982m6681L5328m2998j13533j8049P6079Q528n1265N7972J53270
$$ 145038 8056 -38625 -3297 -46295 -159828 -177877 -101798 -93270 -144535 -86563 66707
33341F6707M7942q7291m6213L8154j5432p6327J5769J05409J5650r5619k9572
$$ 66707 114649 27358 -18855 19299 3867 -72460 -56691 48718 64368 -31251 -60823
33330f0823P7234K4023p3263k4832O6365K8828l6985J6529O7258l0680j29750
$$ -60823 16411 40434 -32829 -57661 8704 37532 547 17076 84334 53654 -76096
33319g6096n3219O4754L1776n1859j7708M2332n737m3068N3317J19879o628j62247
$$ -76096 -129315 -64561 -32785 -84644 -102352 -60020 -65757 -108825 -55508 64371 57743 -104504
33307a04504j39883m3397l6406j3655J35427K17640N9937j23195o5300R9928J01367
$$ -104504 -244387 -287784 -324190 -337845 -202418 15222 75159 -48036 -113336 -13408 87959
33296H7959k051n402K8999n7577j53817q0485M0698L504r4568n3237M5130K4057
$$ 87959 85908 80506 109505 51928 -101889 -182374 -141676 -138172 -232740 -285977 -240847 -216790
33284b16790k1677P0550J69174P6524p9623o7239L2682R776p5197n2696K623l5545
$$ -216790 -238467 -167917 1257 77781 -1842 -69081 -36399 -26623 -101820 -154516 -151893 -187438
33272a87438k6247J60499K82567Q3080k11354k13787n39O5310m4888p2481R212
$$ -187438 -213685 -53186 229381 312461 101107 -112680 -113219 -47909 -92797 -165278 -156066
33261a56066J5931k6703M0204J21933K4211j21918n7908J00744M9728j30943j06960
$$ -156066 -140135 -166838 -126634 -4701 19510 -102408 -160316 -59572 -9844 -140787 -247747
33250b47747R1491J19236n4857j07383M2834J18315J1389n8796R699N0391O27
$$ -247747 -156256 -37020 -91877 -199260 -156426 -38111 -26722 -85518 -75819 -25428 -24801
33239b4801O030P4978K7972j27244j48623K7482J74705J51101O1097o839q4733
$$ -24801 -18771 56207 84179 -43065 -191688 -164206 10499 161600 222697 215858 131125
33228A31125j30419m5955P9210N2552q1366r6993J9379O2849n548j2971P0155
$$ 131125 706 -45249 33961 86513 5147 -91846 -72467 -9618 -15166 -28137 42018
33217D2018P3397l8795r8091l8380K5233M5582Q6879J18011M6706n5534m6050
$$ 42018 115415 76620 -21471 -59851 -34618 10964 97843 215854 262560 207026 160976
33206A60976J3191l1584j06326l3707R7083N4063j02472j01724N7632J14982J8162
$$ 160976 174167 142583 36257 2550 99633 153696 51224 -50500 7132 122114 140276
33195A40276k7161J9942j5640j28562j03744O7636J44673O2739J0903L6372k4599
$$ 140276 113115 133057 117417 -11145 -114889 -47253 97420 160159 171062 207434 182835
33184A82835j62844j56768L727O2249m3120p2595N2915R4652n5631j63477o0626
$$ 182835 19991 -136777 -133050 -70801 -113921 -186516 -133601 -38949 -94580 -258057 -318683
33173c18683Q6126R0517J5554l2730q3452j27571n0769J26038K05271J21512L2149
$$ -318683 -232557 -142040 -126486 -159216 -242668 -370239 -421008 -294970 -89699 31813 63962
33162F3962K3080K226n1306l1635L8530P120r6948p7758N4123P4064l5125l5885
$$ 63962 87042 89268 37962 6327 44857 51977 -44971 -122729 -68606 5458 -29667 -65552
33150f5552J10388J43994k3337j41916p3715j3831r0284j26001k169R7746K6896
$$ -65552 44836 188830 165493 23577 -50138 -63969 -154253 -280254 -282423 -184677 -157781
33139a57781o1431m649J02091J23269R5593N8475m9746j80528j54811Q811N9772
$$ -157781 -219212 -223861 -121770 1499 97092 155567 105821 -74707 -229518 -220707 -160935
33128a60935n6546q1999Q9967K03182Q5311o2042m5220M138n7444r5420N371P0442
$$ -160935 -217481 -299480 -209513 -6331 78980 16938 -28282 -24144 -81588 -177008 -171637 -101195
33116a01195m5986j58920o4688J03567J23840M9693L9847M7379l2530j04079m1336
$$ -101195 -147181 -306101 -370789 -267222 -143382 -93689 -53842 -6463 -38993 -143072 -184408
33105a84408N5881L5042m0483k9751L7105O1937O8704R6246P3353j8283m5781
$$ -184408 -128527 -93485 -133968 -163719 -126614 -64677 4027 100273 173626 155343 109562
33094A09562L5636N7044o7636j51378m7592Q1136M2164o1291l8081N4511M7156
$$ 109562 145198 202242 134606 -16772 -64364 16772 58936 -2355 -40436 14075 61231
33083F1231l3364m8573m856O136M54K9693L7288l0271r2421p1960k6044o277M4644
$$ 61231 27867 -20706 -25562 -19426 -18972 10721 48009 17738 -74683 -146643 -172687 -178964 -134320
33070a34320J27255J13842j5081p5658K2973J10281M9499l2706k09M2289l4628
$$ -134320 -7065 106777 91696 16038 39011 149292 198791 166085 165876 208165 173537
33059A73537j31820j03012j635N3176P4210R2322M1947p2211j06672l4880l1299
$$ 173537 41717 -61295 -62930 -9754 64456 156778 198725 126514 19842 -15038 -46337
33048d6337j42236j53357K5808J50194M5080q1515n485J25145P7145n3879m4817
$$ -46337 -188573 -341930 -316122 -165928 -120848 -202363 -207848 -82703 -5558 -59437 -104254
33037a04254O1268Q4889L8241K2848p256r2723q5362R0855K09788P7688j19239
$$ -104254 -42986 41903 80144 102992 95736 3013 -82349 8506 218294 295982 176743
33026A76743j18576j2210l2086j17702o7018O1103O9507m271K359M0298k4097
$$ 176743 58167 45957 13871 -103831 -170849 -109746 -40239 -44510 -42151 -1853 -25950
33015b5950r3056j0417R3840O664j53965j17161O1981J00673j9736o0287L1575
$$ -25950 -119006 -129423 -35583 -28919 -182884 -300045 -238064 -137391 -157127 -217414 -185839
33004a85839P4623K6830L8132J29063J47330N4396l1980p0401j08402j03674O490
$$ -185839 -111216 -84386 -46254 82809 230139 284535 252555 182154 73752 -29922 -23432
32993b3432J15513Q5576k138N021L7763n7027j94818j77425m1390K4962J4345
$$ -23432 92081 177657 175519 180540 218303 161276 -33542 -210967 -252357 -227395 -213050
32982b13050M2556O8707m690o8884J6932J13575K3178j10326k1042J78852J58995
$$ -213050 -170494 -101787 -106477 -175361 -158429 -44854 -21676 -132002 -153044 25808 184803
32971A84803n3930j24416J0979Q3003P365r700P5913M8172j32019k18234j09514
$$ 184803 130873 6457 17436 100439 107804 98104 174017 222189 90170 -128064 -237578
32960b37578M26L242K8577J17117J11688j1523n4970L9438P6183l1237j07429
$$ -237578 -237152 -233910 -205333 -88216 23472 11949 -43021 -3583 72600 41363 -66066
32949f6066m3991K7019O431j4766K1502L4951J1130L9703Q7954K2621r8384p0695
$$ -66066 -110057 -83038 -76607 -91373 -69871 -34920 -23790 15913 103867 126488 28104 -42591
32937d2591P7984R8535l6425p4749M8061Q1529p3251j69576o0362M5937j5079
$$ -42591 35393 133928 97503 22754 70815 152344 79093 -90483 -150845 -104908 -119987
32926a19987o7671N4496J83230J11314n2948r5118l7625k2054l7836l201L9842
$$ -119987 -187658 -133162 50068 161382 108434 13316 -24309 -46363 -84199 -87400 -47558
32915d7558J6706k6556k2516k098N448L8426P2776J1005j08145j03169M5519J19085
$$ -47558 -30852 -57408 -79924 -82022 -76574 -38148 34628 45633 -62512 -165681 -120162 -1077
32903a077J0495r4128l2758P6218P0306J0861K0355M8158q42o7944n8579j6309
$$ -1077 9418 -84710 -117468 -41250 29056 39917 60272 108430 107588 39644 -18935 -35244
32891c5244j3086l809N5692Q1938O681p6865n2548M1353R3107P5187K4770l3856
$$ -35244 -48330 -52139 3553 85491 92172 15307 -37241 4112 97219 172406 197176 163320
32879A63320p4538p5365p7269j24681j49793o7634L6633J7386n6949R920J82732
$$ 163320 88782 13417 -63852 -188533 -338326 -405960 -369327 -351941 -408890 -398970 -216238
32868b16238K11237M2064r1734o1014q129l0803j8179P1465Q3094l2930q9697
$$ -216238 -5001 37063 -54671 -115685 -123814 -154617 -172796 -101331 -18237 -51167 -140864
32857a40864K849O5186k0250r6843l9243J7777m1648q8228j6469L4885l8672p5266
$$ -140864 -138015 -72829 -93079 -189922 -229165 -211388 -253036 -341264 -357733 -322848 -361520 -436786
32845d36786O1493K11365J91635R9967Q5318N9718q2534j90998j06619K4444n682
$$ -436786 -375293 -163928 27707 127674 212992 272710 190176 -822 -107441 -82997 -88679
32834h8679r8680m5930P8860O1340n4684n4190N6767P9251j3302m8880K7510Q8565
$$ -88679 -187359 -233289 -154429 -93089 -147773 -201963 -145196 -65945 -79247 -128127 -100617 -12052
32822a2052O8580L2724O135n4897j22680j10149j8844O8717J17340J38956J20159
$$ -12052 56528 89252 95387 40490 -82190 -192339 -211183 -142466 -25126 113830 233989
32811B33989O4371L2970M1204J0283q2457j35711j04292q4275j07806n2538R9824
$$ 233989 298360 331330 372534 382817 300360 164649 60357 -23918 -131724 -184262 -84438
32800h4438J38779m5066k21637j48304N7984J30966O2156K3626L6991Q559k6298
$$ -84438 54341 9275 -212362 -360666 -302682 -171716 -109560 -85934 -48943 -40384 -66682
32789f6682K1453P4379J4110p0303k5518P5564O1759j7514N834Q5193M0603q8487
$$ -66682 -45229 29150 43260 -27043 -52561 23003 84762 67248 73082 158275 198878 110391
32777A10391r6539J2018K9459o7168o5943Q5373J46951l5620k73856k99316j05986
$$ 110391 13852 25870 55329 -11839 -77782 7591 154542 118922 -154934 -454250 -560236
32766e60236R8912J60165Q4871k6951q0483n3656K986M7049Q6560J11665O9080
$$ -560236 -461324 -301159 -216288 -243239 -323722 -377378 -374392 -327343 -240783 -129118 -60038
32755f0038l0095p6418k2481K9897P3l6485O58M4359J7855q232M4212R0605K5748
$$ -60038 -90133 -166551 -189032 -159135 -159062 -195547 -194889 -150530 -132675 -140907 -96695 -6090 19658
32742A9658p9097r5176m2281p133K5482Q5779R1451n193p2666k006Q0213J4937
$$ 19658 -59439 -154615 -196896 -204029 -178547 -92768 -1317 -6510 -79176 -81182 -969 13968
32730A3968j06958j00561k174K2249k2927j3445L5725K3295l639O9899J75593
$$ 13968 -92990 -193551 -195725 -173476 -196403 -209848 -174123 -150828 -154467 -84568 91025
32719I1025J50493K5457k5852J8792K9494k4772n9084o3096q3108o6479M9169
$$ 91025 241518 266975 241123 259915 289409 264637 205553 142457 59349 -7130 42039
32708D2039J50629Q5864p2564j31975q0240m5112l1652M0625J08892M9649o2475
$$ 42039 192668 278532 205968 73993 -6247 -51359 -83011 -42386 66506 116155 53680
32697E3680n1427M8777M9918o2230j24676q7891m6174j4552O2360J19521N3190
$$ 53680 2253 51030 100948 38718 -85958 -173849 -220023 -234575 -172215 -52694 496
32686D96n0865l1923O1869P2132L2025P2829J18199Q871j42626r3961P8220O9206
$$ 496 -50369 -82292 -20423 51709 83734 156563 274762 283633 141007 47046 125266 194472
32674A94472j24370j79337R674J64423Q7386p6100j44274j35555r6202L125J06327
$$ 194472 70102 -109235 -99561 64862 152248 76148 -68126 -203681 -299883 -296758 -190431
32663a90431Q9737M773K3201J12510P6479o5106q8077J8125K7064q1656o7608
$$ -190431 -100694 -95921 -72720 39790 116269 51163 -36914 -18789 8275 -73381 -140989
32652a40989R8291J36674l5734j34155r455R6151N826q3454N093J02665L8356
$$ -140989 -42698 93976 58242 -75913 -85368 10783 16609 -66845 -61752 40913 79269
32641G9269l5736M2889J18641J1606j28179p4482Q8012J27419L0084o3621j16678
$$ 79269 43533 86422 205063 216669 88490 14008 102020 229439 259523 195902 79224
32630G9224j47975r7453L7680J00138J1066o6109N887J01923O9280o136R980M1096
$$ 79224 -68751 -166204 -128524 -28386 -17320 -83429 -77542 24381 93661 87525 97505 138601
32618A38601l1322j14770o2827O0873R8060M3886j4316o6579j09378n7918R2927
$$ 138601 107279 -7491 -70318 -9445 88615 132501 118185 51606 -57772 -115690 -22763
32607b2763J75109Q4262n1292r2597r2822j17654p7948O6987J51252N7870o5406
$$ -22763 152346 236608 185316 92719 -103 -117757 -195705 -128718 22534 80404 14998
32596A4998n3077J6980J7687J2227P4041Q9462j3441o1682O8274J74326M4882
$$ 14998 -38079 -21099 -3412 8815 82856 172318 158877 97195 165469 339795 384677
32585C84677j58122j60307l2474l2167j40581j33670j0849K6019l3953j823J39100
$$ 384677 226555 66248 33774 1607 -138974 -272644 -283493 -257474 -291427 -293250 -154150
32574a54150J85960O2904p2040r6182n3159L188P3041J08394M9143l7598l5055
$$ -154150 31810 94714 22674 -73508 -126667 -123479 -50438 57956 107099 69501 34446
32563C4446K7976L4135j3892k5294r646m0596q1824m5792K1128Q153n0554l0978
$$ 34446 62422 96557 82665 57371 47725 7129 -74695 -120487 -99359 -91206 -141760 -172738
32551a72738N7015R0404M1680r053l0301m3835k4781M6196R3982O0113J9389M1016
$$ -172738 -115723 -25319 16361 7308 -22993 -66828 -91609 -45413 48569 108682 128071 169087
32539A69087M7358k8098p8471o482P5468L7701k6642J2511N5897l7317j50205
$$ 169087 216445 188347 109876 103394 178862 216563 189921 202432 258329 221012 70807
32528G0807r8999J6270j5326j13180m1898J38729J55654J0614k4139R5040J03394
$$ 70807 -28192 -11922 -27248 -140428 -182326 -43597 112057 122671 98532 193572 296966
32517B96966q5993k12705j08796M4598N4720L455K3675N2708p112q9930r7415
$$ 296966 210973 -1732 -110528 -65930 -11210 -7755 15920 68628 61516 -28414 -125829
32506a25829o3202n0295l0624K3385O3374O5736P4431Q4717L0286o5933q7649
$$ -125829 -189031 -239326 -269950 -246565 -183191 -117455 -43024 41693 71979 6046 -81603
32495h1603k0042J6218k5516m5352J0584N6326L0570m401N198K0466J5554K6289
$$ -81603 -101645 -85427 -110943 -156295 -145711 -89385 -58815 -63216 -58018 -37552 -21998 4291
32483D291M3885M71r3974j35143q0780M367P2839J23814J12742o70j13427p4614
$$ 4291 48176 48647 -45327 -180470 -261250 -256883 -184044 -60230 52512 51842 -61585 -136199
32471a36199O6595J03917j0331r8125m7828L4263L2161j3060k7148k4500k6395
$$ -136199 -69604 34313 23982 -74143 -121971 -87708 -55547 -68607 -95755 -120255 -146650
32460a46650n729K3310J847m3425j5366P5779J10148O0357K1337J4745l9673j22407
$$ -146650 -152379 -129069 -127222 -170647 -186013 -110234 -86 60271 81608 96353 56680 -65727
32448f5727r9319L1531R5484K4609k8566L9902J11938O7683j0839N67O1447O1017
$$ -65727 -165046 -133515 -38031 -13422 -41988 -2086 109852 177535 166696 167263 228710 289727
32436B89727o844q2764j40529j48650n6542Q8188J36036M1726n3075l2454L2156
$$ 289727 282883 200119 59590 -89060 -145602 -57414 78622 120348 67273 34819 66975
32425F6975L1082o075L853M5910N4607K6695n371l4545m7437j7952J7708j7326
$$ 66975 98057 91982 95835 141745 196352 223047 217676 183131 135694 117742 135450 118124
32413A18124r9627j05753m533P8790N1703j8809l5985r327Q379J0850M926j2326
$$ 118124 18497 -87256 -91789 -12999 38704 19895 -16090 -25417 -17038 -6188 -1262 -13588
32401a3588n839N8266J09330M5072p9022r9520q221K5737n6801j05108k6799N3678
$$ -13588 -19427 38839 148169 193241 114219 14699 6478 32215 -24586 -129694 -156493 -102815
32389a02815K0577m1071j7433L7975L0389K545L1210O1921L311r7424j12890j4434
$$ -102815 -82238 -123309 -140742 -102767 -72378 -69833 -38623 23298 26609 -70815 -183705 -198139
32377a98139J09909J66556J16945j0844j20119j22412m4255J7324L7022M9310
$$ -198139 -88230 78326 195271 184427 64308 -58104 -102359 -85035 -48013 1297
32367A297K6494o6937j22244j442J90582J93158j0302j42134n7656N3922J8961
$$ 1297 27791 -39146 -161390 -162832 27750 220908 210606 68472 10816 64738 83699
32356H3699m7002P210Q8814N1817l1907j7906N0846M3567k6927o6580p7461r7153
$$ 83699 36697 43907 132721 184538 152631 134725 185571 229138 202211 135631 58170 -38983
32344c8983p8936L48L5056m0371j02303k7921Q9478R1224K937m4582l5806l5025
$$ -38983 -117919 -117571 -82515 -122886 -225189 -253110 -163632 -72408 -69471 -114053 -149859 -184884
32332a84884k9804J9000O2283N2553M8718Q6639O8445n9220j50404o7176Q3303
$$ -184884 -214688 -195688 -133405 -80852 -32134 54505 122950 63730 -86674 -153850 -70547
32321g0547J15640N3299L7991N6572j1157j40276j80910r7223L022M6994M3606
$$ -70547 45093 98392 136383 192955 181798 41522 -139388 -236611 -233589 -186595 -142989
32310a42989j918o7607o5913L6463J17478O4774l9208m9859J2165L1166L565J176
$$ -142989 -144907 -212514 -278427 -241964 -124486 -59712 -98920 -148779 -136614 -105448 -101883 -100707
32298a00707J3779K129J7430R0957J06950j9585j43213q3846P2710J04713N377
$$ -100707 -86928 -84799 -67369 23588 130538 110953 -32260 -116106 -43396 61317 66694
32287F6694m4250O807M3782L0572L6567M0115m5325j56574j38540j9983J3492
$$ 66694 22444 29251 73033 103605 140172 180287 134962 -21612 -160152 -180135 -166643
32276a66643o3567p6940L2741J05130M0279m3797k7750K9717L2027K889M478K8949
$$ -166643 -230210 -307150 -274409 -169279 -129000 -172797 -200547 -170830 -138803 -135914 -131436 -102487
32264a02487N6203J05220J56926J32211J3694r9250j12504m3660K6514M4164P130
$$ -102487 -46284 58936 215862 348073 361767 262517 150013 106353 132867 177031 184161
32253A84161m1764m6120q483r43n2538q9271n7036j9817l9822n4933N105P9534
$$ 184161 142397 96277 87794 86851 34313 -54958 -111994 -131811 -171633 -226566 -221461 -141927
32241a41927R1136R3433J42294J33856k9662k09720j95847l2321N5583J0320l0005
$$ -141927 -50791 42642 184936 318792 289130 79410 -116437 -148758 -93175 -82855 -112860
32230a12860j6751l7542p8740j0932J46961J97883P0025o5795n8648K8842O3535
$$ -112860 -129611 -167153 -245893 -256825 -109864 88019 158044 92249 33601 62443 125978
32219A25978J9833m6917p4930j7608Q7433R3203o3040j95709j01544J02645J27619
$$ 125978 145811 98894 23964 6356 93789 186992 123952 -71757 -173301 -70656 56963
32208E6963l5591j10915O1P8000j2097j01595m2575L8424m619p2510j8068Q6036
$$ 56963 21372 -89543 -89482 -11482 -23579 -125174 -167749 -129325 -133944 -206454 -224522 -138486
32196a38486Q6747J0606j0754L7916P8081Q6205P5654K1739o7362r7837k8671
$$ -138486 -51739 -41133 -51887 -13971 64110 150315 225969 247708 180346 82509 53838
32185E3838K9271l0324j39399j55411n7682N5590J01223O2478k5490p9488l2534
$$ 53838 83109 52785 -86614 -242025 -299707 -244117 -142894 -80416 -105906 -185394 -217928
32174b17928O1071P5774J216m0566l44K2410l0682o6052n583P8190R4521P1192
$$ -217928 -156857 -81083 -79867 -120433 -120777 -98367 -129049 -195101 -200684 -122494 -27973 43219
32162D3219N6423J2347q0510j29773o2687M6639R1000P7521N9966K5212m0658
$$ 43219 99642 111989 31479 -98294 -160981 -114342 -23342 54179 114145 139357 98699
32151I8699o7175j335Q0874P8642J6457j5857j1815l1398q1983j11330q8926k5984
$$ 98699 31524 30189 111063 189705 206162 190305 178490 147092 65109 -46221 -135147 -161131
32139a61131N0270R3837O1825j7954n8941l0649O042P204N180K4370L0030N827
$$ -161131 -110861 -17024 44801 26847 -32094 -62743 -56701 -49497 -44317 -19947 10083 15910
32127A5910p377M551l871m2779n1866o107L5417L1940K0889L1391K9597m649l2616
$$ 15910 8533 13084 9213 -33566 -85432 -91539 -56122 -24182 -3293 28098 57695 53046 20430
32114B0430k7994j4048l585J7743L6580K4847L254J521j5598p1719q1969J7852
$$ 20430 -7564 -21612 -25197 -7454 29126 53973 57227 58748 43150 -28569 -110538 -92686
32102i2686J07156L9266r1100p6015M7508M9707q2770j09237L8209J21786O933
$$ -92686 14470 53736 -37364 -113379 -65871 -16164 -98934 -208171 -169962 -48176 -41243
32091d1243j13165o1945M2488M1191K686L4173O1532N159l9880L788L5845n122
$$ -41243 -154408 -216353 -173865 -132674 -129988 -95815 -34283 -29124 -69004 -65216 -29371 -34493
32079c4493J285R2609Q2108r0863j57730M4256K20380O1375k13641j82580R6665
$$ -34493 -33208 59401 141509 50646 -107084 -62828 157552 218927 5286 -177294 -80629
32068h0629J97071J6205j20524m0266N2811N582m0016L5935J05391M2524n9978
$$ -80629 116442 132647 12123 -28143 24668 30250 -9766 26169 131560 174084 114106
32057A14106p5312l9679l8229n9161n9008l4536K6715J27779J71365N3046j35278
$$ 114106 38794 -885 -39114 -98275 -157283 -191819 -165104 -37325 134040 187086 51808
32046E1808j78608m4870P2532N6191Q004L0300O2657K9886j8298j9880j3058l8304
$$ 51808 -126800 -171670 -99138 -42947 -34943 -4643 58014 87900 69602 49722 36664 -1640
32034a640m8211n434L4594K1334m045O061J8702j0030m9846m7378j0216J2153
$$ -1640 -49851 -55285 -20691 643 -3402 2659 21361 11331 -38515 -85893 -96109 -83956
32022h3956m394m0572n6372k6359K3900L6445K696j8735n08R774m543K0914R4714
$$ -83956 -88350 -128922 -185294 -211653 -187753 -151308 -148612 -167347 -167855 -158081 -162624 -141710 -46996
32009d6996R9316k1841j23189o0271O9016P2540l0915o4613O046N1406K8042K4019
$$ -46996 52320 30479 -92710 -152981 -83965 -11425 -42340 -106953 -100907 -49501 -21459 2560
31997B560N4183L1510l8002m4501J0989L42q9273j05478J0566J11394P4376k7105
$$ 2560 56743 88253 50251 5750 16739 17081 -72192 -177670 -167104 -55710 18666 -8439
31985h439p2501n8311k5252L3361R8020Q7814r057q2156n6859J447J3518O762
$$ -8439 -80940 -139251 -164503 -131142 -33122 54692 45635 -36521 -93380 -91933 -78415 -71653
31973g1653L1200N6322L6076l744j6474o137O698K4494L5614O420n2610p9816
$$ -71653 -40453 15869 51945 48201 31727 25590 32288 56782 92396 98816 46206 -33610
31961c3610n0944j0929J017o966k1023l8481m4099l3747m2366p8660p5503K788
$$ -33610 -84554 -95483 -94466 -101432 -122455 -160936 -205035 -238782 -281148 -359808 -435311 -432523
31949d32523O1838Q354p6924m7562P1552J23827O8894J2762O528K57q178K9484
$$ -432523 -370685 -362331 -439255 -486817 -415265 -291438 -222544 -209782 -203254 -202997 -211175 -181691
31937a81691O3528l264j04602o3954J09699J97537R4258n5889j06742q1485k7552
$$ -181691 -118163 -121427 -226029 -289983 -180284 17253 111511 55622 -51120 -132605 -160157
31926a60157P8649J89641J63884m023j25261r5428l4196m1207l0078N9639J04051
$$ -160157 -81508 108133 272017 267994 142733 47305 13109 -28098 -58176 1463 105514
31915A05514J6736p1182l8125P602o0995j31347l8161J30055J60781N7836N198
$$ 105514 122250 51068 12943 20545 -40450 -171797 -209958 -79903 80878 138714 143912
31904A43912N0139O0377k3576j06728j16808q7512n3150o429L1595K4470P15J1612
$$ 143912 194051 254428 230852 124124 7316 -80196 -133346 -139775 -108180 -83710 -82995 -71383
31892g1383K7958j0640p1051o9336j4569R177j2803j6034J9760M8049M8622L9695
$$ -71383 -43425 -54065 -125116 -194452 -209021 -199844 -212647 -228681 -208921 -160872 -112250 -72555
31880g2555O643p5181j47794j07333M6898J82576J76930L6780j24270j80406q1663
$$ -72555 -65912 -141093 -288887 -396220 -349322 -166746 10184 46964 -77306 -257712 -339375
31869c39375R5760K00968J59448N0537r400j5174l6608p9625p9097j6890M5302
$$ -339375 -243615 -42647 116801 167338 157938 142764 106156 26531 -52566 -69456 -24154
31858b4154O2079N7175N6946L4746l6371j12814j16827m5397O766k7175p2605
$$ -24154 37925 95100 152046 186792 150421 37607 -79220 -124617 -117851 -145026 -217631
31847b17631p903J29087J51603J303j20738l2859J33710J17959o4214j41893j6468
$$ -217631 -225534 -96447 55156 56459 -64279 -97138 36572 154531 90317 -51576 -68044
31836f8044R5785K3052j03717q8606K9148P9720K3878n6177j18027j53454j09070
$$ -68044 27741 50793 -52924 -141530 -112382 -32662 -8784 -64961 -182988 -336442 -445512
31825d45512L4579J66343J62988N9218j1471K367M6553O5970M1526k5234q5796
$$ -445512 -410933 -244590 -81602 -22384 -33855 -31488 15065 81035 122561 97327 11531
31814A1531o4050K7952P0813O436o6357m8432R583J6857J485L5187Q1368N3783
$$ 11531 -52519 -24567 46246 52682 -13675 -62107 -52524 -35667 -34182 1005 82373 136156
31802A36156k8344o9353m3735p554L705J81o141j520L0852O3167L7989k8795m9749
$$ 136156 107812 38459 -5276 -12830 -9125 -8944 -15085 -16605 14247 77414 115403 86608 36859
31789C6859j0941J785k9905j2600O0648M2466j15694k14580q1412J46901K07044
$$ 36859 25918 27703 -2202 -14802 45846 88312 -27382 -241962 -323374 -176473 30571
31778C0571P3032n5926n6845J1342N4421L5523l9437j04162n9255P6369J36784
$$ 30571 103603 47677 -9168 2174 56595 92118 52681 -51481 -110736 -34367 102417
31767A02417M5557m8415j3753L7592m1737j49122r4591O4852J17125M3936P552
$$ 102417 147974 99559 85806 123398 81661 -67461 -162052 -97200 19925 63861 71413
31756G1413L8845J6440n9036m6082O2722J02790J5185o8983o6629m7903n6588
$$ 71413 110258 126698 67662 21580 84302 187092 202277 133294 66665 18762 -37826
31745c7826l6701P981j4608r2526q4639M4435J49149J32572P2067M3653J418p9149
$$ -37826 -74527 -66546 -81154 -173680 -258319 -213884 -64735 67837 139904 183557 184975 105826
31733A05826j06812k9779N5414N3693J1695J5089N0401N5030J8647l2097p3931
$$ 105826 -986 -30765 24649 78342 90037 105126 155527 210557 229204 197107 123176
31722A23176p2386j0393M8122K1837n1434n9537l595J349o7323r1865j7605N2957
$$ 123176 50790 40397 88519 110356 58922 -615 -4210 -2861 -70184 -162049 -179654 -126697
31710a26697L5031j4180k0073m217N814M9060J22331J19859j0069j43187j26990
$$ -126697 -91666 -105846 -125919 -130136 -124322 -75262 47069 166928 156859 13672 -113318
31699a13318J2028J09176P2413k9221p3339k5324L5794K3276l5826l2139N3890
$$ -113318 -101290 7886 80299 51078 -22261 -47585 -11791 11485 -24341 -56480 -2590
31688b590R9133K5249o4057m9364L394k9514q9348k7873J14039J50229N3711j7787
$$ -2590 96543 121792 57735 8371 11765 -17749 -107097 -134970 -20931 129298 183009 165222
31676A65222o507k0517q2794o7809M2537Q5255m042o8791n805N7622j467r2541
$$ 165222 158715 138198 55404 -12405 30132 115387 111345 42554 36749 94371 92904 363
31664C63r1834n0250n7285o0136R984P3642M0089j4567K1227R2299P7845M122
$$ 363 -91471 -141721 -199006 -259142 -249158 -175516 -135427 -149994 -128767 -36468 41377 45499
31652D5499j3804K6645L1903j9767o4147o4116k7479L7330R2146O7150k3253n3548
$$ 45499 31695 58340 90243 70476 6329 -57787 -85266 -47936 44210 111360 88107 34559
31640C4559K6086Q3640O058j05154q8862K0466O3821J6050q160K7852L7474j4420
$$ 34559 60645 144285 150343 45189 -43673 -23207 40614 56664 48504 76356 113830 99410
31628I9410m9261j6827K4327Q706m2728o7998m4786j830J6117p517l1001Q566
$$ 99410 50149 33322 57649 66355 23627 -44371 -89157 -90987 -74870 -82387 -113388 -104822
31616a04822J03655J59381J01617l3286j43890j60026p7837M7813J27860J12437
$$ -104822 -1167 158214 259831 226545 82655 -77371 -155208 -107395 20465 132902
31606A32902N0292J5387j0799q8620j69695j36302m435O9316K7197n061N7770
$$ 132902 183194 198581 187782 99162 -70533 -206835 -211270 -141954 -114757 -119818 -62048
31595f2048J14638N7224m9464q4000m8271j6260o913j1233m4531p8492l1680Q1714
$$ -62048 52590 109814 60350 -23650 -71921 -88181 -95094 -106327 -150858 -229350 -261030 -179316
31583a79316J18275J8677q0738n9470R578K2337K9004R6723J31958L2627r7022
$$ -179316 -61041 -42364 -123102 -182572 -172994 -150657 -121653 -24930 107028 139655 42633
31572D2633q7302K5842P0170J1247l8300l3466k9961l4764r82M9163N4396M1302
$$ 42633 -44669 -18827 51343 62590 24290 -9176 -39137 -73901 -74883 -25720 28676 69978
31560F9978P1478R6518K1364j17005j87629j56448r2840k1047P6656J38714P7999
$$ 69978 141456 237974 259338 142333 -45296 -201744 -294584 -315631 -238975 -100261 -22262
31549b2262m8937q6583r48Q7095R1951M9876J1071k3380m6059l8723k7669m6684
$$ -22262 -71199 -157782 -158730 -71635 20316 70192 81263 57883 11824 -26899 -54568 -101252
31537a01252o2305l2110K321r803j5717M6920J01896L9810p3935p6314K9897P7900
$$ -101252 -163557 -195667 -193346 -203149 -218866 -171946 -70050 -30240 -104175 -180489 -150592 -72692
31525g2692O646n7078j7847N8384Q4563P4435O3972L6279j2335l1164M575M8072
$$ -72692 -66046 -123124 -140971 -82587 1976 76411 140383 176662 164327 133163 137738 185810
31513A85810N1281J6951l3850q2392r9256p2087l5943k2157j0221J4663J6458
$$ 185810 237091 254042 220192 137800 38544 -33543 -69486 -91643 -101864 -87201 -70743
31502g0743j1515m589M8193M2539o0200j11747J841J34225Q0238q9441j34666
$$ -70743 -82258 -86847 -38654 3885 -56315 -168062 -166221 -31996 48242 -41199 -175865
31491a75865k8323L0543k7940m8023N2326J37275R2163r6j8370K3506M7888K6949
$$ -175865 -204188 -173645 -201585 -249608 -197282 -60007 32156 32060 13690 37196 85084 112033
31479A12033l3260j05092j09733j784J12765Q9683k7360o1922J9724P9812N9809
$$ 112033 78773 -26319 -136052 -137836 -25071 64612 37252 -24670 -4946 74866 134675
31468A34675M7036O5451K3144q0854j16028n0683j0149l8805k6059N2532N6191
$$ 134675 181711 247162 270306 189452 73424 22741 12592 -26213 -52272 260 56451
31457E6451n3753j03980j574R0010K8490o5441l3011M2866p08j07322r0116O4517
$$ 56451 2698 -101282 -102856 -12846 15644 -49797 -82808 -39942 -40650 -147972 -238088 -173571
31445a73571J82633J48895J5798r5973r7939J2983J20839Q6456n8495j22408k5581
$$ -173571 9062 157957 173755 77782 -20157 -7174 113665 200121 141626 19218 -6363
31434f363Q0185N3655l2769n3716l7145n8619p0262o540N4366J1092p0320n5259
$$ -6363 73822 127477 94708 40992 3847 -54772 -125034 -131574 -77208 -66116 -136436 -191695
31422a91695M3082R9502O3301k3865j20434j71015r3958Q4480J84605J02532k2957
$$ -191695 -148613 -49111 14190 -9675 -130109 -301124 -395082 -310602 -125997 -23465 -46422
31411d6422k2483M7204L7103k4133r140N3006L5259l4021j5372P4418P6425k9736
$$ -46422 -68905 -21701 15402 -8731 -17871 35135 70394 36373 21001 95419 171844 142108
31399A42108q5297j7134O2597O0626K1343l783l8011q3227r0698o5195n8015l7817
$$ 142108 56811 39677 102274 162900 184243 180460 142449 59222 -31476 -96671 -154686 -192503
31387a92503P1983K05774J90573J9626r7704m3420L5522j8389j13196p0030P3141
$$ -192503 -120520 85254 275827 295453 197749 154329 189851 171462 58266 -11764 61377
31376F1377J16679R429q3975l8216O6479Q8231J7342n6555r4748j21910j19647
$$ 61377 178056 187485 103510 65294 131773 220004 237346 180791 86043 -35867 -155514
31365a55514k8596J15613J62214M3021r6586q3373K8689M5342n5750r7906j8112
$$ -155514 -184110 -68497 93717 136738 40152 -43221 -14532 30810 -24940 -122846 -140958
31354a40958J5702r5819j78158n2916J54288J96703Q2019K0733O4993O1237m0783
$$ -140958 -125256 -221075 -399233 -452149 -297861 -101158 -19139 1594 66587 127824 87041
31343H7041q9717l135Q4286M1209o4970j02132o5722k6654L397M3760O3015K8905
$$ 87041 -2676 -5811 78475 119684 54714 -47418 -113140 -139794 -136397 -92637 -29622 -717
31331g17j5643j1173K7239M4013K4839j2072n9487r9629q5024j576Q4726J00859
$$ -717 -16360 -27533 -294 43719 68558 56486 -3001 -102630 -187654 -189230 -104504 -3645
31319c645N8507K2017J1780n889m8120q7779r6675p6824m2246J020M4932O9387
$$ -3645 54862 76879 88659 82770 34650 -53129 -149804 -226628 -268874 -267854 -222922 -153535
31307a53535O0865L6671L0758M6857M6014L619m1181l4481O149J2814k3730l7174
$$ -153535 -92670 -55999 -25241 21616 67630 71249 30068 -4413 1736 14550 -9180 -46354
31295d6354L554M5107M7596M7296O5308M2083n1061j14964n3211N4890M7524p3335
$$ -46354 -42800 2307 49903 97199 162507 204590 153529 38565 -14646 40244 87768 14433
31283A4433j30887k9861J05650J09944m507q6127n2069K4635L1851l4854p3544
$$ 14433 -116454 -146315 -40665 69279 64772 -21355 -73424 -48789 -16938 -51792 -125336
31272a25336j2872Q8918J13667L4809n4462o8125k0225K7772M4645K4328k5349
$$ -125336 -138208 -49290 64377 99186 44724 -23401 -43626 -15854 28791 53119 27770
31261B7770n1552M797R3203P4870p0129j66686q2665O1204O5565m4484p2075L1979
$$ 27770 -23782 -18985 74218 149088 78959 -87727 -170392 -109188 -43623 -88107 -160182 -128203
31249a28203J00703K5302q2852p7010J5842O5567L0189j6375l971N6238R8283
$$ -128203 -27500 -2198 -85050 -162060 -146218 -80651 -50462 -66837 -70808 -14570 83713
31238H3713P0817q968o4005l8444L8610R4574R4930M9644k4248r4043j02966l6722
$$ 83713 154530 145562 81557 43113 81723 176297 271227 320871 296623 202580 99614 62892
31226F2892L1578L0459q350j0776J3694l221o2328r1512n9227p953K2446L0325
$$ 62892 94470 124929 116579 105803 119497 116276 53948 -37564 -96791 -104744 -82298 -51973
31214e1973J9569r3L821L8592N1496J1146k2766L683K6867l8628j36875j31383
$$ -51973 -32404 -32497 -28676 9916 61412 72558 49792 53475 80342 41714 -95161 -226544
31202b26544o621J14978J44186R7908K0406m8127m5320M3480J08203L9653q9452
$$ -226544 -233165 -118187 25999 123907 144313 96186 50866 94346 202549 242202 152750
31191A52750j14124k6602K8700J068r629L8928N3567j4297p8796p0835l1619l185
$$ 152750 38626 12024 40724 41792 32163 71091 124658 110361 31565 -39270 -70889 -74074
31179g4074K9222M2453j8991r7246n4473Q8656J34255R019j08064p0289J6861
$$ -74074 -44852 -2399 -21390 -118636 -173109 -84453 49802 58821 -49243 -119532 -102671
31168a02671O945l3606L0900J43564J40562J5494r0776j13007j05482r7540n9574
$$ -102671 -95726 -129332 -98432 45132 185694 201188 110412 -2595 -108077 -205617 -265191
31157b65191O35L5385M2997N6000O3813L8775J0836K6141N9625N4000J6637k161
$$ -265191 -264556 -229171 -186174 -130174 -66361 -27586 -16750 9391 69016 123016 139653 137492
31145A37492L295K368q752j8236l4332n2278l8035j151j2057p8341q9645K0964
$$ 137492 140787 143155 134403 116167 81835 29557 -8478 -9629 -21686 -100027 -189672 -168708
31133a68708J43337J32343J6235o0357m7374j2808N092L2052O0108M4797K166
$$ -168708 -25371 106972 123207 62850 15476 2668 7760 39812 99920 144717 146883
31122A46883l293K6049J9857l5598o5897k0434O0684J08495R3403K5690n6830
$$ 146883 143590 169639 189496 153898 88001 67567 128251 236746 330149 355839 299009
31111B99009j01613q9102n8569m8199l9906r401J5221P783P023M7721P7862L7115
$$ 299009 197396 108294 49725 1526 -38380 -47781 -32560 -24777 -17754 29967 107829 144944
31099A44944k4925j6273M1351M1167l4730q9224o7465k8021k9473m3481k0719
$$ 144944 120019 103746 145097 186264 151534 62310 -5155 -33176 -62649 -106130 -126849
31088a26849L1279P3789Q5680O4660K8161J7537M5816M7999m3155j73939k10077
$$ -126849 -95570 -21781 63899 128559 156720 174257 220073 268072 224917 50978 -159099
31077a59099j13307J3616Q2483J19310J59035J43013J6415j35352j60929m2440
$$ -159099 -272406 -258790 -176307 -56997 102038 245051 261466 126114 -34815 -77255
31067g7255P5330P2485o966m2402k217M2973M6247M4784P5052R3521L9013n8093
$$ -77255 -1925 70560 63594 21192 18975 61948 108195 152979 228031 321552 360565 302472
31055C02472r8553m8265J2807J309n6360o2899J7405J04719R2312k4644j30616
$$ 302472 203919 155654 168461 169770 113410 50511 67916 172635 264947 240303 109687
31044A09687j19530k7966J2785l7337p1090j0277N6808J5768p3374o2284L9129
$$ 109687 -9843 -37809 -25024 -62361 -133451 -143728 -86920 -71152 -144526 -206810 -167681
31033a67681P4345R46m3684J4824N9738p772q9545n1350N6367Q5354J8324l3261
$$ -167681 -93336 -92390 -136074 -121250 -61512 -69284 -158829 -210179 -153812 -68458 -50134 -83395
31021h3395j4470K0907K3502N273j1302k0606j6059K02P808M858J4314K3959j3714
$$ -83395 -97865 -76958 -53456 -48183 -59485 -80091 -96150 -95948 -88140 -83282 -68968 -45009 -58723
31008e8723q1926q5283N384Q4221O2460j408j4021J223k4077n8729k6086N1456
$$ -58723 -140649 -225932 -220548 -136327 -73867 -75275 -89296 -88073 -112150 -170879 -196965 -145509
30996a45509Q5583O1901L5711K3541M083p159J4583L4620J1811j8583o432J7141
$$ -145509 -59926 1975 37686 61227 65310 58151 72734 107354 119165 100582 94150 111291
30984A11291J521k0638J266K4672j3499o6085m6265J6369K7058k504K1270R5655
$$ 111291 112812 92174 93440 118112 104613 38528 -7737 8632 35690 33186 54456 150111
30972A50111J13160L5176n4216q1354o2368m0200l4592n6164r1537q8931k9648
$$ 150111 263271 298447 244231 162877 100509 60309 25717 -30447 -121984 -210915 -240563
30961b40563K3277K1678J6459N5950P9231K6118l0491j946M7738J2373n2106j8265
$$ -240563 -217286 -195608 -179149 -123199 -43968 -17850 -48341 -50287 -2549 9824 -42282 -60547
30949f0547P5937Q0549j1908o6115l6045L46J9385O3178R0522K5560o1449m2623
$$ -60547 15390 95939 84031 17916 -18129 -17783 1602 64780 155302 180862 119413 76790
30937G6790J9711l7571j56208j14206P5190J43912J8542m7609P7574J60519P998
$$ 76790 96501 58930 -97278 -211484 -136294 7618 26160 -21449 56125 216644 224642
30926B24642j82544j40292M8015J10784K0789l6753n283R784k3932m1559m2446
$$ 224642 42098 -98194 -50179 60605 81394 44641 39358 49142 25210 -16349 -58795
30915e8795o5649n6971M0336J20222M6431r7181j04424L1621J11454M2172n4207
$$ -58795 -124444 -181415 -141079 -20857 25574 -71607 -176031 -144410 -32956 9216 -44991
30904d4991p1189n6489o5587n2806J2713O2376M3756J3116L3422O5715L8379l7691
$$ -44991 -116180 -172669 -238256 -291062 -278349 -215973 -172217 -159101 -125679 -59964 -21585 -59276
30892e9276r0438q0990k4854M6691J00268R9003L2280n3105p9792j5799P8694
$$ -59276 -149714 -230704 -255558 -208867 -108599 -9596 22684 -30421 -110213 -126012 -47318
30881d7318J02151K7173n7706n8323k011Q038m9668q8466n1730J5772O0673R0732
$$ -47318 54833 82006 24300 -34023 -36034 -27996 -77664 -166130 -217860 -202088 -141415 -50683
30869e0683J10859Q2037m71o9848q5467r0329j17344j22481p1708r641K3429N6581
$$ -50683 60176 142213 141742 71894 -13573 -103902 -221246 -343727 -415435 -425076 -401647 -345066
30857c45066J03051J04776M2288M054N1576J05612P1365q093l7681l0492n4554
$$ -345066 -242015 -137239 -94951 -90897 -39321 66291 137656 129563 91882 61390 6836
30846F836q4190m2351M7582Q3203L7842j6914k9235j3204P828K4780K9443L5862
$$ 6836 -77354 -119705 -72123 11080 48922 32008 2773 -10431 -2603 22177 51620 87482
30834H7482P3248J09590O0221o3826j19736l8049M9908J2196p2965o3352q25j9491
$$ 87482 160730 270320 330541 266715 146979 108930 158838 171034 98069 34717 33892 14401
30822A4401q7950o2868M3827P7443R099l0411K260L490n2609n0066L9149O9135
$$ 14401 -73549 -136417 -92590 -15147 -6048 -36459 -34199 -30709 -83318 -133384 -94235 -25100
30810b5100l5163j29677p1736O0407J03100M7620R906L8230P2271M9340l3698
$$ -25100 -60263 -189940 -261676 -201269 -98169 -50549 -40643 -2413 69858 119198 85500
30799H5500j27262j50251o2030N5685P2943r82j6262Q0465J40962M0587j14387
$$ 85500 -41762 -192013 -254043 -198358 -125415 -126397 -142659 -62194 78768 119355 4968
30788D968j35346j8520Q0502Q4155N6241M6760J6054o0641j20216r3280k321O1620
$$ 4968 -130378 -148898 -68396 15759 72000 118760 134814 74173 -46043 -139323 -141644 -80024
30776h0024L9963l0870n5468J1159R6991R7607K3655j2285K4603K8930o2777j33712
$$ -80024 -40061 -70931 -126399 -115240 -18249 79358 103013 90728 115331 144261 81484 -52228
30764e2228m9233J13980J51409K2236r5071o3200L6139M8511l5615r8117o6270
$$ -52228 -101461 12519 163928 186164 91093 27893 64032 112543 76928 -21189 -87459
30753h7459J6457O5377L6766m9511j23130j12929j9609P5433R8593N6495j289
$$ -87459 -71002 -5625 31141 -18370 -141500 -254429 -274038 -198605 -100012 -43517 -44806
30742d4806m7991o9231l6398M6477J05320P8401J0403j3209J86k1035o6201m5395
$$ -44806 -92797 -162028 -198426 -151949 -46629 31772 42175 28966 29152 8117 -58084 -103479
30730a03479M6809R9337N9178J1004J8565J7613l9594o3188K0123J04467N7749
$$ -103479 -56670 42667 101845 112849 131414 149027 109433 46245 66368 170835 228584
30719B28584n0041n4117L0816M5804l2601o3908k986L0319j5288l1435L1059N1957
$$ 228584 178543 124426 155242 201046 168445 104537 101551 131870 116582 85147 116206 168163
30707A68163m2962j33924j01391j5553L604j8348K546M1378L0655n93P021K1463
$$ 168163 125201 -8723 -110114 -125667 -122063 -140411 -137865 -96487 -65832 -66425 -59404 -37941
30695c7941o627l1831l230K1339j8129n3592p449M9268J4852n0302k2727O1280
$$ -37941 -44568 -76399 -79629 -58290 -76419 -130011 -137460 -88192 -73340 -123642 -146369 -85089
30683h5089O9028R610J3548R4801J23811M4906n0361q5118q1382o3931j8309L5965
$$ -85089 -16061 -6451 7097 101898 225709 270615 220254 135136 53754 -10177 -28486 7479
30671G479N1237L8581L9029K4649m8951j19812r2573q815J2397j8951O704P5104
$$ 7479 58716 97297 136326 160975 112024 -7788 -100361 -109176 -96779 -115730 -109026 -33922
30659c3922N4000o0154j07359k5603M9549K0400k2006K1839R1749R0519L9900
$$ -33922 20078 -40076 -147435 -173038 -123489 -103089 -125095 -103256 -11507 79012 118912
30648A18912M260k7245p7758j01554o4259j8405j2017l530N1439J07176J00734
$$ 118912 123172 95927 18169 -83385 -147644 -166049 -178066 -181596 -130157 -22981 77753
30637G7753M8247r82l9748p0393o4510j6543K1409R844k6281n0617o1242n9110
$$ 77753 126000 125018 85270 14877 -49633 -66176 -44767 -34923 -61204 -111821 -173063 -232173
30625b32173l5935r260n6K4364R8805J61650J18758P93o9363o3448n8292o1809
$$ -232173 -268108 -277368 -277424 -253060 -154255 7395 126153 126946 57583 -5865 -64157 -125966
$$ [...]
##END NTUPLES=NMR SPECTRUM
##END=
