##TITLE=31Pdec_LY-TMF-6.70.3
 D2O, 24 sc
 28.2.2020
##JCAMPDX= 6.0         $$ Bruker NMR JCAMP-DX V2.0
##DATA TYPE= NMR SPECTRUM
##DATA CLASS= NTUPLES
##ORIGIN= UXNMR, Bruker Analytische Messtechnik GmbH
##OWNER= root
$$ XWIN-NMR		Version 3.5
$$ Fri Feb 28 15:58:38 2020 Russian Standard Time (UT+4h)  she@DPX200
##.OBSERVE FREQUENCY= 81.013821
##.OBSERVE NUCLEUS= ^31P
##.ACQUISITION MODE= SIMULTANEOUS
##.ACQUISITION SCHEME= undefined
##.AVERAGES= 24
##.DIGITISER RES= 17
##SPECTROMETER/DATA SYSTEM= spect
##.PULSE SEQUENCE= zgpg30
##.SOLVENT NAME= CDCl3
##.SHIFT REFERENCE= (INTERNAL, CDCl3, 0, 182.463)
##AUDIT TRAIL= $$ (NUMBER, WHEN, WHO, WHERE, WHAT)
$$ ##TITLE= Audit trail, XWIN-NMR		Version 3.5
$$ ##JCAMPDX= 5.01
$$ ##ORIGIN= Bruker BioSpin GmbH
$$ ##OWNER= she
$$ F:/spectra/data/she/nmr/P31/1/pdata/1/auditp.txt
$$ ##AUDIT TRAIL=  $$ (NUMBER, WHEN, WHO, WHERE, WHAT)
(   1,<2020-02-28 15:57:30.65 +0400>,<she>,<DPX200>,
      <created by zg, POWCHK disabled, PULCHK disabled
       configuration hash MD5:
       00 E9 B6 7A A2 85 ED C7 34 08 36 98 17 FE 4E 26
       data hash MD5: 32K
       D1 CB 1E 2B DE 0A BD 08 E4 0A EB 24 54 76 CD DC>)
(   2,<2020-02-28 15:57:33.04 +0400>,<she>,<DPX200>,
      <Start of raw data processing
       efp BC_mod = 2 LB = 1 FT_mod = 6 PKNL = 1 PHC0 = -1613.835 PHC1 = 671.0013 SI = 64K 
       data hash MD5: 64K
       87 85 41 EB 01 27 61 6A 95 20 C3 F9 8A B9 77 F4>)
(   3,<2020-02-28 15:57:50.79 +0400>,<she>,<DPX200>,
      <pk PHC0 = 1.909225 PHC1 = 0 
       data hash MD5: 64K
       E5 76 41 DE 40 A2 23 1B 68 1D 17 DA 6E 85 32 10>)
(   4,<2020-02-28 15:57:53.93 +0400>,<she>,<DPX200>,
      <abs ABSG = 5 
       data hash MD5: 64K
       D7 B7 3C 55 3D A8 75 99 E0 6D D4 F3 9E BA 5C 4F>)
$$ ##END=
$$ 
$$ hash MD5
$$ 6F 9E A5 D0 FC 6E 8E 69 50 C8 57 51 81 F0 0A 22
##$RELAX= 
##$RELAX= 
##$RELAX= 
##$RELAX= 
##$RELAX= 
##$RELAX= 
##$RELAX= 
##$RELAX= 
$$ Bruker specific parameters
$$ --------------------------
##$DU= <F:/spectra>
##$EXPNO= 1
##$NAME= <P31>
##$PROCNO= 1
##$TYPE= <nmr>
##$USER= <she>
##$AMP= (0..31)
100 100 100 100 100 100 100 100 100 100 100 100 100 100 100 100 100 100 
100 100 100 100 100 100 100 100 100 100 100 100 100 100 
##$AQSEQ= 0
##$AQ_mod= 1
##$AUNM= <au_zg>
##$AUTOPOS= <>
##$BF1= 81.014009
##$BF2= 200.13
##$BF3= 200.13
##$BF4= 200.13
##$BF5= 200.13
##$BF6= 200.13
##$BF7= 200.13
##$BF8= 200.13
##$BYTORDA= 1
##$CFDGTYP= 0
##$CFRGTYP= 5
##$CHEMSTR= <none>
##$CNST= (0..31)
1 1 145 1 1 1 1 1 1 1 1 1 1 1 1 1 1 1 1 1 1 1 1 1 1 1 1 1 1 1 1 1 
##$CPDPRG= <waltz16>
##$CPDPRG1= <>
##$CPDPRG2= <waltz16>
##$CPDPRG3= <>
##$CPDPRG4= <mlev>
##$CPDPRG5= <mlev>
##$CPDPRG6= <mlev>
##$CPDPRG7= <mlev>
##$CPDPRG8= <mlev>
##$CPDPRGB= <>
##$CPDPRGT= <>
##$D= (0..31)
0 1 0 0 0 0 0 0 0 0 0 0.03 2e-05 3e-06 0 0 0 0 0 0 0 0 0 0 0 0 0 0 0 0 
0 0 
##$DATE= 1582891050
##$DBL= (0..7)
120 120 120 11 120 120 24 19 
##$DBP= (0..7)
150 150 150 150 150 150 150 150 
##$DBP07= 0
##$DBPNAM0= <>
##$DBPNAM1= <>
##$DBPNAM2= <>
$$ [...]
##$SUBNAM3= <"">
##$SUBNAM4= <"">
##$SUBNAM5= <"">
##$SUBNAM6= <"">
##$SUBNAM7= <"">
##$SUBNAM8= <"">
##$SUBNAM9= <"">
##$SW= 369.568048894756
##$SWIBOX= (0..15)
0 1 3 0 0 0 0 0 0 0 0 0 0 0 0 0 
##$SW_h= 29940.119760479
##$TD= 32768
##$TD0= 1
##$TE= 0
##$TE2= 300
##$TE3= 300
##$TEG= 300
##$TL= (0..7)
0 120 53 12 22 120 120 120 
##$TP= (0..7)
150 150 150 150 150 150 150 150 
##$TP07= 0
##$TPNAME0= <>
##$TPNAME1= <>
##$TPNAME2= <>
##$TPNAME3= <>
##$TPNAME4= <>
##$TPNAME5= <>
##$TPNAME6= <>
##$TPNAME7= <>
##$TPOAL= (0..7)
0.5 0.5 0.5 0.5 0.5 0.5 0.5 0.5 
##$TPOFFS= (0..7)
0 0 0 0 0 0 0 0 
##$TUNHIN= 0
##$TUNHOUT= 0
##$TUNXOUT= 0
##$USERA1= <user>
##$USERA2= <user>
##$USERA3= <user>
##$USERA4= <user>
##$USERA5= <user>
##$V9= 5
##$VALIST= <valist>
##$VCLIST= <CCCCCCCCCCCCCCC>
##$VD= 0
##$VDLIST= <DDDDDDDDDDDDDDD>
##$VPLIST= <PPPPPPPPPPPPPPP>
##$VTLIST= <TTTTTTTTTTTTTTT>
##$WBST= 1024
##$WBSW= 4
##$XGAIN= (0..3)
0 0 0 0 
##$XL= 0
##$YL= 0
##$YMAX_a= 5055
##$YMIN_a= -5755
##$ZGOPTNS= <>
##$ZL1= 120
##$ZL2= 120
##$ZL3= 120
##$ZL4= 120
##$ABSF1= 182.463
##$ABSF2= -187.1042
##$ABSG= 5
##$ABSL= 3
##$ALPHA= 0
##$AQORDER= 0
##$ASSFAC= 0
##$ASSFACI= 0
##$ASSFACX= 0
##$ASSWID= 0
##$AUNMP= <proc_1d>
##$AZFE= 0.1
##$AZFW= 0.5
##$BCFW= 0
##$BC_mod= 2
##$BYTORDP= 0
##$COROFFS= 0
##$CY= -3
##$DATMOD= 1
##$DC= 0
##$DFILT= <>
##$DTYPP= 0
##$F1P= 0
##$F2P= 0
##$FCOR= 1
##$FTSIZE= 65536
##$FT_mod= 6
##$GAMMA= 0
##$GB= 0
##$INTBC= 1
##$INTSCL= 5.30512e-09
##$ISEN= 30
##$LB= 1
##$LEV0= 0
##$LPBIN= 0
##$MAXI= 10000
##$MC2= 0
##$MEAN= 0
##$ME_mod= 0
##$MI= 50
##$NCOEF= 0
##$NC_proc= -6
##$NLEV= 6
##$NOISF1= 182.463
##$NOISF2= 159.3651
##$NSP= 0
##$NTH_PI= 0
##$NZP= 0
##$OFFSET= 182.463
##$PC= 4
##$PHC0= -1611.926
##$PHC1= 671.0013
##$PH_mod= 1
##$PKNL= yes
##$PPARMOD= 0
##$PSCAL= 0
##$PSIGN= 0
##$REVERSE= no
##$SF= 81.0140089999434
##$SI= 65536
##$SIGF1= 159.3651
##$SIGF2= -187.1042
##$SINO= 113.3802
##$SIOLD= 16384
##$SREGLST= <1H.CDCl3>
##$SSB= 0
##$STSI= 65536
##$STSR= 0
##$SW_p= 29940.119760479
##$SYMM= 0
##$S_DEV= 0
##$TDeff= 32768
##$TDoff= 0
##$TI= <>
##$TILT= no
##$TM1= 0
##$TM2= 0
##$TOPLEV= 0
##$USERP1= <user>
##$USERP2= <user>
##$USERP3= <user>
##$USERP4= <user>
##$USERP5= <user>
##$WDW= 1
##$XDIM= 65536
##$YMAX_p= 301988389
##$YMIN_p= -24126951
$$ End of Bruker specific parameters
$$ ---------------------------------
##NTUPLES= NMR SPECTRUM
##VAR_NAME=  FREQUENCY,     SPECTRUM/REAL,   SPECTRUM/IMAG
##SYMBOL=    X,             R,               I
##VAR_TYPE=  INDEPENDENT,   DEPENDENT,       DEPENDENT
##VAR_FORM=  AFFN,          ASDF,            ASDF
##VAR_DIM=   65536,         65536,           65536
##UNITS=     HZ,            ARBITRARY UNITS, ARBITRARY UNITS
##FACTOR=    0.456856943014862, 1,           1
##FIRST=     14782.0589164792, 0,            0
##LAST=      -15158.0608439998, 0,           0
##MIN=       -15158.0608439998, -24126951,   0
##MAX=       14782.0589164792, 301988389,    0
$$ Real data points
##PAGE= N=1
##DATA TABLE= (X++(R..R)), XYDATA
$$ [...]
36633C950575j844811l87729M64746K45568J82408K89965n44893j915278k088994
36624a648443r81571m29633j059743j221040J35073J553072J282012p2259m79869
36615b922401O93339J971350J699188J2431j282954p84854O81438R21829o97671
36606B91695k159659j456254O11548J588900O63402o95829j073779n73358M7022
36597b756312L82291L69675K51921N73256J419652J923194J376643M06221N1658
36588C998199K03350O8684l79401o63366r20246j406768j482692n54733N34259
36579f02714N80564j07639m51712m51177n66183j89251J160616K040368R69323
36570B382195o85630n58877O18521P7526k085501k750474q85391R41063J042366
$$ plain form
36633 3950575 2105764 1718035 2182781 2428349 2610757 2900722 2355829 440551 -1648443
36624 -1648443 -2630014 -3059647 -4119390 -5340430 -5205357 -3652285 -2370273 -2442532 -2922401
36615 -2922401 -2229062 -257712 1441476 1453907 170953 -613901 67537 989366 291695
36606 291695 -1867964 -3324218 -2712670 -1123770 -460368 -1156197 -2229976 -2803334 -2756312
36597 -2756312 -2374021 -2004346 -1752425 -1179169 240483 2163677 3540320 3946541 3998199
36588 3998199 4201549 4270233 3890832 3227466 2307220 900452 -582240 -1136973 -602714
36579 -602714 -22150 -129789 -581501 -1032678 -1598861 -1788112 -627496 1412872 2382195
36570 2382195 1696565 1137688 1756209 1833735 -251766 -3002240 -3887631 -2946568 -1904202
36561a904202Q56809J351157R54795q93519j636121L46287K490693J734662r17476
36552B383085k355398j866362q56527J46017J326100J843754J022080J23887M75978
36543B242614J023233J36264j457565k028730j784727j837877j590459l0429J554370
36534c773306J255221K1023K90735J833403K179776P83360m47337n55939l74932
36525A212004j16160P49783J296745N1088j858652j774045J05365Q88529j06477
36516D48180l86220R96385J678589L61676q12724j92680N21324l61413j402103
36507H51014q71484j6009p01767k013257j960975p18516M37274J627030L189007
36498a77683L699245J946046n05251j380238j020007j049674j164945j44668J187705
$$ plain form
36561 -1904202 -1047393 303764 1258559 365040 -1271081 -924794 1565899 3300561 2383085
36552 2383085 27687 -1838675 -2695202 -2549185 -1223085 620669 1642749 1766636 2242614
36543 2242614 3265847 3402111 1944546 -84184 -1868911 -3706788 -5297247 -5327676 -3773306
36534 -3773306 -2518085 -2497062 -2206327 -372924 1806852 2590212 2142875 1586936 1212004
36525 1212004 1095844 1845627 3142372 3193460 1334808 -439237 -333872 554657 448180
36516 448180 61960 1058345 2736934 3098610 2285886 2093206 2614530 2253117 851014
36507 851014 -20470 -36479 -738246 -2751503 -4712478 -5430994 -4993720 -3366690 -177683
36498 -177683 3521562 5467608 4962357 3582119 2562112 1512438 347493 202825 1390530
36489A390530J129823K49359K11786L58366j097161l078633k655792j2597J441751
36480b062568M62319l02599R49362K316240J781516N16308M41566R98093O40921
36471E741158l49589p42137n97268p13525j020476j121116j246815j301428l60532
36462a711728J453141K185089Q25548p05539k95426J115737J235634P0908n97603
36453C575761m07622m62065q32940o66716l69787r92780j678920o23364J360002
36444a098431J372379q68929k082409m38778J546091J079319o34065p48289O14270
36435a258842J051485j1915q27551m58282K13443N51596R02439J080817K90117
36426A533307r84393r72976P46065K267213J886202K39092r92385j315071j345247
$$ plain form
36489 1390530 2520353 2769712 2981498 3339864 2242703 -835930 -3491722 -3504319 -2062568
36480 -2062568 -1600249 -1902848 -953486 1362754 3144270 3660578 4102144 5100237 5741158
36471 5741158 5391569 4649432 4052164 3338639 2318163 1197047 -49768 -1351196 -1711728
36462 -1711728 -258587 1926502 2752050 2046511 1751085 2866822 4102456 4173364 3575761
36453 3575761 3168139 2706074 1873134 1206418 836631 -156149 -1835069 -2458433 -1098431
36444 -1098431 273948 -594981 -2677390 -3116168 -1570077 -490758 -1124823 -1873112 -1258842
36435 -1258842 -207357 -219272 -1046823 -1505105 -1291662 -740066 162373 1243190 1533307
36426 1533307 548914 -424062 322003 2589216 4475418 4714510 3722125 2407054 1061807
36417A061807j433360j435411j279059r19780k07285N96545P80129K71754L4087
36408b530573O19506J110387N02279n31618n31747M73466R94303L65790l97378
36399G4415l72206m5568j64968l71949j0727M53933Q4241p79813p62692L79922
36389a515412J120902L67196p36062l58154J230384J869723N77066j035456j086602
36380D33585k292L85969l81774r26560k32738R96464J533200J176219N73341J83567
36370C738981k2670k29099n36139q03197o47652l5944K10299o69837j848052j422527
36360b265837R51969L011779K475711l0473j813325j476793k02796K92832j41394
36351H01673m97464k92179j20060o62107j575745j648596k22233J695660K271034
$$ plain form
36417 1061807 -371553 -1806964 -3086023 -4005803 -4213088 -3616543 -2836414 -2564660 -2530573
36408 -2530573 -1911067 -800680 -298401 -830019 -1361766 -888300 106003 471793 74415
36399 74415 -297791 -343359 -508327 -880276 -891003 -437070 -352829 -1132642 -1895334 -1515412
36389 -1515412 -394510 -27314 -763376 -1121530 108854 1978577 2555643 1520187 433585
36380 433585 431293 817262 435488 -491072 -723810 272654 1805854 2982073 3555414 3738981
36370 3738981 3716311 3487212 2951073 2147876 1500224 1464280 1674579 1004742 -843310 -2265837
36360 -2265837 -1313868 1697911 4173622 4143149 2329824 853031 650235 943067 801673
36351 801673 304209 12030 -108030 -770137 -2345882 -3994478 -4216711 -2521051 -250017
36342b50017R50988q48462j486409r01464j75090O0957L1749Q4960L39647P95885
36332a397256J160027R10187J38138j84736M63503J112044N22406j000273k015651
36323b91611j759532n70594R52355K070746J809100J92310r57475j63284J217367
36314B499382O85942j438625k183583l41484J820705K101006J128934L09643o04121
36305C977799k027464k646047j299493O14382R18042j14516n06715J62456M98927
36296d22629m8710m19686Q9468Q30223R97023N45098j05025l10706M33666J394520
36286B983242P39548j830622l681668k424498M59495J549703L29838o63419j79982
36277b718363L78560J70934K87306J079374J152271K19427O6079J180798J315039
$$ plain form
36342 -250017 700971 -147491 -1633900 -2535364 -2710454 -2649497 -2617748 -2532788 -2193141 -1397256
36332 -1397256 -237229 672958 811096 626360 1089863 2201907 2724313 1724040 -291611
36323 -291611 -2051143 -2621737 -1669382 401364 2210464 2402774 1445299 1282015 2499382
36314 2499382 3185324 1746699 -436884 -778368 1042337 3143343 4272277 4581920 3977799
36305 3977799 1950335 -695712 -1995205 -1380823 -462781 -577297 -1084012 -921556 -422629
36296 -422629 -471339 -891025 -801557 28666 1025689 1570787 1465762 1155056 1588722 2983242
36286 2983242 3722790 1892168 -1789500 -4213998 -3754503 -2204800 -1874962 -2538381 -2718363
36277 -2718363 -2339803 -2168869 -1881563 -802189 350082 569509 635588 1816386 3131425
36268C131425o60895k227673j012008J265860J481187j61331j114012p35204m03457
36259d36108m31834l5268L08194m10954j112099O7331K070533J910435m38174
36250A492056j616684j07967J521145R26613o16890r60327m74815m88440n66056
36241h91365K25177J014498M93496o55613r08844m24280l11379l82763J60598
36232a680475O62313n376r94394n16470R37333J018955o30605j557374l16683
36223c082776J210671O95389j189825j872999m41322J492026K110989J334962
36215B57115L77496J45468L58525R7404q85625j688652j422506n02526p3076l23775
36205c660152k89821N77496J533225J552533N72767n52978q65226j1984J308004
$$ plain form
36268 3131425 2470530 242857 -769151 496709 1977896 1816565 702553 -32651 -436108
36259 -436108 -867942 -903210 -595016 -1005970 -2118069 -2050738 19795 1930230 1492056
36250 1492056 -124628 -232595 1288550 2215163 1598273 637946 163131 -325309 -891365
36241 -891365 -666188 348310 841806 186193 -722651 -1146931 -1458310 -1841073 -1680475
36232 -1680475 -1018162 -1023538 -2017932 -2534402 -1597069 -578114 -1208719 -2766093 -3082776
36223 -3082776 -1872105 -1176716 -2366541 -4239540 -4680862 -3188836 -1077847 257115
36215 257115 634611 780079 1138604 1236008 350383 -1338269 -2760775 -3263301 -3336377 -3660152
36205 -3660152 -3949973 -3372477 -1839252 -286719 286048 -266930 -1132156 -1144140 163864
36196A63864J728468P25024m96702n38586J03242j50684j232115j338584M3500
36187i92573J034214L16091o51008J3631J486110J500058j28472j399200j242773
36178f3922o36527m64666k66540K58689K66036o34955j129106M5684J843365J952071
36168A170129P139j643742r64614R66568J301495o99283k501187j664552P70742
36159c257305J770791O61407j11325R64250J946849O33927j566698j597831L07480
36150b48455Q37459r59278j746648R21209M195226L512518q60726m053385l167263
36141a569343n86434J61942p84855q72680N01267J382085O36634l62815k3609
36132a517808J164153J638965J024743K18985j80233l72228n01060l83644j57977
$$ plain form
36196 163864 1892332 2617356 2120654 1582068 1685310 1534626 302511 -1036073 -992573
36187 -992573 41641 357732 -293276 -279645 1206465 2706523 2578051 1178851 -63922
36178 -63922 -700449 -1165115 -1431655 -1172966 -906930 -1541885 -2670991 -2625307 -781942 1170129
36168 1170129 1177268 -466474 -1431088 -464520 836975 137692 -2363495 -4028047 -3257305
36159 -3257305 -1486514 -825107 -936432 27818 1974667 2608594 1041896 -555935 -248455
36150 -248455 589004 -370274 -2116922 -1195713 2999513 6512031 5651305 1597920 -1569343
36141 -1569343 -2155777 -1993835 -2778690 -3651370 -3150103 -1768018 -1131384 -1494199 -1517808
36132 -1517808 -353655 1285310 2310053 2529038 2348805 1976577 1475517 1091873 933896
36123I33896k91603p21220p43861n8818P24803R26080N61520K652n13498o93332
36113A26619j70538Q13317J266002N62546o86597j374826j132775m22727J21235
36104h97744K3109p83724j520190j039680N99394J752326J225736k7878l41356
36095a010007K20893K91536l18043k86917Q97350J888538J368053j83878j264732
36086A602793j048670J76297J464559J718573N92026p55957p63501L02383L93763
36077C682266j390031l192224k810764o72796R96721J239408R72669Q85022N47927
36068B58198q1229J8263J156893J731611K04245k272641k778207m09496K199953
36059B7590K038133m74262k153136j272307M59511O72388l73975o06205N94838
$$ plain form
36123 933896 642293 -78927 -822788 -881606 -156803 769277 1330797 1333449 819951 126619
36113 126619 -43919 769398 2035400 2597946 1911349 536523 -596252 -1018979 -897744
36104 -897744 -874635 -1658359 -3178549 -4218229 -3618835 -1866509 -640773 -668651 -1010007
36095 -1010007 -789114 -497578 -815621 -1102538 -205188 1683350 3051403 2867525 1602793
36086 1602793 554123 730420 2194979 3913552 4505578 3749621 2986120 3288503 3682266
36077 3682266 2292235 -899989 -3710753 -4383549 -3386828 -2147420 -1174751 -289729 258198
36068 258198 176969 195232 1352125 3083736 3287981 1015340 -1762867 -2172363 27590
36059 27590 2065723 1591461 -561675 -1833982 -1374471 -702083 -1076058 -1682263 -1087425
36050a087425J658694J305994J80847m77441n22730m75168l33858J99247P74991
36041A223151O00153m67481j621839j975367j419208n89314j30402n0369J19005
36032d311671N21292O96091L66926M4426K87258P75237Q52150O07631N07072L07990
36022F54402m82339j279767r45291L11719J013788O65314L91775Q16281Q88962
36013B034844k35952j517647j436078j71064P51649M07882p42329j490934q39513
36004c239142R41716J994867P87384j422550j719356L05081J619603J79038j936520
35995b489879j748000K00160J179450O04955J21809J97456k94893j225304q96388
35986d350634R25261K181747J516792N2293o10646l77731J12919O19636Q66908
$$ plain form
36050 -1087425 571269 1877263 2058110 1580669 1057939 582771 248913 448160 1223151
36041 1223151 1823304 1355823 -266016 -2241383 -3660591 -4249905 -4380307 -4430676 -4311671
36032 -4311671 -3790379 -3094288 -2727362 -2682936 -2395678 -1620441 -768291 -160660 346412 654402
36022 654402 172063 -1107704 -2052995 -1741276 -727488 -62174 329601 1145882 2034844
36013 2034844 1798892 281245 -1154833 -1325897 -574248 -166366 -908695 -2399629 -3239142
36004 -3239142 -2297426 -302559 484825 -937725 -2657081 -2352000 -732397 -553359 -2489879
35995 -2489879 -4237879 -4037719 -2858269 -2253314 -2131505 -1934049 -2228942 -3454246 -4350634
35986 -4350634 -3425373 -1243626 273166 325459 -285187 -662918 -549999 69637 936545
35977I36545M17040l24507k91961M80368O46155l25190j210005q98323J12267
35968d57611P76130Q07831L04111o53854j381814r25498K92663N90994l94797
35959a041845q16479N53512K093484J522754p53998k231046j639449o3648J024511
35950a352204J306032J036224K26548r76324j778564j349956L9826R75429M61864
35941a411125o12675m30250J097138J863005O53103p44167k57664R22231J55587
35932A235183j992802k239866M1629J535153L05743j098058p6236J594255Q70835
35923A75836j291630j440645Q03534K317927J385161j96215l33231O54552J306959
35914C382248J038827J32507q68763j268045q09248k73548m49988p98715m18970
$$ plain form
35977 936545 1353585 1029078 737117 1217485 1863640 1538450 328445 -569878 -457611
35968 -457611 318519 1126350 1430461 776607 -605207 -1530705 -1238042 -647048 -1041845
35959 -1041845 -1858324 -1304812 788672 2311426 1557428 -673618 -2313067 -2376715 -1352204
35950 -1352204 -46172 990052 1216600 240276 -1538288 -2888244 -2848418 -1872989 -1411125
35941 -1411125 -2023800 -2454050 -1356912 506093 1159196 415029 157365 1079596 1235183
35932 1235183 -757619 -2997485 -2955856 -1420703 -1114960 -2213018 -2289254 -694999 175836
35923 175836 -1115794 -2556439 -1752905 565022 1950183 1753968 1420737 2075289 3382248
35914 3382248 4421075 4553582 3684819 2416774 1607526 1333978 883990 85275 -333695
35905c33695J31336l23235j253532r47521O10989J432478M89238q97434j252034
35896b343410q16223m55548j90837K95951Q49165J263089J537244J282530L5591
35887A457552j447527j590483k63999P62246L76715l16673o062O57519K98234
35878g2478p89489j084622k11633N90666L32037n20885q65249k25533R92577J992972
35868A38363K137294J314557R636r88767j098795m59199K1370l89204j052677
35859c67422m83815J404002K594102J597502k08307n44843K23694k15449k061725
35850A937739k689840p40125J509007J288926r55117k589814k169900l00922J722541
35841b987505K709851K004435M29214j86024M34282K61824j784560l403145j879027
$$ plain form
35905 -333695 -202359 -525594 -1779126 -2726647 -2115658 -683180 -193942 -1091376 -2343410
35896 -2343410 -3159633 -3615181 -3806018 -3510067 -2660902 -1397813 139431 1421961 1457552
35887 1457552 10025 -1580458 -1844457 -1082211 -705496 -1022169 -1028231 -370712 -72478
35878 -72478 -861967 -1946589 -2158222 -1567556 -1235519 -1756404 -2621653 -2847186 -1854609 138363
35868 138363 2275657 3590214 3599850 2611083 1512288 1053089 1074459 685255 -367422
35859 -367422 -851237 552765 3146867 4744369 4536062 3991219 4214913 3999464 1937739
35850 1937739 -752101 -1492226 16781 1305707 350590 -2239224 -4409124 -4710046 -2987505
35841 -2987505 -277654 1726781 2155995 1969971 2404253 2666077 881517 -2521628 -4400655
35832d400655J636622L327307J705593r65326k063552j187652O08892J944754
35824F05983J382486j190380l247230k030222J377701K951971J327882l99221
35816G78970K61094J417358L68345j716451j847759j69511O61235J20076K06336
35807G9693J333882J448065r0349j084095k45196O36194J7767o39065K47369J096667
35797B800932k91123k572753k573821l24179J044229L26281k56113P61833J667437
35788E82723Q02735n38655m77238K94656K3505r37800q98764J34792N61616n2341
35778e04771m38545J54835J001317J298155J043052L99094m76770r12459l16479
35769A247429O61763P95282O7784m42420l15789m4706K49745P21156O07662q73688
$$ plain form
35832 -4400655 -2764033 563274 2268867 1303541 -760011 -1947663 -1338771 605983
35824 605983 1988469 798089 -2449141 -4479363 -3101662 -149691 1178191 778970
35816 778970 1040064 2457422 2825767 1109316 -738443 -907954 -246719 -126643 79693
35807 79693 1413575 2861640 2771291 1687196 1442000 2078194 2095961 1456896 1704265 2800932
35797 2800932 2509809 -62944 -2636765 -2960944 -1916715 -1590434 -1846547 -1084714 582723
35788 582723 1385458 846803 369565 664221 687726 -250074 -1148838 -1014046 -452430 -504771
35778 -504771 -943316 -788481 212836 1510991 2554043 2953137 2476367 1563908 1247429
35769 1247429 1909192 2704474 2772258 2329838 2014049 1969343 2219088 2940244 3547906 2674218
35759B674218k400654j643416J001139K242965N13313j683776j598251j15140
35751a009602L48259j10032L27785J559225J669573K93584q47596q83155q40416
35742E07625j357174j585586j080980p67147j055461p93710O77784J923980J353124
35733b177545l19865j108719n55193Q2822Q4184R9775O33848J125417J030060
35724a105216O96724N14189J07054p83999j362121p83295L50394P33659M06718
35715a225893O18766J442327J207843p53910k334929j259448J463014K647867
35707A805637J190252p53475j010725N5508Q41878P13876J3376q67402j454270
35698E34655j193804k99862K35217M0393k04009j78091m52446j003496p61963
$$ plain form
35759 2674218 273564 -1369852 -368713 1874252 2387565 703789 -894462 -1009602
35751 -1009602 -661343 -771375 -443590 1115635 2785208 3078792 2231196 1348041 507625
35742 507625 -849549 -2435135 -3516115 -4283262 -5338723 -6132433 -5454649 -3530669 -2177545
35733 -2177545 -2497410 -3606129 -4161322 -4078500 -3994316 -3894541 -3260693 -2135276 -1105216
35724 -1105216 -408492 105697 212751 -571248 -1933369 -2716664 -2366270 -1632611 -1225893
35715 -1225893 -607127 835200 2043043 1289133 -1045796 -2305244 -842230 1805637
35707 1805637 2995889 2242414 1231689 1287197 2129075 2842951 2856327 1988925 534655
35698 534655 -659149 -959011 -723794 -683401 -887410 -1065501 -1517947 -2521443 -3283406
35689c283406M30816J062734L65191k29256L92322Q34606l60152j695532q45286
35680c327963J334428J948311O32317k24245K37153K00063j071632j645000m46280
35671b362848N66307k93042j367419k64397K171556L016345J441690n72118j247581
35662A088493p43544j6157L79442K58009j82961k85722K05917M79524j53945q50454
35652A78602l27507R25293J088203k54655j412552j093155j18379K19270J92666
35643f02214P08107J243915M47370j383103k146716p86236J141341J657523R49602
35634A229589M73706M04941k26609j254090j325626m01854j76798j162246j421321
35625c860308L43078K273428J924011m7942j056733m86146Q1030n7706q8444L2907
$$ plain form
35689 -3283406 -2852590 -1789856 -1424665 -1653921 -1261599 -426993 -787145 -2482677 -3327963
35680 -3327963 -1993535 -45224 587093 362848 600001 800064 -271568 -1916568 -2362848
35671 -2362848 -1796541 -2089583 -3457002 -3721399 -1549843 1466502 2908192 2336074 1088493
35662 1088493 344949 328792 708234 966243 783282 497560 703477 1183001 1029056 178602
35652 178602 -148905 776388 1864591 1609936 197384 -895771 -1014150 -794880 -602214
35643 -602214 105893 1349808 1797178 414075 -1732641 -2518877 -1377536 279987 1229589
35634 1229589 1703295 2108236 1881627 627537 -698089 -1099943 -1276741 -2438987 -3860308
35625 -3860308 -3517230 -1243802 680209 632267 -424466 -910612 -829582 -887288 -975732 -942825
35615i42825n85583j384543n85214J480933K025857K250j893344j074236J243561
35606a713144K135286J019308m10889r61398o68198J99941J053278Q15085n16577
35597I52692j155710l5258J150420L77621j352188j457379J87536J255994P18260
35588F41988m7415p2988j82500q82409j142025l72933J94650n58970j645802j306271
35578e374675L91205J544585Q37577q55705j455922o0404J858030K034038K58620
35569h22651j230561p65136M89248N04593m50964n36379L85528N44929n32563
35560b413956r89571L48998J925084J723088J54350p91022l61490L93966M46839
35551D36286j8800k33520O9840L96059J63975m25069n07810J83785P67136N61852
$$ plain form
35615 -942825 -1528408 -2912951 -3498165 -2017232 8625 10875 -1882469 -2956705 -1713144
35606 -1713144 422142 1441450 1030561 69163 -599035 -399094 654184 1469269 952692
35597 952692 -203018 -238276 912144 1289765 -62423 -1519802 -1332266 -76272 641988
35588 641988 594573 521585 339085 -543324 -1685349 -2058282 -1863632 -2422602 -4068404 -5374675
35578 -5374675 -4983470 -3438885 -2601308 -3457013 -4912935 -4973339 -3115309 -1081271 -822651
35569 -822651 -2053212 -2818348 -2329100 -1824507 -2275471 -2811850 -2426322 -1881393 -2413956
35560 -2413956 -3403527 -3054529 -1129445 593643 747993 -43029 -404519 -10553 436286
35551 436286 417486 183966 253806 649865 813840 388771 -119039 64746 831882 1393734
35541A393734K48567N51865N49138r70045k913170k831278n67289J271860R96528
35532b270090k22702q51739j085550j228689l42181J669412K651279J116948j011538
35523a574850j008892N50031R33726l38477j096366l06700N58328L42580r7547
35514b038167J67601N86360N44969O49709J433863K072063J528086P6524j243999
35505C777009j911298j888059j124111P6226Q48342P25801L00732K96816N40035
35496A641493M70716P5439l86955r78552j577144j363969R8928J617879J462894
35487A060729k11375j278416m21412J134166J509100Q27990O31787J117531P59068
35478E129168r31583k021681q01997J401606J801707o1615j994139k441226k029798
$$ plain form
35541 1393734 1642301 2194166 2743304 1773259 -1139911 -3971189 -4538478 -3266618 -2270090
35532 -2270090 -2492792 -3344531 -4430081 -5658770 -6000951 -4331539 -1680260 -563312 -1574850
35523 -1574850 -2583742 -2033711 -1099985 -1438462 -2534828 -2841528 -2283200 -1940620 -2038167
35514 -2038167 -1870566 -1284206 -739237 -89528 1344335 3416398 4944484 5021008 3777009
35505 3777009 1865711 -22348 -1146459 -1070233 -221891 503910 804642 1101458 1641493
35496 1641493 2112209 2187648 1800693 822141 -755003 -2118972 -2020044 -402165 1060729
35487 1060729 849354 -429062 -850474 283692 1792792 2620782 3252569 4370100 5129168
35478 5129168 4197585 2175904 1373907 2775513 4577220 4515605 2521466 80240 -1949558
35469a949558j497471l53659J310615J753337O7069j821397j648005j38709L60601
35460c917177l04556j90075J185857K029122J298759J10326n18713j059204j710860
35451c076521j416964J14655J308747J079520N82030J013925J316492P7288j583623
35442e84451j391728N13740J733409J130363L5052j95692J75255M70348O58926
35433B545222N87416k88860j624208j967519p01909R10330J474856J193029Q79061
35424C007418L21150r92944k181012j648109M84292K026870J342982o06225j550767
35415B03655o98064N90239P66794r9265q45391r09946o96096l99291M85243J968382
35405C66260K728658J527819q17068k023944j112600L88652M84198q05299j701803
$$ plain form
35469 -1949558 -3447029 -3800688 -2490073 -736736 -669667 -2491064 -4139069 -4277778 -3917177
35460 -3917177 -4221733 -4411808 -3225951 -1196829 101930 212256 -306457 -1365661 -3076521
35451 -3076521 -4493485 -4378830 -3070083 -1990563 -1408533 -394608 921884 999172 -584451
35442 -584451 -1976179 -1462439 270970 1401333 1436385 1240693 1415948 1886296 2545222
35433 2545222 3132638 2843778 1219570 -747949 -1449858 -539528 935328 2128357 3007418
35424 3007418 3328568 2335624 154612 -1493497 -1009205 1017665 2360647 1754422 203655
35415 203655 -494409 95830 862624 763359 -82032 -991978 -1688074 -2087365 -1602122 366260
35405 366260 3094918 4622737 3805669 1781725 669125 1057777 1541975 736676 -965127
35396i65127r89307O44500J528001Q22088o27678j120343R9894J853810K161836
35387C407674M27179j961071l290752l142222k085251o10718R15663J854824J808720
35378b675954J285264J023954Q75981K38522n68462m66177O59188J442003P50521
35369B564840q34813j790428j332742J19627J581336K062614J053497q33980k009994
35360E79957j373984M59882J862356J921098J017666m2684q04431j110837r34909
35351A574114m90929j81777k63666o68338j088159j115048n17712M09039J044612
35342a297864J207623J303795J420959R28689l90808j469749j203774j46530K03702
35333E56043m03383p61088j90886O00496Q85771Q21023N86766n2374p63753n41181
$$ plain form
35396 -965127 -1954434 -1309934 218067 1040155 412477 -707866 -607972 1245838 3407674
35387 3407674 3834853 1873782 -1416970 -4559192 -6644443 -7255161 -6339498 -4484674 -2675954
35378 -2675954 -1390690 -366736 509245 747767 179305 -286872 372316 1814319 2564840
35369 2564840 1730027 -60401 -1393143 -1273516 307820 2370434 3423931 2589951 579957
35360 579957 -794027 -334145 1528211 3449309 4466975 4424291 3619860 2509023 1574114
35351 1574114 1083185 901408 637742 -30596 -1118755 -2233803 -2751515 -2342476 -1297864
35342 -1297864 -90241 1213554 2634513 3563202 3172394 1702645 498871 352341 556043
35333 556043 152660 -608428 -799314 -198818 686953 1507976 2094742 2042368 1278615 737434
35323G37434O72752J517512J180698N03444J96309m71554j823253k235017m49415
35314a71090J814705J912356J00359j185023j275866j640491k451744j964253
35306d861047P1334J443965J084241P29749J446247J403967o41055k320719j090634
35297b733952J360504J583125j35791n48636R03719J298041n18512j849172p34522
35288a375196Q47593N47304m21690K74615J715600J076747j530753k840622j248121
35279b954523R61137J166362l379j94765R63912J569045M37895j292332j896841
35270a243489j180167j44358O51223J372331J858322J459931K22631p26384o13544
35261A656496j56212m75611j368141j606789p42657L66486Q64440Q64570Q82999
$$ plain form
35323 737434 1410186 2927698 4108396 4611840 4808149 4336595 2513342 278325 -171090
35314 -171090 1643615 3555971 3656330 2471307 1195441 -445050 -2896794 -4861047
35306 -4861047 -4789713 -3345748 -2261507 -1531758 -85511 1318456 677401 -1643318 -2733952
35297 -2733952 -1373448 209677 73886 -474750 428969 1727010 1208498 -640674 -1375196
35288 -1375196 -527603 19701 -401989 -127374 1588226 2664973 1134220 -1706402 -2954523
35279 -2954523 -1993386 -827024 -830403 -1025168 -61256 1507789 1945684 653352 -1243489
35270 -1243489 -2423656 -2568014 -1916791 -544460 1313862 2773793 2996424 2270040 1656496
35261 1656496 1500284 1024673 -343468 -1950257 -2692914 -2326428 -1461988 -597418 285581
35252B85581R72195P41081r0091j252723j887740j254060J86928R65600M85476
35243h47753l1923N73655J455704J170147K49051K99139R19714Q9512k086615
35234A790631k818031r07834J061164N93206r81300r40851N35496J274883J000481
35225F07845J233911J905409J226074q80839k141780j469457n91423j032179j699580
35216b842019j003572L76084O71518j18916l92967N03340J473008J421862O13756
35207G02094q216p2937N1627j8443j81524j09445J99936M25139M80476O04464
35197B073171O77263R1063j161756j936626j339002j52427J97427k88204l82354
35188b221445L28423R83353J008887P02035J01497j163605k446652k103209J68384
$$ plain form
35252 285581 1257776 1998857 1908766 656043 -1231697 -2485757 -2298829 -1333229 -847753
35243 -847753 -879676 -306021 1149683 2319830 2568881 2868020 3787734 3877246 1790631
35234 1790631 -1027400 -1935234 -874070 -280864 -1262164 -2203015 -1667519 -392636 607845
35225 607845 1841756 3747165 4973239 4092400 1950620 481163 -110260 -1142439 -2842019
35216 -2842019 -3845591 -3469507 -2797989 -2916905 -3309872 -2806532 -1333524 88338 702094
35207 702094 693878 620941 672568 654125 472601 363156 563092 988231 1468707 2073171
35197 2073171 2750434 2841497 1679741 -256885 -1595887 -1748314 -1550887 -1839091 -2221445
35188 -2221445 -1893022 -909669 99218 801253 902750 -260855 -2707507 -4810716 -4642332
35179d642332K306668K300358O53324o48866q10548o26221p05459o03702J90357
35170b586421J266159J620266P26010p96123j599195r31911N06446J380548J234058
35161H19837O67845K57996J08903L15410Q54750J039008J72049j184648j754719
35152A296431j401662j106646j026870k68390J021996J263446L3725p79780K71610
35143f96140J882459J992710Q04449N5174K28656L08784k12704p41086p96611
35134B825691n55459l17500l22870p31804j074713m16813J124589J914476Q42369
35125C287966j056883k056921j852522j138567k11372O87270P50091j68222p22028
35116b481188L0160J007739R49029N53101R18807J261501M69658m02204J19358
$$ plain form
35179 -4642332 -2335664 -35306 618018 -30848 -841396 -1467617 -2173076 -2776778 -2586421
35170 -2586421 -1320262 300004 1026014 229891 -1369304 -2301215 -1794769 -414221 819837
35161 819837 1487682 1745678 1854581 2169991 3024741 4063749 4235798 3051150 1296431
35152 1296431 -105231 -1211877 -2238747 -2507137 -1485141 -221695 -187970 -967750 -696140
35143 -696140 1186319 3179029 3983478 4038652 4267308 4576092 4363388 3622302 2825691
35134 2825691 2270232 1952732 1629862 898058 -176655 -593468 531121 2445597 3287966
35125 3287966 2231083 174162 -1678360 -2816927 -3028299 -2341029 -1590938 -1759160 -2481188
35116 -2481188 -2451028 -1443289 -494260 58841 977648 2239149 2708807 2306603 2425961
35107B425961Q59060k34641k110850j866086M21526J742595J075163M72692P62369
35098C547789J42696j748790k294370l53607J248011J36850j706432j272998O88116
35089a612735J263341n888j109029j023575m56921J10386P37300R21973K17885
35080i57263n49829l91428J81121J75120o5568K55144O46935L59895K29613J356601
35070A240341K608709J764833j018503l011386k366957q9444J622029J580637
35062B330259Q3473j552049j855717o14350P15155P94622M7359l98726m93723
35053i43697o93534n79843K88058R70617M47099l87179j4114J045784J069973
35044A203164J45206j08287M00470J01221j154806j615490p78983l01917q38677
$$ plain form
35107 2425961 3285021 3050380 939530 -926556 -505030 1237565 2312728 2785420 3547789
35098 3547789 3690485 1941695 -352675 -706282 541729 678579 -1027853 -2300851 -1612735
35089 -1612735 -349394 -355282 -1464311 -2487886 -2944807 -2834421 -2097121 -1175148 -957263
35080 -957263 -1507092 -1898520 -1717399 -1542279 -1607847 -1352703 -705768 -345873 -116260 1240341
35070 1240341 3849050 5613883 4595380 1583994 -782963 -872407 749622 2330259
35062 2330259 2413732 861683 -994034 -1608384 -893229 -98607 -51248 -449974 -943697
35053 -943697 -1637231 -2217074 -1929016 -958399 -511300 -898479 -912593 133191 1203164
35044 1203164 1348370 1240083 1640553 1741774 586968 -1028522 -1807505 -2109422 -2948099
35035b948099o91971R59503K048023Q17033j089243j108813K64972O28695k39036
35026a358936k90666J015207J642121L10968j392619j458859l36780J49817k89305
35017b009052l39876M20661P25416k38796j321626j074299k1853R7160r52031
35008d714296j428946j78235J617992K014737P88180n06863m85590P41862J859423
34999b91736J533067k42930j728581j124153R86781J948519M54991j532902j395563
34990a392507O64483K180884J728231J18966j261876j761718j269271j64030N04672
34981f52166o143r48267r37661P2051P71816M42703j67292n9524P83849J552541
34971H51907J455570M67005m71755m10649K51715K67322l33137r1491J209149
$$ plain form
35035 -2948099 -3640070 -2680567 -632544 184489 -904754 -2013567 -1748595 -1119900 -1358936
35026 -1358936 -1649602 -634395 1007726 1318694 -73925 -1532784 -1869564 -1719747 -2009052
35017 -2009052 -2348928 -1928267 -1202851 -1441647 -2763273 -3837572 -3859425 -3762265 -4714296
35008 -4714296 -6143242 -6321477 -4703485 -2688748 -1900568 -2407431 -2893021 -2151159 -291736
34999 -291736 1241331 998401 -730180 -1854333 -867552 1080967 1535958 3056 -1392507
34990 -1392507 -728024 1452860 3181091 3300057 2038181 276463 -992808 -1156838 -652166
34981 -652166 -658309 -1606576 -2544237 -2472186 -1700370 -1257667 -1424959 -1484483 -700634 851907
34971 851907 2307477 2774482 2302727 1892078 2143793 2411115 2077978 1986487 3195636
34962C195636J629132J70209j213360o72626L86380k32951j588813j229889M94347
34953I38065J150223M15754J42p2745j251754k685986j778992J047197K245073
34944F977P08205n70748L27079J410476Q09980k17153l79362p61619j802144j458872
34934a927181Q91421K166901K98473j949964j300298Q27712J174681Q6063j7373
34925B50435N64286p4627j170857o07266O54301l1325j873285j488106J293812
34916b482632K925294J808210K38033o5080l18485j324228j452365K75327K061510
34907A665584K056579Q13507m10279j485508k174223j389057P04094J877107Q19254
34898B477058p77344p35931M92993Q90071j15831j256152j316090k41289J078008
$$ plain form
34962 3195636 4824768 4994977 3781617 3108991 3495371 3262420 1673607 443718 938065
34953 938065 2088288 2504042 2504184 2431439 1179685 -1506301 -3285293 -2238096 6977
34944 6977 715182 144434 471513 1881989 2691969 2474816 2095454 1333835 -468309 -1927181
34934 -1927181 -1035760 1131141 1429614 -520350 -1820648 -992936 181745 267808 250435
34925 250435 814721 740094 -430763 -1038029 -383728 -415053 -2288338 -3776444 -2482632
34916 -2482632 442662 2250872 2488905 2423825 2105340 781112 -671253 -395926 1665584
34907 1665584 3722163 4535670 4125391 2639883 465660 -923397 -219303 1657804 2477058
34898 2477058 1699714 963783 1456776 2346847 2231016 974864 -341226 -582515 495493
34889D95493J395952J77306j465795j804408p67355K857l01364n57352J77027
34880b647639J026760Q47701J22208K0876M61502M06174l70003r29286n12882
34871a574589M85252J006745N60806j54335j19143M85797L80269p59144j441323
34862a129665n78074N94083L76843o30157o67243Q1531j2562q34782o31913N92649
34852b839290P26289p41041j520797k21311J392508J385840N46878M45414O46671
34843a78839J0119q09527m40556O63583R23224K55659L3134O85301J060521K83699
34833B486318r98750j509420q13757K44698M13968m77541j066967j43803J486104
34824c79150J960126R96059K7448k96955p93570j516817j088564O77192J572502
$$ plain form
34889 495493 1891445 2068751 602956 -1201452 -1968807 -1965950 -2267314 -2824666 -2647639
34880 -2647639 -1620879 -773178 -650970 -630094 -168592 237582 -132421 -1061707 -1574589
34871 -1574589 -1089337 -82592 478214 323879 204736 690533 1070802 311658 -1129665
34862 -1129665 -1707739 -1113656 -736813 -1366970 -2034213 -1952682 -1965244 -2800026 -3431939 -2839290
34852 -2839290 -2113001 -2854042 -4374839 -4596150 -3203642 -1817802 -1270924 -825510 -178839
34843 -178839 -168720 -978247 -1418803 -755220 168004 423663 456797 1142098 2202619 2486318
34833 2486318 1487568 -21852 -835609 -590911 -176943 -654484 -1721451 -1865254 -379150
34824 -379150 1580976 2577035 2604483 2307528 1513958 -2859 -1091423 -414231 1158271
34815A158271N2884k098471k004504M44775K665283K660338Q17566j131896j849376
34806G14870j344316p69749r22953j039973n7338J275515J320988M40724N50858
34797A68626J541915J082869j126046k177207o78941O69178l45514j479720O4329
34788b280511K435227J841360j280125k992111j845168j15375N71634R68518J386895
34779a309656P62849p70392j406225n45847L87837N69977P34315J028055M27070
34770a22017j049387j876330j420612o06414K58143J872544L561959L146786K70700
34761D035372k485593k987184j881743m79036J278983L170574L352449Q97281
34753D901103j910555k131409j12153J211891M34630q87052r61109k29074l46264
$$ plain form
34815 1158271 1211155 -887316 -2891820 -2447045 218238 2878576 3696142 2564246 714870
34806 714870 -629446 -1399195 -2322148 -3362121 -3419459 -2143944 -822956 -382232 168626
34797 168626 1710541 2793410 1667364 -509843 -1188784 -519606 -865120 -2344840 -2280511
34788 -2280511 154716 1996076 715951 -2276160 -4121328 -4236703 -3665069 -2696551 -1309656
34779 -1309656 -546807 -1317199 -2723424 -3269271 -2881434 -2311457 -1577142 -549087 -122017
34770 -122017 -1171404 -3047734 -4468346 -5074760 -4816617 -2944073 617886 3764672 4035372
34761 4035372 1549779 -1437405 -3319148 -3798184 -2519201 651373 4003822 4901103
34753 4901103 2990548 859139 746986 1958877 2393507 1506455 545346 316272 -29992
34744b9992j524802j968659l04856K096743K486789N62462q02907K65330J643505
34735B423613N36264j816737j920236L16248J438103R6796j087265l79668K12323
34726a80559j031351k090900o45902J656401J676108j78452p48539Q63952K190111
34717A510869J236654j042279k419909j791405L16467K311046K549878P97303
34709C468624j424601k543081k401731j494279M6019J662594J920723L45518j341832
34700a762046j370634l00571L01738L82799O84532O37863o56277k057988j542447
34691e683031N40988J814653J444984R31258J132865J013108m2633r90105j112130
34682i50043j157667j470447r78726O65279J788169J148456J55339P65448K271538
$$ plain form
34744 -29992 -1554794 -3523453 -3828309 -1731566 755223 1317685 514778 780108 2423613
34735 2423613 2959877 1143140 -777096 -460848 977255 1074051 -13214 -392882 -180559
34726 -180559 -1211910 -3302810 -3948712 -2292311 -616203 -794655 -1543194 -679242 1510869
34717 1510869 2747523 1705244 -714665 -2506070 -2189603 121443 2671321 3468624
34709 3468624 2044023 -499058 -2900789 -4395068 -4349049 -2686455 -765732 -420214 -1762046
34700 -1762046 -3132680 -3433251 -3131513 -2748714 -2064182 -1426319 -2082596 -4140584 -5683031
34691 -5683031 -5142043 -3327390 -1882406 -951148 181717 1194825 1152192 162087 -950043
34682 -950043 -2107710 -3578157 -4556883 -3891604 -2103435 -954979 -799640 -34192 2237346
34673B237346K253966K26478j650286j551208n5549J115593J135795L03433p92273
34664C223295j642480j904922j700369j512727j409045p43803Q36506K395218
34656b458327K484991J018003l97753m39612K31903L4088j141462j673742n08593
34647b850504J310936J984971J111532j96443q57309p36493k92554k4819k07771
34638g58454o36073o57514J31215J246089J675668Q76607o75761j784231j462412
34629b044866K570J034411N31729m52824M7051J829860K310163K39900k048520
34620A449474j781158J73093O26476j104421k253345q22685J550177K049795M21813
34611C09219j106223q25447O80474J489111M52159j496792k099062l09648K114818
$$ plain form
34673 2237346 4491312 4717790 3067504 1516296 1460747 2576340 3712135 4015568 3223295
34664 3223295 1580815 -324107 -2024476 -3537203 -4946248 -5690051 -4853545 -2458327
34656 -2458327 26664 1044667 646914 207302 439205 473293 -668169 -2341911 -2850504
34647 -2850504 -1539568 445403 1556935 1360492 503183 -233310 -525864 -550683 -758454
34638 -758454 -1394527 -2052041 -1920826 -674737 1000931 1877538 1201777 -582454 -2044866
34629 -2044866 -2042296 -1007885 -476156 -928980 -881929 947931 3258094 3497994 1449474
34620 1449474 -331684 -158591 467885 -636536 -2889881 -3712566 -2162389 -112594 309219
34611 309219 -797004 -1622451 -941977 547134 999293 -497499 -2596561 -2906209 -791391
34602g91391K494550N79332j267141j348987m74720O4206N25451J399804J604193
34593B785297j9732k190542k318198j02459J914801J805329N91999L02680J002119
34584C771294J006093n42986k473729k963690j468203Q12501K077708J545822
34576A764810Q8464q29513p93554o42174j010493j350190q18953M20735J423262
34567a747606J620918J135160K66125n76281o88451K58716J392766J398970K37042
34558C297359p63683o79416O1268O96082R95821P47095l64764j664842j575889
34549G49031J56854J498555O84667j276312k142199j518739o41149P6806J104168
34540a308318J860248J131111n05522r83902J42539J077661P40313Q9681j67294
$$ plain form
34602 -791391 1703159 2282491 1015350 -333637 -808357 -744151 -218700 1181104 2785297
34593 2785297 2765565 575023 -1743175 -1845634 69167 1874496 2466495 2769175 3771294
34584 3771294 4777387 4234401 1760672 -1203018 -2671221 -1858720 218988 1764810
34576 1764810 1853274 1023761 230207 -411967 -1422460 -2772650 -3591603 -3170868 -1747606
34567 -1747606 -126688 1008472 1274597 698316 9865 268581 1661347 3060317 3297359
34558 3297359 2533676 1854260 1915528 2611610 3607431 4354526 3989762 2324920 749031
34549 749031 905885 2404440 3089107 1812795 -329404 -1848143 -2489292 -2412486 -1308318
34540 -1308318 551930 1683041 1177519 193617 336156 1413817 2154130 2243811 2076517
34531B076517p85631j851134j828079j87561J192375Q95089J52768L61122N52334
34522E77800m22388j221234k58673J030784K70921j661924j791251K36009J839829
34513a400127J717990J145241Q90888N2568j342976j561622j26641R72011L41784
34504F89116o89399l73218Q69120J521215J131052J74364r35781j649315j291286
34495e54132j75054M18895M7145l20409l4353L24758K65171Q6747j89990q87386
34485a018608j243009K9425K157175K640578J058737o3120N39862P02589j173219
34476C630410k891056k047667l12074o02362j885007q57964K152592L248208R95233
34467A430313j522467j524431M073R66503J315588J796877J809571N23155j277505
$$ plain form
34531 2076517 1290886 -560248 -2388327 -2575888 -1383513 -488424 -335656 25466 577800
34522 577800 155412 -1065822 -1324495 -293711 -22790 -1684714 -3475965 -3239956 -1400127
34513 -1400127 317863 1463104 2353992 2406560 1063584 -498038 -624679 347332 689116
34504 689116 -283 -373501 495619 2016834 3147886 3322250 2386469 737154 -554132
34495 -554132 -729186 -310291 -263146 -583555 -617908 -293150 -27979 58768 -131222 -1018608
34485 -1018608 -2261617 -2232192 -75017 2565561 3624298 3561178 4101040 4803629 3630410
34476 3630410 739354 -1308313 -1620387 -2222749 -4107756 -4965720 -2813128 435080 1430313
34467 1430313 -92154 -1616585 -1612512 -646009 669579 2466456 4276027 4799182 3521677
34458C521677k144056j846824j108875l30069M13377Q86414J068010J307951J515320
34449C282925J041573o6027o89021k35565L20650j53794j254588j618324p14729
34440h6900O33692J213966N35525o64894r68317J01728J164507O63466p46683
34431A846090r88798J91533P13772m39394j414306m89393R74646O55313r32379
34422A17084j179301N90247K206882J902027M27497n72628o43066k66995J67655
34413B749402L77274P4412n25522q01671p04967q36103j226424j012801J21852
34404a784548J082028O93992o96101j655163j274580J67285J698187K316364J615034
34395B162498K48163n69280l52726K84808P11057R54886R96436L81563p83115
$$ plain form
34458 3521677 1377621 -469203 -1578078 -1908147 -1494770 -608356 459654 1767605 3282925
34449 3282925 4324498 4258471 3569450 3333885 3654535 3500741 2246153 627829 -86900
34440 -86900 546792 1760758 2296283 1631389 663072 764800 1929307 2592773 1846090
34431 1846090 857292 1048825 1762597 1323203 -91103 -580496 394150 1049463 117084
34422 117084 -1062217 -471970 1734912 3636939 4064436 3491808 2848742 2581747 2749402
34413 2749402 3126676 3201088 2675566 1873895 1168928 332825 -893599 -1906400 -1784548
34404 -1784548 -702520 -8528 -704629 -2359792 -3634372 -3467087 -1768900 547464 2162498
34395 2162498 2410661 1841381 1488655 1773463 2484520 3439406 4435842 4817405 4034290
34386D034290j414213r40979l35254n93020j060900o07459L09925L83035k58501
34377d83076l08381M11677Q12354O52705P45313Q90850q0795j653917j542769
34368e56039N78901J790957J84375j903455j369920Q09730J257806m40147j384177
34359a031969r6609J590462J784566Q53417k28757j316383j933452j048330P93883
34350f33172J263677m31600j964085j184828P71681J455128O15151k24279m39606
34341g71933m47088j15681P94047J250907J73928j365096j307178K20045J082256
34332d85793N27092R2785P02099J175291O08202J13685P21458J260451K00794
34323D916064j550306j767095l06734O49324j51920j373070j298325k49016K32866
$$ plain form
34386 4034290 2620077 1679098 1343844 750824 -310076 -917535 -607610 -224575 -483076
34377 -483076 -791457 -379780 432574 1085279 1830592 2721442 2640647 986730 -556039
34368 -556039 22862 1813819 1998194 94739 -1275181 -465451 792355 352208 -1031969
34359 -1031969 -1128578 461884 2246450 3099867 2871110 1554727 -378725 -1427055 -633172
34350 -633172 630505 198905 -1765180 -2950008 -2178327 -723199 -108048 -332327 -771933
34341 -771933 -1219021 -1334702 -540655 710252 884180 -480916 -1788094 -1568049 -485793
34332 -485793 41299 134084 836183 2011474 2619676 2733361 3454819 4715270 4916064
34323 4916064 3365758 1598663 1291929 1941253 1789333 416263 -882062 -1131078 -898212
34314h98212l17034r67783r40290l75362L41946J007458J186310L35832j182048
34305a809183j964096j116357N44093J497085J310173P07199K74297N0692J70994
34296c35103P91882J322142Q58741l09891p26520J92970J153517P70985m62495
34287C256228r54704k43985N29665K51533q21197j438715p53043O70921J248966
34278A745669J26923j544348j795829l72367R02399O50258k88287l63764L97687
34269e41659P24437J01828o85480p73962j44067N17291L73793p50162j745777
34260b923758j148340Q02152K020905J265682j66861m95191L4076J85957J16938
34251c08440P06454J326001O25578p75617q48782M82216J048597N6048n46457
$$ plain form
34314 -898212 -1215246 -2183029 -3123319 -3498681 -3156735 -2149277 -962967 -627135 -1809183
34305 -1809183 -3773279 -4889636 -4345543 -2848458 -1538285 -831086 -556789 -506097 -335103
34296 -335103 456779 1778921 2637662 2327771 1601251 1794221 2947738 3718723 3256228
34287 3256228 2301524 2057539 2587204 2838737 2017540 578825 -174218 496703 1745669
34278 1745669 1872592 328244 -1467585 -1839952 -937553 -287295 -575582 -939346 -541659
34269 -541659 182778 284606 -400874 -1174836 -1318903 -801612 -427819 -1177981 -2923758
34260 -2923758 -4072098 -3269946 -1249041 16641 -150220 -645411 -611335 -425378 -308440
34251 -308440 398014 1724015 2349593 1573976 725194 1207410 2256007 2312055 1765598
34242A765598N49715J628703P19663j109756j427566k34070K61740p75972j669419
34233b91364r24133O92201J432134P56885m68508j200566r78137M0450J159047
34224B18009J475692O68679n24808r54253k85148O29885P44133r517p88816r44195
34214B29661o14203j79071L22584Q95450J176790Q51254J98916k76058n19029
34205B086294p17800p31390l99121j61325n07216r02320l21333R22838J038925
34196C07552p74877k609442j881599J122644L164042K052717m74034j117037M81129
34187B71095J493077K94976j142254n49074R48074P83812o75633p83057P26275
34178A367291J137646n48443j750625o67009P00318J93343o69053M39317K174583
$$ plain form
34242 1765598 2315313 3944016 4663679 3553923 2126357 1892287 2154027 1378055 -291364
34233 -291364 -1215497 -523296 908838 1665723 1197215 -3351 -981488 -941038 218009
34224 218009 1693701 2362380 1837572 883319 598171 1228056 1972189 1962672 1173856 229661
34214 229661 -384542 -563613 -241029 654421 1831211 2682465 2881381 2605323 2086294
34205 2086294 1368494 637104 237983 76658 -430558 -1332878 -1654211 -731373 307552
34196 307552 -467325 -3076767 -4958366 -3835722 -671680 1381037 907003 -210034 271095
34187 271095 1764172 2059148 916894 367820 1315894 2099706 1424073 641016 1367291
34178 1367291 2504937 1956494 205869 -461140 239178 432521 -236532 202785 2377368
34169B377368J533952j010672k138703q64611M80552L93730n2165K6411q7041
34160F58821o60711p52136k23283j14942m51074q4527P81348N04089r29340j389323
34150b661078P433J547814J816251J377260P64434m13763j432325n90959J380591
34141A795658J352753j155748k448669l34191K229882K021024O20171R45365J777813
34132F804058K27620k511371k762250n56107N93144l26036p52466L22442P23883
34123A762917m60867j005593K99734J278762J86374j192143o36155P58782N29340
34114A521151j132516j887968q73394M55608P84613M58097M64916J084982J721265
34105B596754J516861K41074j171210j429728n34922P1473n19994j312276p89011
$$ plain form
34169 2377368 3911320 2900648 761945 -102666 377886 771616 719451 745862 658821
34160 658821 -1890 -754026 -977309 -1092251 -1543325 -1627852 -846504 -342415 -1271755 -2661078
34150 -2661078 -2653645 -1105831 710420 2087680 2852114 2438351 1006026 415067 1795658
34141 1795658 3148411 1992663 -456006 -790197 1439685 3460709 4080880 5026245 6804058
34132 6804058 7031678 4520307 1758057 1201950 1795094 1469058 716592 1039034 1762917
34123 1762917 1302050 296457 596191 1874953 2061327 869184 233029 991811 1521151
34114 1521151 388635 -1499333 -2372727 -1917119 -1132506 -674409 -209493 875489 2596754
34105 2596754 4113615 4354689 3183479 1753751 1218829 1290302 770308 -541968 -1330979
34096a330979Q29641J706456P70868q30489j129116J63575J215283L77645j613380
34087A59504k461675j120457J155259K592540K596743J373104p39381k707058
34079H48579k873272q93516J288024J685509P15408R9690K09962J40374k54246
34070I66512k75806p373j41978l21121M28670J531394J185687o86335j817166
34061H62484q08216P97693Q81331k57580p92325k78835M8226m38917q08405k24057
34051a018601O65749P47539J73328J08835Q47767J152790r472j760904k248923
34042a341892j054952L21651M91034k36949o15495m3309J042405J806355J719624
34033B088472R94498L47534j8497p46268j933911k224199o66910J257359J422649
$$ plain form
34096 -1330979 -501338 1205118 1975986 1145497 16381 179956 1395239 1772884 159504
34087 159504 -2302171 -3422628 -2267369 325171 2921914 4295018 3555637 848579
34079 848579 -2024693 -2918209 -1630185 55324 770732 870422 1080384 1220758 966512
34070 966512 690706 683333 541355 220234 648904 2180298 3365985 2679650 862484
34061 862484 54268 851961 1733292 1475712 683387 404552 452778 13861 -794544 -1018601
34051 -1018601 -352852 394687 568015 676850 1524617 2677407 2667935 907031 -1341892
34042 -1341892 -2396844 -2075193 -1584159 -1821108 -2436603 -2479912 -1437507 368848 2088472
34033 2088472 3082970 3430504 3412007 2665739 731828 -1492371 -2159281 -901922 520727
34024E20727L27183J58878Q99676L67414j613898k476553j260450k08711n29153
34015c814887j61064K045993L437943J762040q02552j155258j64535m41016j517738
34006h11074j157503K91359P54842K87662L42753M50500o54949j762244q16142
33997c074796J183548J648461P82218P34002J400021J024472O8745L74324J239852
33988E380847N15591j066304r17750O43874R68742j57125o71685n12164j194636
33979B989390j855149n49458J223659M61784j595112j210070J036599J259738
33971A761381l90503q8409K010939J668842j281062k100927L23938J604912J21715
33962C630826m04188J370551J797092k41629q94473R07899J078444j420922k050555
$$ plain form
34024 520727 847910 1006788 1906464 2273878 659980 -1816573 -3077023 -3285734 -3814887
34015 -3814887 -3975951 -1929958 1507985 3270025 2467473 1312215 1147680 706664 -811074
34006 -811074 -1968577 -1677218 -922376 -634714 -291961 158539 -496410 -2258654 -3074796
33997 -3074796 -1891248 -242787 539431 1273433 2673454 3697926 3766671 4140995 5380847
33988 5380847 5896438 4830134 3912384 4556258 5525000 5367875 4696190 4184026 2989390
33979 2989390 1134241 584783 1808442 2270226 675114 -534956 501643 1761381
33971 1761381 1370878 1282469 3293408 4962250 3681188 1580261 1904199 3509111 3630826
33962 3630826 3226638 4597189 6394281 6152652 5258179 6166078 7244522 5823600 3773045
33953C773045O34627K127683Q00537P08914K633407K207522j0863K000638O888105
33944B1763615O104394J097856L697010J3235969J4458832R434163K5438333O8119032
33936A63349204R0963500M7675685l6789793q7376842p0776558k8075992r042100
33929F9927104j2821345j2432771m317331l627053j0233309j0188442k512275
33922A3794578P55011k675522l467337M00788J167663k557382l351706L94725
33914D460818J651036j723612l262134j06729K241382L43577j732579o35187R58121
33905B194693N15083p500R06990J183970k81003j195721l33030L08539l30014
33896B962007m88990N35713Q50856k75018j008704m80285n0917j98959K52526
$$ plain form
33953 3773045 4407672 6535355 7335892 8044806 10678213 12885735 12874872 14875510 21763615
33944 21763615 27868009 28965865 32662875 45898844 60357676 69791839 95230172 163349204
33936 163349204 254312704 301988389 265198596 177821754 107045196 78969204 69927104
33929 69927104 57105759 44672988 40355657 36728604 26495295 16306853 13794578
33922 13794578 14549589 11874067 8406730 8807518 9975181 7417799 4066093 4460818
33914 4460818 6111854 4388242 1126108 1019379 3260761 3604338 1871759 1236572 2194693
33905 2194693 2709776 2702276 3609266 4793236 4512233 3316512 2983482 3292021 2962007
33896 2962007 2473017 3008730 3859586 3584568 2575864 2095579 2044662 1845703 2098229
33887B098229J153617Q75542l67669o55691j36950q70988k557083k439572j41431
33878c041996J365904N89464l80299K86124J573851K053944J906903J473496M61008
33869F288399o05580n99512R9638J07295l63745m4648N10323l57059j986718j975011
33859A073382j57412J263725J485375J542036J160359q86894l130989k353206
33851c624J087830K988793J427357p97690j104885n60692p31258q51832j88909
33842A265090J3606r33499j470704n63183L98258K44472Q7522R79242J837910
33833A858714J428699L48484m24047r76365j297858p60383K41056L37707l02393
33824D53614K2003J271377J244249n47669j606348m36091J115673J092098K34556
$$ plain form
33887 2098229 3251846 4127388 3759719 3104028 2967078 2096090 -460993 -2900565 -3041996
33878 -3041996 -1676092 -1086628 -1466927 -1180803 393048 2446992 4353895 5827391 6288399
33869 6288399 5682819 5083307 5182945 5290240 4926495 4881847 5392170 5035111 3048393 1073382
33859 1073382 915970 2179695 3665070 5207106 6367465 5480571 2349582 -3624
33851 -3624 1084206 4072999 5500356 4702666 3597781 3037089 2305831 1453999 1265090
33842 1265090 1278696 345197 -1125507 -1688690 -1290432 -1045960 -958438 20804 1858714
33833 1858714 3287413 3635897 3211850 2235485 937627 177244 418300 756007 453614
33824 453614 475617 1746994 2991243 2443574 837226 401135 1516808 2608906 2843462
33815B843462j06006k30423n89918n24123m4841l71727j326159r62381Q29795
33806d82321J471171N8244p93076N00856J574933L09464j377046r34693N70711
33797H98243Q19564K06350J58932o8590j494596k487772j262375O11598O75014
33788a943632k27469K25211J464564J240815j19307m43495K60838J72919o85520
33779e5076p06878n0757k96997j152561q57115L82118O34593j71406r1921J275164
33769a090836K033917J115828l82723j225477j214172m39642N71393M44860j113101
33760a299953j818267J82820K772400K409204n49896k478500j927837q00498k82200
33751c792727N00137J443813R82594n74688q40475N48167J114516r5071q81694
$$ plain form
33815 2843462 2737456 2507033 1917115 1392992 1348151 976424 -349735 -1312116 -482321
33806 -482321 988850 1047094 254018 754874 2329807 2639271 1262225 327532 898243
33797 898243 1717807 1924157 2083089 2014499 519903 -1967869 -3230244 -2618646 -1943632
33788 -1943632 -2171101 -1945890 -481326 759489 640182 196687 457525 630444 -55076
33779 -55076 -761954 -812711 -1109708 -2262269 -3119384 -2737266 -2102673 -2274079 -2366000 -1090836
33769 -1090836 943081 2058909 1676186 450709 -763463 -1203105 -631712 -186852 -1299953
33760 -1299953 -3118220 -2935400 -163000 2246204 1696308 -782192 -2710029 -3510527 -3792727
33751 -3792727 -3292590 -1848777 -866183 -1440871 -2281346 -1733179 -618663 -713734 -1595428
33742a595428J0018P19525l9300n40531M99587J191787j57154j638881o84426
33733b234803J629194K250339P34681p23165r70929r51661j374902j535897o62888
33724c840031R02272K041429J827907M73332n42838j33447O83733K15866q51937
33715G76286j44664K189422K790419K6909l086336l044774o39552R36798Q39836
33706F44344N11919L01497o09679j557355q52405J074651J795345N85993m60141
33697A434169K31680J425521J227399j20605r32485n62184Q0914Q5807m08871
33688B461345p56899p45464o25670m14920K51343J260294J609118O58515o39250
33679C058412r22560n09709p31160j294217m53750J694395K510818O83484j471051
$$ plain form
33742 -1595428 -1585410 -865885 -905185 -1445716 -946129 245658 88504 -1550377 -2234803
33733 -2234803 -605609 1644730 2379411 1656246 685317 -266344 -1641246 -3177143 -3840031
33724 -3840031 -2937759 -896330 931577 1404909 862071 728624 1412357 1628223 776286
33715 776286 631622 2821044 5611463 5638372 2552036 -492738 -1132290 -195492 644344
33706 644344 1156263 1457760 848081 -709274 -1561679 -487028 1308317 1894310 1434169
33697 1434169 1665849 3091370 4318769 4198164 3265679 2703495 2784409 2870216 2461345
33688 2461345 1704446 958982 333312 -81608 169735 1430029 3039147 3697662 3058412
33679 3058412 2135852 1626143 894983 -399234 -852984 841411 3352229 4035713 2564662
33670B564662j455436l19935n04091j553527r86546J327139K705100J634115l70507
33661C040974j301776r31620q3297N08859J46455j368598k783675k391515k84863
33652e449056J754021K624312K574144J677339k00624j738499r52850J545507
33644A834294K487650L91004k142911k186183n00065K89847j29970J3763J059536
33635A116965J276061k23329k054658k488710j325419M70194J758569J641837
33627A71510J33887j268939q38762J147492K462365J685741j12702j079212r62547
33618A338833p90589q59652m05445P33812J393477O39488p51016j255742o80501
33609f37335k25243m39959l06175R66286K223490J703590l45175j802182j486619
$$ plain form
33670 2564662 1109226 789291 285200 -1268327 -2254873 -927734 1777366 3411481 3040974
33661 3040974 1739198 807578 724281 1233140 1379595 10997 -2772678 -5164193 -5449056
33652 -5449056 -3695035 -1070723 1503421 3180760 2980136 1241637 288787 1834294
33644 1834294 4321944 4712948 2570037 383854 -116211 173636 43666 57429 1116965
33635 1116965 2393026 2169697 115039 -2373671 -3699090 -3228896 -1470327 171510
33627 171510 305397 -963542 -1802304 -654812 1807553 3493294 3380592 2301380 1338833
33618 1338833 548244 -311408 -716853 16959 1410436 2049924 1298908 43166 -637335
33609 -637335 -862578 -1302537 -1608712 -642426 1581064 3284654 2939479 1137297 -349322
33600c49322m42914r894Q761L79338Q05945N17556k16544m78450k44110k34487
33590b64121l61396K92545J655236K114017N92144j608909k076404k59255J697362
33581A781219J469585o00754j946772j101621M07809L11132j087668j464675j63369
33572b395114P89838P3831p06489J94105J545456J192590j23222O1430J564229
33563B196654J627856m59896k098633j614704o28430p29287p91736L06119J005670
33554a186387j99644j573342p54787J144418J399956L41694M95275J793077J602042
33545C062302m29179j515873m92945L34490n60812j357961m84976L99216m98359
33536a544097j649123o95714J526427K349338J303570Q4120m52651o60337l48695
$$ plain form
33600 -349322 -792236 -802130 -793369 -414031 391914 909470 692926 214476 -29634 -264121
33590 -264121 -625517 -332972 1322264 3436281 4028425 2419516 343112 83857 1781219
33581 1781219 3250804 2650050 703278 -398343 9466 320598 -767070 -2231745 -2395114
33572 -2395114 -1605276 -1531445 -2237934 -2043829 -498373 694217 570995 632425 2196654
33563 2196654 3824510 3364614 1265981 -348723 -977153 -1706440 -2498176 -2192057 -1186387
33554 -1186387 -1386031 -2959373 -3714160 -2569742 -1169786 -828092 -332817 1460260 3062302
33545 3062302 2633123 1117250 624305 958795 397983 -959978 -1444954 -1045738 -1544097
33536 -1544097 -3193220 -3888934 -2362507 -13169 1290401 1374521 921870 261533 -87162
33527h7162P36532J314270K1965j942510k144779o13348L20514j96844n32585
33518c123947L91277J549663J868175J566551Q31726o49000k087535j729186L98387
33509i83889J870035J119611n35437j259061j173714j091055o50972M77797J085538
33500a141147J34826j122632p60382Q78157J794747J312581N02063P695n64624
33491A041284j120545q44281J62397O26342J9682o08890l20269L56074M71347
33482b16859J41080J44686O11385Q83934M77988l22224p53340k95647O98425J116301
33472B485729K64261j043278j228622k8051R37769K74779j180683j503358n05078
33463a526532k3964j032087j892900o96952J638574K373806Q11044p94776o47481
$$ plain form
33527 -87162 649370 1963640 1985605 43095 -2101684 -2715032 -2394518 -2591362 -3123947
33518 -3123947 -2732670 -1183007 685168 2251719 3083445 2434445 346910 -1382276 -983889
33509 -983889 886146 2005757 1470320 211259 -962455 -2053510 -2704482 -2226685 -1141147
33500 -1141147 -1006321 -2128953 -2889335 -2011178 -216431 1096150 1598213 1605908 1041284
33491 1041284 -79261 -923542 -761145 -134803 -115121 -724011 -1044280 -688206 -216859
33482 -216859 -75779 68907 680292 1564226 2042214 1719990 966650 671003 1369428 2485729
33472 2485729 2749990 1706712 478090 450039 1387808 1662587 481904 -1021454 -1526532
33463 -1526532 -1550496 -2582583 -4475483 -5172435 -3533861 -1160055 -349011 -1143787 -1791268
33454a791268K00548P223q12417p62822M146J57621k42702J28931J296921J713157
33444a00662Q13520j77029m61828p12752j197861q56657O72467J866880J497022
33435A343100N12958L17526M35607m64743k115806k841171j789208K30240J805143
33426b566354J999301R12527j76424L5209J058067J048533l71774j297285n28497
33417A13303L98149k57614j533735j458633l45186k1796o24344o21989L54237
33408c997608J065708R86115R48347J355028J575234J244913O01934l49810j451074
33399A978787j569396k7167J579548J161874n34868q17149P49455J662603M50081
33390D633768j307213j789766j397793j245452j223178p94773j02629O95707J663543
$$ plain form
33454 -1791268 -1590720 -1583497 -2395914 -3158736 -3154590 -2996969 -3239671 -3110740 -1813819 -100662
33444 -100662 712858 535829 74001 -638751 -1836612 -2693269 -2020802 -153922 1343100
33435 1343100 1856058 2173584 2609191 2144448 28642 -2812529 -4601737 -4371497 -2566354
33426 -2566354 -567053 345474 169050 204259 1262326 2310859 1939085 641800 113303
33417 113303 511452 253838 -1279897 -2738530 -3083716 -3105512 -3729856 -4351845 -3997608
33408 -3997608 -2931900 -1945785 -997438 357590 1932824 3177737 3779671 3429861 1978787
33399 1978787 409391 382224 1961772 3123646 2588778 1771629 2521084 4183687 4633768
33390 4633768 3326555 1536789 138996 -1106456 -2329634 -3124407 -3227036 -2531329 -867786
33381h67786K023935P16258j321092j590673K75803J540543L72507j415992j314939
33372a581436K58529J230451J039590N15213J7417l69280p2157P58720O49291
33363B446338q11064j556532p7938J755138J383256l59660p11942M97534R06823
33354C471953k67990j249569q89714j04236J66576K8463n64151j759787k393586
33345c562041j036615J269077J844914L87900m90364N36974J518361O59472q08607
33336C19071q82706J95227R87338J177852J032287J02837j611505k517461j411896
33327b608956L94295Q08069r4283p29646p51178r77904j126762J3001K039287
33318c034077K741529J095729j176522j850535q24041K98885M22797m2974p4410
$$ plain form
33381 -867786 1156149 1872407 551315 -1039358 -763555 776988 1149495 -266497 -1581436
33372 -1581436 -1322907 -92456 947134 1462347 1479764 1110484 1038327 1797047 2446338
33363 2446338 1635274 78742 804 1755942 3139198 2779538 2067596 2565130 3471953
33354 3471953 3203963 1954394 1064680 960444 1127020 1155483 591332 -1168455 -3562041
33345 -3562041 -4598656 -3329579 -1484665 -1096765 -1587129 -1050155 468206 1127678 319071
33336 319071 -563635 -368408 618930 1796782 2829069 2931906 1320401 -1197060 -2608956
33327 -2608956 -2214661 -1406592 -1500875 -2230521 -2981699 -3959603 -5086365 -5073364 -3034077
33318 -3034077 -292548 803181 -373341 -2223876 -3047917 -2749032 -2326235 -2369209 -2443619
33309b443619N80390R85864J87144j163086j170822O53556K126588J142543j068691
33300a70133j395287O51344K183123J221504n71371p53503K80702M80764m42443
33291A484700j059355r67013j124251j550378r96850O12084J470167N33133q02051
33282b399814p70554L80464J281066J502352J393388Q83629o5273o23007k50936
33273A331315R947r06803j895757j048929J126960K136801J213615J93465J64427
33264B325041j87480j694134k600859j245930J032908J870997J348926J132136
33256A981605J214229K13327j503517j752080O3556J809759J619278J58748r15603
33247B889302j154277j016762o88406k05952J62168M43176J030769J643593J218057
$$ plain form
33309 -2443619 -1863229 -877365 -690221 -1853307 -3024129 -2370573 -243985 898558 -170133
33300 -170133 -1565420 -914076 1269047 2490551 1919180 1165677 1446379 1927143 1484700
33291 1484700 425345 -541668 -1665919 -3216297 -4213147 -3601063 -2130896 -1597763 -2399814
33282 -2399814 -3170368 -2789904 -1508838 -6486 1386902 2270531 2205258 1582251 1331315
33273 1331315 1341262 434459 -1461298 -2510227 -1383267 753534 1967149 2160614 2325041
33264 2325041 2137561 443427 -2157432 -3403362 -2370454 -499457 849469 1981605
33256 1981605 3195834 3409161 1905644 153564 217120 2026879 3646157 3804905 2889302
33247 2889302 1735025 718263 29857 -176095 -13927 429249 1460018 3103611 4321668
33238D321668m21048j760818j416372k0713O53359o6729j293030j965590j800704
33229c769977j019276M3304R11930J075542M33357m13330n08622N06114J700530
33220a040428J634767K31142p74020k6642J418729J431824k59295j881693k156300
33211a421916j416648j97126J415226K596545J929611l03373j688754p91929P49532
33202H71168O49109p61817j328031k92031R42222R36257j75436j086970o00855
33193h46384J140358K347636J388104p83665j461902p7415P46938o91760k262675
33184e00765j392082O49838Q55863n45211p67515N40727Q38237n40441j000981
33175a862330P69670K333470J432602m58279p76906J63775L55401l71344n63432
$$ plain form
33238 4321668 3900620 2139802 723430 702717 1356076 1289347 -3683 -1969273 -3769977
33229 -3769977 -4789253 -4745949 -3834019 -2758477 -2325120 -2738450 -3247072 -2740958 -1040428
33220 -1040428 594339 825481 51461 24819 1443548 2875372 2616077 734384 -1421916
33211 -1421916 -2838564 -3035690 -1620464 976081 2905692 2602319 913565 121636 871168
33202 871168 1520277 758460 -569571 -861602 80620 1016877 841441 -245529 -846384
33193 -846384 293974 2641610 4029714 3246049 1784147 1706732 2453670 1761910 -500765
33184 -500765 -1892847 -1243009 -387146 -932357 -1699872 -1159145 -320908 -861349 -1862330
33175 -1862330 -1092660 1240810 2673412 2215133 1438227 1602002 1957403 1586059 1022627
33166A022627N6680L94629J30611R865J76044j4952n21459m69513L73874J166750
33156B325156J176446M94708m22589j111687j091379l02039N13625N52037o0127
33147B074151n95377p46752o83659m77416k19423l16703q24719q79083J98490
33138b470491J508431J462161N6635r42959m30316N07724J99850j159437j643532
33129b911934j41357K044945K677257J291381l97838r11797p63887j022675j191093
33120a326998j38255J403268J415521j55453j006698j20004N27730o59499k007647
33111b068035j215952Q37371J547649O83407J81036M67309L3508j259901j451663
33102b245271J62093J494779P20969j095461j716278n96045J100323K130643J872370
$$ plain form
33166 1022627 1079307 1473936 1604547 1614412 1790456 1775504 1254045 784532 1158406 2325156
33156 2325156 3501602 3996310 3573721 2462034 1370655 1068616 1582241 2134278 2074151
33147 2074151 1478774 732022 48363 -429053 -648476 -965179 -1789898 -2668981 -2470491
33138 -2470491 -962060 500101 556736 -386223 -816539 -308815 -108965 -1268402 -2911934
33129 -2911934 -3053291 -1008346 1668911 2960292 2562454 1650657 886770 -135905 -1326998
33120 -1326998 -1465253 -61985 1353536 1198083 191385 71381 599111 -60388 -2068035
33111 -2068035 -3283987 -2446616 -898967 -215560 -34524 432785 466293 -793608 -2245271
33102 -2245271 -2083178 -588399 132570 -962891 -2679169 -3275214 -2174891 -44248 1828122
33093A828122M79753q55439q11289L22209R03699L14426l32757k79350k01530
33084A367844n03152l84626L37149L30257r54886j835313r15424N04984M64355
33075a588812n45947o42256K78993P00034K10374j35038Q4676K07203J6198q4385
33065a498960k69563r10777j230763k55274J063065Q18092o68361r60100O82218
33056c230423J934492R12005j007518j365978j06855Q17374L96083m90997p04307
33047b846124j66188M24571M60131l460k75339J46550P93878Q31134L64647K76901
33037F701P51006J058721R22260P51349K83712j297764l189592k860887L61947
33028c212547L234658K306155j214094k737449l15114L014953L509698J241105
$$ plain form
33093 1828122 2307875 1452436 641147 963356 1867055 2181481 1848724 1569374 1367844
33084 1367844 864692 480066 817215 1147472 192586 -1642727 -2558151 -2053167 -1588812
33075 -1588812 -2134759 -2777015 -2498022 -1797988 -1587614 -1722652 -1637976 -1430773 -1414575 -1498960
33065 -1498960 -1768523 -2679300 -3910063 -4165337 -3102272 -2284180 -2952541 -3912641 -3230423
33056 -3230423 -1295931 -383926 -1391444 -2757422 -2864277 -2046903 -1650820 -2141817 -2846124
33047 -2846124 -3012312 -2587741 -2127610 -2131070 -2406409 -2259859 -1465981 -634847 -270200 6701
33037 6701 757707 1816428 2738688 3490037 3773749 2475985 -713607 -3574494 -3212547
33028 -3212547 22111 2328266 1114172 -1623277 -1938391 1076562 4586260 5827365
33020E827365r72604j602537j473074j400226q44854N29389J495586P63351q30866
33011A491530j128246K82686J235229m3846k266421k627942m46364K073508K578136
33002A148270Q98002j350013k370803j333883R49304K318424J358238o25918r70005
32993B1616P77385K156392J264414o68712j292462m22213J64000n33027j645048
32984a77655j850919q28679O20210J282956O25244m63988n50862M40756J083000
32975A80063N99604j3739K36795P02726L33650n15936p97632m40743q0218J15835
32965C20405K09356m8071m05252J26992J415144J497427m90057k126005q47090
32956c47151J855321K305890J36747j322572k71457J222893R93295j20122m52186
$$ plain form
33020 5827365 4854761 3252224 1779150 378924 -465930 63459 1559045 2322396 1491530
33011 1491530 363284 645970 1881199 1837353 -429068 -3057010 -3503374 -1429866 1148270
33002 1148270 2046272 696259 -1674544 -3008427 -2059123 259301 1617539 991621 21616
32993 21616 799001 2955393 4219807 3551095 2258633 1836420 2000420 1467393 -177655
32984 -177655 -2028574 -2857253 -2237043 -954087 -328843 -792831 -1343693 -902937 180063
32975 180063 779667 765928 1002723 1705449 2039099 1523163 725531 284788 204570 320405
32965 320405 529761 481690 76438 203430 1618574 3116001 2625944 499939 -347151
32956 -347151 1508170 3814060 3950807 2628235 2356778 3579671 4572966 4452844 4000658
32947D000658l57100r60141j782935j545926l35978N65709L99625n12346j285830
32938a814264r88500M94754J769775J273054m36365j224699n14416M2162m25790
32929a824289n96093L52049R75454J67028o26240J11047J108782M09100j113290
32920a036452j023332P91244K163516K029898J217237J89820j375384k722909
32912B33638k275804k46648J188615R42776K92385M14872N47068l44667j535089
32903g82854j432694K69221K203768K694875J233455r21473j715103n54103P88223
32894A783315M94470p05467p92087K53364N24656n32993j313140r95782q95932
32885b179596j829962k323183r23107J437918K920364L116127K428863P01363
$$ plain form
32947 4000658 3643558 2683417 900482 -645444 -981422 -415713 -16088 -528434 -1814264
32938 -1814264 -2802764 -2308010 -538235 734819 298454 -926245 -1440661 -1398499 -1824289
32929 -1824289 -2420382 -2068333 -1092879 -925851 -1552091 -1441044 -332262 76838 -1036452
32920 -1036452 -2059784 -1268540 894976 2924874 4142111 4331931 2956547 233638
32912 233638 -2042166 -2288814 -1100199 -157423 134962 549834 1096902 752235 -782854
32903 -782854 -2215548 -1946327 257441 2952316 4185771 3264298 1549195 995092 1783315
32894 1783315 2277785 1572318 780231 1033595 1558251 1025258 -287882 -1283664 -2179596
32885 -2179596 -4009558 -6332741 -7255848 -5817930 -2897566 218561 2647424 3348787
32877C348787j709929k881207j518829P15624J258962L25107K00058J264520J355770
32868B358863n41527k420210k136240l48067P66360N14133K5316K28768P28420
32859h24184O35146j96474r08739n38208O99743J291098J90395j525698j754292
32850b931213j36574J454478J541481Q72338Q40158J242483Q68194l83802j364740
32841B002803j430074j083654q27394m89779K7443K89718Q4404o4161L31939Q89390
32831b69365Q07662m9561q86430p40245N49645J987532K154421O80594j124260
32822C109993j669839j017184n92660r29846q87003L04020J439443J023684k70489
32813E10119m27595Q63804J662139N84423j330085k283562k021465j481700j079848
$$ plain form
32877 3348787 1638858 -1242349 -2761178 -2045554 -786592 -461485 -261427 1003093 2358863
32868 2358863 1817336 -602874 -2739114 -3087181 -2320821 -1806688 -1781372 -1552604 -824184
32859 -824184 -189038 -385512 -1294251 -1832459 -1132716 158382 348777 -1176921 -2931213
32850 -2931213 -3067787 -1613309 -71828 800510 1640668 2883151 3751345 3367543 2002803
32841 2002803 572729 -510925 -1338319 -1828098 -1800655 -1510937 -1426533 -1490694 -1158755 -269365
32831 -269365 538297 488736 -397694 -1137939 -588294 1399238 3553659 4234253 3109993
32822 3109993 1440154 422970 -169690 -1099536 -1986539 -1682519 -243076 780608 510119
32813 510119 82524 946328 2608467 3192890 1862805 -420757 -2442222 -3923922 -5003770
32804e003770n88443k31678n73980j279088j073146O44744K807725L737814K879358
32795A319536J177041o3962l93516l00606l15019l28446Q651M72371L89185l44440
32785A620795r24900o49893J62599O63236N36761J32404k05897m40216n75786
32776C19103n22000k39568J73271M81611L57022k94666r49815q32096J06885R72896
32766d27357R48530J46649p14563r85256l37724Q98947J498012M76374j157417
32757C46195j146495P62343J900670M21844j602807j050435J359585J898772o03810
32748B285862l035404k625165n88267L69443J6611J4546P53636R83643J31918
32739a693177p82511n80832Q04160K409373K918820J661163m38320j503495r40299
$$ plain form
32804 -5003770 -5592213 -5823891 -6397871 -7676959 -8750105 -8105361 -5297636 -1559822 1319536
32795 1319536 2496577 2432615 2039099 1738493 1423474 1095028 1103679 1576050 1965235 1620795
32785 1620795 695895 46002 208601 871837 1408598 1541002 1335105 894889 319103
32776 319103 -202897 -442465 -269194 212417 569439 274773 -675042 -1507138 -1400253 -427357
32766 -427357 521173 667822 -46741 -1031997 -1369721 -470774 1027238 1503612 346195
32757 346195 -800300 -37957 1862713 2284557 681750 -368685 990900 2889672 2285862
32748 2285862 -749542 -3374707 -3962974 -3593531 -3576920 -3562374 -2808738 -1825095 -1693177
32739 -1693177 -2475688 -3056520 -2252360 157013 3075833 4736996 4298676 2795181 1854882
32730A854882j85279m66397r73483m96178K92204L433q28632m66844R58767J421658
32720A114131L02272n60064Q8994R02700K43824j159804j454169m00329O96487
32711b25958R79702M98473o00702j803154j764865J45934K185427J958626k05982
32702A167501j484528m58445J123968J178540M1905p23437p08998m39660k0448
32693c23602M84662L35219o90991j320752n97390L45596J84427n9317J129288
32684e12860K335162R56118j879131k049633J062889K896742N47279k568475k067876
32675a279785O05087R71269j077066j589249N20897J906507O93599o82680j41092
32666g2513N59808n81708j905269p80663J873744K818479J151777r29782j539995
$$ plain form
32730 1854882 1669603 1203206 229723 -266455 25749 29182 -799450 -1266294 -307527 1114131
32720 1114131 1416403 856339 945333 1848033 2091857 932053 -522116 -922445 -225958
32711 -225958 753744 1252217 651515 -1151639 -2916504 -2770570 -585143 1373483 1167501
32702 1167501 -317027 -775472 348496 1527036 1568941 845504 136506 -303154 -323602
32693 -323602 161060 496279 -194712 -1515464 -2112854 -1767258 -1582831 -1642148 -512860
32684 -512860 1822302 2778420 899289 -1150344 -87455 2809287 3356566 788091 -1279785
32675 -1279785 -674698 296571 -780495 -2369744 -1848847 57660 751259 68579 -72513
32666 -72513 487295 -94413 -1999682 -2780345 -906601 1911878 3063655 2133873 593878
32657E93878j022346n44261n69197r23003j156710p14120M16009J290336R89909
32648a639505j13358o92548J2523J384336J997613R13539j237733k565746j905999
32639c846878k39599P37870R62133J458076J910265R57464r69847j589570k64612
32630h84698R04169N56155R9572P60465J196675J32169j028129p46255l58356
32621F31767j577501k827070j497377J375889K316191O73482q60636q04418m46044
32612c015717o28230l94485M40095M87176m14440l63707J424196K999742K498486
32603C033116N62517j116206j791532j352660J8058J068060L72344j247984j383344
32594a837631J86819R57429o3790n54888R72752K198156P17079j709549j756804
$$ plain form
32657 593878 -428468 -972729 -1541926 -2464929 -3621639 -4335759 -3919750 -2629414 -1639505
32648 -1639505 -1752863 -2445411 -2432888 -1048552 949061 1862600 624867 -1940879 -3846878
32639 -3846878 -4086477 -3348607 -2386474 -928398 981867 1939331 969484 -620086 -884698
32630 -884698 19471 575626 675198 1435663 2632338 2764507 1736378 990123 631767
32621 631767 -945734 -3772804 -5270181 -3894292 -1578101 -904619 -1765255 -2569673 -3015717
32612 -3015717 -3643947 -4038432 -3598337 -3111161 -3525601 -3889308 -2465112 534630 3033116
32603 3033116 3595633 2479427 687895 -664765 -646707 421353 793697 -454287 -1837631
32594 -1837631 -1650812 -693383 -757173 -1312061 -339309 1858847 2575926 866377 -890427
32585h90427K92256J288456K18087p99484l48423M17145K53693j96502J52855
32576C87656R80808J097636M5345j371508j808118o79133R62572J321619L4199
32567I71076j341810j543487j171028j147980r51598J65659J320098J190906L25786
32558b182378L28356J178915J321070K98625n70257l08521N73517J260825J447627
32549C347779P67171j018947k868672l013872j290695L85197N63290P7148M57502
32540b594099J557132J901377Q76940n44605j226507j146572r35600o71267J62661
32531b620540J409272J715308J60084j935808k153673j75093J570342J159794
32523h70314l29928p40074N0391N36272J82447k39069l75440n13168l66834N43127
$$ plain form
32585 -890427 -598171 690285 908372 108888 -239535 177610 431303 234801 387656
32576 387656 1368464 2466100 2511445 1139937 -668181 -1347314 -384742 936877 971076
32567 971076 -370734 -1914221 -3085249 -4233229 -5184827 -5019168 -3699070 -2508164 -2182378
32558 -2182378 -1854022 -675107 645963 944588 374331 65810 639327 1900152 3347779
32549 3347779 4114950 3096003 227331 -2786541 -4077236 -3692039 -3128749 -3051601 -2594099
32540 -2594099 -1036967 864410 1741350 1196745 -29762 -1176334 -2111934 -2783201 -2620540
32531 -2620540 -1211268 504040 664124 -1271684 -3425357 -3600450 -2030108 -870314
32523 -870314 -1200242 -1940316 -1889925 -1353653 -1171206 -1410275 -1785715 -2298883 -2665717 -2122590
32513b122590J475627J260321L78617K70405O12509l41089k325735k640450l10062
32504c742447J843718J184565p29111n83758J570181K455872M54563k323314l282854
32495c152585k421944j209665j70583R67706J788446J486462M05571p0443O08103
32486a768932J366397J034215m2676n51835K6897R13501J167787O87060k5637
32477B806777n38899p14197o38709n55373o10331o13566l33813O6459L25945O06878
32467a98829J042509J023791R396j054718n96738R93426J326008o05211k662706
32458g23072k492011p14579M84308O57979Q91751J221200O94151l08038k47426
32449e35737Q76946J237097Q3269j077137r41928k25687n7340j62689J87858O45823
$$ plain form
32513 -2122590 -646963 613358 991975 1262380 1874889 1533800 -791935 -3432385 -3742447
32504 -3742447 -1898729 -714164 -1443275 -2027033 -456852 1999020 2453583 130269 -3152585
32495 -3152585 -5574529 -6784194 -6954777 -5987071 -4198625 -2712163 -2306592 -2377035 -1768932
32486 -1768932 -402535 631680 589004 37169 64066 977567 2145354 2832414 2806777
32477 2806777 2267878 1553681 914972 359599 -250732 -864298 -1198111 -1131652 -805707 -198829
32467 -198829 843680 1867471 1876867 822149 225411 1218837 2544845 1939634 -723072
32458 -723072 -3215083 -3929662 -3445354 -2787375 -1895624 -674424 19727 -288311 -535737
32449 -535737 341209 1578306 1661575 584438 -357490 -583177 -640517 -803206 -615348 30475
32439C0475M39554k11695l90057K42266J115293J356875M70714j077171j922646
32430E3608j191851K54974Q98578O54449N97713Q07768K73511q72042j063874
32421D12834K8389N19081q18223k380760j952579J39093J632638J304075L058
32412a112394p28474o2966J568079K634226J867538p8450j267281j070002o90735
32403A059541p08948j34843J081196R23430j427711l262295j833267J268945K141773
32394h92179J71218j421692n12170J381671K029866J412951O58724L3719o91972
32385B170136j159402r07015k21977L02683N30347N86152L99558j30877q12308
32376G57297j219059j002689l18697K0525n54782j152785j90168K082017L238821
$$ plain form
32439 30475 470029 258334 -131723 110543 1225836 2582711 3053425 1976254 53608
32430 53608 -1138243 -883269 15309 669758 1267471 2075239 2348750 1476708 412834
32421 412834 441223 960304 142081 -2238679 -4191258 -4052165 -2419527 -1115452 -1112394
32412 -1112394 -1840868 -1903834 -335755 2298471 4166009 4087559 2820278 1750276 1059541
32403 1059541 350593 215750 1296946 2220376 792665 -2469630 -4302897 -3033952 -892179
32394 -892179 -720961 -2142653 -2654823 -1273152 756714 2169665 2828389 2862108 2170136
32385 2170136 1010734 103719 -118258 184425 714772 1300924 1700482 1569605 757297
32376 757297 -461762 -1464451 -1783148 -1762623 -2317405 -3470190 -3660358 -1578341 1660480
32367A660480J940341J7232l05437K52290k73406j331003q01470Q52287P87227
32358B798541j460195k712489r18582J641024J794780k1419r24834Q1950J158034
32349A436810N68006j116364j914601p53539J232524J747634J03405j517094p54583
32340i67802J397360J709369n62801k471117j720531J68945N76749l82739p71317
32331c023884j25962L44237N4003m18640o61734p25428m38134K83327Q21153O15428
32321c275634L9134l36407n65951o13805K3781R66056O87157r61412j554396O10227
32311d981250L413983L503763R47983j238044j445197o35420L07048J421289J934059
32302C228214O38161j637068k609290j933092j314416j034803M07264K564227
$$ plain form
32367 1660480 3600821 3618053 3312616 3564906 3291500 1960497 1159027 2011314 2798541
32358 2798541 1338346 -1374143 -2292725 -651701 1143079 1121660 196826 278776 1436810
32349 1436810 2004816 888452 -1026149 -1779688 -547164 1200470 1303875 -213219 -967802
32340 -967802 429558 2138927 1576126 -894991 -2615522 -2446577 -1869828 -2252567 -3023884
32331 -3023884 -3149846 -2805609 -2751606 -3170246 -3831980 -4557408 -4995542 -4712215 -3891062 -3275634
32321 -3275634 -3236500 -3572907 -4138858 -4752663 -4728882 -3762826 -3075669 -4037081 -5591477 -4981250
32311 -4981250 -1567267 1936496 2884479 1646435 201238 -434182 -127134 1294155 3228214
32302 3228214 3866375 2229307 -379983 -2313075 -3627491 -4662294 -4255030 -1690803
32294a690803K625061J82730j244876L23554J826225J15582k658507k447311J99873
32285b768472J379638K41884l97218N16002P55524o23624j334415M6283J466053
32276g18345Q34534o51924p62125L09409R02698P04515M97200K82479l84538j024683
32266a0780q86408k73282J82020P26901J554800J634972J77304j521580j558661
32257B5286k39515M40388k16950j026683j138638q90648m00744P17296J916266
32248h13942J898792P49997N6328K83033m489j358346j941462l64235J686891
32239A92567J668546j29842j263231p94809m9590O4958K30605Q52265J042737
32230A814206L14515k94896J45962Q61450N10469q77318k128409k441352j707684
$$ plain form
32294 -1690803 934258 1116988 -127888 195666 2021891 2137473 -521034 -2968345 -2768472
32285 -2768472 -1388834 -1146950 -1544168 -1028166 -272642 -896266 -2230681 -2184398 -718345
32276 -718345 116189 -535735 -1297860 -988451 -85753 618762 1115962 1398441 1013903 -10780
32266 -10780 -897188 -1170470 -988450 -261549 1293251 2928223 3105527 1583947 25286
32257 25286 -214229 226159 9209 -1017474 -2156112 -3046760 -3447504 -2730208 -813942
32248 -813942 1084850 1834847 1891175 2174208 2169719 811373 -1130089 -1494324 192567
32239 192567 1861113 1731271 468040 -326769 -376359 -311401 -80796 771469 1814206
32230 1814206 2128721 1833825 1979787 2841237 3351706 2474388 345979 -2095373 -3803057
32221c803057K4056K193666L255194J989236o22608k116502j494281k83269j14512
32212i72077n09398j57961O45131N12894m75478n98113Q07765K192518K152614
32203C597895J387386J052429N57107j141080k949840k665041m66729R25003J16369
32194D13499j088494p14121M38382M53722n82441j075035o23748k23384j60520
32185c162140L38339J302763J607949P67077k69162o05294n33057o47556q45489
32176b046570p91604n70417l23336R0066O11581Q09242N99160N02216P64821Q73796
32166E18955M17953j89570l88774l22364m14751n44631k63604M35211J105182
32157C53607J413504J303883Q00440M3852o39259j019396j150364j054637n34292
$$ plain form
32221 -3803057 -3779001 -1585335 1669859 3659095 3036487 919985 -574296 -857565 -972077
32212 -972077 -1481475 -1639436 -994305 -481411 -956889 -1555002 -747237 1445281 3597895
32203 3597895 4985281 6037710 6594817 5453737 2503897 -161144 -627873 297130 413499
32194 413499 -674995 -1389116 -950734 -497012 -1079453 -2154488 -2778236 -3001620 -3162140
32185 -3162140 -2823801 -1521038 86911 853988 584826 -20468 -553525 -1201081 -2046570
32176 -2046570 -2838174 -3408591 -3731927 -3641861 -3030280 -2221038 -1621878 -1119662 -354841 518955
32166 518955 936908 747338 358564 36200 -378551 -923182 -1186786 -751575 353607
32157 353607 1767111 3070994 3871434 3915286 3276027 2256631 1106267 51630 -482662
32148d82662L61093R69850O15474m89276j338350j214337m37015P2762j57787
32139b100248o98396q26986m01639J21077M05530M99735L65772j47610n75240
32130c358005O3248J741575K804559J906178l1633j026388p08946k82962j21996
32121I85630O65996J992920K111952J73563k090471k504636j192304M3453K35293
32112D21396q6320j70180J59796O88587R85994P13926K41422L21249P17788J85968
32102D179626j459650k491056j643436j69167L8624o04593k40879J180649J702341
32093D92459M71615r68488j044617j54018M53051M69649L39096K28933N8696n0469
32083B95907q585j9786k02272l49462l35569l39507m72734n73551m70720j17327
$$ plain form
32148 -482662 -121569 848281 1463755 974479 -363871 -1578208 -2015223 -1942461 -2100248
32139 -2100248 -2798644 -3625630 -4027269 -3906192 -3500662 -3000927 -2635155 -2782765 -3358005
32130 -3358005 -3294757 -1553182 1251377 3157555 3125922 2099534 1390588 1107626 985630
32121 985630 1651626 3644546 5756498 5930061 3839590 1334954 142650 186103 421396
32112 421396 335076 164896 324692 1013279 1999273 2713199 2954621 3275870 3993658 4179626
32102 4179626 2719976 228920 -1414516 -1583683 -1545059 -2149652 -2390531 -1209882 492459
32093 492459 964074 -4414 -1049031 -1203049 -749998 -280349 58747 287680 346376 295907
32083 295907 287322 267536 65264 -284198 -619767 -959274 -1432008 -2005559 -2476279 -2593606
32073b593606M48833R06026P15346o3554m52286J71283R32573O03087n22558j100728
32063i55584p68316l02484L6254P07865J428981J246195L40075L733M10105K53433
32053B400257p88291j254687m95921L7897n57536q10444M46823J491255K37709
32044G07062k076877k496408p55592P81829J145545J659037K661783K454837M90335
32035D571551j104928o80173M52581L61793n22937o93637l41166o62369j350260
32026C0455j057428M1624L50902m29791p38159K23107J139772P65923q1076J5882
32016B61211P02230N20482n34135q22547L18319J247588K60927j759911k310819
32007b116655p18970Q03715J71452j662985k048411l06257J527587J739994J065634
$$ plain form
32073 -2593606 -2144773 -1238747 -523401 -586955 -1039241 -867958 64615 667702 145144 -955584
32063 -955584 -1723900 -2026384 -1990130 -1282265 146716 1392911 1732986 1736719 2146824 2400257
32053 2400257 1611966 357279 -138642 -100745 -658281 -1468725 -1021902 469353 707062
32044 707062 -1369815 -3866223 -4621815 -3839986 -2694441 -1035404 1626379 4081216 4571551
32035 4571551 3466623 2786450 3239031 3600824 3077887 2384250 2043084 1380715 30455
32026 30455 -1026973 -985349 -634447 -1064238 -1802397 -1579290 -439518 326405 245329 261211
32016 261211 963441 1483923 949788 127241 445560 1693148 1954075 194164 -2116655
32007 -2116655 -2835625 -2031910 -1860458 -3523443 -5571854 -5878111 -4350524 -2610530 -1544896
31998a544896R45750J086092K63943j221717j718719p73632J67396J6744m75096
31989c254135k42497L76927N37881N33006J169085J991415J586655k80293k020481
31980C97563k076401o14606R85827J686270J459207R17324O77270Q19895P75405
31971E027754J1058j105455j544897q59674K26159O60616J35163q40420j525959
31962A84345j409053m88776N88145R42424K82415q08893j435432j037785L28516
31953b854094J853277K261176J033442n94802p77223N36517J373944M62916r57597
31944B337556j073710k74961m56716j933881k764305j501058P64446J902122J401415
31935a599092N82616N44559Q47646M24060p72046j536733q72552O78309J540510
$$ plain form
31998 -1544896 -599146 486946 750889 -470828 -2189547 -2963179 -2795783 -2779039 -3254135
31989 -3254135 -3496632 -3119705 -2581824 -2048818 -879733 1111682 2698337 2418044 397563
31980 397563 -1678838 -2293444 -1307617 378653 1837860 2755184 3432454 4252349 5027754
31971 5027754 5038812 3933357 2388460 1528786 1754945 2415561 2550724 1710304 184345
31962 184345 -1224708 -1713484 -1125339 -182915 99500 -709393 -2144825 -3182610 -2854094
31953 -2854094 -1000817 1260359 2293801 1698999 921776 1458293 2832237 3295153 2337556
31944 2337556 1263846 988885 532169 -1401712 -4166017 -5667075 -4902629 -3000507 -1599092
31935 -1599092 -1016476 -471917 375729 799789 27743 -1508990 -2381542 -1703233 -162723
31926a62723R15927l37516p98418n9840J043948J423036O24007r16101k118262
31917c85942k034139p50260O56660J253976J007432L19301m91084r15354l30355
31908a669765R66909J577798P44513m27723n40818m836j97894j018131r78555
31899a548502K55752J156030O38659m03198o45024j97358K7560p9370Q5090O28104
31889h2257R89762Q01215K19390n13329j279643j791997j494705p7603J856391
31880a372776K877335J959531k43475j878656j920891j086007l67433L25433J195201
31871e11738J307075j40884j919917j935760j43945J406390J462911P65664J88336
31862D78132m24972j027898p87329L91632J241458R29782J94578j03291k52101
$$ plain form
31926 -162723 753204 415688 -382730 -442570 601378 2024414 2648421 1732320 -385942
31917 -385942 -2420081 -3170341 -2513681 -1259705 -252273 67028 -424056 -1339410 -1669765
31908 -1669765 -702856 874942 1619455 1191732 650914 646078 448184 -569947 -1548502
31899 -1548502 -1292750 -136720 501939 98741 -546283 -743641 -716081 -795451 -710361 -82257
31889 -82257 907505 1708720 1928110 1414781 135138 -1656859 -3151564 -3229167 -1372776
31880 -1372776 1504559 3464090 3220615 1341959 -578932 -1664939 -2032372 -1706939 -511738
31871 -511738 795337 654453 -1265464 -3201224 -3345169 -1938779 -475868 289796 478132
31862 478132 53160 -974738 -1762067 -1370435 -128977 800805 995383 892092 639991
31853F39991o92919j028563q78136n53076k03906M30878R21224M33884l26201
31844a256824M16783K193325J987359j116108l592015k234746R99297J955677
31836f47252L23883p89082j66181M75460L51447O31224J252131M44183j588203
31827B87610j980669K47133K050299Q12990j633485j898711j0924J171991L70000
31818e83766r10825j151930n72927l1643J47423N635k02201J22963J221826K130442
31808A74997J530547m08014j919522j693668l89492L01332k68513j004271m69161
31799d145765J260885K474685J755139k50299j489178q68176O34148J334889P22411
31790A428739l45411q22679m03894M58168J011711P16544l71432j539434j821292
$$ plain form
31853 639991 -52928 -1081491 -1959627 -2512703 -2716609 -2285731 -1364507 -930623 -1256824
31844 -1256824 -840041 1353284 3340643 2224535 -1367480 -3602226 -2602929 -647252
31836 -647252 -323369 -1112451 -1278632 -803172 -451725 179499 1431630 1875813 287610
31827 287610 -1693059 -1445926 604373 1417363 -216122 -2114833 -2125757 -953766 -583766
31818 -583766 -1494591 -2646521 -3219448 -3251091 -3103668 -3098033 -3300234 -3177271 -1955445 174997
31808 174997 1705544 1297530 -621992 -2315660 -2705152 -2403820 -2672333 -3676604 -4145765
31799 -4145765 -2884880 -410195 1344944 1094645 -394533 -1262709 -628561 706328 1428739
31790 1428739 1083328 260649 -143245 314923 1326634 2043178 1671746 132312 -1688980
31781a688980p78452Q42855J501148N04916q57759p15834Q01168J581290N24835
31772A715187r67184j397700j400153j934354j806809N07413L413817L547638
31764A677855O87022j553077p49906J207684J386183o9402r83501o86380l09831
31755F06647l83967k03271N50354J133012Q84888M4205p34443r99192o06827K36003
31745E27409R54133R55087J23842r97333j483820q08832L41722N38214n25278
31736c74856j301334m70685J010931J342664O30955L27526M53398k13493j294420
31727A10686r58874N91508P59086j193801k459388r98850J196501J425056L89546
31718a138530K31756N49314l48139j655613j110320Q41880J387781j46489j300024
$$ plain form
31781 -1688980 -2467432 -1624577 -123429 381487 -476272 -1192106 -390938 1190352 1715187
31772 1715187 748003 -649697 -2049850 -3984204 -5791013 -5283600 -1869783 1677855
31764 1677855 2364877 811800 61894 1269578 2655761 2586359 1602858 916478 606647
31755 606647 222680 19409 569763 1702775 2587663 2631868 1897425 898233 291406 527409
31745 527409 1481542 2436629 2560471 1563138 79318 -729514 -387792 150422 -374856
31736 -374856 -1676190 -2146875 -1135944 206720 837675 1165201 1618599 1405106 110686
31727 110686 -848188 -256680 502406 -691395 -3150783 -4149633 -2953132 -1528076 -1138530
31718 -1138530 -906774 -357460 -705599 -2361212 -3471532 -2629652 -1241871 -1388360 -2688384
31709b688384m28780J166744J785397J515059R98237K17824m74869r2088J091162
31700C090302J108820r24003l033787k822450o95386P76032K17302j099993j184924
31691d568087J74700J297987Q42822l76268m63779P99053J509011M86659q63286
31682a161188p52781K42060M00789j84213k6073R56760J356353Q05034L41347
31673A978088K47695k19112q15773m04191O31011N39329o80954r44696K87603
31664F19000Q07379n32553j520862j02710K115619K290839N34550q36440r72413
31655B402409q85898j002084p52161k44629k44456o39144o20223j46887K53718
31646a879355O82393J346418J451919L19497r83523r91110k83958n25572j479576
$$ plain form
31709 -2688384 -3117164 -1950420 -165023 1350036 2348273 2566097 2091228 1999140 3090302
31700 3090302 4199122 3275119 241332 -2581118 -3276504 -2500472 -2283170 -3383163 -4568087
31691 -4568087 -4393387 -3095400 -2252578 -2628846 -3092625 -2293572 -784561 -297902 -1161188
31682 -1161188 -1913969 -1671909 -1271120 -1455333 -1481406 -524646 831707 1636741 1978088
31673 1978088 2225783 2006671 1190898 786707 1417718 1957047 1276093 331397 619000
31664 619000 1426379 893826 -627036 -729746 1385873 3676712 4211262 3374822 2402409
31655 2402409 1516511 514427 -237734 -482363 -726819 -1365963 -1986186 -2133073 -1879355
31646 -1879355 -1196962 149456 1601375 1920872 937349 -53761 -337719 -863291 -2342867
31637b342867j336329Q9990J011404Q09628R53992K024215K330040P78002j080797
31628C237278j464630r63533r43306r82886k4295J127002Q10798n90790j060976
31619h55338r9000O87065L22664k42770j48773n4093n87371r09328j10141J013824
31609i83261R54830l18501j388350j278978k81170Q64854J607598J546313P30788
31600A454123k1149k017K16543n24710k041255k671556j420498P79190K402877
31591a828452K902469K346226O77504j550248k614320j337692R20479J451551
31583I67517m66677k624816k636358o35176J315686J735936R45335J54989L948
31574a239616P3735l46392j135043j247423k8159J649847K139200R37339o60094
$$ plain form
31637 -2342867 -3679196 -3589206 -2577802 -1768174 -814182 1210033 3540073 4318075 3237278
31628 3237278 1772648 809115 -134191 -1117077 -1141372 -14370 796428 205638 -855338
31619 -855338 -954338 -267273 55391 -187379 -336152 -390245 -977616 -1886944 -1997085 -983261
31609 -983261 -28431 -346932 -1735282 -3014260 -3295430 -2430576 -822978 723335 1454123
31600 1454123 1432974 1430957 1647500 1122790 -918465 -3590021 -5010519 -4231329 -1828452
31591 -1828452 1074017 3420243 4097747 2547499 -66821 -1404513 -484034 967517
31583 967517 500840 -2123976 -4760334 -5395510 -4079824 -2343888 -1398553 -1243564 -1239616
31574 -1239616 -1165881 -1512273 -2647316 -3894739 -3922898 -2273051 -133851 803488 143394
31565A43394j008090J08345J339471J315029K28498l19570O27954J798727J121800
31556E355558j179798k369770q70627J344434J549435J84322k02680Q37215J204568
31547E852657M7656q37619k99230R1001j141141k595425k154442m48795J70211
31538a315127o68845j014389J78602J555632J537132M18675m12892l53286N0415
31529b4083O4818m74000j189502j592937j390450m64431J066401K400358K164807
31520E60981k831k153794j753180R33021K724811J597077p36431j586600j054993
31511a471939j047078j644741j050705J018126K430122J788008L93454l1526Q2413
31502D66134o32854j772085j476940O71338K601396K177971j58677j969931j746190
$$ plain form
31565 143394 -864696 -756351 583120 1898149 2126647 1807077 2435031 4233758 5355558
31556 5355558 4175760 1805990 935363 2279797 3829232 4013554 3810874 4648089 5852657
31547 5852657 5900313 5062694 4763464 4854465 3713324 1117899 -1036543 -1485338 -1315127
31538 -1315127 -1983972 -2998361 -2819759 -1264127 273005 691680 278788 -74498 -24083
31529 -24083 40735 -433265 -1622767 -3215704 -4606154 -5070585 -4004184 -1603826 560981
31520 560981 558150 -1595644 -3348824 -2415803 309008 1906085 1169654 -416946 -1471939
31511 -1471939 -2519017 -4163758 -5214463 -4196337 -1766215 21793 415247 383721 466134
31502 466134 -166720 -1938805 -3415745 -2744407 -143011 2034960 1876283 -93648 -1839838
31493a839838m14433K78793N0002p3053L09229M62607R6960J29990J152499K154187
31483B306943J785939K28185j208788j846960j956738j672460p52432N62832J408531
31474a144948J274550O00289K39669N73581J072664O81363r29607k431481j988781
31465b052701L10160K158116J786537K1276j193561j232783p11113n9559M81670
31456d91958L59510l65561m19606Q52870J936990J168961n33317j002798j91800
31447A313291J50782k54129M2859J127947J160382m28779j749245j498913q46388
31438i82193r59154q46639N96958K155732J880454r487j591866j812259j055275
31429b623729J26392J308084J683305P07871q65671j652819j246390m22332K6073
$$ plain form
31493 -1839838 -2254271 -1975478 -1925476 -1998529 -1689300 -1226693 -1129733 -999743 152756 2306943
31483 2306943 4092882 4321067 3112279 1265319 -691419 -2363879 -3116311 -2553479 -1144948
31474 -1144948 129602 729891 969560 1543141 2615805 3297168 2367561 -63920 -2052701
31465 -2052701 -1742541 415575 2202112 2223388 1029827 -202956 -914069 -973628 -491958
31456 -491958 -132448 -498009 -917615 -64745 1872245 3041206 2507889 1505091 1313291
31447 1313291 1464073 1209944 1252803 2380750 3541132 3112353 1363108 -135805 -982193
31438 -982193 -1941347 -2787986 -2191028 -35296 1845158 1835671 243805 -1568454 -2623729
31429 -2623729 -2497337 -1189253 494052 1201923 336252 -1316567 -2562957 -2985289 -2959216
31420b959216J056j16605J22427Q35345J578117J869520J905064K045100J757053
31411G037861K83820j582723j983000p00594L13991o1474m07992O52888J877819
31402E430596J291956n36009j269719l07103N62907j2518j246269j720429j276967
31393I16445p91791p91942q54552k68614Q48262J363519N36935o74301p36359
31384d52398J56758L72721m01181n80134M80885J179688M30919l54051K07210
31375A040417R23764K12931r11287o36425L04636M9965p27808R5014J922595J927452
31365D201254k02976j554064o86322L34894k31486j106937p38976P5708K32446
31356C23541M96815J490304J704367k9808j897919j568923R0129N26140l08064
$$ plain form
31420 -2959216 -2958160 -3074765 -2952338 -2116993 -538876 1330644 3235708 5280808 7037861
31411 7037861 7321681 5738958 3755958 3055364 3369355 3307881 2899889 3552777 5430596
31402 5430596 6722552 6186543 4916824 4609721 5172628 5160110 3913841 2193412 916445
31393 916445 124654 -667288 -1521840 -1790454 -942192 421327 958262 283961 -452398
31384 -452398 -295640 77081 -324100 -904234 -423349 756339 1187258 833207 1040417
31375 1040417 1964181 2177112 1265825 629400 934036 984001 256193 351207 2273802 4201254
31365 4201254 3998278 2444214 1757892 2092786 1861300 754363 15387 91095 323541
31356 323541 820356 2310660 4015027 3985219 2087300 518377 608506 1134646 826582
31347H26582k68642R32826J134819m42301j619393o18523J248221J756152R88898
31338C938639O06574Q86920M49905j202630k610992k420003j290548p09459o21407
31329b973001K86950J965398K385176N15653j501561r35350J521530K516270P77094
31320D558159j282471j378706m03459k15876m91337P6239R28313N51652n68333
31311A774181n40683N98760P37668q19503k126088j599045j09571Q97933J396097
31302B09749J677761J146467k18177p87053M52795J804440J090801r36918j662387
31293B777478n55256L28605k15102r75401p25828n1187J48217J92454N41671O51223
31283B116874J02732l46057l7392L40691l4423o91354q53809q09742r66531o23363
$$ plain form
31347 826582 557940 1490766 2625585 2183284 563891 -54632 1193589 2949741 3938639
31338 3938639 4545213 5432133 5882038 4679408 2068416 -351587 -1642135 -2351594 -2973001
31329 -2973001 -2686051 -720653 1664523 2180176 678615 -256735 1264795 3781065 4558159
31320 4558159 3275688 1896982 1493523 1277647 786310 862549 1790862 2342514 1774181
31311 1774181 1233498 1832258 2569926 1750423 -375665 -1974710 -2084281 -1186348 209749
31302 209749 1887510 3033977 2815800 2028747 2481542 4285982 5376783 4439865 2777478
31293 2777478 2222222 2550827 2335725 1360324 634496 583309 731526 923980 1465651 2116874
31283 2116874 2219606 1873549 1836157 2176848 2142425 1451071 597262 -212480 -1179011 -1802374
31273a802374P21895J813799J223317k60679p61078j98155N1254j61802J94483
31264H20660Q72176N35618n32474o43383Q9894k54861j548604j084745J683549
31255f2170L266651J263041j663649j825620L1717P09204n7305q5605O62187J43483
31245B381934j482605j664047P5698J136706J73544q65268k76433P12388L66097
31236E58014p93609j279526q72481j53687O44588J197351R97489N60310J038395
31227A896844J929307J260221j011018k210721j004453K74959n91119j952858
$$ plain form
31273 -1802374 -1080479 733320 1956637 1695958 934880 736725 787979 626177 820660
31264 820660 1692836 2228454 1695980 1052597 1142491 887630 -660974 -1745719 -62170
31255 -62170 3204481 4467522 2803873 978253 1009970 1719174 1661869 1576264 2238451 2381934
31245 2381934 899329 -764718 -689020 447686 621230 -244038 -520471 191917 558014
31236 558014 -235595 -1515121 -2387602 -2541289 -1896701 -699350 298139 858449 1896844
31227 1896844 3826151 5086372 4075354 1864633 860180 1135139 544020 -1408838
$$ [...]
##END NTUPLES=NMR SPECTRUM
##END=
