##TITLE=31Pdec_LY-TMF-6.5.R.t
 D2O, 24 sc
 27.2.2020
##JCAMPDX= 6.0         $$ Bruker NMR JCAMP-DX V2.0
##DATA TYPE= NMR SPECTRUM
##DATA CLASS= NTUPLES
##ORIGIN= UXNMR, Bruker Analytische Messtechnik GmbH
##OWNER= root
$$ XWIN-NMR		Version 3.5
$$ Thu Feb 27 14:25:36 2020 Russian Standard Time (UT+4h)  she@DPX200
##.OBSERVE FREQUENCY= 81.013821
##.OBSERVE NUCLEUS= ^31P
##.ACQUISITION MODE= SIMULTANEOUS
##.ACQUISITION SCHEME= undefined
##.AVERAGES= 24
##.DIGITISER RES= 17
##SPECTROMETER/DATA SYSTEM= spect
##.PULSE SEQUENCE= zgpg30
##.SOLVENT NAME= CDCl3
##.SHIFT REFERENCE= (INTERNAL, CDCl3, 0, 182.463)
##AUDIT TRAIL= $$ (NUMBER, WHEN, WHO, WHERE, WHAT)
$$ ##TITLE= Audit trail, XWIN-NMR		Version 3.5
$$ ##JCAMPDX= 5.01
$$ ##ORIGIN= Bruker BioSpin GmbH
$$ ##OWNER= she
$$ F:/spectra/data/she/nmr/P31/1/pdata/1/auditp.txt
$$ ##AUDIT TRAIL=  $$ (NUMBER, WHEN, WHO, WHERE, WHAT)
(   1,<2020-02-27 14:24:30.34 +0400>,<she>,<DPX200>,
      <created by zg, POWCHK disabled, PULCHK disabled
       configuration hash MD5:
       00 E9 B6 7A A2 85 ED C7 34 08 36 98 17 FE 4E 26
       data hash MD5: 32K
       C9 B0 80 E5 EB 3D D4 B7 9D 00 FE 74 13 8F 78 28>)
(   2,<2020-02-27 14:24:33.51 +0400>,<she>,<DPX200>,
      <Start of raw data processing
       efp BC_mod = 2 LB = 1 FT_mod = 6 PKNL = 1 PHC0 = -1572.255 PHC1 = 583.2014 SI = 64K 
       data hash MD5: 64K
       F9 39 E4 0B 9B 49 6F C2 D6 38 03 49 F2 05 1B 0E>)
(   3,<2020-02-27 14:24:58.67 +0400>,<she>,<DPX200>,
      <pk PHC0 = -23.92681 PHC1 = 43.40003 
       data hash MD5: 64K
       3D 77 EA DE 21 97 34 2D 78 20 F1 4B EE 19 1B C6>)
(   4,<2020-02-27 14:25:01.93 +0400>,<she>,<DPX200>,
      <abs ABSG = 5 
       data hash MD5: 64K
       52 74 ED AC 7D 34 DF B9 A6 B8 AC 2A 9B 85 A5 EC>)
$$ ##END=
$$ 
$$ hash MD5
$$ D9 85 C1 33 63 28 8C E8 C0 EC 1C 42 18 99 FF 5C
##$RELAX= 
##$RELAX= 
##$RELAX= 
##$RELAX= 
##$RELAX= 
##$RELAX= 
##$RELAX= 
##$RELAX= 
$$ Bruker specific parameters
$$ --------------------------
##$DU= <F:/spectra>
##$EXPNO= 1
##$NAME= <P31>
##$PROCNO= 1
##$TYPE= <nmr>
##$USER= <she>
##$AMP= (0..31)
100 100 100 100 100 100 100 100 100 100 100 100 100 100 100 100 100 100 
100 100 100 100 100 100 100 100 100 100 100 100 100 100 
##$AQSEQ= 0
##$AQ_mod= 1
##$AUNM= <au_zg>
##$AUTOPOS= <>
##$BF1= 81.014009
##$BF2= 200.13
##$BF3= 200.13
##$BF4= 200.13
##$BF5= 200.13
##$BF6= 200.13
##$BF7= 200.13
##$BF8= 200.13
##$BYTORDA= 1
##$CFDGTYP= 0
##$CFRGTYP= 5
##$CHEMSTR= <none>
##$CNST= (0..31)
1 1 145 1 1 1 1 1 1 1 1 1 1 1 1 1 1 1 1 1 1 1 1 1 1 1 1 1 1 1 1 1 
##$CPDPRG= <waltz16>
##$CPDPRG1= <>
##$CPDPRG2= <waltz16>
##$CPDPRG3= <>
##$CPDPRG4= <mlev>
##$CPDPRG5= <mlev>
##$CPDPRG6= <mlev>
##$CPDPRG7= <mlev>
##$CPDPRG8= <mlev>
##$CPDPRGB= <>
##$CPDPRGT= <>
##$D= (0..31)
0 1 0 0 0 0 0 0 0 0 0 0.03 2e-05 3e-06 0 0 0 0 0 0 0 0 0 0 0 0 0 0 0 0 
0 0 
##$DATE= 1582799069
##$DBL= (0..7)
120 120 120 11 120 120 24 19 
##$DBP= (0..7)
150 150 150 150 150 150 150 150 
##$DBP07= 0
##$DBPNAM0= <>
##$DBPNAM1= <>
$$ [...]
##$SUBNAM3= <"">
##$SUBNAM4= <"">
##$SUBNAM5= <"">
##$SUBNAM6= <"">
##$SUBNAM7= <"">
##$SUBNAM8= <"">
##$SUBNAM9= <"">
##$SW= 369.568048894756
##$SWIBOX= (0..15)
0 1 3 0 0 0 0 0 0 0 0 0 0 0 0 0 
##$SW_h= 29940.119760479
##$TD= 32768
##$TD0= 1
##$TE= 0
##$TE2= 300
##$TE3= 300
##$TEG= 300
##$TL= (0..7)
0 120 53 12 22 120 120 120 
##$TP= (0..7)
150 150 150 150 150 150 150 150 
##$TP07= 0
##$TPNAME0= <>
##$TPNAME1= <>
##$TPNAME2= <>
##$TPNAME3= <>
##$TPNAME4= <>
##$TPNAME5= <>
##$TPNAME6= <>
##$TPNAME7= <>
##$TPOAL= (0..7)
0.5 0.5 0.5 0.5 0.5 0.5 0.5 0.5 
##$TPOFFS= (0..7)
0 0 0 0 0 0 0 0 
##$TUNHIN= 0
##$TUNHOUT= 0
##$TUNXOUT= 0
##$USERA1= <user>
##$USERA2= <user>
##$USERA3= <user>
##$USERA4= <user>
##$USERA5= <user>
##$V9= 5
##$VALIST= <valist>
##$VCLIST= <CCCCCCCCCCCCCCC>
##$VD= 0
##$VDLIST= <DDDDDDDDDDDDDDD>
##$VPLIST= <PPPPPPPPPPPPPPP>
##$VTLIST= <TTTTTTTTTTTTTTT>
##$WBST= 1024
##$WBSW= 4
##$XGAIN= (0..3)
0 0 0 0 
##$XL= 0
##$YL= 0
##$YMAX_a= 4245
##$YMIN_a= -6972
##$ZGOPTNS= <>
##$ZL1= 120
##$ZL2= 120
##$ZL3= 120
##$ZL4= 120
##$ABSF1= 182.463
##$ABSF2= -187.1042
##$ABSG= 5
##$ABSL= 3
##$ALPHA= 0
##$AQORDER= 0
##$ASSFAC= 0
##$ASSFACI= 0
##$ASSFACX= 0
##$ASSWID= 0
##$AUNMP= <proc_1d>
##$AZFE= 0.1
##$AZFW= 0.5
##$BCFW= 0
##$BC_mod= 2
##$BYTORDP= 0
##$COROFFS= 0
##$CY= -3
##$DATMOD= 1
##$DC= 0
##$DFILT= <>
##$DTYPP= 0
##$F1P= 0
##$F2P= 0
##$FCOR= 1
##$FTSIZE= 65536
##$FT_mod= 6
##$GAMMA= 0
##$GB= 0
##$INTBC= 1
##$INTSCL= 5.30512e-09
##$ISEN= 30
##$LB= 1
##$LEV0= 0
##$LPBIN= 0
##$MAXI= 10000
##$MC2= 0
##$MEAN= 0
##$ME_mod= 0
##$MI= 50
##$NCOEF= 0
##$NC_proc= -6
##$NLEV= 6
##$NOISF1= 182.463
##$NOISF2= 159.3651
##$NSP= 0
##$NTH_PI= 0
##$NZP= 0
##$OFFSET= 182.463
##$PC= 4
##$PHC0= -1596.182
##$PHC1= 626.6014
##$PH_mod= 1
##$PKNL= yes
##$PPARMOD= 0
##$PSCAL= 0
##$PSIGN= 0
##$REVERSE= no
##$SF= 81.0140089999434
##$SI= 65536
##$SIGF1= 159.3651
##$SIGF2= -187.1042
##$SINO= 113.3802
##$SIOLD= 16384
##$SREGLST= <1H.CDCl3>
##$SSB= 0
##$STSI= 65536
##$STSR= 0
##$SW_p= 29940.119760479
##$SYMM= 0
##$S_DEV= 0
##$TDeff= 32768
##$TDoff= 0
##$TI= <>
##$TILT= no
##$TM1= 0
##$TM2= 0
##$TOPLEV= 0
##$USERP1= <user>
##$USERP2= <user>
##$USERP3= <user>
##$USERP4= <user>
##$USERP5= <user>
##$WDW= 1
##$XDIM= 65536
##$YMAX_p= 470068399
##$YMIN_p= -11246600
$$ End of Bruker specific parameters
$$ ---------------------------------
##NTUPLES= NMR SPECTRUM
##VAR_NAME=  FREQUENCY,     SPECTRUM/REAL,   SPECTRUM/IMAG
##SYMBOL=    X,             R,               I
##VAR_TYPE=  INDEPENDENT,   DEPENDENT,       DEPENDENT
##VAR_FORM=  AFFN,          ASDF,            ASDF
##VAR_DIM=   65536,         65536,           65536
##UNITS=     HZ,            ARBITRARY UNITS, ARBITRARY UNITS
##FACTOR=    0.456856943014862, 1,           1
##FIRST=     14782.0589164792, 0,            0
##LAST=      -15158.0608439998, 0,           0
##MIN=       -15158.0608439998, -11246600,   0
##MAX=       14782.0589164792, 470068399,    0
$$ Real data points
##PAGE= N=1
##DATA TABLE= (X++(R..R)), XYDATA
$$ [...]
##PAGE= N=2
##DATA TABLE= (X++(I..I)), XYDATA
36770h2324K58281K37049L7877j79861j73467l1406o567n2005P1499K91345K43702
36759F14123j65883n57216n13341j1286O05996R14829P07156J90824j54980r6873
36749A533349P6036j0024k45839k16715J30028L58124J39007l19309n60523m04239
36739D79895p0723J02998M473j37559K953M20356O89194M48370j25902n26001
36729A288054n11250k72736o5932L7232K4167j33337l30985l39297q9601K01307
36719a92378K93667J86840M7026k490M7507J20105J00586m6767j99706k31667
36709A22723k15197k88603l39653r0121M32244P83799O34301J88454j15809j43486
36699I68652p0812j6530N0696J04607M1492j16426k15483j94980j31541m9248
$$ plain form
36770 -82324 175957 413006 450883 271022 97555 66149 59582 7577 79076 370421 614123
36759 614123 448240 -108976 -622317 -633603 -27607 887222 1594378 1785202 1630222 1533349
36749 1533349 1609385 1599361 1353522 1136807 1266835 1624959 1763966 1444657 884134 479895
36739 479895 409172 512170 516643 379084 382037 802393 1491587 1939957 1814055 1288054
36729 1288054 776804 504068 438136 475368 499535 366198 35213 -304084 -393685 -192378
36719 -192378 101289 288129 335155 332665 380172 500277 600863 554096 354390 122723
36709 122723 -92474 -381077 -720730 -810851 -378607 405192 1039493 1227947 1112138 968652
36699 968652 897840 881310 932006 1036613 1078105 961679 746196 551216 419675 370427
36689C70427J01794K37151J50776j42297k95551o6310K89473L11993l6691l20354
36679F00411k36808o94L4234r1155n4201K03372L56727J72226j71394l67670l60622
36668H4426k47903j2148L56491N84845L32328k79265o82015n36748j20915J13968
36658d06936J02554N4728L0009m8533j01510J6955J79342R9299j74269k28886
36648d77247J20979N23063N57971K73002J4459p8321j29722j85529j20686Q3972
36638E81941K07779M2132l30484n94307n07939j31176K38220L56324K55169J36458
36628B54117Q3830J2109q9958o3950J57146L61593L11123O9164j10182j36541
36618H48451j26241j51631j67171j64388j78933j32541J02704M20284M76833J07771
$$ plain form
36689 370427 472221 709372 860148 717851 422300 355990 645463 957456 920765 600411
36679 600411 363603 362909 397143 305988 251787 455159 811886 984112 812718 445048 84426
36668 84426 -163477 -175625 180866 765711 1098039 818774 136759 -399989 -520904 -406936
36658 -406936 -304382 -249654 -219645 -268178 -369688 -352733 -173391 -74092 -248361 -477247
36648 -477247 -356268 166795 724766 997768 1012227 933906 804184 618655 497969 581941
36638 581941 789720 831852 501368 -92939 -600878 -732054 -493834 -137510 117659 254117
36628 254117 337947 350056 260098 196148 353294 714887 1026010 1095174 984992 848451
36618 848451 722210 570579 403408 239020 60087 -72454 30250 450534 927367 1035138
36608A035138l91609n45619k12548K61853L85840K778n25032o31871j24580N80368
36598a65282Q87790O50288K34322P826l3520r5403k48037l84400l96174k67225
36588A90185m4050J98371L75354M21204L12920R2626j27332k53856l33659m67571
36578C64192n58649l41366J98555O46449O34524L16885R4023M1805l9751j71518
36568A185149k19996k67872m67298n74814j94186M77013P47440M24832R8621J91053
36558A399942L45790J30079k29360k97783j55975j52449k96479l86814m12314
36549e5363l71477p1019M15567N31454N9827l11524J8140M72048J48562n78187
36539B58028m90600M86905J001418K83031p20483q13905j92743J70914N0791k7094
$$ plain form
36608 1035138 643529 97910 -114638 147215 533055 535833 10801 -621070 -745650 -165282
36598 -165282 722508 1372796 1607118 1614944 1581424 1486021 1237984 853584 457410 190185
36588 190185 146135 344506 719860 1141064 1453984 1546610 1419278 1165422 831763 364192
36578 364192 -194457 -535823 -337268 309181 943705 1260590 1354613 1396418 1356667 1185149
36568 1185149 965153 697281 229983 -344831 -539017 -62004 685436 1110268 1208889 1399942
36558 1399942 1745732 1875811 1646451 1348668 1192693 1040244 743765 356951 -55363
36549 -55363 -426840 -497859 -82292 449162 508989 197465 215605 687653 836215 258028
36539 258028 -232572 254333 1255751 1538782 818299 4394 -188349 -17435 33356 6262
36529F262J37092K22986J11127N3826J41605J76052R4978N3478N4004q8327l54319
36518F08764m53802k46888M1210J33586M3432J0951K01544N11672O37850L75408
36508A863727j19359m53543m22507j92632k9879j4523p8440j29733o2867J55157
36498E15401L40375K64500L2391p324J82925K29588l3137k51860j32682O7884
36488A208061M995j53679n3168J87600J54962j70263l96596l16613p7967J62361
36478E49693L22628K24567j86730n05884k59724L62600O85802M80536J68394L0793
36468A872675j50800m60877n09955j10172K64536J67705j27923j43557J3718k7771
36458G87579j39131M0560K93445Q3821m23976m63181P6122L46464j32158o49996
$$ plain form
36529 6262 143354 366340 477467 531293 672898 848950 943928 997406 1051410 963083 608764
36518 608764 154962 -91926 -50716 82870 126302 137253 338797 850469 1488319 1863727
36508 1863727 1744368 1290825 868318 675686 645807 631284 552844 423111 360244 515401
36498 515401 855776 1120276 1152667 1145343 1328268 1557856 1524719 1272859 1140177 1208061
36488 1208061 1213056 1059377 1006209 1193809 1348771 1178508 781912 465299 387332 549693
36478 549693 872321 1096888 910158 404274 144550 507150 1192952 1673488 1841882 1872675
36468 1872675 1721875 1260998 751043 640871 905407 1073112 945189 801632 815350 787579
36458 787579 648448 689008 982453 1066274 642298 179117 255239 601703 469545 -180451
36448a80451m00961K73876N20120L54777M56107P98084N72927l76159j041613
36439I76707o37599K57377N55693J23740k86235k35056k9697n9889k92290m71207
36429i8456m20776j21494K24694K71656m8100l15321j57407J99413L03810J85519
36419B3538J74173J99850p5412m90770m72060K2464L48949J77307l8461J03158
36409b7264K98319J52205j18247j10017P8190J09149J3597L2221J38876J88629
36399G55658K66497M30468L91668n2556n29081n65700l27619l05480m61162l29797
36389g27104J15812L81339K77964J84770L13415K99735j55747o78558o53866o2228
36379g04468M59844L67757j82646n47123l74519l8119r3628l98347k27611N74638
$$ plain form
36448 -180451 -581412 -307536 212584 567361 1023468 1821552 2394479 2018320 976707
36439 976707 339108 596485 1152178 1275918 989683 754627 724930 665041 372751 -98456
36429 -98456 -519232 -640726 -416032 -144376 -192476 -507797 -665204 -465791 -161981 23538
36419 23538 197711 397561 322149 -168621 -640681 -618217 -269268 -91961 -130422 -27264
36409 -27264 271055 423260 305013 194996 273186 382335 395932 428153 567029 755658
36399 755658 1022155 1452623 1844291 1791735 1262654 696954 369335 63855 -397307 -727104
36389 -727104 -611292 -229953 48011 232781 546196 845931 690184 11626 -642240 -704468
36379 -704468 -244624 123133 -59513 -606636 -981155 -1019274 -1112902 -1511249 -1738860 -1164222
36369a164222J129420O91996j72714l09640L71752Q03613L36454m30989o59285
36360E96385l69160q4100N8005K45171L73149J20944l96319n64916m4409O73967
36350F08717P39146n1827r17757r28788r8662O32381N56256j4833l30355j92392
36340A886M1633J55519K36213K79355J79375O4668J26028J57618j66800n82348
36330D93147m56396J89996N84610L41067j0200L7730J97455N2247j45311k956
36320A281389J75881j29251o40291n86549M9687M19299Q2737l40298j47884L96863
36310E61583N07180K1485m55844m68435k33411j33840j18055Q6642M08777M78473
36300F54555K00292p8420n9848J31901K04283P3577j61223l80023m17960j51112
$$ plain form
36369 -1164222 -34802 657194 484480 174840 546592 1350205 1686659 1255670 596385
36360 596385 227225 143125 201130 446301 819450 940394 544075 -20841 -65250 608717
36350 608717 1347863 1296036 378279 -550509 -649171 -16790 539466 524633 194278 1886
36340 1886 43519 199038 435251 714606 893981 958649 1084677 1242295 1075495 493147
36330 493147 36751 226747 811357 1152424 1142224 1179954 1377409 1429656 1284345 1281389
36320 1281389 1457270 1328019 687728 101179 150866 570165 652902 312604 164720 561583
36310 561583 1068763 1090248 634404 165969 -67442 -201282 -319337 -232695 176082 654555
36300 654555 854847 776427 716579 848480 1052763 1126340 965117 585094 167134 16022
36290A6022K03144J90240k16264m17103l4813M06668J81432n36724r03180n81655
36280a692233l8526K83199M10604M21621K39570j4251m3206J02193O0777j74810
36270d45062k13505p219J3492k42988k41312L14149R02896Q74612K72272l54999
36260H72336n81385l38364O9079P7313m93606r01627l10934Q04426J061939K01957
36250D61134m32169M4261P26816M96460k08832l52963j08232l20976p98422o08265
36240a101188K16499O86469M73553K14504J97745K1381l16682k33006K62633L54140
36230G76048k33161p11643m94679k1883J57025K08975L65605K88416k38305o61157
36220e64759m10182K08011N01538L52289J14618m8505j68606j43080P6618K46111
$$ plain form
36290 16022 219166 409406 193142 -223961 -258774 147894 329326 -207398 -1110578 -1692233
36280 -1692233 -1730759 -1447560 -1036956 -615335 -375765 -390016 -433222 -331029 -270252 -445062
36270 -445062 -658567 -665786 -652294 -895282 -1136594 -822445 80451 955063 1227335 872336
36260 872336 290951 -47413 21666 98979 -394627 -1296254 -1607188 -802762 259177 461134
36250 461134 28965 73226 800042 1296502 1087670 734707 626475 305499 -492923 -1101188
36240 -1101188 -884689 -198220 275333 489837 687582 708963 392281 159275 421908 776048
36230 776048 542887 -168756 -663435 -685318 -528293 -319318 46287 334703 96398 -564759
36220 -564759 -974941 -766930 -265392 86897 201515 153010 -15596 -158676 -82058 164053
36210A64053K15401K41358M87988N81353J72094l88630n17487k98939k88550n42974
36200a74333n04781P7340O84939P17811K62707j09002j03001L3671j4505j53568
36190G17278o8600K08254K60326l6707j69164K77962Q05560N40444m49953j069996
36180A015404o23174K83698O14107J89628l24184l71410j6075K95910J71806l58371
36170H77339p39313m44454K42694M53811n1177m85136k37270J72626n273m58046
36160f74199l19643L50306O29012K40866l3713K83311N54176J08438o04086o81709
36150a47241j47352J46372j55776m43395j37730M59406O67845L91541J20998J25019
36140H79687J19140j69618n04513m83061j50547P3075m019j55771j57148n4781
$$ plain form
36210 164053 379454 620812 1108800 1690153 1862247 1473617 956130 657191 368641 -174333
36200 -174333 -679114 -601774 83165 800976 1063683 954681 851680 885351 870846 717278
36190 717278 648678 856932 1117258 1080551 911387 1189349 1994909 2535353 2085400 1015404
36180 1015404 392230 675928 1290035 1479663 1155479 784069 767994 1063904 1235710 877339
36170 877339 138026 -306428 -63734 390077 338900 -146236 -383506 -210880 -216153 -674199
36160 -674199 -993842 -643536 -14524 226342 192629 475940 1030116 1138554 534468 -147241
36150 -147241 -294593 -148221 -303997 -747392 -885122 -425716 242129 633670 754668 879687
36140 879687 998827 829209 324696 -158365 -308912 -235837 -239856 -395627 -552775 -607556
36130f07556O5163K47638M39123L87423J3408l53883l86204k04837j22630j16809
36120f39164N9421L27397K88317j39870m73520k63624K98568O17702M12274k1372
36110D66129k24330p8792J33444P7974k68391n73759m79375m57M40147M48527
36100e8883J03825j39033N286L52236N61291N62666M73842K52484k08546o52421
36090A252747n65431Q3422N88221L45337l14439n65575k12515J20560o1726m75410
36080A95191n49233k04517J50673K20340J22405J12764K12399K12999R609k02972
36070B79658j78753J6500J14401R5778K04990M35870M18897M2475k53068j55670
36060A021078j3973j99546l60043K8111O70519P87825K77897k31653m04479m63801
$$ plain form
36130 -607556 -542393 -294755 144368 531791 545199 191316 -194888 -399725 -522355 -639164
36120 -639164 -579743 -252346 35971 -103899 -577419 -841043 -542475 75227 487501 466129
36110 466129 241799 163007 296451 374425 106034 -467725 -947100 -947557 -507410 -58883
36100 -58883 44942 -94091 -88805 263431 824722 1387388 1861230 2113714 1905168 1252747
36090 1252747 687316 770738 1358959 1704296 1389857 824282 611767 732327 670601 195191
36080 195191 -354042 -558559 -407886 -187546 -65141 47623 260022 473021 482630 279658
36070 279658 100905 117405 231806 327584 532574 968444 1387341 1429816 1176748 1021078
36060 1021078 1007105 807559 447516 475627 1146146 1933971 2211868 1980215 1575736 1111935
36050A111935m75008k32812O8435m4432l80655k07610M43047O09504m8515n67162
36040B76727j66034N40832O09061K02609N2638J58209K4287k92520l58264k33807
36030H13738k65556l10895n4460J97880l7580m32951k74650K85534M19960J4329
36020C55349j72850J63133M05608J36297k04825j72553l8998j82520l76915k07956
36010b96230K23952M72576L55580P9305o3304L8321J69111p9087p60801j267883
36000a128460r89486j84921L40273L73443M45441P76248Q26636K19844n21347
35991A57671o23620n2358N55112O75591L05885j99702m47813l04505O300K21972
35981B94533L71471N17289L69114l07149r87237p99709K32886J042230Q56394
$$ plain form
36050 1111935 636927 404115 472550 428118 47463 -160147 282900 892404 843889 276727
36040 276727 110693 651525 1260586 1463195 1515833 1674042 1698329 1405809 1047545 813738
36030 813738 548182 237287 182827 380707 343127 -89824 -364474 -78940 341020 355349
36020 355349 182499 345632 751240 887537 682712 510159 471161 288641 -88274 -296230
36010 -296230 -72278 400298 755878 835183 771879 810200 979311 900224 139423 -1128460
36000 -1128460 -2117946 -2302867 -1962594 -1589151 -1143710 -367462 459174 679018 157671
35991 157671 -465949 -518307 36805 712396 1018281 818579 370766 66261 72561 294533
35981 294533 666004 1183293 1552407 1245258 258021 -541688 -308802 733428 1589822
35972A589822P7228m78163n83043m41017j14548L29545N27831K52451j29326j27824
35962I02956J48707K09085n3475k63310j58493R9284K15460J03472q3209j34287
35952I86190k9917j1079k46959m74945k85007K25333M94063K95850M0863P8302
35942A072694J86921P5763o0646P4998K85460J58519k44925m42955k12821J39910
35932A032918K04127o9317l43157k53860J63505M42450K31989k15869l92082k53689
35922E47015j68052k09876r4850J50450J21394j97592k92384n620J56035m6366
35912c9846j07637K72056N24383J59190l18836k29695J39921J07473j70473k1378
35902C15158M88121O21402J72769l07040m32496l12452l3168L63481M62048q6474
$$ plain form
35972 1589822 1667050 1188887 605844 164827 50279 379824 907655 1160106 1030780 902956
35962 902956 1051663 1260748 1207273 943963 785470 884754 1100214 1203686 1120477 986190
35952 986190 956273 945194 698235 223290 -61717 163616 657679 953529 994392 1072694
35942 1072694 1259615 1335378 1274732 1349730 1635190 1793709 1548784 1105829 893008 1032918
35932 1032918 1237045 1167728 824571 570711 734216 1176666 1408655 1192786 800704 547015
35922 547015 378963 169087 74237 224687 346081 148489 -143895 -149515 6520 -39846
35912 -39846 -147483 124573 648956 808146 489310 259615 399536 507009 336536 315158
35902 315158 803279 1424681 1597450 1290410 857914 545462 512294 875775 1337823 1251349
35892A251349p35359n84923K05428N44425R3076k56098P2339M03569M8220m81135
35882E60891l32246K98443N62156L08441J29172K62905K97861l8279m81847p20800
35872H46697p44262n99060k59130J17718J98197n8254k30259M2841N59149P94747
35862F68384N41686R8546j47452j31313m3074j6127m1578j12285k44333l45498
35852B26956k68442n4065P9905O6115O8240J40532J12635j8397M3485L30441L16436
35841A043841l20776r57785p05194K89913R21437N74182j57211m07068j17431
35832A63908J54677P3807k12879l97321k92427N1855L45804L37857J57342J33682
35822E16305K57495J93215j00173k22013K712J73742m8839l56261k42289K35541
$$ plain form
35892 1251349 515990 -68933 136495 680920 773996 517898 590237 993806 1042026 560891
35882 560891 228645 527088 1089244 1397685 1526857 1789762 2087623 2049344 1567497 846697
35872 846697 102435 -496625 -755755 -638037 -439840 -498094 -728353 -685512 -126363 668384
35862 668384 1210070 1308616 1161164 1029851 986777 970650 929072 816787 572454 226956
35852 226956 -41486 -95551 -15646 50469 118709 259241 371876 353479 396964 727405 1043841
35841 1043841 723065 -234720 -939914 -650001 271436 845618 688407 281339 163908
35832 163908 318585 392392 179513 -217808 -510235 -458380 -112576 225281 382623 516305
35822 516305 773800 967015 866842 644829 647541 821283 772444 416183 173894 409435
35812D09435N60264M52531R9205k04143l23636k61785j06634K1476R0056J25211
35802H61980L6290k74076n59998l78863K17526N59375K45822k49342k81000M0197
35792B17911J72803Q2516J63023L70406K13354l10662n06078O510O60656P18206
35782A788645K17182k84562n42526o88915o95136l51673K19225N27669L36332
35773E26241m0089k23564k53147l43056m12321j98174K49660N29541L98488O4221
35763B97800j38762j51521j12372l9831J84792N53502Q23049P20743K25508l40580
35753B022328n26173j83664K92900L40049j06970n33341n18019k01017Q4256K85555
35743I55904M25383K80965k37948o44234l99716K36362N05581K45446K900J5914
$$ plain form
35812 409435 969699 1422230 1521435 1317292 993656 731871 625237 646713 736769 861980
35802 861980 898270 624194 64196 -314667 -97141 462234 708056 458714 177714 217911
35792 217911 390714 473230 636253 1006659 1220013 909351 403273 409783 1070439 1788645
35782 1788645 2005827 1721265 1178739 489824 -205312 -556985 -337760 189909 526241
35773 526241 486152 262588 9441 -333615 -745936 -944110 -694450 -164909 233579 297800
35763 297800 159038 7517 -104855 -144686 40106 593608 1416657 2137400 2362908 2022328
35753 2022328 1496155 1312491 1605391 1945440 1838470 1305129 787110 586093 670349 955904
35743 955904 1381287 1662252 1424304 780070 380354 616716 1122297 1367743 1370643 1386557
35733A386557j34221o17797q88805n65181r9915j3517m3083K73876O54952N09977
35723D62843J6248r3641K82222M58654O9892l89654l40935J33301N59700O46622
35713A805252L73493j04122m44457l56477q826J19181r4773k73889j93847j32600
35703F88935l36728n63814m89649k28515p7326j8254J26652K63526J83311J8123
35693d33739R2959L53280L75957K6554k81622j59969K21166M10483K94746J56234
35683A056049J75782J72893n4828l40817l28674J052K33739O0141k77595k84301
35673D13441J43989O08286P06565M09238o4060m75342o12624l77550K7017K10577
35663I89537M1188k15588l19522l49361l84002k04132L33272Q34199P23262J5442
$$ plain form
35733 1386557 1252336 634539 -254266 -819447 -919362 -932879 -975962 -702086 -47134 462843
35723 462843 479091 385450 667672 1126326 1196218 806564 465629 598930 1158630 1805252
35713 1805252 2178745 2074623 1630166 1273689 1264863 1384044 1289271 1015382 821535 688935
35703 688935 352207 -211607 -701256 -929771 -1007097 -1025351 -898699 -635173 -451862 -433739
35693 -433739 -340780 12500 388457 415011 133389 -26580 194586 605069 899815 1056049
35683 1056049 1231831 1404724 1349896 1009079 680405 681457 915196 975337 697742 413441
35673 413441 557430 1165716 1872281 2281519 2217459 1742117 1129493 751943 778960 989537
35663 989537 1030725 815137 495615 146254 -237748 -441880 -108608 725591 1448853 1464295
35653A464295o51256p74646m56546r7207M7906m1678j88634q8962L41542O59606
35643B14420L27320m51926p89261k31023O10640Q75770N13133J02708l8089n0038
35633A083654n3440l0074q3082k90546l63922M089M80210L96194k02310m67125
35623D73648M7010P01582O87768J05845l53848m12081l37635l39999l68916l94674
35613a91300m21975l08549K3431K97414K14992l1255k8501J65201J21092j86295
35603c45745k79436L3768L26816K42193K2593L8257J90441J61804m1482j73234
35593A75975j37302N0259M35980Q67090Q16817K4884q25647p48190J49333O19083
35583A428282l0691q63404o01606M71726Q50878q0q35710m55323N39762O71385
$$ plain form
35653 1464295 813039 38393 -418153 -515360 -467454 -509132 -697766 -786728 -445186 214420
35643 214420 541740 89814 -699447 -930470 -319830 555940 1069073 1171781 1133692 1083654
35633 1083654 1030214 1000140 917058 626512 262590 266679 746889 1143083 940773 473648
35623 473648 520658 1222240 1910008 2015853 1662005 1249924 912289 572290 203374 -191300
35613 -191300 -613275 -921824 -898393 -600979 -385987 -417242 -445743 -280542 -159450 -345745
35603 -345745 -625181 -591413 -264597 -22404 189 38446 228887 390691 349209 175975
35593 175975 38673 88932 524912 1392002 2208819 2233703 1408056 659866 809199 1428282
35583 1428282 1397591 534187 -67419 404307 1255185 1255105 419395 -35928 503834 1175219
35573A175219k48434r44308n89551J77595M45591L05026L40642N34669M34831
35564A631280L4234k47714k79329k82641l00730j72150L8054J15018J35203L10957
35554I82182M76054K93521q0920j70232o755r7605m66769m88306N6261M83203
35544I80634K14861l21926l63234O6657K98088K6465l74779m46249j22235L30114
35534B88396N54494L60460n9093k91491k22278j54902k71461l33508j70665n5787
35524c55835j94983k24017K43602Q30578P92714J12111m30767l31269O4418K16391
35514G22943J01856j4584j02289k61973l53344j57105J66764J89304j43263l29482
35504a81173r36M72128M35411q3567l22469J75157Q88365R88081L64661l78684
$$ plain form
35573 1175219 926785 -17523 -607074 -429479 16112 321138 661780 1196449 1631280
35564 1631280 1665514 1417800 1138471 855830 555100 382950 421004 536022 671225 982182
35554 982182 1458236 1751757 1670837 1500605 1493850 1396245 929476 441170 497431 980634
35544 980634 1195495 873569 510335 576992 875080 901545 526766 80517 -41718 288396
35534 288396 842890 1203350 1144257 852766 630488 475586 204125 -129383 -300048 -355835
35524 -355835 -550818 -774835 -531233 299345 1092059 1204170 773403 442134 506552 722943
35514 722943 824799 810215 707926 445953 92609 -64496 102268 291572 148309 -181173
35504 -181173 -182109 290019 725430 641863 319394 494551 1382916 2370997 2735658 2356974
35494B356974p09137n28361K0055O02728P04492J39309n15250n49085j16335K9676
35484A435066k49186l10908J01115L78938P5282l62526l56591m7482J33945J76340
35474I73993K40226K07530N646q4200N9718O4713k54447m16707n4093L79933L44215
35463A466527J15944K06046L69872P8264m14453m19933J2134K02920j8486j84115
35453A414720j21905j58472l81357m78167l39674j44063J08466M75541O31865
35444A006954K96587p9124R4172M41771J16131o98920r04111j99038M67938M23433
35434I65793J23870Q3672J7941l71120o62806m23145O7758L60736M73727N05730
35424A142156K78975j61031l56543k03456j92574m28673k48734N62262J052384
$$ plain form
35494 2356974 1647837 1119476 1139531 1742259 2446751 2586060 2070810 1521725 1405390 1435066
35484 1435066 1185880 874972 976087 1355025 1430307 1067781 711190 663708 797653 973993
35474 973993 1214219 1421749 1427395 1343195 1402913 1467626 1213179 796472 742379 1122312 1466527
35463 1466527 1582471 1788517 2158389 2236653 1822200 1402267 1414401 1617321 1598835 1414720
35453 1414720 1292815 1134343 752986 274819 -64855 -208918 -100452 375089 1006954
35444 1006954 1303541 1224417 1318589 1760360 1876491 1177571 273460 74422 542360 965793
35434 965793 1089663 1173335 1191276 820156 157350 -265795 -198037 162699 636426 1142156
35424 1142156 1421131 1260100 903557 700101 507527 78854 -169880 392382 1444766
35415A444766M63601m27428l66682M90498Q58795K36833n37407o49165k83035
35406A230776l0488m4324j11978j34185k12653m08796n61057l73635J99073O91904
35396B44637N69347j9151l40163n9765L60644M39731K78505J01390j76579m99741
35386H98855m10786K06181O69780L98210k30897n38831n45561n95189m98660O2806
35376e84092O52604N65356l541k24413L8887J38721j11694j19505L37698N93873
35366A283894J75902l56204k38972L32450M99689l8692o59057o67837j37181K79468
35356D73460J97773q0977q8664J06914O3501k48596l29535K8669L30157J27999
35346E80701k58812k32290K18816O09704O52609M11992K846m26147o01070m04326
$$ plain form
35415 1444766 1908367 1480939 1114257 1604755 2463550 2700383 2162976 1513811 1230776
35406 1230776 1200288 1155964 1043986 909801 697148 288352 -272705 -646340 -447267 244637
35396 244637 813984 794833 454670 394905 755549 1195280 1473785 1575175 1398596 898855
35386 898855 488069 694250 1364030 1762240 1531343 992512 446951 -148238 -646898 -584092
35376 -584092 68512 633868 630327 405914 444801 583522 471828 352323 690021 1283894
35366 1283894 1459796 1103592 864620 1197070 1696759 1658067 999010 331173 193992 473460
35356 473460 671233 590256 501592 608506 672007 423411 93876 122545 452702 580701
35346 580701 321889 89599 308415 918119 1570728 1982720 1985566 1559419 958349 554023
35336E54023p8417J19223J89981J21116j94642m97039k36858M74676P12893J05028
35326A269984m39953j35050L73775J27052m71367l81880K32186L44930r3614j89299
35316F36764J62106J47813k88900k39890M19975O22936p1977o90493m85775l4270
35306A78289M257l8946K13693L44646Q7346J8314M35936O15298R8418l42065m1335
35295A573851L21106k3003m64585j37689M14347J95352l81571k37198L30300J26620
35285A717530p07666p97578J10717P01340L05657j31041J42361M60550J16520
35276A918390l72410l13236o5159k16370m19049r6595L77695K90330j16730m7898
35266I38968M33429M68323j54193n88294j86395N66885P28636P8276o85681p36984
$$ plain form
35336 554023 475606 594829 784810 905926 711284 214245 -22613 452063 1164956 1269984
35326 1269984 830031 694981 1068756 1195808 724441 342561 574747 919677 826063 636764
35316 636764 798870 946683 657783 417893 837868 1460804 1388827 698334 212559 178289
35306 178289 182546 143600 357293 701939 789285 807599 1243535 1858833 1957251 1615186 1573851
35295 1573851 1894957 1871954 1407369 1269680 1684027 1879379 1497808 1260610 1590910 1717530
35285 1717530 1009864 212286 323003 1024343 1330000 1198959 1341320 1801870 1918390
35276 1918390 1545980 1232744 1167585 951215 532166 435571 813266 1103596 986866 938968
35266 938968 1372397 1840720 1686527 1098233 911838 1478723 2207359 2285635 1599954 862970
35256H62970L9951R02168R48371Q4452q13354q61902j39238N36969O15304K64855
35246B440546o1382j33238j246J35016N4010k68099n43947m81457j78684J3452
35236I74971k3512j07016j38506k06758k56239l2995M60144P67890M97884j57164
35226A778699o28101n59525m3885N41397P61445M14192j76955l72054K3355M29694
35216B168262K44886l24069o22172n19792m19390l79087J4471P24696R76849L42386
35206B207040m87750o09131j43977J07344m7291n7635K73980L91852o8723n96953
35196I68756n13960M1340L33979P4821k24817n627N55903P51154K48344m54329
35186A775564o27358j94278K75043L91365L30406K76542J1396n54099q88093m88205
$$ plain form
35256 862970 902921 1805089 2753460 2837912 2024558 1162656 1023418 1560387 2175691 2440546
35246 2440546 2379164 2245926 2244680 2379696 2433706 2165607 1621660 1140203 961519 974971
35236 974971 951459 844443 705937 499179 242940 209945 670089 1437979 1935863 1778699
35226 1778699 1150598 591073 547188 1088585 1850030 2264222 2087267 1715213 1738568 2168262
35216 2168262 2413148 2089079 1466907 947115 527725 148638 163109 887805 1864654 2207040
35206 2207040 1719290 1110159 966182 1073526 1026235 968600 1242580 1634432 1565709 968756
35196 968756 454796 496136 830115 904936 680119 674492 1230395 1981549 2229893 1775564
35186 1775564 1148206 953928 1228971 1620336 1950742 2227284 2238680 1684581 796488 308283
35176C08283K25473L56650j83444n27091j00414O07410P89986L43880j88115l54414
35166A278204j62161R0126J24595o4377k19790k10126k72206n62587o67126j03391
35156g68839P71607J036882M76924j29556j94182n4924j74022l30570j57928J13841
35146E89233R2245m9929P9574L68688M34072K79203J41535j1885k41217k17981
35136A463538K57040O09396J64863o96759r08486k12326N42247O65386L60202
35127B245101J9730l54089o82748n53770N3945M23227O1681m93295m49165Q0497
35117C51114L72726K44742J38233J86926J9026l97515m74380Q7848P03428O89917
35107A922065K32735J7578J78397K40189J8697j01691O2732P5451l93301q91136
$$ plain form
35176 308283 533756 890406 706962 179871 79457 686867 1476853 1820733 1632618 1278204
35166 1278204 1116043 1206169 1330764 1266387 1046597 836471 564265 1678 -665448 -768839
35156 -768839 2768 1039650 1516574 1387018 1192836 1137912 963890 633320 475392 589233
35146 589233 681478 631549 711123 1079811 1513883 1793086 1934621 1922736 1681519 1463538
35136 1463538 1720578 2329974 2494837 1798078 889592 677266 1219513 1884899 2245101
35127 2245101 2264831 1910742 1227994 674224 728169 1151396 1213077 719782 270617 351114
35117 351114 723840 968582 1106815 1293741 1312767 915252 440872 528720 1232148 1922065
35107 1922065 2154800 2172378 2350775 2590964 2609661 2507970 2570702 2646153 2252852 1361716
35097A361716p56314r9198L38289J98687j41422k39879j02515P8886K50655L71615
35087A260520L26866J65334J17210K05111J56442j17052l00910j78602r979j01257
35077A523683k93394k39842L4775K36365K98008L82981M77410L57465k5211m10038
35067B342202n19645l14193J7411J79940j5358l90855m84098r9609L54525L48933
35057A419253m2853k23508J08539N17569L62904l70239r58238p13316K00984Q94096
35047A195191P68947K05176l2970J37449J32009k62675m99055j64321L04089K59540
35037B043380j85836l73368p7424K47859J66485k05507m18411j87277L57456P67444
35027B134801O62705J29167l51558m28724j87965R3855K40031J54788j66048m75905
$$ plain form
35097 1361716 605402 506204 844493 1043180 901758 661879 559364 638250 888905 1260520
35087 1260520 1587386 1752720 1869930 2075041 2231483 2114431 1813521 1634919 1624940 1523683
35077 1523683 1230289 990447 1025222 1261587 1559595 1942576 2419986 2777451 2752240 2342202
35067 2342202 1822557 1508364 1525775 1705715 1690357 1299502 815404 715795 1070320 1419253
35057 1419253 1376400 1152892 1261431 1779000 2141904 1771665 813427 100111 301095 1195191
35047 1195191 1964138 2169314 2136344 2273793 2405802 2143127 1644072 1479751 1783840 2043380
35037 2043380 1857544 1484176 1406752 1654611 1821096 1615589 1197178 1009901 1367357 2134801
35027 2134801 2797506 2926673 2575115 2146391 1958426 2052281 2292312 2447100 2281052 1805147
35017A805147m44777j14567J42563K03221K89750L76628P4398o26757j076222
35008F29384q15300k09082J65273K53730K38088O5608k36481k97927J7522K78474
34998H9289K28396K59900N86397O59047J49711k35784J24192N39661N8692q27525
34988A631976q56966j546O00520N13368L50415K98295j71799r15710r54826j49682
34978C44045L59595j8721l66203J23297P59331N52844j64007l75785L7279L75698
34968A627373L10350P4470k11879n84288p97173n41751L264L59162L66989K26450
34958H32967J03289N7173J51592L01454K17973j97883o05520o15562k49838J47869
34948A43514K62663J4684l23242k52390L37783P93095M67291k35663l05732L88809
$$ plain form
35017 1805147 1360370 1245803 1388366 1591587 1881337 2257965 2332363 1705606 629384
35008 629384 -185916 -394998 -229725 24005 262093 327701 91220 -206707 -189185 89289
34998 89289 317685 577585 1163982 1823029 1972740 1736956 1861148 2400809 2459501 1631976
34988 1631976 775010 773464 1373984 1887352 2237767 2536062 2364263 1448553 493727 344045
34978 344045 703640 684919 318716 442013 1201344 1754188 1590181 1214396 1251675 1627373
34968 1627373 1937723 2012193 1800314 1216026 418853 -122898 -119634 239528 606517 832967
34958 832967 936256 993429 1145021 1446475 1664448 1466565 861045 245483 -4355 143514
34948 143514 406177 420861 97619 -154771 183012 976107 1443398 1207735 902003 1290812
34938A290812Q79242N00601k95657p49747o32974q0885N89653P24816o8182r81485
34928A176194p57768L73074Q17678R3614l79096K54654P14894j88593j282930
34919H21721q03395O54624J024749m188p70222m46493J1672q7903j36946K25793
34909D89412K57693l82422p04212N0732J026574R95651J76945k54418M5223L22094
34899B023272L6065m45743n31807j82424J83068K49692R8880k786n231j09612
34889A313374l29446k98041J73899N95294L41927m03147q01800m64618J25236
34880B52678L77790K84575J77503K18279L21794K97616k4906n41493p64881l40153
34870B58802L61352O13267L07975M4779J64803K73818l2081m86374n76029k79266
$$ plain form
34938 1290812 2170054 2670655 2374998 1625251 992277 911392 1501045 2225861 2157679 1176194
34928 1176194 418426 791500 1609178 1702792 1323696 1578350 2293244 2104651 821721
34919 821721 18326 672950 1697699 1693511 923289 476796 488468 400565 263619 489412
34909 489412 747105 364683 -339529 -288797 737777 1733428 1910373 1655955 1701178 2023272
34899 2023272 2059337 1613594 1081787 899363 1082431 1332123 1431003 1428217 1422986 1313374
34889 1313374 983928 685887 859786 1455080 1797007 1393860 592060 127442 252678
34880 252678 630468 915043 1092546 1310825 1632619 1930235 1905329 1363836 598955 258802
34870 258802 620154 1233421 1541396 1586175 1750978 2024796 1992715 1506341 930312 651046
34860F51046K7069J66013K66040L67018K88990l7048l37136k59586J64895M78655
34850A775956L18051j20066l38680k10932o6805q0509r469K57566L51853l046
34840A873919m45929m67920j68292k6389j24083j11744J57113M26761M32186J36936
34830A682558l22580o31479m47254R8969L39973n4588m71450j87450M87267O11276
34820A105242L769n24801l56750K03969N22924M03417R8013n2636R8446L09851
34810A811444J31692m29179o98023k27936M38635N21726J86044J82077N40135
34801B456615N47270j9977n65703o71993n73451m89102k87209N342J15810J04339
34791F21941K84529M74933J80965l67089l49241K43091M33723j02970l90135J99302
$$ plain form
34860 651046 678115 844128 1110168 1477186 1766176 1729128 1391992 1132406 1297301 1775956
34850 1775956 2094007 1973941 1635261 1424329 1357524 1277015 1267546 1525112 1876965 1873919
34840 1873919 1427990 960070 791778 765389 641306 529562 686675 1113436 1545622 1682558
34830 1682558 1359978 728499 281245 380214 720187 665599 194149 6699 493966 1105242
34820 1105242 1109011 584210 227460 431429 954353 1357770 1455783 1403147 1501593 1811444
34810 1811444 1943136 1513957 815934 587998 1026633 1548359 1734403 1916480 2456615
34801 2456615 3003885 2983908 2418205 1746212 1172761 683659 396450 401792 517602 621941
34791 621941 906470 1381403 1562368 1195279 846038 1089129 1522852 1419882 1029747 1229049
34781A229049P55515K70457o45181o80427J31005N63741J44987l01353j28335
34772A339458K15018R0791l34777n04629l33496j36060o597K20420M91473M77501
34762A519102J01798k22533j32954J31752Q4456k20103k40614J41680L38610l8610
34752A462584n30897n31687j52107J56531L78360O53915O46064J9858p23301p85398
34742E93922k84588l0625k04407k19439J30169L83679L48777L40834L70929Q8622
34732A517873l15612j95347L48803M35322j35008m98622j89492J73067J36700
34723A277684J64348N02284M87474k07679p31507l74323K43497K67623k4949J2981
34713A617433J33897j78261n53866l74371N8425J31474J04202M99126Q71367M77524
$$ plain form
34781 1229049 1984564 2255021 1609840 929413 1060418 1624159 1769146 1467793 1339458
34772 1339458 1554476 1645267 1310490 805861 472365 336305 329708 550128 1041601 1519102
34762 1519102 1620900 1398367 1265413 1397165 1481621 1261518 1020904 1162584 1501194 1462584
34752 1462584 931687 400000 247893 404424 782784 1436699 2082763 2102621 1379320 593922
34742 593922 309334 278709 74302 -145137 -14968 368711 717488 1058322 1429251 1517873
34732 1517873 1202261 1006914 1355717 1791039 1656031 1157409 967917 1140984 1277684
34723 1277684 1442032 1944316 2431790 2224111 1492604 1118281 1361778 1629401 1604452 1617433
34713 1617433 1751330 1573069 1019203 644832 703257 834731 938933 1438059 2309426 2786950
34703B786950k62572l14830K55547M64106J06971r6178l409k85641r96771j237708
34693D16465o06410J64477M27868M35193M76994K23041m57326q59161l72203N22969
34683C71907Q92396N96895K56117K08774J51812j76106m67984k67626K98422N58506
34673B423113J73743l18517k10680L01521L52526k51599o68663k96349L44042
34664A849137N20962L77874L92142L76109p8502o00916m83433R7414K66597k01445
34654B515939o03142m27248J1307J79719l5461l86717n03172j24908M86046N98675
34644A711038l2402o18542l82908K43010K87632k42617m88972j74150J35137J39085
34634E76311J40269K19396P4997j98468j29437J99980J96512j29067j04447L32900
$$ plain form
34703 2786950 2524378 2209548 2465095 2929201 3036172 2939994 2936585 2650944 1654173 416465
34693 416465 -189945 -25468 402400 837593 1314587 1537628 1080302 221141 -151062 371907
34683 371907 1264303 1861198 2117315 2326089 2477901 2301795 1833811 1566185 1864607 2423113
34673 2423113 2596856 2278339 2067659 2369180 2721706 2470107 1801444 1505095 1849137
34664 1849137 2370099 2747973 3140115 3516224 3437722 2836806 2353373 2450787 2717384 2515939
34654 2515939 1912797 1485549 1496856 1676575 1641114 1254397 751225 626317 1112363 1711038
34644 1711038 1678636 1060094 677186 920196 1207828 965211 476239 302089 437226 576311
34634 576311 716580 935976 1010973 812505 683068 883048 1079560 950493 846046 1178946
34624A178946L91629j73381m96217M432O41117N68810M8152j95099j91815m17590
34614A358984p10443m35216L92832R31894O00650j46329l70240K01136P97057
34605B620325N10798m95881j089447o56755L9933L6514l44004r4910P03104R05112
34595B134789J57971m85258k13751L66020L52491m6841n4731L54034N37656K55413
34585C357793j19973l05409l78779l75409j41549K97248N61981L18378k32297
34576B981984m38295O0759P30591O43585k73362r75551o65566R2315K45471k14316
34566B187615m30590r4678K77493L53188K95031Q9555m46596r25458o58975J68623
34556H15208N78955K43218j49130j83328k84834o24376n79441J29834P52690O30417
$$ plain form
34624 1178946 1570575 1397194 900977 905409 1546526 2115336 2163488 1968389 1776574 1358984
34614 1358984 648541 213325 606157 1538051 2138701 1992372 1622132 1823268 2620325
34605 2620325 3131123 2635242 1545795 889040 928973 965487 621483 526573 1229677 2134789
34595 2134789 2292760 1807502 1593751 1959771 2312262 2265421 2210690 2564724 3102380 3357793
34585 3357793 3237820 2932411 2553632 2178223 2036674 2333922 2895903 3214281 2981984
34576 2981984 2543689 2604448 3335039 3978624 3705262 2729711 2064145 2156460 2401931 2187615
34566 2187615 1757025 1662347 1939840 2293028 2588059 2677614 2231018 1305560 646585 815208
34556 815208 1394163 1637381 1488251 1304923 1020089 395713 -183728 -53894 698796 1329213
34546A329213J79616Q6798K51356J88923j31788m35769n78378m17058J33348O04516
34536A210777L22773m14892m66008M06321R76711L98906m80645n08036P3573L17069
34526A836549J19793j5863p7130k84591l02676K01401O67893L72262l30018m91105
34516A696515J1044M82504N49473L93809J35193j75795k30447Q4942K51678r4243
34506C104673l84248M363N68711L92438l49536o80515l44121M2539J62218K53686
34496B770208L17044J00633j85212j16555O7844j86456o31219m86898K05835N73745
34486B428969K97250l9981r1248j89728m56170m61740o6816K73390L00939K61120
34476B255985K42826L3274k27862j25696J59507J5551l99175k07453O13453Q95898
$$ plain form
34546 1329213 1508829 1595627 1846983 2035906 1904118 1468349 889971 472913 606261 1210777
34536 1210777 1533550 1118658 652650 1058971 2035682 2434588 1953943 1445907 1519480 1836549
34526 1836549 1956342 1940479 1863349 1578758 1276082 1477483 2145376 2517638 2187620 1696515
34516 1696515 1707559 2190063 2739536 3133345 3268538 3092743 2862296 2947238 3198916 3104673
34506 3104673 2720425 2724788 3293499 3685937 3336401 2655886 2311765 2354304 2516522 2770208
34496 2770208 3087252 3187885 3002673 2886118 2953962 2767506 2136287 1649389 1855224 2428969
34486 2428969 2726219 2686238 2594990 2405262 1949092 1487352 1420536 1693926 1994865 2255985
34476 2255985 2498811 2532085 2304223 2178527 2338034 2353585 1954410 1746957 2360410 3256308
34466C256308J04280o47636k72520N48043M05156o70178j286279p27459J87629
34457H97344M19478K6671j95998J20882N71731O25196K66496j04240k32617k25357
34447B169586k01604m6576K80049M70458K44711j84790l82794k70363q1573O7545
34437B064649J63742O5902k30221l07067J36003O40887N16848j29672n76978n94538
34427A749555n86556o42393l17699M44986R89053Q69634M44461K11323J53169
34418C315533O6166k6400j20641l64292o28098m79218Q6682M34459J98599j22018
34408B360772O6337N48531O71156K65490k79675n89868n26448j05326L93759M86076
34398C290804N6574l52091k24070J92183K79805q040j34798J42715M05576K08990
$$ plain form
34466 3256308 3360588 2712952 2440432 2988475 3393631 2723453 1437174 709715 897344
34457 897344 1316822 1343493 1147495 1268377 1840108 2465304 2731800 2627560 2394943 2169586
34447 2169586 1967982 1921406 2201455 2671913 2916624 2731834 2349040 2078677 1997104 2064649
34437 2064649 2228391 2294293 2064072 1757005 1893008 2533895 3050743 2921071 2344093 1749555
34427 1749555 1162999 520606 202907 647893 1636946 2506580 2951041 3162364 3315533
34418 3315533 3381699 3355299 3234658 2870366 2242268 1763050 1849732 2284191 2482790 2360772
34408 2360772 2427109 2975640 3646796 3912286 3632611 3042743 2516295 2410969 2804728 3290804
34398 3290804 3347378 2995287 2771217 2963400 3243205 3235165 3100367 3243082 3648658 3857648
34388C857648l00497o17472n01040j59428P6450Q3915k8027r1918k6890J21729
34378B414470K16694J36515p0632j75022k6494K04313K25338N6062J0675J92594
34368C184513L06634J28618j30412j59289O65R9174P0952K4043P52j8657l5338
34357C471655j34141m40192p87391p26744j28519N05678O27514K88901o5223j75287
34347B436251n8865J88348L86951L24118M3243j88404l18485m96429n51265j28367
34337A637096M88000N16393l2168j63211M82643Q80981K75543n02033m31447j2849
34327C138948k39031p18681m07964L95597N15167K578k19N94767O33985j44714
34317C770433n58741r484N47071K94030k08438k34527j05240l46195o35448m34772
$$ plain form
34388 3857648 3557151 2939679 2438639 2279211 2355661 2439576 2411549 2319631 2292741 2414470
34378 2414470 2631164 2767679 2697047 2522025 2495531 2699844 2925182 2981244 2991919 3184513
34368 3184513 3491147 3619765 3489353 3330064 3330729 3429903 3500855 3524898 3525650 3506993 3471655
34357 3471655 3337514 2897322 2109931 1383187 1254668 1760346 2387860 2676761 2611538 2436251
34347 2436251 2377386 2565734 2952685 3276803 3320046 3131642 2813157 2316728 1765463 1637096
34337 1637096 2125096 2641489 2609321 2446110 2928753 3809734 4085277 3583244 3151797 3138948
34327 3138948 2899917 2181236 1773272 2168869 2684036 2686614 2686395 3281162 3915147 3770433
34317 3770433 3211692 3202208 3749279 4043309 3834871 3600344 3495104 3148909 2513461 2078689
34307B078689Q1941M27299N02623L91610P6352k51504k44230m2368j49445m78482
34297B392485l91050J18203K92120m0071r1762M53574P61134K16078n34155o26808
34287B549748k10047Q7828J55462J91984J72702J00878J67260K33931j10224o26988
34277B712534m73785L97528R08351M85329l5134J57862N62513L80492j41705l65926
34267D588059m19348o63036p18832j05319P02259Q77953M86392J91871J28657
34258E068656l7169k62030k22404k5618n3596k74897l47962k20037r2615j3878
34248C518450N2581K6496n5781N3287L64551N18246L57504J52299M3119j46161
34238D884591l52388k44613M1816m1958m41803m59890M890K22531l1169q5561
$$ plain form
34307 2078689 2160630 2587929 3090552 3482162 3558514 3307010 3062780 3020412 2870967 2392485
34297 2392485 2001435 2119638 2411758 2371687 2279925 2733499 3494633 3710711 3176556 2549748
34287 2549748 2339701 2427529 2582991 2774975 2947677 3048555 3215815 3449746 3339522 2712534
34277 2712534 2238749 2636277 3544628 4029957 3994823 4152685 4715198 5095690 4953985 4588059
34267 4588059 4168711 3505675 2786843 2681524 3383783 4261736 4748128 4939999 5068656
34258 5068656 5031487 4769457 4547053 4521435 4467839 4192942 3844980 3624943 3532328 3518450
34248 3518450 3571031 3597527 3541746 3595033 3959584 4477830 4835334 4987633 5030752 4884591
34238 4884591 4532203 4287590 4329406 4287448 3845645 3385755 3390645 3613176 3582007 3496446
34228C496446K30123J22190n82738p65693J56525J025914O78585k46321m36306
34219C678725J27972N55650N54062L66987m5521o40481q01988k45662L02441K50455
34209D102640J04928L65915M90342L0300l01296O0088K91271l30349q28918q0429
34199C904492J037398R05706j90428o22560r4641K04596j62515l99315j83064
34190D399669j29051m34165n27229j96529J62392M10838O69027O47173R4391l93352
34180D703164j76816K18225n9979o09474m13896L66935P06538M50575K64035J72332
34170E621639l17182q96782p83233j63045J30146J29599M74288R37725P44622
34161E877777R6194j33988N1254J9348q5681K36644M83107o4650o81531k34149
$$ plain form
34228 3496446 3726569 3848759 3266021 2500328 2656853 3682767 4361352 4115031 3678725
34219 3678725 3806697 4362347 4916409 5283396 5237875 4597394 3795406 3549744 3852185 4102640
34209 4102640 4207568 4573483 5063825 5094125 4792829 4852917 5144188 4813839 3984921 3904492
34199 3904492 4941890 5847596 5657168 5034608 4939967 5144563 4982048 4582733 4399669
34190 4399669 4270618 3836453 3309224 3112695 3275087 3685925 4354952 5002125 5096516 4703164
34180 4703164 4526348 4744573 4684594 4075120 3661224 4028159 4734697 5185272 5449307 5621639
34170 5621639 5304457 4407675 3624442 3461397 3591543 3721142 4195430 5133155 5877777
34161 5877777 5973971 5839983 5891237 5910585 5824904 6061548 6544655 6480005 5798474 5564325
34151E564325N93330K27652r88189j223139k40622L61333N1351J7504O11870O41499
34141E616914j93079n26434K06809P26607K20774l29753q4479K89550J46906k80
34131F073535J95707J36307l13189k91682L41865M50428l54504q35383k21974
34122E181110M91410L54000m7562M0230K15425N1422P7319N35434N74453k10466
34112G262775p88501l62629K60517R5982m34037m68404j62435q4138j19160N2696
34102E252666K55481L51204N73369P65775L58277m05532m66959K91775O58014
34093G634070N6911n30110l09195J19138P6643p9394L5401O2210j10942N8416
34083G013148N13964L83807l38852m76078K71371O31001m4123o25392k36311K80302
$$ plain form
34151 5564325 6157655 6385307 5397118 4173979 3933357 4294690 4346041 4363545 4975415 5616914
34141 5616914 5423835 4897401 5104210 5830817 6051591 5721838 5637359 5926909 6073815 6073535
34131 6073535 6269242 6405549 6092360 5800678 6142543 6592971 6238467 5403084 5181110
34122 5181110 5672520 6026520 5978958 6019188 6234613 6286035 6363354 6898788 7473241 7262775
34112 7262775 6474274 6111645 6372162 6468144 6034107 5565703 5403268 5319130 5199970 5252666
34102 5252666 5508147 5859351 6432720 7198495 7556772 7151240 6684281 6976056 7634070
34093 7634070 7690981 7160871 6851676 6970814 7047457 6968063 7003464 7065674 6954732 7013148
34083 7013148 7527112 7910919 7572067 7095989 7367360 7998361 7954238 7328846 7092535 7372837
34073G372837M0594l37235n8901M19983M42978L10228L67933K25052k38735l85630
34063H159104o2051O4076n4481L02557Q67444M41641p19559p95799N37685J295631
34053A0036248M39516m82194j81936L31571K1392k72481J70202L41748l74127
34044A0029939o81742K38762R66647K94655o38886n10179l0933j63258k03935
34035I301070M60142P69683O7874l47624L65364Q34493O3548n34294K29490J008527
34025A2218273M53370k98210M6720M83037m6997l64747N21618J140898K64045
34016A4418007n79542P8430Q49820K51473l76494L80719J049175J47432p03151
34007A5515869J71139J098655J90703r18554j53435R72655L33678n84104L66906
$$ plain form
34073 7372837 7413431 7076196 7017295 7437278 7880256 8190484 8558417 8783469 8544734 8159104
34063 8159104 8097053 8161129 8106648 8409205 9276649 9718290 8998731 8202932 8740617 10036248
34053 10036248 10475764 9993570 9811634 10143205 10164597 9892116 10062318 10404066 10029939
34044 10029939 9348197 9586959 10553606 10848261 10209375 9699196 9668263 9505005 9301070
34035 9301070 9761212 10530895 10598769 10251145 10616509 11451002 11514550 10980256 11209746 12218273
34025 12218273 12671643 12373433 12420153 12903190 12856193 12491446 13013064 14153962 14418007
34016 14418007 13838465 13916895 14766715 15018188 14641694 15022413 16071588 16219020 15515869
34007 15515869 15687008 16785663 16976366 16057812 15904377 16877032 17210710 16626606 16993512
33998A6993512J531967M27952j353599q92497P53615P49043k45405J52988J141833
33989A9259409N30846o05685m578J133894N10747m94839M93174J811693P78664
33980B3413325p92097J96100K010645J261301m85808K51834J910870R11545r95268
33971B7682447J46653K552066J775639o63700j11222K075424J140926j427281
33963C3170952m05795K842652K598475k17107J87697L069819K653374j28692P72614
33954D4543989M134662L294614l50979P49912N359852N131978J112581K427477
33946F6404086Q089732P953153K942663M477363J1660239J1465855N006473P711479
33938A25711043J8020862J6999003Q506048K0619678M6008991K4922161p0567664
$$ plain form
33998 16993512 18525479 18953431 17599832 16707335 17460950 18209993 17964588 18117576 19259409
33989 19259409 19790255 19184570 19179992 20313886 20824633 20329794 20822968 22634661 23413325
33980 23413325 22621228 22817328 24827973 26089274 25603466 25855300 27766170 28677715 27682447
33971 27682447 27829100 30381166 32156805 31493105 31381883 33457307 34598233 33170952
33963 33170952 32765157 35607809 38206284 37989177 38176874 41246693 43900067 43771375 44543989
33954 44543989 48678651 51973265 51622286 52372198 57732050 62864028 63976609 66404086
33946 66404086 74493818 82446971 85389634 89866997 101527236 112993091 117999564 125711043
33938 125711043 143731905 160730908 169236956 189856634 235865625 260787786 190220122
33931A90220122j68859122j71321946p8274344J3381667L5701616J6060978Q556981
33924a54534048J6941433J5883331N564200M502687J1403176J0506369K615948
33917h7116904J356545O622003O774292J608536J147982N490124N447343O94162
33909e7975917k58457L445660M315511J252619O12004L105881K880425m41154
33901d3063428r69581J999162K954234R18575P14496L002136L039249J72059q26161
33892c2059259J097704J608220m06625r21647J185116K062659L95013l72083J066988
33883b6343914J627379J46656m99190P45620J200015n456k30015J252783J653856
33874b0452266O9895p78934K46840Q23989j9485j49801J089705J351746o5522
$$ plain form
33931 190220122 21361000 -149960946 -228235290 -214853623 -179152007 -163091029 -154534048
33924 -154534048 -137592615 -121709284 -116145084 -111642397 -100239221 -89732852 -87116904
33917 -87116904 -85760359 -79138356 -72364064 -70755528 -69607546 -64117422 -58670079 -57975917
33909 -57975917 -58234374 -54788714 -50473203 -49220584 -48608580 -45502699 -42622274 -43063428
33901 -43063428 -44033009 -42033847 -39079613 -38161038 -37446542 -34444406 -31405157 -31233098 -32059259
33892 -32059259 -30961555 -29353335 -29759960 -30681607 -29496491 -27433832 -27038819 -27410902 -26343914
33883 -26343914 -24716535 -24569879 -25069069 -24323449 -23123434 -23128890 -23358905 -22106122 -20452266
33874 -20452266 -20382371 -21161305 -20914465 -20090476 -20109961 -20259762 -19170057 -17818311 -17883833
33865a7883833o76349M64756R92685j45326o99144M59422J163550J36452o57706
33856a6845493J32154P95843L6085o09280R6306P58706J99398l50010J61306O11885
33846a5013100J36504j17818N84828R36535P8826o65738j77899N76616N27522
33837a3133724K25282K64221Q4274m50119l60614M66540P02308n3245m66749P1410
33827a2650416M30551N6093l5586N05970N37418j88590k56369P17612J096787
33818i786530J25455o36646j03453N07532R0003l89352P0691N86633J42327n64431
33808i957771n50790j77007k9316J97692N55761K89585n08147n06859N47783J067314
33798i071755K73902m27444J9333N11151k7904o54976k49248M53202L60116l6355
$$ plain form
33865 -17883833 -18560182 -18095426 -17102741 -17248067 -17947211 -17487789 -16324239 -16187787 -16845493
33856 -16845493 -16713339 -15917496 -15881411 -16490691 -16394385 -15635679 -15436281 -15786291 -15624985 -15013100
33846 -15013100 -14876596 -14994414 -14409586 -13473051 -13394225 -14059963 -14237862 -13661246 -13133724
33837 -13133724 -12908442 -12644221 -12559947 -13010066 -13370680 -12904140 -12201832 -12255077 -12721826 -12650416
33827 -12650416 -12219865 -12163772 -12199358 -11693388 -11155970 -11344560 -11600929 -10883317 -9786530
33818 -9786530 -9661075 -10297721 -10401174 -9893642 -9803639 -10192991 -10122300 -9535667 -9393340 -9957771
33808 -9957771 -10508561 -10685568 -10714884 -10517192 -9961431 -9671846 -10179993 -10686852 -10139069 -9071755
33798 -9071755 -8797853 -9225297 -9205964 -8694813 -8722717 -9377693 -9626941 -9173739 -8813623 -8849978
33788h849978J32557M13998J11269k76101j24740J02211J101J88523Q74751R88078
33778f438331L9532o87134k13929M05248o2586r36543r66975m00269r9746J14328
33768i246405O51329Q80785K58190l80597j39221M05189L78995J61749L56852
33759f673134M32601j31085n45158q6612M16159L1579n39723l16048P3964l64690
33749g702147r53436m62941O10133Q24154J76371j40071J73090M04458L64779
33740f705610M27796M32371M142m29481k69243J01393L3999j40464J45592M35846
33730e963659R1824l50949j00850L54286J16392m46514m27938n7764n6184o7385
33720f908741N37177J020384L49984o87070m83734O66290R60060L3999o04979
$$ plain form
33788 -8849978 -8717421 -8303423 -8192154 -8468255 -8592995 -8490784 -8489683 -8301160 -7426409 -6438331
33778 -6438331 -6398799 -7085933 -7299862 -6894614 -6957200 -7893743 -8860718 -9260987 -9360733 -9246405
33768 -9246405 -8595076 -7714291 -7456101 -7836698 -7975919 -7570730 -7191735 -7029986 -6673134
33759 -6673134 -6240533 -6371618 -6916776 -7003388 -6587229 -6555650 -7095373 -7411421 -7337457 -7702147
33749 -7702147 -8655583 -9118524 -8508391 -7684237 -7507866 -7647937 -7474847 -7070389 -6705610
33740 -6705610 -6277814 -5845443 -5841301 -6270782 -6540025 -6438632 -6404633 -6545097 -6399505 -5963659
33730 -5963659 -5871835 -6222784 -6323634 -5969348 -5852956 -6299470 -6727408 -6785172 -6841356 -6908741
33720 -6908741 -6371564 -5351180 -5001196 -5688266 -6172000 -5505710 -4545650 -4511651 -5116630
33711e116630j90421L12722J70728l9507J65474L18660J19779P699J03971j24197
33701d271722o72033p08908J4948O13831M29283q1169k91249k72925k48260p7845
33691e566049K21673K46538n9135j52746K17078N32544L15829j58713l35164r7260
33681d835405K78072N09356M42998J12275k13069k79129j45258k2060L6511M5436
33671d070273n1933j75310r3741J19120O7271k50926l02550N7602K56638M5729
33661d398373N981L98400M73222k29783q49168n11884K09525L22114O3198K17288
33651d299480N43504L38746o2676J03797M45674N6429o55946m98947L72859O09843
33641c046197q6220n94417l71493j27412k32947q4064M91916O86296J42105l53033
$$ plain form
33711 -5116630 -5307051 -4994329 -4823601 -4863108 -4697634 -4378974 -4259195 -4251496 -4147525 -4271722
33701 -4271722 -4943755 -5652663 -5637715 -5023884 -4594601 -4675770 -4967019 -5239944 -5488204 -5566049
33691 -5566049 -5344376 -5097838 -5156973 -5309719 -5092641 -4560097 -4244268 -4402981 -4738145 -4835405
33681 -4835405 -4557333 -4047977 -3604979 -3492704 -3705773 -3984902 -4130160 -4152220 -4115709 -4070273
33671 -4070273 -4122206 -4297516 -4391257 -4272137 -4204866 -4455792 -4758342 -4700740 -4444102 -4398373
33661 -4398373 -4392392 -3993992 -3520770 -3750553 -4599721 -5111605 -4902080 -4579966 -4516768 -4299480
33651 -4299480 -3755976 -3417230 -3479906 -3376109 -2930435 -2874006 -3529952 -4028899 -3656040 -3046197
33641 -3046197 -3132417 -3726834 -4098327 -4225739 -4458686 -4542750 -4050834 -3364538 -3222433 -3575466
33631c575466k01108J09609J3547k33395k14618n2652K0327O3825R2164J1131
33621c966636N810K68379M02500k3152m88076j76674N25457M88364k43945m52176
33611c660149J79979N25416m0809o45608m84926l9162J8655n0117J85249M19869
33601c591603K40477j47978m25950o18093o10339r5531N83445N34496k50464n99789
33591d981329J17865R97840R90770L28550j62149k85375k56695m3412L22166M25927
33581b545842J11839j74939j79542k57802n40337m96496J20590P00177P13159
33572b549193M46311K72912K3623l69350m71831j74563m5619k86539k84816J84387
33562c254678L60206j62383n73085k08320K87178J67883p3926K61250O58444L15150
$$ plain form
33631 -3575466 -3776574 -3666965 -3653418 -3886813 -4101431 -4154083 -4133756 -4069931 -3977767 -3966636
33621 -3966636 -3960826 -3692447 -3289947 -3313099 -3801175 -3977849 -3452392 -2964028 -3207973 -3660149
33611 -3660149 -3480170 -2954754 -2995563 -3641171 -4126097 -4165259 -4146604 -4196721 -4011472 -3591603
33601 -3591603 -3351126 -3499104 -3925054 -4543147 -5153486 -5249017 -4665572 -4131076 -4381540 -4981329
33591 -4981329 -4863464 -3865624 -2874854 -2546304 -2708453 -2993828 -3250523 -3293935 -2971769 -2545842
33581 -2545842 -2434003 -2608942 -2788484 -3046286 -3586623 -4083119 -3962529 -3262352 -2549193
33572 -2549193 -2102882 -1829970 -1806347 -2175697 -2647528 -2822091 -2867710 -3154249 -3439065 -3254678
33562 -3254678 -2894472 -3056855 -3629940 -3838260 -3551082 -3383199 -3457125 -3195875 -2537431 -2222281
33552b222281k98161k16908K87190K15649l39481l68943K60185N95239J88847
33543a898664l46381m72901l25328n5154M12070Q02597N97472q1656m84982l21973
33533b174900j07692k37408m11474k42036J37113L48449K57836j7097k87241l66736
33523c101186j95794P1715K42071K51580O9656l07675o22574m82484N4312M25968
33513c594411L43967J54658J68557K05525J34393K01729M14402L39964R302J30806
33503a491108P41317O75312o11548j694019j044017N23755R36042n3015o98408
33494b715689j44706M28591p130p11143n90573J02843N01215N41084O10295N27210
33484a458003m4155o35793m86020K01504M52288l5011m69147j78567M31611N17015
$$ plain form
33552 -2222281 -2520442 -2737350 -2450160 -2234511 -2573992 -2942935 -2682750 -2087511 -1898664
33543 -1898664 -2245045 -2717946 -3043274 -3098428 -2686358 -1883761 -1286289 -1367945 -1852927 -2174900
33533 -2174900 -2282592 -2520000 -2931474 -3173510 -3036397 -2687948 -2430112 -2447209 -2734450 -3101186
33523 -3101186 -3296980 -3225265 -2983194 -2731614 -2661958 -2969633 -3592207 -4074691 -4020379 -3594411
33513 -3594411 -3250444 -3095786 -2927229 -2721704 -2587311 -2385582 -1971180 -1631216 -1621914 -1491108
33503 -1491108 -749791 -74479 -686027 -2380046 -3424063 -2900308 -1964266 -2017281 -2715689
33494 -2715689 -2860395 -2431804 -2438934 -3150077 -3740650 -3637807 -3136592 -2595508 -1985213 -1458003
33484 -1458003 -1502158 -2137951 -2623971 -2422467 -1970179 -2005190 -2474337 -2652904 -2221293 -1704278
33474a704278l0906n21594m43215n1214J37701Q2035J10676K57711J73749k22600
33464b211935m56024j31128M57463O81527L43873k16634o17573p24434n61275
33455c436140k17846J68841M75873N88493L63513j46718m58470r0470O56414Q71716
33445a224794K27108n31815o18492k00731O6743M289j20252j71132j66477n2778
33435b788331R4951J8170j96660n0114M74424O19875O9341l13373J76489P49222
33425a146006K85544p35943q72135K158N38497Q2655m66538k94098J76594L09684
33415b119588K64182K90957L8004o31820r60515l39554N71492O96864J06025k03417
33405b287370J28032M01806P4125m19477l89879Q8268L48900J00622k29484j56868
$$ plain form
33474 -1704278 -1735184 -2256778 -2699993 -2751207 -2613506 -2531471 -2420795 -2163084 -1989335 -2211935
33464 -2211935 -2667959 -2799087 -2341624 -1660097 -1316224 -1532858 -2150431 -2874865 -3436140
33455 -3436140 -3653986 -3485145 -3009272 -2420779 -2057266 -2203984 -2662454 -2752924 -2096510 -1224794
33445 -1224794 -997686 -1529501 -2147993 -2348724 -2281981 -2277692 -2397944 -2569076 -2735553 -2788331
33435 -2788331 -2693380 -2675210 -2871870 -2921984 -2447560 -1827685 -1758344 -2071717 -1895228 -1146006
33425 -1146006 -860462 -1596405 -2468540 -2466382 -1927885 -1845230 -2311768 -2605866 -2429272 -2119588
33415 -2119588 -1855406 -1564449 -1526445 -2158265 -3118780 -3458334 -2886842 -2189978 -2083953 -2287370
33405 -2287370 -2159338 -1757532 -1683407 -2102884 -2492763 -2404495 -2055595 -1954973 -2184457 -2341325
33395b341325K01748L57505J41101j62669l14191l71870l80498k09451J16207
33386b963443K93457J84526L7147L2157O156j09957m2983K77491M28305J94073
33376a663071K7597K48619L35382k48158r90422r68383k27121L65804M23442L06994
33366b389317K51864J35449M0645J72909K62716r0921n50392m26647J19165K60024
33356b214505r8583j84765K40974M77724J69942r7248P1362J82852j50509m42793
33346b045549k12495J50454P6908k61079l67880k17636m0803J79443M38951M10687
33336a888999m1026m52806l69569Q070K13553J69898N5408r3160k47580k25916
33326b872127j5504J03032L3275L7127J72563P5054l69505o62500m04006R7895
$$ plain form
33395 -2341325 -2139577 -1782072 -1640971 -1803640 -2117831 -2489701 -2870199 -3079650 -2963443
33386 -2963443 -2669986 -2485460 -2448313 -2416156 -2410000 -2519957 -2562940 -2285449 -1857144 -1663071
33376 -1663071 -1635474 -1386855 -1051473 -1299631 -2290053 -3258436 -3485557 -3119753 -2696311 -2389317
33366 -2389317 -2137453 -2002004 -1961359 -1788450 -1525734 -1616655 -2167047 -2593694 -2474529 -2214505
33356 -2214505 -2313088 -2497853 -2256879 -1779155 -1609213 -1706461 -1635099 -1452247 -1602756 -2045549
33346 -2045549 -2258044 -2107590 -2030682 -2291761 -2659641 -2877277 -2918080 -2738637 -2299686 -1888999
33336 -1888999 -1930025 -2382831 -2752400 -2744330 -2530777 -2360879 -2305471 -2398631 -2646211 -2872127
33326 -2872127 -2887631 -2784599 -2751324 -2714197 -2541634 -2466580 -2836085 -3498585 -3902591 -3804696
33316c804696L15826J74445r5945l19246k80721K17815Q79397J007070M19262
33307a486793k38880l94363j87370N9252L23934M88378K02837m00198n99985j82265
33297b415453J43550m4054j38483L19446O46373J45052n61550m33414L33874O98357
33287a306302L89063J5657j23662k45796l09363q8506J30608q0304l77136j02844
33277b098585M75752M57001k17542o63749m86412k16777j63271O6067N63250O83379
33267a600887J17017m54999l52598J30080L03047Q6047j18758j50972j64369k20677
33257b427069k18641r9644R5493K43137J56556j76867l93328j35063L66616N08132
33247b080678J54783j83399j11409J57985K16617k2887l69338n78659m45250L012
$$ plain form
33316 -3804696 -3488870 -3314425 -3410370 -3729616 -4010337 -3792522 -2913125 -1906055 -1486793
33307 -1486793 -1725673 -2120036 -2307406 -2248154 -1924220 -1435842 -1233005 -1633203 -2233188 -2415453
33297 -2415453 -2271903 -2315957 -2454440 -2134994 -1488621 -1343569 -1905119 -2338533 -2004659 -1306302
33287 -1306302 -917239 -901582 -1025244 -1271040 -1580403 -1668909 -1538301 -1618605 -1995741 -2098585
33277 -2098585 -1622833 -1165832 -1383374 -2047123 -2533535 -2750312 -2913583 -2847516 -2284266 -1600887
33267 -1600887 -1483870 -1938869 -2291467 -2161387 -1858340 -1772293 -1891051 -2042023 -2206392 -2427069
33257 -2427069 -2645710 -2745354 -2649861 -2406724 -2250168 -2427035 -2820363 -2955426 -2588810 -2080678
33247 -2080678 -1925895 -2109294 -2220703 -2062718 -1846101 -1868988 -2238326 -2816985 -3262235 -3259223
33237c259223L57743K35761j53200k42920Q5144L93331M04026L03977K43817P6168
33227a555376k23328l62571j87891P2763K06434K65043K74064J18282j21629j56245
33217a670454J8046O0160j07493j27037J36461K91107Q1093j58186r5382K4787
33207a546898j22106k85302m4182M13777N15021J69189j34093p7774J19955J63064
33197h29349Q4152M2082K0229o4394j20446L3373L66605N74834M03243k5303l35744
33186A49282l67967l38176m30430m54875j69626K29712L09132K6055k22237j91561
33176a460691m5276M5805J49777K76060K24346m1489k01871l9861J73844N6131
33166h63225l15764n08835l08477P1385L04518K75405R9775l7106n2414k0832
$$ plain form
33237 -3259223 -2901480 -2665719 -2818919 -3061839 -2976695 -2583364 -2179338 -1875361 -1631544 -1555376
33227 -1555376 -1778704 -2141275 -2329166 -2256403 -2049969 -1784926 -1510862 -1392580 -1514209 -1670454
33217 -1670454 -1652408 -1592248 -1699741 -1826778 -1690317 -1399210 -1318117 -1476303 -1571685 -1546898
33207 -1546898 -1669004 -1954306 -1998488 -1584711 -1069690 -900501 -1034594 -1112368 -992413 -829349
33197 -829349 -745197 -703115 -682886 -747280 -867726 -834353 -467748 107086 510329 485026 149282
33186 149282 -218685 -556861 -987291 -1442166 -1611792 -1382080 -1072948 -1046893 -1269130 -1460691
33176 -1460691 -1505967 -1460162 -1310385 -1034325 -809979 -851468 -1053339 -1093200 -919356 -863225
33166 -863225 -1178989 -1687824 -1996301 -1924916 -1620398 -1344993 -1245218 -1282324 -1334738 -1355570
33156a355570l0441j8915J15119K66622K11164j8905r2042J57675M29858L12157
33146b3278j80761o02387n74868j80385J52343J19288j11789r2607L16967O87748
33136d89729N18555j06913n94786n36662j04044K32906J53614l26043q61707r64486
33126c079295m34065L40648P26069N23179J12499o3937O9183L05270M15185K96404
33116g88860P6348M5970K70025L58959m6816o46755p58604k39185L17855L94657
33106a016406J21701j14725k10446k50423k30527j47227j10388j33569l4451K53549
33096a872912M84639M12867J20223j32619k19180j82178j13775r1632r1165M0167
33086a645565L22057M33303J03657l45797l26261J17651K87049j11605m65395
$$ plain form
33156 -1355570 -1386011 -1404926 -1289807 -1023185 -812021 -830926 -922968 -765293 -335435 -23278
33146 -23278 -204039 -806426 -1381294 -1561679 -1409336 -1290048 -1401837 -1494444 -1177477 -489729
33136 -489729 28826 -78087 -672873 -1209535 -1313579 -1080673 -927059 -1253102 -2114809 -3079295
33126 -3079295 -3513360 -3172712 -2446643 -1923464 -1810965 -1874902 -1805719 -1500449 -1085264 -788860
33116 -788860 -712512 -666542 -396517 -37558 -84374 -731129 -1489733 -1728918 -1411063 -1016406
33106 -1016406 -894705 -1009430 -1219876 -1470299 -1700826 -1848053 -1958441 -2092010 -2126461 -1872912
33096 -1872912 -1388273 -975406 -855183 -987802 -1206982 -1389160 -1502935 -1594567 -1685732 -1645565
33086 -1645565 -1323508 -890205 -786548 -1132345 -1458606 -1340955 -1053906 -1165511 -1630906
33077a630906j66510M71484O83978K94120k15043m39218l82741j78418P4361K15086
33067a273807J22130o5139p2112J50192L71459L77216J71033j00753l12189m38017
33057a069987m99055m32395j29177K88333M20148R3752k62560j57036J96356J84045
33047a367576j98332l19267J7352K28913k4512k17706J36855N86203L94225l09550
33037a073395p11255m26554J38494M24230K73099o2082j67477J28313M39534K41199
33027g95894k58974k39600M37153P72988P0290q75041q64701l8284M78168K91490
33017a022405K680p0181k50615n22250l43145K65496M83314j5740m52251j73475
33007b098572L14744K22979k65644l81459K0342L93135M11725K77935K10042J90808
$$ plain form
33077 -1630906 -1797416 -1325932 -641954 -347834 -562877 -1002095 -1384836 -1563254 -1488893 -1273807
33067 -1273807 -1151677 -1216816 -1288928 -1138736 -767277 -390061 -219028 -319781 -631970 -1069987
33057 -1069987 -1569042 -2001437 -2130614 -1842281 -1422133 -1328381 -1590941 -1747977 -1551621 -1367576
33047 -1367576 -1565908 -1885175 -1867823 -1638910 -1663422 -1881128 -1744273 -1158070 -763845 -1073395
33037 -1073395 -1784650 -2211204 -2072710 -1648480 -1375381 -1437463 -1604940 -1476627 -1037093 -795894
33027 -795894 -1054868 -1294468 -857315 -84327 -14037 -889078 -1753779 -1792063 -1313895 -1022405
33017 -1022405 -1019725 -1089906 -1340521 -1862771 -2205916 -1940420 -1457106 -1472846 -1925097 -2098572
33007 -2098572 -1783828 -1560849 -1826493 -2207952 -2187610 -1794475 -1382750 -1104815 -894773 -703965
32997g03965K08482K97587L26718J09209k55952m48262l40596j07696O3729J40254
32987g10492J29674K9753r0308j34851j25465j56060k06420j47057N1665K37915
32977a121646K39474K9822k72067m87701m57720j32431L41035O47011N07085n9338
32967g66476o73688q73888n16279J06362N50272N77104K59373j15926k10783R8232
32957a565697M87272M09206k39359q30002o62996J60651Q32494P99561L25164
32948b83706P210K7763Q4427r0350l74339m30561j23789K98368M47475J96246
32938b41256k09778m34222l53700p9792J72319J92912n9284l12737k08750J96809
32928a337479L94633Q5748l56477l66438P3911M96053N75929L51360m4357m63704
$$ plain form
32997 -703965 -495483 -197896 128822 238031 -17921 -466183 -806779 -914475 -850746 -710492
32987 -710492 -580818 -551065 -641373 -776224 -901689 -1057749 -1264169 -1411226 -1359561 -1121646
32977 -1121646 -882172 -852350 -1124417 -1612118 -2069838 -2202269 -1861234 -1214223 -707138 -766476
32967 -766476 -1440164 -2314052 -2830331 -2723969 -2173697 -1596593 -1337220 -1453146 -1663929 -1565697
32957 -1565697 -1078425 -669219 -908578 -1738580 -2401576 -2240925 -1408431 -608870 -283706
32948 -283706 -276496 -248733 -164306 -254656 -628995 -1059556 -1183345 -884977 -437502 -241256
32938 -241256 -451034 -885256 -1238956 -1318748 -1146429 -953517 -1012801 -1325538 -1534288 -1337479
32928 -1337479 -942846 -857098 -1213575 -1580013 -1506102 -1010049 -434120 -82760 -127117 -590821
32918e90821o46104m46537j21429j0148j8951J36087K82080j3179n79999o68948
32908b677949l8531O35223P63490O18909O36580N59148k4679p30076q02492k96020
32898a356397K0650r3275p8002K90842L94656j40787o32881l34008L18414L19011
32888a291777l35777o56283k15238K78573K14712k0717J12147L38289J51914k05237
32878a629394j65790J55551K31709J18351K49462M14220k274p36009p50522R6758
32868b017938O44529K12507l10660L1537O57296M37877m02787o47804k4510M59039
32858i60914J14708n57270p84912m54081J09022N90603P11046L77842k4638k2997
32848i01591K04623O1052m48501o21631j61419L19635K20891k03740l20742k238
$$ plain form
32918 -590821 -1236925 -1683462 -1804891 -1815039 -1833990 -1697903 -1415823 -1429002 -2009001 -2677949
32908 -2677949 -2716480 -2081257 -1317767 -698858 -62278 496870 472191 -257885 -1060377 -1356397
32898 -1356397 -1335747 -1429022 -1507024 -1216182 -821526 -962313 -1595194 -1929202 -1610788 -1291777
32888 -1291777 -1627554 -2283837 -2499075 -2220502 -2005790 -2026507 -1914360 -1576071 -1424157 -1629394
32878 -1629394 -1795184 -1639633 -1407924 -1289573 -1040111 -625891 -628165 -1364174 -2114696 -2017938
32868 -2017938 -1373409 -1160902 -1471562 -1440025 -782729 -344852 -747639 -1395443 -1419953 -960914
32858 -960914 -846206 -1403476 -2188388 -2642469 -2533447 -1942844 -1231798 -853956 -878594 -901591
32848 -901591 -696968 -635916 -1084417 -1706048 -1867467 -1547832 -1326941 -1530681 -1851423 -1853661
32838a853661L53056M01114J59746p4944K6734M69699Q00576N97882L9266l64113
32828E55355m73525m93201l89801Q073L92461K27694l03214m15187K6223K29775
32818f35347j98598n35478j09964N64970N66608p4078n52549m89349k24181r9507
32808a787473q5897o9146l8092Q746O2198Q3107J29086K86681L86089J61901j74440
32797a037240m6141N59105Q62976L87120l15458n08379k81403j27618o6909R3459
32787d80488J06815k68657n35876r0971O17482N35532l96419j037280o30386K40323
32777a939925O11972L62914K9088p4693l6423N2375J97363K90172J44891k18639
32767e80905n17941n03747k41500k7886l1392j20037j22339j01011j53857j13729
$$ plain form
32838 -1853661 -1500605 -1099491 -939745 -1014689 -987955 -518256 282320 880202 919468 555355
32828 555355 81830 -411371 -801172 -793099 -400638 -172944 -476158 -891345 -865122 -635347
32818 -635347 -833945 -1369423 -1479387 -914417 -347809 -421887 -974436 -1463785 -1687966 -1787473
32808 -1787473 -1873370 -1942516 -1980608 -1971862 -1909664 -1826557 -1697471 -1410790 -1024701 -862800 -1037240
32797 -1037240 -1083381 -524276 338700 725820 410362 -98017 -379420 -507038 -573947 -480488
32787 -480488 -373673 -642330 -1178206 -1269177 -651695 -116163 -512582 -1549862 -2180248 -1939925
32777 -1939925 -1327953 -965039 -935951 -1010644 -1047067 -994692 -797329 -507157 -362266 -580905
32767 -580905 -1098846 -1602593 -1844093 -1871979 -1903371 -2023408 -2145747 -2246758 -2400615 -2514344
32757b514344J72180L83031Q7074m39082m22989K08869N86308J94478l31126k49815
32747b325416J43712J49564j39740j25218K09007L69853K72258K40778K59202
32738i46000K9798l20340l62044j13245O8515K18869N86822Q31895L37730o16641
32728b84641r48209k64973N70746O73892J78522k79084m13404k41600J96129O49056
32718a63566O87172K82334p8929j30910j82469m60400o49364m70656k30919l33687
32708a731394n98922n17843L0768O59032R09725O17902K2374l64718k30041J44901
32698a058216K39152J5693j17596m0768p0007l02682m06716k31180m7895K3156
32688a997059K33866N90479O25704J45364l47124l62247o2638J82468L60936N16050
$$ plain form
32757 -2514344 -2342164 -1959133 -1872059 -2311141 -2734130 -2525261 -1938953 -1744475 -2075601 -2325416
32747 -2325416 -2181704 -2032140 -2171880 -2297098 -2088091 -1718238 -1445980 -1205202 -946000
32738 -946000 -916202 -1236542 -1598586 -1711831 -1643316 -1424447 -837625 -5730 332000 -284641
32728 -284641 -1232850 -1497823 -927077 -253185 -74663 -353747 -767151 -1008751 -812622 -163566
32718 -163566 523606 805940 727011 596101 413632 -46768 -696132 -1166788 -1397707 -1731394
32708 -1731394 -2330316 -2848159 -2817391 -2158359 -1248634 -630732 -608358 -973076 -1203117 -1058216
32698 -1058216 -819064 -803371 -920967 -961735 -1031742 -1334424 -1741140 -1972320 -2020215 -1997059
32688 -1997059 -1763193 -1172714 -547010 -401646 -748770 -1111017 -1173655 -991187 -630251 -114201
32678a14201M02060n3711l92033k56415j638j29598m60762m42359l0631K99142
32668a180146K73443O4383q4167p5367R8711L14014L29483Q8940j61701k41083
32658e73490k47243k31639m2926K57761K72043j04369l78576k01015M7603q9941
32648a291792l39038j47401L74756O09443L29805j29516m41562n07026k73304
32639a815635J56577L90660K02935n8863J4351K23335J49697m6488J07359M86584
32629a89488M57563j20128o58110p14375n13839m23857m04864k11445J90683N90281
32619a997579P27162M88632O2318j94088j86284j77983k78952k04518J50789L51812
32609a258691J05945j45715O8353L83560J89625k70177k75237J25405K02089j94855
$$ plain form
32678 -114201 287859 234148 -157885 -414300 -415938 -545536 -1006298 -1448657 -1479288 -1180146
32668 -1180146 -906703 -842320 -926487 -1001854 -903143 -589129 -259646 -170706 -332407 -573490
32658 -573490 -820733 -1052372 -1095298 -837537 -565494 -669863 -1048439 -1249454 -1201851 -1291792
32648 -1291792 -1630830 -1778231 -1403475 -794032 -464227 -593743 -1035305 -1542331 -1815635
32639 -1815635 -1659058 -1268398 -1065463 -1124326 -1109975 -886640 -736943 -783431 -676072 -189488
32629 -189488 268075 147947 -510163 -1224538 -1738377 -2162234 -2567098 -2778543 -2587860 -1997579
32619 -1997579 -1270417 -781785 -719467 -913555 -1099839 -1277822 -1556774 -1761292 -1610503 -1258691
32609 -1258691 -1152746 -1298461 -1230108 -846548 -656923 -927100 -1202337 -1076932 -874843 -1069698
32599a069698m26249j71485J61109K45773K07528P1835k83816n22761j33549N33309
32589a388004N41294r9485l22756K01134M35314k07057o98548n7048R28036Q98872
32579B31752M7370l67113q5091L2538k89306l73714N215J96050o7760j69055J96047
32568f43067L82268o5090n39019l40910J88995K70587j13437l80383l29544j97263
32558a766863m578L58479N48521J06274o00875o22792J69015P39757L77691k34638
32548i30009r8553N61380P29679K16059j95084j50516j91667n60340o11139m211
32538a234401M33478r9243r85781r97946r6253O22674N95232L45906L47458L61753
32528g07123J65067K4968Q4829L4680k17469k49988Q1058K37662j20919m83763
$$ plain form
32599 -1069698 -1495947 -1667432 -1506323 -1260550 -1053022 -981187 -1265003 -1787764 -1921313 -1388004
32589 -1388004 -846710 -946195 -1268951 -1067817 -632503 -839560 -1538108 -1595156 -667120 231752
32579 231752 279122 -87991 -173082 -140544 -429850 -803564 -798349 -602299 -670059 -839114 -643067
32568 -643067 -260799 -325889 -864908 -1205818 -1016823 -746236 -859673 -1240056 -1569600 -1766863
32558 -1766863 -1771441 -1412962 -864441 -758167 -1359042 -1981834 -1812819 -1073062 -695371 -930009
32548 -930009 -1028562 -467182 262497 478556 283472 132956 -58711 -619051 -1230190 -1234401
32538 -1234401 -800923 -900166 -1885947 -2883893 -2980146 -2357472 -1762240 -1416334 -1068876 -707123
32528 -707123 -542056 -517088 -432259 -397579 -615048 -865036 -783978 -546316 -667235 -1150998
32518a150998k83466J96277L29999J25825M7351J92989K74808J75782j9184l16400
32508d27017o29642n71726J6363N69133M26270k10402n39620k59840J80974L66869
32498a078638L56597L14285K14902K4542j89569l79428m81188l38785N2147L74346
32488a130789L78518K36232J61775q420l91597n68178j66416L39220J98854l88342
32478a339143m83017J46173O65287M52911q9397l23351k39503j24739K2306K74811
32468a037662M34307L31264J23227k1923j83856l69453l39605m5482J56453K7775
32458i24955j77037j37785Q7016K89748M06361L56843L1711l26746k32314K67956
32448c59202M70066K4298n00069m94223j66402K865O3158K10012J70002k60976
$$ plain form
32518 -1150998 -1434464 -1238187 -908188 -782363 -735012 -542023 -267215 -91433 -110617 -427017
32508 -427017 -1056659 -1628385 -1612022 -1042889 -616619 -827021 -1366641 -1626481 -1445507 -1078638
32498 -1078638 -722041 -407756 -192854 -168312 -357881 -737309 -1218497 -1557282 -1505135 -1130789
32488 -1130789 -752271 -516039 -354264 -362684 -754281 -1322459 -1488875 -1149655 -950801 -1339143
32478 -1339143 -1822160 -1675987 -1010700 -557789 -647186 -970537 -1210040 -1334779 -1312473 -1037662
32468 -1037662 -603355 -272091 -148864 -170787 -354643 -724096 -1063701 -1109183 -952730 -924955
32458 -924955 -1101992 -1239777 -1152761 -863013 -456652 -99809 -68098 -394844 -627158 -359202
32448 -359202 110864 135162 -364907 -859130 -1025532 -1022667 -959509 -749497 -579495 -840471
32438h40471n63507k45137J84818l1901n20817k79507N96982R41061L67859j43346
32428e33966J04777M69300J82161l71591m14490p1401L980j98425j57279J63422
32418h23512K56145m6881l41740l28642j45282K5641J89605L06016K43929P0521
32408e94200M0428K05428L17292J92370o4823k48235k57031j09568N9957O0165
32398c98217r9023r8526K73008O94353O52561J61805k54206l16065k90950m30511
32388a05771n53252m31768k23433j85580k26549r1954J76483L09235K26688P9218
32378a026683m1101j23462o0153K00990L68101Q2704m51323n48114N4361P53686
32368g90994Q50097M34991J16783J01392O3124j46312k39118p9003j857k34934
$$ plain form
32438 -840471 -1403978 -1649115 -1464297 -1496198 -2017015 -2296522 -1699540 -758479 -390620 -533966
32428 -533966 -429189 40111 222272 -149319 -563809 -635210 -631230 -829655 -986934 -823512
32418 -823512 -567367 -614248 -955988 -1284630 -1429912 -1404271 -1214666 -908650 -664721 -594200
32408 -594200 -553772 -348344 -31052 161318 96495 -151740 -408771 -518339 -458382 -398217
32398 -398217 -497240 -595766 -322758 371595 1024156 1185961 931755 615690 324740 -105771
32388 -105771 -659023 -1090791 -1314224 -1499804 -1726353 -1818307 -1641824 -1332589 -1105901 -1026683
32378 -1026683 -1067784 -1191246 -1251399 -1050409 -682308 -599604 -1050927 -1599041 -1544680 -790994
32368 -790994 59103 494094 610877 712269 775393 629081 389963 310960 309103 74169
32358G4169m07567q6481M52802N00408j05695p44804q27562m44031n7689J04730
32348a541720J39524J81180K63560L36240K67579l5813l98708m46641o1961L97220
32338h99540N12175K85230J4023j63833l48521n73366o69031m61514J0586M68598
32328a825193N63256K11246j96127j60151K45472L84508m5340n12264m16570J7787
32318a733376J60134p972J7753K97164L58896J31532J44328N47927P06725J92993
32308H16104m75929o20868l62888k14998j99176m7388R2537r9422l87908k44158
32298a744094K54309M83666K25445r1262j43203r1253j08537j02808m1264l8033
32288a397034j0686K34808M95255L30671j42177k64303J36741M07299R9183l16988
$$ plain form
32358 74169 -333398 -419879 32923 533331 427636 -317168 -1144730 -1588761 -1646450 -1541720
32348 -1541720 -1402196 -1221016 -957456 -621216 -353637 -389450 -788158 -1234799 -1296760 -899540
32338 -899540 -387365 -102135 -88112 -251945 -600466 -1173832 -1842863 -2304377 -2293791 -1825193
32328 -1825193 -1261937 -1050691 -1246818 -1406969 -1161497 -776989 -822329 -1334593 -1751163 -1733376
32318 -1733376 -1573242 -1581214 -1563461 -1266297 -907401 -775869 -631541 -83614 623111 816104
32308 816104 340175 -280693 -643581 -858579 -1057755 -1105143 -1012606 -1112028 -1499936 -1744094
32298 -1744094 -1489785 -1006119 -780674 -871936 -1015139 -1106392 -1214929 -1317737 -1359001 -1397034
32288 -1397034 -1407720 -1172912 -677657 -346986 -489163 -753466 -616725 -209426 -110243 -427231
32278d27231k43553J20018K15390J9604j09031j14553j61043j52429P1213K89991
32268d91624K19599M6628R8893K34188J50358K4955J54226K25559k12424p43605
32258b93247n42204J77144K73424n12413r88430k96892P38932Q58925J76539k20648
32248f28870L0709L05086K03292M0957O8678L5918k31451m30203k56839J05137
32238g57586K34829o240l45860l68348Q0298O29274O66575Q0616n02741n06372
32228g95555j43534K9492j3824O7886J95078q836l91832l95960o5131n1836m06329
32217a980381l10944N16682J083645N29945m77263o94054j08164K61231O4124
32208a115179m0150K57654L70688l6825l48902k6073M19664K07652m42632o19333
$$ plain form
32278 -427231 -670784 -550766 -335376 -315772 -424803 -539356 -700399 -852828 -781615 -491624
32268 -491624 -272025 -225397 -126504 107684 258042 282997 437223 662782 450358 -293247
32258 -293247 -835451 -658307 -384883 -897296 -1885726 -2182618 -1443686 -584761 -408222 -628870
32248 -628870 -598161 -293075 -89783 -48826 19852 55770 -175681 -605884 -862723 -757586
32238 -757586 -522757 -528997 -874857 -1243205 -1162907 -533633 132942 213558 -289183 -795555
32228 -795555 -939089 -909597 -923421 -855535 -660457 -669293 -1061125 -1457085 -1522216 -1574052 -1980381
32217 -1980381 -2291325 -1774643 -690998 -161053 -638316 -1332370 -1440534 -1179303 -1115179
32208 -1115179 -1155329 -897675 -526987 -563812 -912714 -938787 -519123 -311471 -754103 -1373436
32198a373436q6925M13714K87938j30718j93743J08977K31997n6089l29923j47485
32188a275693K95086M60502K74593K03532M55132N64565R3177o17024q56736n09658
32178i12524q2098J11021K06654K46462J9584l72906m14194M4268M19876K20332
32168e13525k20733k88644J0453K11911J70408J19487J29851N4341p0038o3717
32158d60206k603j06999k67244j61062J50872K43911J4243j46722l681J68039
32148e71452R8773l3465J6157P8383j52195n53814o63440k83053K64157N03316
32138a296633K84271j15856k75958k7835L77252N19124K43799j86966l75796j76190
32128a030788J76359K83294m585l64625l24610J34698N07198M21395J11096q340
$$ plain form
32198 -1373436 -1460361 -1046647 -758709 -889427 -1083170 -974193 -742196 -798285 -1128208 -1275693
32188 -1275693 -980607 -520105 -245512 -41980 413152 977717 1070894 453870 -402866 -912524
32178 -912524 -994622 -883601 -676947 -430485 -410901 -783807 -1198001 -1153733 -733857 -513525
32168 -513525 -734258 -1022902 -1012449 -800538 -630130 -510643 -380792 -326451 -396489 -460206
32158 -460206 -462809 -569808 -837052 -998114 -847242 -603331 -589088 -735810 -739491 -571452
32148 -571452 -472679 -506144 -489987 -411604 -563799 -1117613 -1781053 -2064106 -1799949 -1296633
32138 -1296633 -1012362 -1128218 -1404176 -1432011 -1054759 -535635 -291836 -478802 -854598 -1030788
32128 -1030788 -854429 -571135 -575720 -940345 -1264955 -1130257 -623059 -201664 -90568 -98908
32118i8908M4978m110j18750k9320K20360K88078Q3800j28498j81673j48568o1372
32107a33983P5651M7183k92607n58688k67180K85194L08525k18687m17654Q3964
32097a088282N01088J57806m18184l92523M4099J01690k97299n24933l25147n1445
32087b293130P1394J90213L56482M36109M51901M79934L24894j29574m22735o6869
32077f01381N18502M24007l67368q44211m09596L20695N08822K09447K8988J73210
32067c8885L39591K62419m7352m25141o43394n52481k99694j88126k05365k612
32057a801040N01725Q45339N99375l9931m86669m09226L6533M30872M08572m9597
32047C5953n27208n63790j94303J34563J96522J96041K91445L15211J34947p2343
$$ plain form
32118 -98908 -53930 -58040 -176790 -206110 14250 302328 386128 257630 75957 -72611 -133983
32107 -133983 -58332 -11149 -303756 -862444 -1129624 -844430 -535905 -754592 -1172246 -1088282
32097 -1088282 -587194 -429388 -847572 -1240095 -1195996 -1094306 -1391605 -1916538 -2241685 -2293130
32087 -2293130 -2221736 -2031523 -1675041 -1238932 -787031 -307097 17797 -111777 -534512 -601381
32077 -601381 -82879 341128 -26240 -870451 -1280047 -959352 -450530 -241083 -212095 -38885
32067 -38885 300706 563125 515773 90632 -552762 -1105243 -1404937 -1593063 -1798428 -1801040
32057 -1801040 -1299315 -453976 145399 105468 -381201 -790427 -753894 -323022 85550 35953
32047 35953 -491255 -1055045 -1249348 -1114785 -918263 -722222 -430777 -115566 19381 -52962
32037e2962j10558k5675P9690J74993J33216j63378m19909j46090M88440O10035
32027E67802j27066q44550o01739K11355M47873q8523m39987m5363M21897J57040
32017c41261n40205p50724k65884K43735K94310J90718L86516P22810O78240J39957
32007G58212m71262p66784p11833l97007J00118N29840N62261K55076M0579M3022
31997e7778j09522m91754n11453J13333O15661K45876m17252k90667L89075L68666
31987a45815m99013q74609p9280P61115M90111l38910n15128m5534J80944l5746
31977a101865j64200p9408j08978j67129R3776L90531J03200n46602o15120J28849
31967b066946Q01004O87274J49721p9302J27515L83096L94203J70723p8386j06717
$$ plain form
32037 -52962 -163520 -189195 -109505 65488 198704 35326 -384583 -530673 -42233 567802
32027 567802 440736 -403814 -1005553 -794198 -346325 -434848 -874835 -920198 -498301 -341261
32017 -341261 -881466 -1632190 -1898074 -1654339 -1360029 -1169311 -782795 -59985 618255 758212
32007 758212 286950 -479834 -1191667 -1588674 -1488556 -958716 -396455 -141379 -100800 -57778
31997 -57778 -167300 -659054 -1170507 -1057174 -441513 -195637 -612889 -903556 -514481 -145815
31987 -145815 -644828 -1519437 -1598717 -837602 -347491 -686401 -1201529 -1247063 -1066119 -1101865
31977 -1101865 -1266065 -1345473 -1454451 -1621580 -1527804 -1137273 -1034073 -1580675 -2195795 -2066946
31967 -2066946 -1265942 -578668 -428947 -508249 -380734 2362 396565 567288 488902 382185
31957C82185P4007R3494k70676o32261m88135j5968J72454m2243k32589k24371
31947a184103k51690k93689M888N97558Q95316N84023J7225l75866n14505l74633
31937h95476R1485N56387M79875q2656m36354k50038K4280p19o0381J25581K78888
31926a69128J04315j39141j13990l15j23545l58158l54956o0797L39921O80706
31916a95088P35075K91540l98420o83942l34004J46826K82700J77275L0712k38296
31906a85622n06514k96982L67925O72096J80263l92595k91508J15628J28505m3280
31896b52084J35019L16163j28286p45251n82299J18329K33150k87171k89041N28384
31886i53087R55370K47713o11312m80608K24853M03478r48k27990p4489N1361
$$ plain form
31957 382185 456192 549686 279010 -353251 -841386 -857354 -684900 -727143 -959732 -1184103
31947 -1184103 -1435793 -1729482 -1724594 -1127036 -231720 352303 369528 -6338 -520843 -895476
31937 -895476 -803991 -247604 232271 149615 -286739 -536777 -512497 -513216 -573597 -448016 -169128
31926 -169128 -64813 -203954 -317944 -318259 -441804 -799962 -1154918 -1215715 -875794 -195088
31916 -195088 539987 831527 433107 -250835 -584839 -438013 -155313 21962 52674 -185622
31906 -185622 -692136 -989118 -621193 50903 231166 -161429 -452937 -337309 -208804 -252084
31896 -252084 -117065 199098 70812 -674439 -1256738 -1138409 -905259 -1192430 -1481471 -953087
31886 -953087 2283 249996 -361316 -841924 -617071 -213593 -214541 -442531 -517020 -465659
31876d65659R5094L32566N45635K00623n29678p94806k81882L35018M08047J38829
31866a6213M2547J21112M9815j39933j02302J79527K67696r1219n39515n57218
31856g85703j41191K53215L54781L02447J99278j18235o07978p25171r6052P22023
31846f42586P61714n3002p15031m44700L20716N97427J36519m12721m40937m6109
31836i38710K54577J87573k4467O595L24533N36105L10270j64115m55488n07891
31826d71018n96534p01472m55050J36045M81201K58646l5780J23593M11759K13598
31816f35012k61517k39521L30561O10933J72600l40163k38614J89739K62558Q605
31806a39831j1832K72729L51427L6552k24765j10643Q3207J424j91351j75271
$$ plain form
31876 -465659 -370565 -37999 507636 708259 178581 -616225 -898107 -563089 -155042 -16213
31866 -16213 26334 147446 197261 57328 -44974 134553 402249 311030 -228485 -785703
31856 -785703 -926894 -673679 -318898 -16451 182827 64592 -543386 -1268557 -1364609 -642586
31846 -642586 119128 66126 -648905 -1093605 -772889 -175462 -38943 -451664 -892601 -938710
31836 -938710 -684133 -496560 -521027 -514432 -189899 346206 656476 492361 36873 -471018
31826 -471018 -1067552 -1769024 -2224074 -2088029 -1606828 -1348182 -1383962 -1260369 -848610 -635012
31816 -635012 -896529 -1136050 -805489 -194556 -21956 -362119 -600733 -410994 -148436 -139831
31806 -139831 -151663 121066 472493 509045 284280 173637 256844 258268 66917 -108354
31796a08354o6831j80997m09067l33422P9206L59815J97569j58028l08080k17432
31786a145621j16059j00004n3869J27173L99187O06900N85687K99519p6642k94754
31776B31517k73146j18992L4466P4314j01269l94727m22521K3229M99639L80667
31766f6823j82125l48939J98397P66881O85675J91947j74417m25895p34751p55580
31756h45630j73091M76515M50906K849l9696K81549J47685m77244o06532J07467
31746f75222O48907K12022n07643m45500J88537L86393m8389l92758k65537l4806
31736i33996J3266P6277K74002L58828J99615M7049R6753J72925N5798j57684
31726B02833k06525n175K86424M28101L01885K1670j97099l08027m18378m64103
$$ plain form
31796 -108354 -175185 -356182 -765249 -1098671 -1019465 -659650 -462081 -620109 -928189 -1145621
31786 -1145621 -1261680 -1361684 -1415553 -1288380 -889193 -282293 303394 602913 526271 231517
31776 231517 -41629 -160621 -126155 -51841 -153110 -547837 -970358 -947129 -447490 -66823
31766 -66823 -248948 -597887 -399490 367391 1053066 1245013 1070596 644701 -90050 -845630
31756 -845630 -1018721 -542206 -91300 -88451 -128147 153402 301087 -176157 -782689 -675222
31746 -675222 -26315 185707 -321936 -767436 -578899 -192506 -240895 -633653 -899190 -933996
31736 -933996 -920730 -844453 -570451 -211623 -12008 35041 131794 304719 360517 202833
31726 202833 -3692 -8867 277557 705658 1007543 1029213 832114 524087 105709 -358394
31716c58394k08556K69421M60813J19451k81981k20266P2660K9613k62440j79255
31706e58934L82043P60776M89507j07858m98088n92908n35201k98201J15169L91488
31696d52207K28468k14765m85168l51604M6469M31111N71331L64029n9925l67847
31686b90108l14973J9013L33927L79901J24643k08993k74478L3616L39103J65899
31676C07550l95662p21970m73579k3624J49882J28443K42763M09736L01041K5443
31666d9977M3203L44496L10858l29886r08205o30855L02267R17051O83955J2023
31656F94930m69044n88959m53773j08694K75753K87685k01062o54384m95345O6077
31646a646816L35296J40880m1605M4895R8833o4648j31070J14645L48317K49453
$$ plain form
31716 -358394 -566950 -297529 163284 282735 754 -219512 -146852 -117239 -379679 -558934
31706 -558934 -176891 583885 1073392 965534 467446 -125462 -660663 -958864 -843695 -452207
31696 -452207 -223739 -438504 -923672 -1275276 -1228807 -797696 -226365 137664 77739 -290108
31686 -290108 -605081 -586068 -252141 127760 252403 43410 -231068 -197452 141651 307550
31676 307550 -88112 -810082 -1283661 -1307285 -1157403 -1028960 -786197 -376461 -75420 -49977
31666 -49977 -6774 337722 648580 318694 -589511 -1220366 -918099 -1048 682907 694930
31656 694930 225886 -363073 -816846 -925540 -649787 -362102 -563164 -1217548 -1712893 -1646816
31646 -1646816 -1311520 -1170640 -1212245 -1167350 -1068517 -1133165 -1264235 -1149590 -801273 -551820
31636e51820K5964j7374j4261j79164k96567q9180K17173K39505P7390M5414K7662
31625e15258k60703n61604l34236L33466P48733N57445N1003m38273p77662o92028
31615a889117K7633Q56425Q88333J08134m58802j81849L69928M64280K39817J28679
31605E53461L988l42779m97440p0953M10226K01820l81882l90694K01762M18050
31595A05559j37233o32611l20368L65486N72235K47322m8719j24572k69371n55448
31585g97720o45950l41436J13082L73389L67609K38091J27294J03776J44842J33407
31575a83616j660j23100k5967K23890K98899O5538j82738j46580J8056l0262k10863
31564b98403j13104K72567M01032j8135m90139m06120P0461K71321p082l15182
$$ plain form
31636 -551820 -525856 -543230 -557491 -736655 -1033222 -1122402 -905229 -665724 -588334 -542920 -515258
31625 -515258 -775961 -1337565 -1671801 -1338335 -589602 -32157 18846 -419427 -1197089 -1889117
31615 -1889117 -1861484 -1005059 -116726 -8592 -467394 -649243 -279315 184965 424782 553461
31605 553461 557449 214670 -282770 -353723 56503 258323 -123559 -514253 -312491 105559
31595 105559 -31674 -664285 -984653 -619167 -46932 200390 151671 27099 -242272 -797720
31585 -797720 -1443670 -1785106 -1672024 -1298635 -931026 -692935 -565641 -461865 -317023 -183616
31575 -183616 -185276 -308376 -334343 -110453 188446 253984 71246 -75334 -57278 -87540 -298403
31564 -298403 -411507 -138940 262092 243957 -246182 -652302 -581841 -310520 -317602 -632784
31554f32784k65869N4861L99085O08505N06845J5272n04818m68771J77678P64351
31544F54355O36062j56070r60229j074068k75448Q25216J119173K20412q22123
31535A67280p56821R7254L29983l17998n44307K69004Q70423J54030r29893q41489
31525a502534J25994M80450k1523k83176K5453L5176n09807o74463l1953N16031
31515a840352K68641j76577j02823J60285J00063P0974N03576Q48746L78209m95967
31505b85225p42870k19610K96532L65394K70427K42344J40072m1211m8503J24874
31495A02224J75508L2602l0791O7936M0698k55924n10275l76486M1461L27874
31485c85173K57429J2513q9947k0389q0123m32672p39798n50528K1096M11298
$$ plain form
31554 -632784 -898653 -843792 -444707 163798 670643 685915 181097 -287674 -109996 654355
31544 654355 1290417 1134347 174118 -899950 -1175398 -350182 768991 989403 167280
31535 167280 -589541 -492287 -162304 -480302 -1024609 -755605 114818 268848 -661045 -1502534
31525 -1502534 -1376540 -896090 -917613 -1200789 -1175336 -1140160 -1649967 -2324430 -2356383 -1840352
31515 -1840352 -1571711 -1748288 -1851111 -1690826 -1590763 -1519789 -1016213 -167467 210742 -285225
31505 -285225 -1028095 -1247705 -951173 -585779 -315352 -73008 67064 25853 -22650 102224
31495 102224 277732 310334 279543 347479 388177 132253 -378022 -754508 -713047 -385173
31485 -385173 -127744 -115231 -205178 -225567 -305690 -738362 -1478160 -2028688 -2007592 -1596294
31475a596294M12484L72946M83848M47286J25249o8456J47870L66678J40145k53296
31465E78460k71199K7280J86134J20776N9139k2097k53799l91357j59501R3260
31455c2904j90113p96067r12038k84045M82325Q23264P68613N32418K00784n3036
31445E39201k3589J44617J36004J6807M2723K2365l71813p28502k90095O72226
31435A59944R32561R0180p74276p28939k40505r7012q9058K69904N44843Q1353
31425A48995o42210o01235J27692N10918K36256N0937L35830N03701J44547k47346
31415E68085j81942K3258p8611k49512o2726K74057K36163j76532m88224m59488
31405e95472k67998r3379N6652J57774J47613P9542O4852J08025J64610K40788
$$ plain form
31475 -1596294 -1183810 -810864 -327016 120270 245519 177063 324933 691611 831756 578460
31465 578460 307261 334541 520675 641451 700590 678493 424694 33337 -126164 -32904
31455 -32904 -223017 -1019084 -1931122 -2215167 -1732842 -909578 -140965 391453 592237 539201
31445 539201 515612 660229 796233 813040 855763 878128 506315 -222187 -512282 159944
31435 159944 1092505 1182685 408409 -320530 -561035 -658047 -747105 -477201 67642 148995
31425 148995 -493215 -1094450 -966758 -455840 -219584 -168647 167183 670884 815431 568085
31415 568085 386143 409401 330790 81278 18552 292609 528772 352240 -135984 -595472
31405 -595472 -863470 -956849 -900197 -742423 -594810 -515268 -450416 -342391 -177781 63007
31395F3007K70133Q2042k85037m56655k07162J32089J21201j06026p9111J80997
31385b84522J45118l22820o27296k87656L54720O64257N58052L54199R6857l56915
31375B93994p41058n72897N815K65824j5043j66702K63571O57102K39108o05622
31365c75908p78561o8931N61085L93470j45296l05431n0948J83642K52505K76124
31355e8249K07765m4968k84265k84547k19002l72941n87508m68816n1078K43133
31345a920476K66993K77442L75521L21507K8668k11483j78670j7291J00980K39650
31335g17159M08377L68793J3829l41330l50172j02100Q4251J38499K05587K86219
31325e206K25885j1893l15492n85383o96291m36159K07755P93692Q17130L53358
$$ plain form
31395 63007 333140 415182 130145 -326510 -533672 -401583 -280382 -386408 -465519 -284522
31385 -284522 -139404 -462224 -1089520 -1377176 -1022456 -358199 199853 554052 650909 293994
31375 293994 -447064 -1019961 -1014146 -748322 -763365 -930067 -666496 -9394 229714 -375908
31365 -375908 -1154469 -1223400 -662315 -268845 -414141 -719572 -770520 -586878 -334373 -58249
31355 -58249 149516 104548 -179717 -464264 -683266 -1056207 -1643715 -2112531 -2163609 -1920476
31345 -1920476 -1653483 -1376041 -1000520 -679013 -650345 -861828 -1040498 -1057789 -956809 -717159
31335 -717159 -308782 60011 73840 -267490 -617662 -719762 -635511 -497012 -291425 -5206
31325 -5206 220679 208786 -106706 -692089 -1388380 -1824539 -1616784 -823092 -5962 347396
31315C47396l7764p9538o9229k82185m89335l59752n6865m4591m06503p12997
31305b191363n72256l6857N64935R44679R47279N98329J86983P6706K67942L38248
31295A124625k697m95406p02338n96778m39213k20803K78113Q48884Q26329j3879
31285F06837r38918j049046l50235L61031N19473K65501j9474j69660j43365J06273
31275h11583M61749O15416M14129M8221k35356m00861m61535k91708J51287N71599
31265F1358N84804J91562k11125k89128p4999J78110K72108J62381o3922k32233
31255E78916k08442o7122n7285k99601n64481m93460p2518K65045J43590k39577
31245a014935l18456J10088N94387N93314J47436k08354r8906L13414N53827K98459
$$ plain form
31315 347396 309632 230094 160865 -121320 -610655 -970407 -1027272 -1071863 -1478366 -2191363
31305 -2191363 -2763619 -2800476 -2235541 -1290862 -343583 254746 441729 518435 786377 1124625
31295 1124625 1121928 626522 -75816 -672594 -1111807 -1332610 -1054497 -205613 620716 606837
31285 606837 -332081 -1381127 -1731362 -1370331 -850858 -585357 -604831 -774491 -917856 -811583
31275 -811583 -349834 265582 679711 727932 492576 91715 -369820 -661528 -510241 61358
31265 61358 646162 837724 626599 337471 262472 440582 712690 875071 811149 578916
31255 578916 370474 303352 246067 -53534 -618015 -1111475 -1183993 -918948 -775358 -1014935
31245 -1014935 -1333391 -1223303 -628916 -35602 111834 -96520 -195426 117988 671815 970274
31235I70274l24655p97412p00002k36544m3969l07926m23111Q8667O92010N26136
31225e56532k13592m35999J98677O93323K13011o17670o38832J44800O49069K96552
31215b67193l05050l44488J77704O30513N38727j76m45821l13029K52190M90670
31205D14047o6997q58179r01921q4157P12221Q03764M46274J95473J14973n763
31195G69735j00798J7581K06548J47459j62211m24730m68303l64748k05294m4626
31185f29387j2063j98874m38245m32039j23693K29223L73804L14929K34624K61531
31175d20190L40374L03386J09860j3701J66004M76536M48775l6859m91297m31025
31165D51863k032L08117L54603L34058K50227j23592p18593j058174q33205k77890
$$ plain form
31235 970274 645619 -151793 -851795 -1088339 -1132308 -1440234 -1863345 -1774678 -1082668 -556532
31225 -556532 -770124 -1206123 -1007446 -314123 -101112 -718782 -1357614 -1212814 -563745 -267193
31215 -267193 -572243 -916731 -739027 -108514 430213 430037 -15784 -328813 -76623 414047
31205 414047 347050 -511129 -1413050 -1497207 -784986 18778 465052 660525 775498 769735
31195 769735 668937 686518 893066 1040525 878314 453584 -14719 -379467 -584761 -629387
31185 -629387 -641450 -840324 -1278569 -1710608 -1834301 -1605078 -1231274 -916345 -681721 -420190
31175 -420190 -79816 223570 333430 319729 485733 962269 1411044 1374185 882888 451863
31165 451863 449831 757948 1112551 1446609 1696836 1573244 854651 -203523 -1036728 -1314618
31155a314618J70366L24184K52111J10537R7922L08216N03198L18737j66012m09205
31145A95436j61446J40698N6629j60242k0535L36237L49380p251j50213J48924
31135G27617L70857Q9377l43716l60910k3918J63558L1557j43716j69369j30563
31125B10774r1167J5689J76039K74413K91230K69224J42755j08496k34753l5718
31115I09990J63343j41895p63369q61127q2903Q46090J021093M36589k19345m90194
31105H18272m27147k31306j02385k37282n20651m28995K55641Q61976N91677k66100
31095C13700o17227q9147M90982L46629k49261n72709l99600O8316O33812R58179
31085H83674N54060m47621j017474m58063M82390N78537r2898l71380Q1829K90681
$$ plain form
31155 -1314618 -1144252 -820068 -567957 -457420 -359498 -51282 451916 770653 604641 195436
31145 195436 33990 174688 231317 71075 50540 386777 736157 728906 578693 727617
31135 727617 1098474 1187851 844135 483225 459307 622865 654422 510706 341337 210774
31125 210774 119607 135296 311335 585748 876978 1146202 1288957 1180461 945708 909990
31115 909990 1073333 931438 168069 -693058 -775961 70129 1091222 1527811 1308466 818272
31105 818272 391125 159819 57434 -179848 -700499 -1129494 -873853 -11877 579800 313700
31095 313700 -303527 -392674 98308 444937 195676 -377033 -776633 -708317 -74505 883674
31085 883674 1437734 990113 -27361 -485424 -3034 575503 482605 111225 193054 483735
31075D83735l26260r14708n60673K02039K45987l44652m40551L18736R61273O53497
$$ plain form
31075 483735 157475 -757233 -1317906 -1115867 -869880 -1214532 -1655083 -1336347 -375074 278423
$$ [...]
##END NTUPLES=NMR SPECTRUM
##END=
