##TITLE=31Pdec_LY-TMF-6.40.3
 D2O, 24 sc
 28.2.2020
##JCAMPDX= 6.0         $$ Bruker NMR JCAMP-DX V2.0
##DATA TYPE= NMR SPECTRUM
##DATA CLASS= NTUPLES
##ORIGIN= UXNMR, Bruker Analytische Messtechnik GmbH
##OWNER= root
$$ XWIN-NMR		Version 3.5
$$ Fri Feb 28 13:59:55 2020 Russian Standard Time (UT+4h)  she@DPX200
##.OBSERVE FREQUENCY= 81.013821
##.OBSERVE NUCLEUS= ^31P
##.ACQUISITION MODE= SIMULTANEOUS
##.ACQUISITION SCHEME= undefined
##.AVERAGES= 24
##.DIGITISER RES= 17
##SPECTROMETER/DATA SYSTEM= spect
##.PULSE SEQUENCE= zgpg30
##.SOLVENT NAME= CDCl3
##.SHIFT REFERENCE= (INTERNAL, CDCl3, 0, 182.463)
##AUDIT TRAIL= $$ (NUMBER, WHEN, WHO, WHERE, WHAT)
$$ ##TITLE= Audit trail, XWIN-NMR		Version 3.5
$$ ##JCAMPDX= 5.01
$$ ##ORIGIN= Bruker BioSpin GmbH
$$ ##OWNER= she
$$ F:/spectra/data/she/nmr/P31/1/pdata/1/auditp.txt
$$ ##AUDIT TRAIL=  $$ (NUMBER, WHEN, WHO, WHERE, WHAT)
(   1,<2020-02-28 13:58:57.12 +0400>,<she>,<DPX200>,
      <created by zg, POWCHK disabled, PULCHK disabled
       configuration hash MD5:
       00 E9 B6 7A A2 85 ED C7 34 08 36 98 17 FE 4E 26
       data hash MD5: 32K
       8A 8F B3 67 66 BD C2 2E 7F CD EF BC BF 59 E0 7B>)
(   2,<2020-02-28 13:58:59.56 +0400>,<she>,<DPX200>,
      <Start of raw data processing
       efp BC_mod = 2 LB = 1 FT_mod = 6 PKNL = 1 PHC0 = -1610.501 PHC1 = 663.0013 SI = 64K 
       data hash MD5: 64K
       8A AC 69 38 26 BE F6 86 0B 75 F3 EE 07 1E BB 81>)
(   3,<2020-02-28 13:59:11.25 +0400>,<she>,<DPX200>,
      <pk PHC0 = 2.382543 PHC1 = 0 
       data hash MD5: 64K
       3C 8E 77 0C 7B 55 56 81 EF A7 D6 A0 FD E0 FF 96>)
(   4,<2020-02-28 13:59:18.76 +0400>,<she>,<DPX200>,
      <abs ABSG = 5 
       data hash MD5: 64K
       9F CB B7 B6 68 78 1D 3B 04 47 D5 99 33 14 AC E0>)
$$ ##END=
$$ 
$$ hash MD5
$$ 51 A4 F3 90 F6 C9 B3 D9 54 EB AE C8 99 19 3F AD
##$RELAX= 
##$RELAX= 
##$RELAX= 
##$RELAX= 
##$RELAX= 
##$RELAX= 
##$RELAX= 
##$RELAX= 
$$ Bruker specific parameters
$$ --------------------------
##$DU= <F:/spectra>
##$EXPNO= 1
##$NAME= <P31>
##$PROCNO= 1
##$TYPE= <nmr>
##$USER= <she>
##$AMP= (0..31)
100 100 100 100 100 100 100 100 100 100 100 100 100 100 100 100 100 100 
100 100 100 100 100 100 100 100 100 100 100 100 100 100 
##$AQSEQ= 0
##$AQ_mod= 1
##$AUNM= <au_zg>
##$AUTOPOS= <>
##$BF1= 81.014009
##$BF2= 200.13
##$BF3= 200.13
##$BF4= 200.13
##$BF5= 200.13
##$BF6= 200.13
##$BF7= 200.13
##$BF8= 200.13
##$BYTORDA= 1
##$CFDGTYP= 0
##$CFRGTYP= 5
##$CHEMSTR= <none>
##$CNST= (0..31)
1 1 145 1 1 1 1 1 1 1 1 1 1 1 1 1 1 1 1 1 1 1 1 1 1 1 1 1 1 1 1 1 
##$CPDPRG= <waltz16>
##$CPDPRG1= <>
##$CPDPRG2= <waltz16>
##$CPDPRG3= <>
##$CPDPRG4= <mlev>
##$CPDPRG5= <mlev>
##$CPDPRG6= <mlev>
##$CPDPRG7= <mlev>
##$CPDPRG8= <mlev>
##$CPDPRGB= <>
##$CPDPRGT= <>
##$D= (0..31)
0 1 0 0 0 0 0 0 0 0 0 0.03 2e-05 3e-06 0 0 0 0 0 0 0 0 0 0 0 0 0 0 0 0 
0 0 
##$DATE= 1582883936
##$DBL= (0..7)
120 120 120 11 120 120 24 19 
##$DBP= (0..7)
150 150 150 150 150 150 150 150 
##$DBP07= 0
##$DBPNAM0= <>
##$DBPNAM1= <>
##$DBPNAM2= <>
$$ [...]
##$SUBNAM3= <"">
##$SUBNAM4= <"">
##$SUBNAM5= <"">
##$SUBNAM6= <"">
##$SUBNAM7= <"">
##$SUBNAM8= <"">
##$SUBNAM9= <"">
##$SW= 369.568048894756
##$SWIBOX= (0..15)
0 1 3 0 0 0 0 0 0 0 0 0 0 0 0 0 
##$SW_h= 29940.119760479
##$TD= 32768
##$TD0= 1
##$TE= 0
##$TE2= 300
##$TE3= 300
##$TEG= 300
##$TL= (0..7)
0 120 53 12 22 120 120 120 
##$TP= (0..7)
150 150 150 150 150 150 150 150 
##$TP07= 0
##$TPNAME0= <>
##$TPNAME1= <>
##$TPNAME2= <>
##$TPNAME3= <>
##$TPNAME4= <>
##$TPNAME5= <>
##$TPNAME6= <>
##$TPNAME7= <>
##$TPOAL= (0..7)
0.5 0.5 0.5 0.5 0.5 0.5 0.5 0.5 
##$TPOFFS= (0..7)
0 0 0 0 0 0 0 0 
##$TUNHIN= 0
##$TUNHOUT= 0
##$TUNXOUT= 0
##$USERA1= <user>
##$USERA2= <user>
##$USERA3= <user>
##$USERA4= <user>
##$USERA5= <user>
##$V9= 5
##$VALIST= <valist>
##$VCLIST= <CCCCCCCCCCCCCCC>
##$VD= 0
##$VDLIST= <DDDDDDDDDDDDDDD>
##$VPLIST= <PPPPPPPPPPPPPPP>
##$VTLIST= <TTTTTTTTTTTTTTT>
##$WBST= 1024
##$WBSW= 4
##$XGAIN= (0..3)
0 0 0 0 
##$XL= 0
##$YL= 0
##$YMAX_a= 17552
##$YMIN_a= -18695
##$ZGOPTNS= <>
##$ZL1= 120
##$ZL2= 120
##$ZL3= 120
##$ZL4= 120
##$ABSF1= 182.463
##$ABSF2= -187.1042
##$ABSG= 5
##$ABSL= 3
##$ALPHA= 0
##$AQORDER= 0
##$ASSFAC= 0
##$ASSFACI= 0
##$ASSFACX= 0
##$ASSWID= 0
##$AUNMP= <proc_1d>
##$AZFE= 0.1
##$AZFW= 0.5
##$BCFW= 0
##$BC_mod= 2
##$BYTORDP= 0
##$COROFFS= 0
##$CY= -3
##$DATMOD= 1
##$DC= 0
##$DFILT= <>
##$DTYPP= 0
##$F1P= 0
##$F2P= 0
##$FCOR= 1
##$FTSIZE= 65536
##$FT_mod= 6
##$GAMMA= 0
##$GB= 0
##$INTBC= 1
##$INTSCL= 5.30512e-09
##$ISEN= 30
##$LB= 1
##$LEV0= 0
##$LPBIN= 0
##$MAXI= 10000
##$MC2= 0
##$MEAN= 0
##$ME_mod= 0
##$MI= 50
##$NCOEF= 0
##$NC_proc= -4
##$NLEV= 6
##$NOISF1= 182.463
##$NOISF2= 159.3651
##$NSP= 0
##$NTH_PI= 0
##$NZP= 0
##$OFFSET= 182.463
##$PC= 4
##$PHC0= -1608.118
##$PHC1= 663.0013
##$PH_mod= 1
##$PKNL= yes
##$PPARMOD= 0
##$PSCAL= 0
##$PSIGN= 0
##$REVERSE= no
##$SF= 81.0140089999434
##$SI= 65536
##$SIGF1= 159.3651
##$SIGF2= -187.1042
##$SINO= 113.3802
##$SIOLD= 16384
##$SREGLST= <1H.CDCl3>
##$SSB= 0
##$STSI= 65536
##$STSR= 0
##$SW_p= 29940.119760479
##$SYMM= 0
##$S_DEV= 0
##$TDeff= 32768
##$TDoff= 0
##$TI= <>
##$TILT= no
##$TM1= 0
##$TM2= 0
##$TOPLEV= 0
##$USERP1= <user>
##$USERP2= <user>
##$USERP3= <user>
##$USERP4= <user>
##$USERP5= <user>
##$WDW= 1
##$XDIM= 65536
##$YMAX_p= 514058128
##$YMIN_p= -2266820
$$ End of Bruker specific parameters
$$ ---------------------------------
##NTUPLES= NMR SPECTRUM
##VAR_NAME=  FREQUENCY,     SPECTRUM/REAL,   SPECTRUM/IMAG
##SYMBOL=    X,             R,               I
##VAR_TYPE=  INDEPENDENT,   DEPENDENT,       DEPENDENT
##VAR_FORM=  AFFN,          ASDF,            ASDF
##VAR_DIM=   65536,         65536,           65536
##UNITS=     HZ,            ARBITRARY UNITS, ARBITRARY UNITS
##FACTOR=    0.456856943014862, 1,           1
##FIRST=     14782.0589164792, 0,            0
##LAST=      -15158.0608439998, 0,           0
##MIN=       -15158.0608439998, -2266820,    0
##MAX=       14782.0589164792, 514058128,    0
$$ Real data points
##PAGE= N=1
##DATA TABLE= (X++(R..R)), XYDATA
$$ [...]
$$ plain form
36938 416887 128068 -272242 -406554 -293465 -244610 -284500 -165407 83081 118655 -147985
36928 -147985 -407309 -476307 -549794 -773938 -953503 -891489 -698723 -537250 -330339 18960
36918 18960 337988 385421 209459 68553 80153 146050 161641 120380 47107 -19348 13095
36907 13095 227650 578515 885158 952490 710602 300962 15975 40143 224134 234684
36897 234684 -29527 -303652 -303881 -69244 150096 222565 205906 169092 118881 98639 205827
36886 205827 447753 662236 653518 381084 -33496 -461711 -845794 -1093226 -1011730 -517831
36876 -517831 101207 352397 90441 -254143 -183507 244599 526560 379718 35643 -143170
36866 -143170 -74368 98937 237630 241427 34795 -315168 -575930 -582058 -413055 -250041
$$ packed form
36938D16887k88819m00310j34312J13089M8855l9890J19093K48488L5574k66640
36928a47985k59324o8998p3487k24144j79565O2014J92766J61473K06911L49299
36918A8960L19028M7433j75962j40906J1600O5897J5591m1261p3273o6455L2443
36907A3095K14555L50865L06643O7332k41888m09640k84987K4168J83991J0550
36897B34684k64211k74125k29K34637K19340P2469j6659l6814n0211k0242J07188
36886B05827K41926K14483q718k72434m14580m28215l84083k47432Q1496M93899
36876e17831O19038K51190k61956l44584P0636M28106K81961j46842l44075j78813
36866a43170O8802J73305J38693L797k06632l49963k60762o128J69003J63014
$$ plain form
36856 -250041 -164125 -143579 -201316 -319409 -392425 -367577 -346299 -402697 -407062 -212876 62841
36845 62841 157762 22729 -149786 -234268 -274828 -261601 -64852 304770 587992 573857 340051
36834 340051 60691 -251076 -626826 -925405 -972237 -831670 -703626 -602841 -389893 -96700
36824 -96700 52848 -23125 -173502 -302468 -457888 -552731 -349124 89398 274866 -75066
36814 -75066 -574177 -706627 -575806 -639905 -872897 -783462 -281528 82696 -57757 -349559
36804 -349559 -317336 -73078 -40662 -285002 -533623 -658407 -723282 -683616 -445265 -174127
36794 -174127 -174044 -438747 -639661 -603914 -528359 -639778 -860102 -903609 -574724 61958 687382
36783 687382 925381 698928 382028 422000 798570 1031503 760751 157820 -305891 -375463
$$ packed form
36856b50041Q5916K0546n7737j18093p3016K4848K1278n6398m365J94186K75717
36845F2841R4921j35033j72515q4482m0560J3227J96749L69622K83222j4135k33806
36834C40051k79360l11767l75750k98579m6832J40567J28044J00785K12948K93193
36824i6700J49548p5973j50377j28966j55420r4843K03607M38522J85468l49932
36814g5066m99111j32450J30821o4099k32992Q9435N01934L64224j40453k91802
36804c49559L2223K44258L2416k44340k48621j24784o4875L9666K38351K71138
36794a74127Q3k64703k00914L5747P5555j11419k20324m3507L28885O36682O25424
36783F87382K37999k26453l16900L9972L76570K32933k70752o02931m63711o9572
$$ plain form
36773 -375463 -205135 -90221 -99954 -41159 200741 407861 295180 -29486 -158531 12695
36763 12695 112742 -112892 -381400 -326251 -69018 27300 -59387 -87193 -38657 -96290 -239314
36752 -239314 -293291 -296893 -388306 -418832 -169801 104371 -90660 -685247 -1057191 -953396
36742 -953396 -795419 -859250 -774667 -218602 419924 563464 280520 105943 259681 495489
36732 495489 581093 529811 436099 398371 532579 809921 983098 898886 740180 714915 673269
36721 673269 339064 -197314 -544219 -527078 -363915 -332755 -492619 -730356 -886986 -830783
36711 -830783 -558091 -229913 -21984 22271 -55357 -200401 -303690 -257062 -157519 -262937
36701 -262937 -598654 -810958 -605290 -149269 174306 252250 247641 260872 228782 78717
$$ packed form
36773c75463J70328J14914r733N8795K41900K07120j12681l24666j29045J71226
36763A2695J00047k25634k68508N5149K57233R6318q6687k7806M8536n7633j43024
36752b39314n3977l602r1413l0526K49031K74172j95031n94587l71944J03795
36742i53396J57977o3831Q4583N56065O38526J43540k82944j74577J53738K35808
36732D95489Q5604n1282r3712l7728J34208K77342J73177q4212j58706k5265m1646
36721F73269l34205n36378l46905J7141J63163L1160j59864k37737j56630N6203
36711h30783K72692L28178K07929M4255p7628j45044j03289M6628R9543j05418
36701b62937l35717k12304K05668M56021L23575P7944m609J3231l2090j50065
$$ plain form
36691 78717 -209040 -605638 -957655 -1051507 -906980 -823916 -956942 -1055365 -849462 -473854
36681 -473854 -231816 -144268 -48068 36768 -12093 -104933 -58551 68969 97363 79321 186270
36670 186270 325208 248235 5768 -83482 84826 298686 422053 537930 654268 610825
36660 610825 388353 239671 385659 746925 1031014 961764 469685 -180160 -540816 -465796
36650 -465796 -320308 -483945 -817270 -930771 -791287 -649238 -518705 -231507 66217 22338
36640 22338 -296217 -439724 -326806 -395938 -824075 -1140019 -908374 -339552 114939 384494
36630 384494 632189 804274 720691 417999 71775 -273871 -630612 -866815 -837242 -606821
36620 -606821 -357924 -188246 -132861 -219560 -359258 -359820 -190106 -43724 -13775 69140 320049
$$ packed form
36691G8717k87757l96598l52017r3852J44527Q3064j33026r8423K05903L75608
36681d73854K42038Q7548R6200Q4836m8861r2840M6382J27520K8394j8042J06949
36670A86270J38938p6973k42467q9250J68308K13860J23367J15877J16338m3443
36660F10825k22472j48682J45988L61266K84089o9250m92079o49845l60656P5020
36650d65796J45488j63637l33325j13501J39484J42049J30533K87198K97724m3879
36640B2338l18555j43507J12918o9132m28137l15944K31645N68822M54491K69555
36630C84494K47695J72085q3583l02692l46224l45646l56741k36203K9573K30421
36620f06821K48897J69678N5385q6699j39698n62J69714J46382K9949Q2915K50909
$$ plain form
36609 320049 562002 600007 514005 471162 447168 351413 250274 245270 272614 211566 55129
36598 55129 -170357 -475423 -751570 -763152 -479612 -206389 -187466 -282438 -238684 -64131
36588 -64131 98140 244661 395624 401292 157940 -131908 -207309 -152186 -278398 -666786
36578 -666786 -1047543 -1103110 -755685 -236666 44859 -137426 -510416 -555465 -160233 265448
36568 265448 417845 453698 535655 482463 193396 -18797 61171 109944 -173828 -444377
36558 -444377 -232121 209126 231052 -233999 -683452 -879646 -995841 -1030709 -796904 -472953
36548 -472953 -446333 -580156 -376073 70790 98322 -367226 -550316 -67666 405351 217389
36538 217389 -262980 -376184 -258298 -437521 -807441 -813126 -394695 7002 224955 444103
$$ packed form
36609C20049K41953L8005q6002m2843k3994r5755j01139n004K7344o1048j56437
36598E5129k25486l05066k76147j1582K83540K73223J8923r4972M3754J74553
36588f4131J62271J46521J50963N668k43352k89848p5401N5123j26212l88388
36578f66786l80757n5567L47425N19019K81525j82285l72990m5049L95232M25681
36568B65448J52397L5853Q1957n3192k89067k12193P9968M8773k83772k70549
36558d44377K12256M41247K1926m65051m49453j96194j16195l4868K33805L23951
36548d72953K6620j33823K04083M46863K7532m65548j83090M82650M73017j87962
36538B17389m80369j13204J17886j79223l69920n685M18431M01697K17953K19148
$$ plain form
36528 444103 601529 398794 -74494 -347649 -269143 -159780 -198867 -192377 -65162 -62049 -273606
36517 -273606 -422678 -343094 -265289 -385344 -511316 -406378 -188069 -121338 -250302 -458223
36507 -458223 -662493 -749566 -574259 -250025 -173987 -497960 -837765 -823120 -675710 -829598
36497 -829598 -1171888 -1164421 -671333 -157601 17329 32055 136726 168926 -141051 -646102
36487 -646102 -923750 -832069 -623236 -544909 -594897 -684301 -798332 -901043 -855853 -584800
36477 -584800 -227357 -2736 73093 203373 487402 693401 510289 9695 -340198 -219738
36467 -219738 152353 338391 239841 94147 29373 -40978 -96840 28008 266040 281811
36457 281811 19083 -78689 306487 831104 961383 746478 675631 901570 1087802 1006181
$$ packed form
36528D44103J57426k02735m73288k73155P8506J09363l9087O490J27215L113k11557
36517b73606j49072P9584P7805j20055j25972J04938K18309O6731j28964k07921
36507d58223k04270q7073J75307L24234P6038l23973l39805J4645J47410j53888
36497h29598l42290P467M93088N13732J74930J4726J04671L2200l09977n05051
36487f46102k77648R1681K08833P8327m9988q9404j14031j02711M5190K71053
36477e84800L57443K24621P5829J30280K84029K05999j83112n00594l49893J20460
36467b19738L72091J86038r8550j45694o4774p0351n5862J24848K38032J5771
36457B81811k62728r7772L85176N24617J30279k14905p0847K25939J86232q1621
$$ plain form
36447 1006181 817328 677932 486379 167589 -130218 -292677 -420745 -607301 -777721
36438 -777721 -882016 -1001239 -1130949 -1099193 -843899 -555134 -408658 -358739 -294652 -183074
36428 -183074 18582 324085 521670 340935 -81271 -280141 -158681 -167753 -548993 -869424
36418 -869424 -693761 -295785 -205176 -380371 -394125 -204243 -134360 -214206 -150296 63262
36408 63262 82050 -172743 -351428 -242333 -43506 57148 137139 220848 124181 -172087
36398 -172087 -348887 -186043 96337 136503 -152405 -612404 -1050013 -1274477 -1163051 -831669
36388 -831669 -533663 -300564 57968 508094 674053 348618 -163594 -423301 -342042 -115109
36378 -115109 63557 17308 -387907 -951310 -1122245 -616806 123595 430199 234339 41229
$$ packed form
36447A006181j88853j39396j91553l18790k97807j62459j28068j86556j70420
36438g77721j04295j19223j29710L1756K55294K88765J46476M9919O4087J11578
36428a83074K01656L05503J97585j80735m22206j98870J21460r072l81240l20431
36418h69424J75663L97976R0609j75195j3754J89882O9883p9846O3910K13558
36408F3262J8788k54793j78685J09095J98827J00654P9991Q3709r6667k96268
36398a72087j76800J62844K82380M0166k88908m59999m37609k24464J11426L31382
36388h31669K98006K33099L58532M50126J65959l25435n12212k59707Q1259K26933
36378a15109J78666m6249m05215n63403j70935N05439P40401L06604j95860j93110
$$ plain form
36368 41229 155507 331594 249261 -19108 -196755 -229248 -290575 -444575 -521891 -399962
36358 -399962 -268532 -447645 -938532 -1331826 -1268691 -846848 -414481 -122368 74904 127345
36348 127345 -21879 -108941 238852 883672 1223225 1038871 846960 1101046 1455427 1262021
36338 1262021 517580 -174389 -429157 -378271 -204866 115657 520372 718720 544266 200682
36328 200682 1534 32152 163113 232127 122461 -187513 -550485 -728297 -618420 -331309
36318 -331309 -20925 257778 491071 619196 583371 420073 268456 277402 462561 633820
36308 633820 553595 237037 -7589 48357 241186 235707 -14460 -225828 -185034 9729
36298 9729 135744 97861 -58674 -227415 -255744 -22054 390888 692864 671980 435502
$$ packed form
36368D1229J14278J76087q2333k68369j77647l2493o1327j54000p7316J21929
36358c99962J31430j79113m90887l93294O3135M21843M32367K92113J97272N2441
36348A27345j49224q7062L47793O44820L39553j84354j91911K54086L54381j93406
36338A262021p44441o91969k54768N0886J73405L20523M04715J98348j74454l43584
36328B00682j99148L0618J30961O9014j09666l09974l62972j77812J09877K87111
36318c31309L10384K78703K33293J28125l5825j63298j51617Q946J85159J71259
36308F33820q0225l16558k44626N5946J92829n479k50167k11368M0794J94763
36298I729J26015l7883j56535j68741k8329K33690M12942L01976k0884k36478
$$ plain form
36288 435502 272027 313216 432509 456190 345932 136285 -175844 -555269 -812664 -732326
36278 -732326 -326678 180044 628052 983125 1085779 657789 -208276 -836412 -630476 166093
36268 166093 757492 768389 500638 257288 -28686 -337653 -306099 196542 643839 464353
36258 464353 -163967 -559358 -416638 -40227 198752 246730 233017 277474 446944 669313
36248 669313 723194 520749 312381 367516 549097 486906 104903 -315177 -554054 -654620
36238 -654620 -724620 -804639 -912174 -972701 -757676 -160818 515881 844444 795064 671664
36228 671664 583536 366280 38476 -91950 82955 227946 2116 -515301 -997979 -1247625
36218 -1247625 -1251144 -1077021 -878803 -838782 -955736 -995398 -754206 -293650 128791 291283
$$ packed form
36288D35502j63475M1189J19293K3681j10258k09647l12129l79425k57395Q0338
36278g32326M05648N06722M48008L55073J02654m27990q66065o28136K05936P96569
36268A66093N91399J0897k67751k43350k85974l08967L1554N02641M47297j79486
36258D64353o28320l95391J42720L76411K38979M7978j3713M4457J69470K22369
36248F69313N3881k02445k08368N5135J81581o2191l82003m20080k38877j00566
36238f54620p0000q0019j07535o0527K15025N96858O76699L28563m9380j23400
36228F71664q8128k17256l27804j30426J74905J44991k25830n17417m82678k49646
36218a247625l519J74123J98218M0021j16954l9662K41192M60556M22441J62492
$$ plain form
36208 291283 203775 166140 515071 1147016 1463508 1070099 364901 51285 197616 268541
36198 268541 36970 -119255 70968 344438 415802 405696 472320 478805 352266 346023 582353
36187 582353 729109 525115 258312 290444 449066 366513 109277 -60010 -269611 -767699
36177 -767699 -1231897 -1019099 -108584 794242 1167990 1163225 1092509 975891 800642 769553
36167 769553 996105 1259573 1311741 1192053 1047345 866786 583945 252598 -38944 -259467
36157 -259467 -319369 -56769 510538 1064007 1240189 915399 227490 -496957 -832216 -553306
36147 -553306 52192 419190 350156 162790 104932 -15336 -394642 -778513 -792329 -494664
36137 -494664 -223966 -54646 190289 467652 489364 217582 6480 108742 324759 317697
$$ packed form
36208B91283q7508l7635L48931O31945L16492l93409p05198l13616J46331P0925
36198B68541k31571j56225J90223K73470P1364j0106O6624O485j26539o243K36330
36187E82353J46756k03994k66803L2132J58622q2553k57236j69287k09601m98088
36177g67699m64198K12798R10515R02826L73748m765p0716j16618j75249l1089
36167G69553K26552K63468N2168j19688j44708j80559k82841l31347k91542k20523
36157b59467n9902K62600N67307N53469J76182l24790o87909p24447l35259K78910
36147e53306O05498L66998o9034j87366n7858j20268l79306l83871j3816K97665
36137d94664K70698J69320K44935K77363K1712k71782k11102J02262K16017p062
$$ plain form
36127 317697 71353 -157190 -214821 -196073 -247613 -359492 -369040 -135737 276988 595332
36117 595332 565575 215743 -150732 -245848 -73522 75143 -93402 -547107 -895659 -794676
36107 -794676 -390864 -176467 -321734 -411834 -71923 399652 417980 -1461 -239289 7481
36097 7481 319618 280446 133947 339219 799895 1006757 799846 548135 589702 845990
36087 845990 1021306 914248 514755 27546 -203824 -18811 336965 523736 562777 699517
36077 699517 900831 872734 579114 333060 289889 243904 55006 -117981 -181818 -306368
36067 -306368 -523612 -518435 -125682 309311 411935 306677 289251 281155 68711 -171024
36057 -171024 -114291 104985 94378 -84954 -8912 289509 225933 -418191 -1041290 -1005226
$$ packed form
36127C17697k46344k28543n7631J8748n1540j11879r548K33303M12725L18344
36117E95332k9757l49832l66475r5116J72326J48665j68545m53705l48552J00983
36107g94676M03812K14397j45267r0100L39911M71575J8328m19441k37828K46770
36097G481L12137l9172j46499K05272M60676K06862k06911k51711M1567K56288
36087H45990J75316j07058l99493m87209k31370J85013L55776J86771L9041J36740
36077F99517K01314k8097k93620k46054m3171m5985j88898j72987o3837j24550
36067c06368k17244N177L92753M34993J02624j05258j7426q096k12444k39735
36057a71024N6733K19276j0607j79332P6042K98421o3576o44124o23099L6064
$$ plain form
36047 -1005226 -458107 -18527 55052 -956 35653 107501 95665 41061 90769 318482 612858
36036 612858 748091 628655 425118 347390 355217 286565 184910 205469 249415 77365 -184494
36025 -184494 -100327 366640 656783 394175 -45668 -109217 141569 254333 147547 127571
36015 127571 255207 220893 -91247 -344175 -203261 240443 643310 789483 676807 401148
36005 401148 90571 -143670 -289114 -425603 -610286 -806161 -907466 -798870 -457309 -61396
35995 -61396 95631 -93449 -425591 -666158 -816729 -941648 -877635 -399449 348049 856831
35985 856831 785329 328649 -9720 75259 432641 630884 408912 10885 -22622 488674
35975 488674 1047178 1022845 426047 -122475 -156136 196513 563230 793845 916161 885352
$$ packed form
36047a005226N47119M39580P3579n6008L6609P1848j1836n4604M9708K27713K94376
36036F12858J35233j19436k03537p7728P827o8652j01655K0559M3946j72050k61859
36025a84494Q4167M66967K90143k62608m39843o3549K50786J12764j06786j9976
36015A27571J27636l4314l12140k52928J40914M43704M02867J46173j12676k75659
36005D01148l10577k34241j45444j36489j84683j95875j01305J08596L41561L95913
35995f1396J57027j89080l32142k40567j50571j24919O4013M78186P47498N08782
35985H56831p1502m56680l38369Q4979L57382J98243k21972l98027l3507N11296
35975D88674N58504k4333n96798n48522l3661L52649L66717K30615J22316l0809
$$ plain form
35965 885352 633731 270603 23592 -3155 102887 194384 162136 -40733 -336546 -498977
35955 -498977 -332386 71167 346767 214646 -207550 -529059 -521131 -342449 -294618 -452852
35945 -452852 -649466 -757887 -816473 -851442 -759676 -469195 -88740 216180 393198 438011
35935 438011 285241 -56999 -342165 -277003 107344 457639 516065 374878 249164 165603
35925 165603 25963 -121478 -71390 264444 723077 1085435 1277509 1292196 1056637 568414
35915 568414 84290 -91534 -34753 -139338 -519822 -768883 -532541 -66133 102953 -122101
35905 -122101 -414352 -600286 -795559 -997507 -993763 -753685 -519878 -407096 -266376 -44375
35895 -44375 89839 87805 115377 182368 75336 -204416 -369928 -381426 -569919 -1005944 -1265423
$$ packed form
35965H85352k51621l63128k47011k6747J06042R1497l2248k02869k95813j62431
35955d98977J66591M03553K75600j32121m22196l21509P928J78682M7831j58234
35945d52852j96614j08421n8586l4969R1766K90481L80455L04920J77018M4813
35935D38011j52770l42240k85166O5162L84347L50295N8426j41187j25714q3561
35925A65603j39640j47441N0088L35834M58633L62358J92074J4687k35559m88223
35915E68414m84124j75824N6781j04585l80484k49061K36342M66408J69086k25054
35905a22101k92251j85934j95273k01948L744K40078K33807J12782J40720K22001
35895d4375J34214k034K7572O6991j07032k79752j65512j1498j88493m36025k59479
$$ plain form
35884 -1265423 -1129166 -975700 -1087820 -1129231 -820232 -578692 -822937 -1109864 -766595 -51448
35874 -51448 182600 -193506 -485819 -354874 -210363 -324718 -391411 -210786 -71855 -119870
35864 -119870 6728 507621 927083 774970 246106 -103320 -110675 -57485 -159405 -327832
35854 -327832 -350709 -126495 213245 377497 251264 110595 270143 596297 692981 488779
35844 488779 238523 21385 -257140 -391742 -17207 665448 912921 422555 -244479 -485014
35834 -485014 -388952 -343551 -376327 -274610 -19355 234552 366909 293096 40671 -94989
35824 -94989 123413 341378 -45601 -902301 -1358810 -1018658 -447048 -138635 208283 880440
35814 880440 1379612 1166540 577631 263021 204825 31863 -146064 -11191 223676 141791
$$ packed form
35884a265423J36257J53466j12120m1411L08999K41540k44245k86927L43269P15147
35874e1448K34048l76106k92313J30945J44511j14355o6693J80625J38931m8015
35864a19870J26598N00893M19462j52113n28864l49426p355N3190j01920j68427
35854c27832k2877K24214L39740J64252j26233j40669J59548L26154R6684k04202
35844D88779k50256k17138k78525j34602L74535O82655K47473m90366o67034k40535
35834d85014R6062M5401l2776J01717K55255K53907J32357p3813k52425j35660
35824i4989K18402K17965l86979q56700m56509L40152N71610L08413L46918O72157
35814H80440M99172k13072n88909l14610n8196j72962j77927J34873K34867q1885
$$ plain form
35804 141791 -110753 -135037 -41072 -120149 -85770 479963 1184320 1270318 830827 611626
35794 611626 727287 615171 248591 275479 778819 992708 585995 217828 375614 597043
35784 597043 391952 95471 167288 353035 221948 -38183 -32161 114470 77510 -23120
35774 -23120 89044 275863 280311 259679 458632 672366 610751 486986 631204 797022
35764 797022 524719 815 -142065 207541 546766 608374 632155 717786 564309 63712
35754 63712 -389874 -452948 -273376 -128396 -3522 178089 216087 -139241 -776611 -1298753
35744 -1298753 -1412526 -1079937 -415615 365134 964958 1154882 933497 492165 60239
35735 60239 -199441 -240657 -147812 -45544 37955 154076 270700 234700 -35349 -381907
$$ packed form
35804A41791k52544k4284R3965p9077L4379N65733P04357Q5998m39491k19201
35794F11626J15661j12116l66580K6888N03340K13889m06713l68167J57786K21429
35784E97043k05091k96481P1817J85747j31087k60131O022J46631l6960j00630
35774b3120J12164J86819M448k0632J98953K13734o1615j23765J44218J65818
35764G97022k72303n23904j42880L49606L39225O1608K3781Q5631j53477n00597
35754F3712m53586o3074J79572J44980J24874J81611L7998l55328o37370n22142
35744a298753j13773L32589O64322P80749N99824J89924k21385m41332m31926
35735F0239k59680m1216R2845J02268Q3499J16121J16624l6000k70049l46558
$$ plain form
35725 -381907 -505952 -235182 297618 720834 713854 307916 -124122 -254747 -145287 -105335
35715 -105335 -256394 -401176 -343992 -158577 -42272 -50198 -117645 -245221 -472916 -692922
35705 -692922 -687135 -421673 -153419 -121724 -233182 -204387 37420 281689 367068 376940 409871
35694 409871 351422 68540 -281331 -370008 -115391 219659 368135 320195 204674 100473
35684 100473 64376 183535 447216 658618 629478 428081 304776 377595 502484 472945
35674 472945 254631 -22660 -234322 -340964 -317661 -101618 320266 804210 1112852 1107920
35664 1107920 840790 462828 119670 -69288 -42549 135330 313321 395560 357986 133513
35654 133513 -323632 -784454 -802472 -248495 372171 420371 -114630 -616781 -600155 -205664
$$ packed form
35725c81907j24045K70770N32800M23216o980m05938m32038j30625J09460L9952
35715a05335j51059j44782N7184J85415J16305p926o7447j27576k27695k20006
35705f92922N787K65462K68254L1695j11458K8795K41807K44269Q5379R872L2931
35694D09871n8449k82882l49871q8677K54617L35050J48476m7940j15521j04201
35684A00473l6097J19159K63681K11402k9140k01397j23305P2819J24889k9539
35674D72945k18314k77291k11662j06642K3303K16043M21884M83944L08642m932
35664A107920k67130l77962l43158j88958K6739J77879J77991Q2239l7574k24473
35654A33513m57145m60822j8018N53977O20666M8200n35001n02151J6626L94491
$$ plain form
35644 -205664 113499 165447 131404 222909 383699 369151 99192 -146740 -24393 387305
35634 387305 615754 411690 77785 -19852 7802 -143958 -370758 -292783 94996 378941
35624 378941 362338 311727 478061 764540 991640 1125228 1100897 783489 283722 -14624
35614 -14624 52569 202117 160257 43011 52233 83787 -72409 -349270 -492397 -392361 -130581
35603 -130581 146833 236852 -35634 -548631 -887162 -801186 -481460 -238955 -149077 -173279
35593 -173279 -338536 -563623 -590791 -359722 -177149 -227199 -212057 157312 594136 611614
35583 611614 273068 89072 270854 545454 660384 624351 454042 122292 -186173 -169567
35573 -169567 133417 311703 118867 -231421 -396747 -290337 -70004 31198 -166198 -585352
$$ packed form
35644b05664L19163N1948l4043R1505J60790j4548k69959k45932J22347M11698
35634C87305K28449k04064l33905r7637K7654j51760k26800P7975L87779K83945
35624C78941j6603n0611J66334K86479K27100J33588k4331l17408m99767k98346
35614a4624O7193J49548m1860j17246R222L1554j56196k76861j43127J00036K61780
35603a30581K77414R0019k72486n12997l38531Q5976L19726K42505Q9878k4202
35593a73279j65257k25087k7168K31069J82573n0050J5142L69369M36824J7478
35583F11614l38546j83996J81782K74600J14930l6033j70309l31750l08465J6606
35573a69567L02984J78286j92836l50288j65326J06410K20333J01202j97396m19154
$$ plain form
35563 -585352 -804408 -452349 256524 666554 442661 -68495 -322654 -156774 237261 658425
35553 658425 1010697 1209508 1160601 826169 284739 -235537 -449364 -268587 89688 376165
35543 376165 578099 741565 711037 368419 -922 2700 279518 353047 125140 8944
35533 8944 192483 306901 93718 -95391 132368 533853 605612 371969 279058 439546
35523 439546 508703 318076 157224 292490 565005 654238 503860 311357 252631 360562
35513 360562 561211 704055 634265 347840 44208 -51876 79256 228595 171197 -90283
35503 -90283 -307084 -262616 -61633 -19321 -212658 -314839 -39198 396784 518500 261020
35493 261020 78019 305917 711885 864442 722150 574399 530348 409500 156971 43239
$$ packed form
35563e85352k19056L52059P08873M10030k23893n11156k54159J65880L94035M21164
35553F58425L52272J98811m8907l34432n41430n20276k13827J80777L58275K86477
35543C76165K01934J63466l0528l42618l69341L622K76818P3529k27907j16196
35533H944J83539J14418k13183j89109K27759M01485P1759k33643r2911J60488
35523D39546O9157j90627j60852J35266K72515Q9233j50378j92503n8726J07931
35513C60562K00649J42844o9790k86425l03632r6084J31132J49339n7398k61480
35503i0283k16801M4468K00983M2312j93337j02181K75641M35982J21716k57480
35493B61020j83001K27898M05968J52557j42292j47751m4051j20848k52529j13732
$$ plain form
35483 43239 283353 656975 721578 331715 -226519 -599462 -717779 -749597 -798107 -732822
35473 -732822 -351742 302041 865275 984725 680934 265439 -49677 -261248 -331221 -159291
35463 -159291 99481 46693 -385507 -689631 -453000 -841 60184 -269392 -457283 -272322
35453 -272322 22416 257720 519065 672997 398970 -130133 -262133 157404 473044 264015
35443 264015 46200 404681 1026948 1272667 1216008 1338139 1524760 1217151 406839 -316760
35433 -316760 -658574 -829730 -909147 -744789 -514259 -616662 -905134 -793530 -289022 -117644
35423 -117644 -548982 -909146 -682133 -312880 -334675 -406814 10502 549466 397338 -393853
35413 -393853 -932701 -779200 -424672 -379756 -493635 -447667 -353928 -466365 -658153 -595966
$$ packed form
35483D3239K40114L73622O4603l89863n58234l72943j18317l1818m8510O5285
35473g32822L81080O53783N63234J19450l03791m15495l15116k11571o9973J71930
35463a59291K58772n2788m32200l04124K36631M52159O1025l29576j87891J84961
35453b72322K94738K35304K61345J53932k74027n29103j32000M19537L15640k09029
35443B64015k17815L58481O22267K45719n6659J22131J86621l07609q10312p23599
35433c16760l41814j71156p9417J64358K30530j02403k88472J11604N04508J71378
35423a17644m31338l60164K27013L69253k1795p2139M17316N38964j52128p91191
35413c93853n38848J53501L54528M4916j13879M5968R3739j12437j91788O2187
$$ plain form
35403 -595966 -255293 78566 233260 274387 232249 -1346 -405054 -680847 -567027 -189867
35393 -189867 103351 210422 324068 495761 461083 75514 -343950 -405757 -210629 -209824
35383 -209824 -575490 -1019288 -1201182 -1033675 -616115 -164118 18454 -195660 -523514 -589025
35373 -589025 -428758 -356996 -410706 -365318 -265984 -409930 -725775 -738910 -352398 -115240
35363 -115240 -412893 -882236 -1002531 -839465 -773961 -839486 -789791 -581386 -356540 -122637
35353 -122637 167944 359199 245940 -127350 -559456 -897956 -943094 -451024 443093 1089216
35343 1089216 1000219 452644 50563 -66710 -167768 -311719 -287313 -66699 125556 153768
35333 153768 39682 -203072 -469476 -460931 -61553 353616 394569 252198 356638 637894
$$ packed form
35403e95966L40673L33859J54694M1127m2138k33595m03708k75793J13820L77160
35393a89867K93218J07071J13646J71693l4678l85569m19464o1807J95128Q05
35383b09824l65666m43798j81894J67507M17560M51997J82572k14114l27854o5511
35373e89025J60267P1762n3710M5388R9334j43946l15845j3135L86512K37158
35363a15240k97653m69343j20295J63066O5504o5525M9695K08405K24846K33903
35353a22637K90581J91255j13259l73290m32106l38500m5138M92070Q94117O46123
35343A089216q8997n47575m02081j17273j01058j43951K4406K20614J92255K8212
35333A53768j14086k42754k66404Q545L99378M15169M0953j42371J04440K81256
$$ plain form
35323 637894 686483 513057 513834 711566 682330 309893 -7350 -33719 15339 32803 257621
35312 257621 684623 818478 404411 -63279 5102 486639 814184 772518 603698 513419
35302 513419 477387 441238 386827 259254 72689 9635 198057 476635 587228 521633
35292 521633 486628 593687 755810 832117 723724 386159 -110209 -570106 -828526 -877635
35282 -877635 -783872 -572696 -278625 -18899 84003 13090 -145225 -248112 -148806 163442
35272 163442 454599 435890 120958 -153633 -131674 82868 227567 220941 187251 231915 299614
35261 299614 241012 3172 -228987 -156746 267756 687216 704549 331118 -98762 -359356
35251 -359356 -448074 -368749 -116062 144363 195106 88351 62960 139802 113495 -51476 -172694
$$ packed form
35323F37894M8589j73426P77J97732k9236l72437l17243k6369M9058J7464K24818
35312B57621M27002J33855m14067m67690O8381M81537L27545m1666j68820r0279
35302E13419l6032l6149n4411j27573j86565o3054J88422K78578J10593o5595
35292E21633l5005J07059J62123P6307j08393l37565m96368m59897k58420m9109
35282h77635R3763K11176K94071K59726J02902p0913j58315j02887R9306L12248
35272A63442K91157j8709l14932k74591K1959K14542J44699o626l3690M4664O7699
35261B99614n8602k37840k32159P2241M24502M19460J7333l73431m29880k60594
35251c59356q8718P9325K52687K60425N0743j06755k5391P6842k6307j64971j21218
$$ plain form
35240 -172694 -220195 -339952 -451983 -263166 196724 490445 390338 153446 16616 -100071
35230 -100071 -173009 84490 613193 786700 280395 -309173 -266811 228555 512559 502179
35220 502179 634426 968905 1127003 1061983 1149304 1453098 1566095 1291402 888399 530065
35210 530065 108009 -293398 -349368 -117457 -93258 -391938 -500391 -180709 22901 -332892
35200 -332892 -770500 -574865 117115 563080 463327 130301 -155382 -300442 -89991 549570
35190 549570 1031787 607512 -516978 -1259799 -1053310 -482350 -258722 -251683 -13715 319911
35180 319911 314393 62583 49564 337321 483791 244219 -148157 -402991 -432259 -197297
35170 -197297 250533 555515 357574 -108877 -179839 342148 914930 1051085 896567 753264
$$ packed form
35240a72694m7501j19757j12031J88817M59890K93721j00107k36892j36830j16687
35230a00071p2938K57499N28703J73507n06305n89568M2362M95366K84004j0380
35220E02179J32247L34479J58098o5020Q7321L03794J12997k74693m03003l58334
35210E30065m22056m01407n5970K31911K4199k98680j08453L19682K03610l55793
35200c32892m37608J95635O91980M45965r9753l33026k85683j45060K10451O39561
35190E49570M82217m24275j124490p42821K06489N70960K23628P039K37968L33626
35180C19911n518k51810j3019K87757J46470k39572l92376k54834k9268K34962
35170a97297M47830L04982j97941m66451p0962N21987N72782J36155j54518j43303
$$ plain form
35160 753264 532226 113057 -165006 70030 538002 611454 209173 -135443 -80860 149208
35150 149208 269171 341081 505490 669868 688734 609046 551427 535112 554664 641913 729579
35139 729579 645999 380180 174563 213438 381526 476777 504403 583034 679058 634946 423750
35128 423750 222072 223722 456939 767556 931247 813646 463168 38233 -331767 -562338
35118 -562338 -563683 -323073 -15495 143579 174064 280918 496240 585406 401728 124065
35108 124065 -11544 -39444 -124400 -225581 -151190 83351 197883 23625 -235409 -249391
35098 -249391 11734 244681 198656 -46323 -250121 -328474 -347462 -288931 -55578 271350
35088 271350 420739 276758 30858 -118537 -195797 -247237 -180251 -9909 12884 -194915
$$ packed form
35160G53264k21038m19169k78063K35036M67972P3452m02281l44616N4583K30068
35150A49208J19963P1910J64409J64378J8866p9688n7619j6315J9552Q7249Q7666
35139G29579q3580k65819k05617L8875J68088R5251K7626P8631R6024m4112k11196
35128D23750k01678J650K33217L10617J63691j17601l50478m24935l70000k30571
35118e62338j345K40610L07578J59074L0485J06854K15322Q9166j83678k77663
35108A24065j35609k7900q4956j01181P4391K34541J14532j74258k59034j3982
35098b49391K61125K32947m6025k44979k03798p8353j8988N8531K33353L26928
35088B71350J49389j43981k45900j49395p7260n1440O6986J70342K2793k07799
$$ plain form
35078 -194915 -285293 19049 403542 379355 22130 -205268 -204105 -227739 -211073 200374 880933
35067 880933 1171220 806377 282626 36459 -126550 -423562 -512732 -41978 648610 920732
35057 920732 663470 265530 5130 -104175 -79182 8917 -38069 -237613 -262509 72102
35047 72102 423729 411618 207291 186951 265825 100600 -261640 -501269 -634242 -908005
35037 -908005 -1183561 -1046812 -545531 -218673 -311869 -513312 -571105 -614631 -687598 -502725
35027 -502725 57889 630429 852574 806488 705555 484314 41740 -361325 -329015 132733
35017 132733 585087 646869 354011 44413 -20923 87788 116082 49420 224389 827400
35007 827400 1463805 1580775 1225333 934502 866650 577930 -148482 -772326 -686349 -85092
$$ packed form
35078a94915r0378L04342L84493k4187l57225k27398J163k3634J6666M11447O80559
35067H80933K90287l64843n23751k46167j63009k97012q9170M70754O90588K72122
35057I20732k57262l97940k60400j09305K4993Q8099m6986j99544k4896L34611
35047G2102L51627j2111k04327k0340P8874j65225l62240k39629j32973k73763
35037i08005k75556J36749N01281L26858r3196k01443n7793m3526p2967J84873
35027e02725N60614N72540K22145m6086j00933k21241m42574m03065L2310M61748
35017A32733M52354O1782k92858l09598o5336J08711K8294o6662J74969O03011
35007H27400O36405J16970l55442k90831o7852k88720p26412o23844Q5977O01257
$$ plain form
34997 -85092 309706 202997 -35471 -24854 141463 143535 -109873 -405909 -475204 -231838
34987 -231838 164101 439415 433184 203318 -73952 -252591 -271619 -166901 -64448 -67067
34977 -67067 -110594 -30595 197352 400738 429424 295036 45359 -318122 -677495 -726981
34967 -726981 -280861 405562 823424 737068 381278 109442 -2738 -110622 -277250 -377384
34957 -377384 -331932 -263907 -305613 -365488 -263495 -52078 4890 -201687 -476883 -594248
34947 -594248 -519772 -289963 98918 534354 740501 589761 294444 101927 -14100 -149049
34937 -149049 -178701 22417 251845 224634 37870 27661 238410 417969 503499 690795
34927 690795 973600 1030244 712207 305682 133155 162706 170328 48751 -197115 -531788
$$ packed form
34997h5092L94798j06709k38468J0617J66317K072k53408k96036o9295K43366
34987b31838L95939K75314o231k29866k77270j78639j9028J04718J02453k619
34977f7067m3527P9999K27947K03386K8686j34388k49677l63481l59373m9486
34967g26981M46120O86423M17862q6356l55790k71836j12180j07884j66628j00134
34957c77384M5452O8025m1706n9875J01993K11417N6968k06577k75196j17365
34947e94248P4476K29809L88881M35436K06147j50740k95317j92517j16027j34949
34937a49049k9652K01118K29428k7211j86764j0209K10749J79559Q5530J87296
34927F90795K82805N6644l18037m06525j72527K9551P622j21577k45866l34673
$$ plain form
34917 -531788 -797972 -748808 -364364 7487 8467 -309927 -546006 -364955 213213 855626
34907 855626 1172464 1000295 510534 50238 -107664 107987 526084 755706 465196 -185721
34897 -185721 -589331 -391273 49330 174089 -27857 -171954 -183667 -343374 -679753 -837875
34887 -837875 -626896 -267571 -13245 81981 -28226 -362212 -615857 -360278 307280 744008
34877 744008 577088 138007 -90565 -38105 147640 413958 637138 531974 54135 -401542
34867 -401542 -476137 -241689 84621 464298 823306 898240 627645 363675 354826 346174 68521
34856 68521 -195153 16422 626312 1118332 1197013 956143 552089 133793 -13288 298277
34846 298277 780354 905998 585125 312685 555471 1194719 1678298 1629399 1222831 932886
$$ packed form
34917e31788k66184M9164L84444L71851R80l18394k36079J81051N78168O42413
34907H55626L16838j72169m89761m60296j57902K15651M18097K29622k90510o50917
34897a85721m03610J98058M40603J24759k01946j44097j1713j59707l36379j58122
34887h37875K10979L59325K54326R5226j10207l33986k53645K55579O67558M36728
34877G44008j66920m39081k28572N2460J85745K66318K23180j05164m77839m55677
34867d01542p4595K34448L26310L79677L59008P4934k70595k63970q849q652k77653
34856F8521k63674K11575O09890M92020P8681k40870m04054m18296j47081L11565
34846B98277M82077J25644l20873k72440K42786O39248M83579m8899m06568k89945
$$ plain form
34836 932886 928295 888367 568307 291093 464280 780900 532952 -248072 -684933 -331057
34826 -331057 167311 111790 -223376 -214119 33450 -19890 -347392 -445289 -219141 -39152
34816 -39152 -8868 125892 356110 339228 -385 -354867 -568736 -778631 -965633 -876688
34806 -876688 -501354 -185670 -147319 -239804 -285086 -311664 -395499 -538765 -711218 -775760 -492473
34795 -492473 99167 496977 352945 68691 236061 649127 549106 -167248 -706761 -498956
34785 -498956 97404 455002 469920 381793 293360 228050 293381 452581 429799 130232 -112209
34774 -112209 25890 400632 625871 560898 356260 164174 -12659 -260064 -608661 -884071
34764 -884071 -784664 -282869 202154 322165 314220 594096 1025077 1158772 1082032 1295314
$$ packed form
34836I32886m591l9928l20060k77214J73187L16620k47948p81024m36861L53876
34826c31057M98368n5521l35166R257K47569n3340l27502r7897K26148J79989
34816c9152L0284J34760K30218j6882l39613l54482k13869k09895j87002Q8945
34806h76688L75334L15684L8351r2485m5282k6578q3835j43266j72453o4542K83287
34795d92473N91640L97810j44032k84254J67370M13066j00021p16354n39513K07805
34785d98956N96360L57598J4918q8127q8433o5310O5331J59200k2782k99567k42441
34774a12209J38099L74742K25239o4973k04638j92086j76833k47405l48597k75410
34764h84071R9407N01795M85023J20011p945K79876M30981J33695p6740K13282
$$ plain form
34754 1295314 1707678 1575649 707112 -70572 -94265 193697 77483 -268520 -188263 300106
34744 300106 562166 377743 180045 301763 608965 911799 1179000 1267372 956386 408207
34734 408207 161541 464713 942192 1113277 957667 757338 620522 441442 224823 176115
34724 176115 411655 722532 743923 362625 -113863 -257674 40185 514236 873341 1045126
34714 1045126 1042009 792209 274281 -288200 -566743 -471966 -241449 -167026 -308499 -490567
34704 -490567 -522597 -380190 -176654 1967 171797 355688 499961 541485 481893 334754
34694 334754 96142 -150971 -225052 -62393 170931 321398 468763 733380 1009528 1116316
34684 1116316 1092413 1089187 1072825 903253 631195 446212 396006 410961 510114 708336 838576
$$ packed form
34754A295314M12364j32029q68537p77684k3693K87962j16214l46003Q0257M88369
34744C00106K62060j84423j97698J21718L07202L02834K67201Q8372l10986n48179
34734D08207k46666L03172M77479J71085j55610k00329j36816j79080k16619m8708
34724A76115K35540L10877K1391l81298m76488j43811K97859M74051L59105J71785
34714A045126l117k49800n17928n62481k78543R4777K30517P4423j41473j82068
34704d90567l2030J42407K03536J78621J69830J83891J44273M1524n9592j47139
34694C34754k38612k47113p4081J62659K33324J50467J47365K64617K76148J06788
34684A116316k3903l226j6362j69572k72058j84983n0206J4955R9153J98222J30240
$$ plain form
34673 838576 770593 664321 664956 533729 25392 -537682 -612455 -257104 -20019 -63917 -51344
34662 -51344 86926 -5047 -359153 -498009 -236545 15088 29927 144921 501521 617458
34652 617458 213584 -171565 19412 488790 627827 470082 452012 605304 648400 586563
34642 586563 593413 546671 271426 -1771 6057 80470 -70424 -152835 268575 903590 1073131
34631 1073131 770203 611550 796517 900016 721955 558343 517400 325965 3878 -849
34621 -849 382065 588147 304442 -13981 87620 350402 332125 165760 239328 464468
34611 464468 436466 138666 -30085 127668 370121 387409 111035 -328370 -703482 -776199
34601 -776199 -504128 -152080 -21986 -91868 -75940 183542 530432 690357 536249 164115
$$ packed form
34673H38576o7983j06272O35j31227n08337n63074p4773L55351K37085m3898J2573
34662e1344J38270r1973l54106j38856K61464K51633J4839J14994L56600J15937
34652F17458m03874l85149J90977M69378J39037j57745j8070J53292M3096o1837
34642E86563O850m6742k75245k73197P828P4413j50894q2411M21410O35015J69541
34631A073131l02928j58653J84967J03499j78061j63612m0943j91435l22087m727
34621h49L82914K06082k83705l18423J01601K62782j8277j66365P3568K25140
34611D64468k8002k97800j68751J57753K42453J7288k76374m39405l75112p2717
34601g76199K72071L52048J30094o9882J5928K59482L46890J59925j54108l72134
$$ plain form
34591 164115 -205234 -393526 -380583 -257902 -94197 78836 175290 98408 -90727 -202918
34581 -202918 -193235 -246259 -461738 -590806 -285765 419806 1066809 1254946 1041646 776670
34571 776670 643674 523350 300050 103732 106097 205017 147439 -43815 -19630 414014
34561 414014 960065 1134396 788895 201571 -244056 -344123 -158260 39861 -22471 -328162
34551 -328162 -578694 -571743 -421403 -299232 -173708 -2813 34882 -199726 -464053 -394839
34541 -394839 -42643 201143 200257 239171 518384 812745 801357 511108 243099 184117 244191
34530 244191 222036 43964 -131840 -41982 383305 869277 1051088 860305 537731 300404
34520 300404 176150 165539 334171 638717 847945 809073 693519 795756 1111381 1288228
$$ packed form
34591A64115l69349j88292J2943J22681J63705J73033R6454p6882j89135j12191
34581b02918R683n3024k15479j29068L05041P05571O47003J88137k13300k64976
34571G76670j32996j20324k23300j96318K365R8920n7578j91254K4185M33644
34561D14014N46051J74331l45501n87324m45627j00067J85863J98121o2332l05691
34551c28162k50532O951J50340J22171J25524J70895L7695k34608k64327O9214
34541c94839L52196K43786q86L8914K79213K94361j1388k90249k68009n8982O0074
34530B44191k2155j78072j75804Q9858M25287M85972J81811j90783l22574k37327
34520C00404j24254j0611J68632L04546K09228l8872j15554J02237L15625J76847
$$ plain form
34510 1288228 1056431 585773 300379 384596 599489 601604 321495 -29348 -216058 -160017
34500 -160017 39310 166638 77269 -85612 -9008 324706 501904 245677 -91376 35772
34490 35772 570087 925978 814166 541546 455456 542597 678132 835437 904236 708860
34480 708860 362458 209097 277740 226883 -25636 -125850 48319 90932 -233344 -518180
34470 -518180 -360001 -12677 67311 -62466 -47184 166463 408925 653470 860716 777470
34460 777470 346896 7689 120536 401908 389691 149035 36602 101082 215087 431179
34450 431179 663256 424397 -470517 -1317674 -1352474 -829955 -529531 -528492 -347557 -47781
34440 -47781 -165935 -618288 -669846 -112652 406920 415669 188231 111314 192558 387013 740740
$$ packed form
34510A288228k31797m70658k85394Q4217K14893K115k80109l50843j86710N6041
34500a60017J99327J27328q9369j62881P6604L33714J77198k56227l37053J27148
34490C5772N34315L55891j11812k72620q6090Q7141J35535J57305O8799j95376
34480G08860l46402j53361O8643n0857k52519j00214J74169M2613l24276k84836
34470e18180J58179L47324P9988j29777J5282K13647K42462K44545K07246q3246
34460G77470m30574l39207J12847K81372j2217k40656j12433O4480J14005K16092
34450D31179K32077k38859q94914q47157l4800N22519L00424J039J80935K99776
34440d7781j18154m52353n1558N57194N19572Q749k27438p6917Q1244J94455L53727
$$ plain form
34429 740740 1031693 893390 438920 162616 150554 39879 -199200 -188754 64716 104893
34419 104893 -93528 -5778 454098 665528 343408 38627 199760 484875 449254 225219
34409 225219 56333 -188803 -548811 -625416 -218377 237012 360908 449757 914509 1558452
34399 1558452 1891504 1768484 1324786 699599 168146 71836 268950 168892 -339240 -578982
34389 -578982 -117075 524832 703663 599037 717379 980191 975566 711039 476716 296816
34379 296816 94805 59385 272423 308194 -212846 -963211 -1342349 -1270754 -1040452 -735623
34369 -735623 -377289 -286971 -655653 -1032385 -889522 -445686 -269641 -308818 -44509 530208
34359 530208 847846 678291 410397 336997 278530 89041 16840 305751 769762 992792
$$ packed form
34429G40740K90953j38303m54470k76304j2062j10675k39079J0446K53470M0177
34419A04893j98421Q7750M59876K11430l22120l04781J61133K85115l5621k24035
34409B25219j68886k45136l60008p6605M07039M55389J23896Q8849M64752O43943
34399A558452L33052j23020m43698o25187n31453r6310J97114j00058n08132k39742
34389e78982M61907O41907J78831j04626J18342K62812m625k64527k34323j79900
34379B96816k02011l5420K13038L5771n21040p50365l79138P1595K30302L04829
34369g35623L58334R0318l68682l76732J42863M43836J76045l9177K64309N74717
34359E30208L17638j69555k67894p3400n8467j89489p2201K88911M64011K23030
$$ plain form
34349 992792 789751 363139 92910 174576 418745 499407 397686 364357 428160 323139
34339 323139 17953 -138570 -19752 11120 -256121 -455391 -268852 -16801 -138816 -475821
34329 -475821 -585074 -439007 -292599 -154420 83110 250433 165585 64977 256457 540575
34319 540575 469549 9393 -501935 -859106 -1015751 -831105 -264967 344367 625590 638207
34309 638207 640219 632785 504152 355702 305724 252027 170576 274638 510566 381719 -241983
34298 -241983 -666518 -345371 196437 156016 -271437 -283188 166476 336588 -62427 -482125
34288 -482125 -442723 -93008 227823 376039 275246 -68059 -363289 -287200 68361 360653
34278 360653 476380 468595 244983 -211316 -538067 -413876 -66605 116506 205530 427668
$$ packed form
34349I92792k03041m26612k70229Q1666K44169Q0662j01721l3329O3803j05021
34339C23139l05186j56523J18818L0872k67241j99270J86539K52051j22015l37005
34329d75821j09253J46067J46408J38179K37530J67323q4848j00608J91480K84118
34319E40575p1026m60156n11328l57171j56645J84646N66138O09334K81223J2617
34309F38207K012p434j28633j48450m9978n3697q1451J04062K35928j28847o23702
34298b41983m24535L21147N41808m0421m27453j1751M49664J70112l99015m19698
34288d82125L9402L49715L20831J48216j00793l43305k95230P6089L55561K92292
34278C60653J15727p785k23612m56299l26751J24191L47271J83111Q9024K22138
$$ plain form
34268 427668 572665 319523 -114825 -291847 -270538 -380011 -535238 -439960 -222116 -194352
34258 -194352 -224829 -18752 234078 178577 -23856 -38552 -55328 -372686 -625355 -284677
34248 -284677 363434 626617 512151 508007 551812 230088 -225805 -210243 145882 207401
34238 207401 55453 364183 1107921 1506188 1282213 919502 663154 334973 124294 429742
34228 429742 895986 770705 248243 234951 732516 789482 201058 -159584 28147 37402
34218 37402 -356967 -324783 422779 927129 645274 462476 1113912 1822720 1585051 781831
34208 781831 377214 355038 110635 -249764 -148262 342791 625606 554433 460316 428173
34198 428173 261219 -10396 -163904 -179019 -185585 -205539 -225787 -261117 -169740 212981 632328
$$ packed form
34268D27668J44997k53142m34348j77022K1309j09473j55227R5278K17844K7764
34258a94352l0477K06077K52830n5501k02433j4696j6776l17358k52669L40678
34248b84677O48111K63183j14466m144M3805l21724m55893J5562L56125O1519
34238B07401j51948L08730P43738L98267k23975l62711k56348l28181k10679L05448
34228D29742M66244j25281n22462j3292M97565N6966n88424l60642J87731R255
34218C7402l94369L2184P47562N04350k81855j82798O51436P08808k37669q03220
34208G81831m04617k2176k44403l60399J01502M91053K82815p1173r4117l2143
34198D28173j66954k71615j53508j5115o566j9954k0248l5330R1377L82721M19347
$$ plain form
34187 632328 604013 174501 -84540 24849 85566 -120115 -271126 -190587 -137925 -191787
34177 -191787 -79374 163891 138838 -110955 -67965 279470 329003 -28508 -160307 164518
34167 164518 395323 297533 370826 774763 930410 659464 606750 995920 1098383 554188
34157 554188 94282 269457 573476 552813 658380 1188005 1498220 1161434 847401 1122002
34147 1122002 1400063 1069287 649987 801180 1123440 1010417 775156 849770 777715 151683
34137 151683 -314045 135716 921630 1056365 729946 742815 1032180 1036974 952139 1332438
34127 1332438 1892834 1914662 1482820 1224015 1176867 937784 553165 326029 157666 -45713
34117 -45713 154419 944844 1544494 1236677 525896 290727 409951 261249 -45558 -40909
$$ packed form
34187F32328k8315m29512k59041J09389O0717k05681j51011Q0539N2662n3862
34177a91787J12413K43265k5053k49793M2990L47435M9533l57511j31799L24825
34167A64518K30805r7790P3293M03937J55647k70946n2714L89170J02463n44195
34157E54188m59906J75175L04019k0663J05567N29625L10215l36786l14033K74601
34147A122002K78061l30776m19300J51193L22260j13023k35261P4614p2055o26032
34137A51683m65728M49761P85914J34735l26419J2869K89365M794q4835L80299
34127A332438N60396K1828m31842k58805m7148k39083l84619k27136j68363k03379
34117d5713K00132P90425N99650l07817p10781k35169J19224j48702l06807M649
$$ plain form
34107 -40909 63358 -185947 -500543 -358923 -8102 30724 -69654 80932 227490 12976
34097 12976 -256429 -276830 -405377 -746190 -526465 553359 1380307 1078560 548632 952599
34087 952599 1699569 1545750 771585 511954 692782 457779 31615 312886 1063110 1273334
34077 1273334 970876 987953 1301430 1238646 952196 1067483 1267905 861358 321324 591101
34067 591101 1287626 1307388 788258 721239 1050064 968933 683055 985287 1468495 1112858
34057 1112858 323119 378800 1122873 1239372 634138 463237 895376 916180 352346 97975
34047 97975 320151 361144 358627 1007305 1812630 1610731 746263 673011 1467553 1842810
34037 1842810 1535526 1477094 1653746 1105656 97767 -38627 658121 814050 286155
$$ packed form
34107d0909J04267k49305l14596J41620L50821L8826j00378J50586J46558k14514
34097A2976k69405k0401j28547l40813K19725J079824Q26948l01747n29928M03967
34087I52599P46970j53819p74165k59631J80828k35003m26164K81271P50224K10224
34077A273334l02458J7077L13477o2784k86450J15287K00422m06547n40034K69777
34067E91101O96525J9762n19130o7019L28825q1131k85878L02232M83208l55637
34057A112858p89739N5681P44073J16499o05234j70901M32139K0804n63834k54371
34047I7975K22176M0993k517O48678Q05325k01899q64468p3252P94542L75257
34037A842810l07284n8432J76652n48090j007889j36394O96748J55929n27895
$$ plain form
34028 286155 319759 1018895 1130670 575728 681169 1570828 1843041 1242672 1132098 1841212
34018 1841212 2065597 1424356 1126383 1537082 1542033 882997 682307 1124133 1069223 431495
34008 431495 410594 958438 672749 -382300 -538882 362701 632797 -44287 -118392 566721
33998 566721 287019 -1066414 -1358519 -5497 922485 415361 27613 609404 893504
33989 893504 462771 718875 1736771 1642600 315551 100357 1582330 2396885 1575732
33980 1575732 1176087 2125809 2491639 1511853 1241413 2436928 2959452 2035319 1814116
33971 1814116 2932310 3080480 1803015 1846637 3765463 4397018 2875929 2579838 4630767
33962 4630767 5415461 3421311 2283929 3797368 4455291 2592371 2068469 4724236 6366727
$$ packed form
34028B86155L3604O99136J11775n54942J05441Q89659K72213o00369j10574P09114
34018A841212K24385o41241k97973M10699M951o59036k00690M41826n4910o37728
34008D31495k0901N47844k85689j055049j56582R01583K70096o77084p4105O85113
33998E66721k79702j353433k92105J353022R27982n07124l87748N81791K84100
33989H93504m30733K56104J017896r4171j327049k15194J481973Q14555q21153
33980A575732l99645R49722L65830r79786k70440J195515N22524r24133k21203
33971A814116J118194J48170j277465M3622J918826O31555j521089k96091K050929
33962D630767P84694j994150j137382J513439O57923j862920n23902K655767J642491
$$ plain form
33953 6366727 4821488 4388931 7257158 8627907 6098113 5187547 9032674 11896402
33945 11896402 10316615 10588175 16592575 21259075 20269389 22173811 32844335 43358282
33937 43358282 48044338 59088515 84316714 109322678 130389940 186262179 310848185
33930 310848185 456146122 514058128 435472353 289402960 179257638 134224522 114065067
33923 114065067 89179707 68866928 61917264 55798409 42254591 31493839 30557488
33916 30557488 30474908 24067054 17855813 17618236 17778994 13452544 9681190 10792490 12014109
33907 12014109 9066362 6080757 7053667 8336968 6191045 3829007 4703790 5949732
33899 5949732 4429113 2824853 4069121 5574352 4370625 2654210 3171187 4004419
$$ packed form
33953F366727j545239m32557K868227J370749k529794r10566L845127K863728
33945A1896402j579787K71560O004400M666500r89686J904422J0670524J0513947
33937D3358282M686056J1044177K5228199K5005964K1067262N5872239J24586006
33930C10848185J45297937N7912006p8585775j46069393j10145322m5033116k0159455
33923A14065067k4885360k0312779o949664o118855j3543818j0760752r36351
33916C0557488q2580o407854o211241k37577J60758m326450l771354J111300J221619
33907A2014109k947747k985605R72910J283301k145923k362038Q74783J245942
33899E949732j520619j604260J244268J505231j203727j716415N16977Q33232
$$ plain form
33891 4004419 2758317 1354112 2057349 2974384 1892576 636859 1404324 2498930 1761346
33882 1761346 722325 1426767 2433703 1755879 663106 933607 1307819 201779 -914726
33873 -914726 -296757 653842 103488 -698234 63399 1212736 826932 -243436 -247458 220886
33863 220886 -138894 -533824 171695 926762 518549 104130 970488 1814188 1046678 -192913
33853 -192913 -155870 335372 -299872 -1264338 -994120 -208044 -427414 -1012916 -558503 226290
33843 226290 -111988 -887894 -596367 171150 -53407 -681441 -190549 882044 883935 73460
33833 73460 -42604 405380 113087 -729354 -834803 -324226 -370310 -855481 -741254 -263555
33823 -263555 -464181 -1034457 -889574 -406322 -813124 -1757805 -1747886 -732961 -77761 -170228
$$ packed form
33891D004419j246102j404205P03237R17035j081808j255717P67465J094606p37584
33882A761346j039021P04442J006936o77824j092773K70501L74212j106040j116505
33873i14726O17969R50599n50354q01722P61633J149337l85804j070368m022M68344
33863B20886l59780l94930P05519P55067m08213m14419Q66358Q43700p67510j239591
33853a92913L7043M91242o35244r64466K70218P86076k19370n85502M54413P84793
33843B26290l38278p75906K91527P67517k24557o28034M90892J072593J891q10475
33833G3460j16064M47984k92293q42441j05449N10577m6084m85171J14227M77699
33823b63555k00626n70276J44883M83252m06802r44681R919J014925O55200r2467
$$ plain form
33813 -170228 -130551 250037 262029 -115714 -170276 88744 64683 -75456 219889 520259
33803 520259 62013 -648989 -559623 49759 134216 -136369 198969 902220 895076 327461
33793 327461 353108 984067 1055447 298195 -342664 -474306 -632705 -857530 -550052 135607
33783 135607 294159 -209183 -578729 -461176 -195266 165482 750152 1023007 444931 -279313
33773 -279313 -82585 625728 561372 -275981 -716856 -487492 -410094 -634645 -462006 27783
33763 27783 -58235 -676504 -765715 -130693 235104 -41870 -198374 80573 146335 -186271
33753 -186271 -226558 171387 230272 -289760 -643699 -515802 -504935 -791084 -704892 -98983
33743 -98983 202231 -146012 -386275 -43377 285778 114664 -96128 104594 382571 375150
$$ packed form
33813a70228L9677L80588J1992l77743n4562K59020k4061j40139K95345L00370
33803E20259m58246p11002Q9366O09382Q4457k70585L35338P03251p144n67615
33793C27461K5647O30959P1380p57252o40859j31642j58399k24825L07478O85659
33783A35607J58552n03342l69546J17553K65910L60748N84670K72855n78076p24244
33773b79313J96728P08313o4356q37353m40875K29364P7398k24551J72639M89789
33763B7783q6018o18269q9211O35022L65797k76974j56504K78947O5762l32606
33753a86271m0287L97945N8885n20032l53939J27897J0867k86149Q6192O05909
33743i8983L01214l48243k40263L42898L29155j71114k10792K00722K77977p421
$$ plain form
33733 375150 318622 436444 545744 632103 954269 1316071 1166908 646779 527605 908558
33723 908558 1049851 719555 527618 636004 400400 -276157 -502139 102886 637885 330843
33713 330843 -320196 -518559 -334875 -176356 63006 561891 955001 857767 508172 366510
33703 366510 524701 849642 1210376 1327413 947719 326884 -37207 -168770 -424485 -636203
33693 -636203 -346081 163097 136602 -322274 -345654 168255 367946 4712 -159293 136704
33683 136704 111087 -530547 -862409 -279490 429759 396644 7980 45094 391301 477314
33673 477314 261676 -24068 -423925 -855672 -835460 -237098 336588 480266 552047 817294
33663 817294 876898 523605 286583 470699 522393 54247 -359333 -167834 207739 217509
$$ packed form
33733C75150n6528J17822J09300Q6359L22166L61802j49163n20129j19174L80953
33723I08558J41293l30296j91937J08386k35604o76557k25982O05025N34999l07042
33713C30843o51039j98363J83684J58519K39362M98885L93110r7234l49595j41662
33703C66510J58191L24941L60734J17037l79694o20835l64091j31563k55715k11718
33693f36203K90122N09178k6495m58876k3380N13909J99691l63234j64005K95997
33683A36704k5617o41634l31862N82919P09249l3115l88664L7114L46207Q6013
33673D77314k15638k85744l99857m31747K0212N98362N73686J43678P1781K65247
33663H17294N9604l53293k37022J84116N1694m68146m13580J91499L75573R770
$$ plain form
33653 217509 166017 481377 747013 400985 -221389 -465533 -438806 -626389 -908182 -834742
33643 -834742 -506283 -385312 -539443 -712082 -802676 -748465 -381586 95812 51936 -630434
33633 -630434 -1173844 -1029830 -681146 -685544 -689518 -195954 397527 440916 128293 42338 120674
33622 120674 -19664 -201069 -39228 239075 215232 123821 413410 845041 893435 679185
33612 679185 636845 627211 284633 -93647 49536 511236 647484 484624 572610 901277
33602 901277 909686 501135 163606 98212 34007 -99454 -66317 114779 189515 208608 398175
33591 398175 577867 384825 -8026 -89551 139004 202889 3170 -63957 150997 334151
33581 334151 271169 53146 -281237 -745349 -1059957 -891047 -464554 -394742 -822884 -1204111
$$ packed form
33653B17509n1492L15360K65636l46028o22374k44144K6727j87583k81793P3440
33643h34742L28459J20971j54131j72639r0594N4211L66879M77398m3876o82370
33633f30434n43410J44014L48684m398l974M93564N93481M3389l12623q5955P8336
33622A20674j40338j81405J61841K78303k3843r1411K89589M31631M8394k14250
33612F79185m2340r634l42578l78280J43183M61700J36248j62860Q7986L28667
33602I01277Q409m08551l37529o5394o4205j33461L3137J81096P4736J9093J89567
33591C98175J79692j93042l92851q1525K28555O3885j99719o7127K14954J83154
33581C34151o2982k18023l34383m64112l14608J68910M26493O9812m28142l81227
$$ plain form
33571 -1204111 -1048390 -497501 -89513 -206238 -738681 -1132235 -920522 -347595 -129561
33562 -129561 -426815 -569927 -134960 323181 150682 -361385 -495546 -211358 -5854 -44385
33552 -44385 -141834 -270738 -401732 -203768 394173 752089 393821 -105891 28250 477244
33542 477244 392033 -113088 -183148 249518 364104 -100052 -440238 -225591 82411 29421
33532 29421 -175546 -208950 -121251 -14906 163760 340507 356955 341288 490028 556387 189650
33521 189650 -342408 -499584 -399081 -576056 -940991 -918305 -586058 -654602 -1208263 -1479263
33511 -1479263 -1080690 -513454 -211778 -24169 84456 -230507 -886370 -1188855 -861038
33502 -861038 -449879 -339418 -193791 208967 438623 214969 -16663 157013 465236 552610
$$ packed form
33571a204111J55721N50889M07988j16725n32443l93554K11713N72927K18034
33562a29561k97254j43112M34967M58141j72499n12067j34161K84188K05504l8531
33552d4385r7449j28904j30994J97964N97941L57916l58268m99712J34141M48994
33542D77244q5211n05121p0060M32666J14586m64156l40186K14647L08002n2990
33532B9421k04967l3404Q7699J06345J78666J76747J6448j5667J48740O6359l66737
33521A89650n32058j57176J00503j76975l64935K2686L32247o8544n53661k71000
33511a479263L98573N67236L01676J87609J08625l14963o55863l02485L27817
33502h61038M11159J10461J45627M02758K29656k23654k31632J73676L08223Q7374
$$ plain form
33492 552610 562718 636136 498050 67969 -161573 104983 424684 376789 252015 409835
33482 409835 546305 249461 -221690 -363629 -205748 -52263 141923 517530 795894 642686
33472 642686 268408 105694 145021 106076 1661 7444 3361 -238663 -577593 -664398 -443791
33461 -443791 -143646 58205 63016 -199440 -547297 -561001 -138501 266388 269485 71749
33451 71749 15160 18938 -125561 -271916 -206615 -106939 -230725 -422346 -397954 -261844 -260733
33440 -260733 -270277 -24999 347620 516301 486909 472610 407802 109067 -222667 -211065 45334
33429 45334 64801 -261772 -498865 -329082 41577 266485 287728 221218 87619 -147825
33419 -147825 -411339 -553903 -520127 -424611 -437350 -558502 -545869 -187763 372653 760851
$$ packed form
33492E52610J0108P3418j38086m30081k29542K66556L19701m7895j24774J57820
33482D09835J36470k96844m71151j41939J57881J53485J94186L75607K78364j53208
33472F42686l74278j62714L9327l8945j04415N783m083k42024l38930q6805K20607
33461d43791L00145K01851M811k62456l47857j3704M22500M04889L097j97736
33451G1749n6589L778j44499j46355O5301R9676j23786j91621K4392J36110J111
33440b60733r544K45278L72619J68681k9392j4299o4808k98735l31734J1602K56399
33429D5334J9467l26573k37093J69783L70659K24908K1243o6510j33599k35444
33419a47825k63514j42564L3776R5516j2739j21152J2633L58106N60416L88198
$$ plain form
33409 760851 813634 681181 487921 179891 -227597 -548599 -681691 -703543 -629217 -372026
33399 -372026 -20230 172430 168277 186755 290827 314500 277319 412349 650442 577494 106364
33388 106364 -310287 -376316 -349473 -478170 -594276 -603244 -803341 -1276666 -1507017 -1131236
33378 -1131236 -598705 -521870 -785637 -874966 -698074 -477945 -181688 288814 621717 469139
33368 469139 80118 -55252 28357 -13380 -97499 86582 303721 -10210 -759434 -1155638
33358 -1155638 -789749 -111418 293007 332070 171031 -98898 -340645 -352802 -176264 -86208
33348 -86208 -151834 -135110 69971 233522 145980 -109699 -343800 -468977 -457666 -317622
33338 -317622 -146918 -26223 100953 244376 202520 -126655 -425768 -336412 -45667 -48796
$$ packed form
33409G60851N2783j32453j93260l08030m07488l21002j33092k1852P4326K57191
33399c72026L51796J92660m153J8478J04072K3673l7181J35030K38093p2948m71130
33388A06364m16651o6029K6843j28697j16106q968k00097m73325k30351L75781
33378a131236N32531P6835k63767q9329J76892K20129K96257M70502L32903j52578
33368D69139l89021j35370Q3609m1737q4119J84081K17139l13931p49224l96204
33358a155638L65889O78331M04425L9063j61039k69929k41747j2157J76538R0056
33348h6208o5626J6724K05081J63551q7542k55679k34101j25177J1311J40044
33338c17622J70704J20695J27176J43423m1856l29175k99113Q9356K90745l129
$$ plain form
33328 -48796 -379997 -569245 -399716 -210986 -307028 -503244 -482055 -258885 -57895 28252
33318 28252 40581 846 -54491 -10463 206379 510610 745323 840372 844635 827816 762233
33307 762233 546565 234104 144064 481633 874070 698565 -1638 -403804 -777 654856
33297 654856 743943 313477 45671 190916 389477 413299 414529 429455 240327 -167802
33287 -167802 -507720 -645348 -715542 -710146 -401006 201905 710515 811490 540434 46774
33277 46774 -549152 -985503 -932558 -400840 202244 538448 619204 570689 412057 172102
33267 172102 -12287 -33185 78741 193234 130892 -214305 -655121 -797348 -547907 -293840
33257 -293840 -317837 -363088 -158829 -6639 -288761 -705687 -689656 -367357 -342545 -626117
$$ packed form
33328d8796l31201j89248J69529J88730r6042j96216K1189K23170K00990Q6147
33318B8252J2329l9735n5337M4028K16842L04231K34713R5049M263j6819o5583
33307G62233k15668l12461r0040L37569L92437j75505p00203m02166M03027O55633
33297F54856Q9087m30466k67806J45245J98561K3822J230J4926j89128m08129
33287a67802l39918j37628p0194N396L09140O02911N08610J00975k71056m93660
33277D6774n95926m36351N2945N31718O03084L36204Q0756m8515j58632k39955
33267A72102j84389k0898J11926J14493o2342l45197m40816j42227K49441K54067
33257b93840k3997m5251K04259J52190k82122m16926J6031L22299K4812k83572
$$ plain form
33247 -626117 -630040 -276684 -245444 -876842 -1605494 -1822547 -1635884 -1402462 -1116089 -697128
33237 -697128 -384355 -372498 -425452 -246577 59045 197882 86516 -183044 -472089 -535031
33227 -535031 -205178 220415 224271 -156489 -317910 -41868 143694 -134532 -453018 -289704
33217 -289704 185650 522452 698748 872216 870611 548037 290068 507869 879198 738986
33207 738986 67990 -511999 -628494 -480620 -332534 -214808 -122117 -52571 131831 478149
33197 478149 657167 356662 -126110 -208920 85878 149495 -219740 -449621 -84346 482616
33187 482616 582291 230287 36210 305120 691827 787276 666317 646470 725311 565632
33177 565632 39265 -488507 -588787 -329298 -168041 -336888 -586931 -587074 -337073 -78846
$$ packed form
33247f26117l923L53356L1240o31398p28652k17053J86663K33422K86373M18961
33237f97128L12773J1857n2954J78875L05622J38837j11366k69560k89045o2942
33227e35031L29853M25593L856l80760j61421K76042J85562k78226l18486J63314
33217b89704M75354L36802J76296J73468j605l22574k57969K17801L71329j40212
33207G38986o70996n79989j16495J47874J48086J17726R2691O9546J84402L46318
33197D78149J79018l00505m82772q2810K94798O3617l69235k29881L65275N66962
33187D82616R9675l52004j94077K68910L86707R5449j20959j9847P8841j59679
33177E65632n26367n27772j00280K59489J61257j68847k50043j43K50001K58227
$$ plain form
33167 -78846 10591 -88321 -293326 -434932 -339102 -20323 294995 414905 351706 201832
33157 201832 7178 -184421 -266542 -190359 -39110 88192 195468 361947 651323 1002723
33147 1002723 1144552 779347 34678 -485072 -417964 -207319 -486523 -1074778 -1226966 -857731
33137 -857731 -735091 -1220867 -1590480 -1102576 -139686 346878 118943 -274205 -436097 -470006
33127 -470006 -479541 -330894 15032 363549 560768 605071 468450 97141 -373498 -635212
33117 -635212 -483374 36523 693236 1166586 1220384 942709 682555 610806 533182 292362
33107 292362 94091 176887 382680 365779 83120 -196414 -247690 -37698 313387 513016
33097 513016 266586 -280097 -520516 -121150 468687 602640 301653 96128 170033 162995
$$ packed form
33167g8846Q9437r8912k05005j41606R5830L18779L15318J19910o3199j49874
33157B01832j94654j91599q2121P6183J51249J27302J07276J66479K89376L51400
33147A002723J41829l65205p44669n19750O7108K10645k79204n88255j52188L69235
33137h57731J22640m85776l69613M87904R62890M86564k27935l93148j61892l3909
33127d70006r535J48647L45926L48517J97219M4303j36621l71309m70639k61714
33117f35212J51838N19897O56713M73350N3798k77675k60154p1749p7624k40820
33107B92362j98271Q2796K05793j6901k82659k79534n1276K09992L51085J99629
33097E13016k46430n46683k40419L99366N89837J33953l00987k05525P3905p038
$$ plain form
33087 162995 -192537 -685272 -965835 -952082 -788058 -608063 -427662 -180489 130404 308083
33077 308083 146766 -222749 -434634 -415477 -458900 -631166 -553937 -56849 429631 537823
33067 537823 559595 864149 1145944 896890 305602 -23378 -29745 -146551 -435163 -540693
33057 -540693 -467743 -612874 -942110 -892293 -285869 333348 527989 519086 616997 656017 364159
33046 364159 -122993 -465403 -530191 -354591 -238 351203 457528 348026 305513 394846
33036 394846 350984 64658 -196422 -210159 -70708 121165 430120 746484 701085 211607
33026 211607 -243532 -214577 139626 344397 214655 -103755 -436237 -641236 -606416 -458817
33016 -458817 -554817 -985119 -1312090 -1103733 -536467 -138554 -82267 -89281 21964 57262
$$ packed form
33087A62995l55532m92735k80563J3753J64024J79995J80401K47173L10893J77679
33077C08083j61317l69515k11885J9157m3423j72266P7229M97088M86480J08192
33067E37823K1772L04554K81795k49054n91288l28980o367j16806k88612j05530
33057e40693P2950j45131l29236M9817O06424O19217J94641q903R7911L9020k91858
33046C64159m87152l42410o4788J75600L54353L51441J06325j09502m2513Q9333
33036C94846m3862k86326k61080j3737J39451J91873L08955L16364m5399m89478
33026B11607m55139K8955L54203K04771j29742l18410l32482k04999L4820J47599
33016d58817r6000m30302l26971K08357N67266L97913N6287p014J11245L5298
$$ plain form
33006 57262 -204586 -630471 -855637 -710706 -410300 -281926 -364454 -401767 -262111 -162503
32996 -162503 -315078 -550796 -574968 -450413 -471917 -636618 -626792 -310713 111683 460864
32986 460864 688145 648113 226201 -255662 -266946 164174 413490 177581 -90777 63172
32976 63172 414337 510734 376160 309682 309021 166323 -71332 -170539 -108867 -39338 39111
32965 39111 260697 617702 953518 1152168 1156845 926598 535936 172584 -85740 -307382
32955 -307382 -452810 -386262 -243765 -391884 -819606 -999440 -645512 -182492 -91032 -210345
32945 -210345 -156625 -43534 -207324 -497441 -471620 -144654 61547 33737 52176 187404
32935 187404 182530 -15263 -128650 -45406 29052 7235 49718 144946 23480 -323927 -470055
$$ packed form
33006E7262k61848m25885k25166J44931L00406J28374q2528l7313J39656R9608
32996a62503j52575k35718k4172J24555k1504j64701R826L16079M22396L49181
32986D60864K27281m0032m21912m81863j1284M31120K49316k35909k68358J53949
32976F3172L51165R6397j34574o6478o61j42698k37655r9207O1672O9529P8449
32965C9111K21586L57005L35816J98650M677k30247l90662l63352k58324k21642
32955c07382j45428O6548J42497j48119m27722j79834L53928M63020R1460j19313
32945b10345N3720J13091j63790k90117K5821L26966K06201k7810J8439J35228
32935A87404m874j97793j13387Q3244P4458k1817M2483R5228j21466l47407j46128
$$ plain form
32924 -470055 -147260 318034 436136 163443 -167429 -315672 -285928 -171453 -79297 -124621
32914 -124621 -311148 -460647 -390850 -134325 96858 126639 -50793 -297206 -436722 -358949
32904 -358949 -56133 393406 807734 902531 499093 -182498 -618625 -520643 -136241 121563
32894 121563 151876 83382 -49512 -235903 -270113 8571 336326 281553 -119932 -365272
32884 -365272 -171975 192317 361438 313412 214574 116478 1487 -84452 -131610 -251366
32874 -251366 -516939 -831659 -1041971 -1060927 -841972 -411930 2037 78306 -243289 -652451
32864 -652451 -812184 -682493 -434076 -204594 -52393 -24443 -146664 -395028 -703251 -928267
32854 -928267 -865077 -475881 -67480 10711 -147770 -128741 130594 167510 -302095 -860535
$$ packed form
32924d70055L22795M65294J18102k72693l30872j48243K9744J14475R2156m5324
32914a24621j86527j49499O9797K56525K31183K9781j77432k46413j39516P7773
32904c58949L02816M49539M14328R4797m03438o81591m36127R7982L84402K57804
32894A21563L0313o8494j32894j86391l4210K78684L27755n4773m01485k45340
32884c65272J93297L64292J69121m8026r8838r8096j14991q5939m7158j19756
32874b51366k65573l14720k10312j8956K18955M30042M13967P6269l21595m09162
32864f52451j59733J29691K48417K29482J52201K7950j22221k48364l08223k25016
32854i28267O3190L89196M08401P8191j58481J9029K59335L6916m69605n58440
$$ plain form
32844 -860535 -922013 -550681 -319595 -453500 -557692 -254148 302740 716687 866591 897865
32834 897865 873057 696779 355461 30820 -72866 75342 321225 445039 315947 21229
32824 21229 -162355 -29098 303942 505015 412767 188832 29406 -110982 -350504 -562970
32814 -562970 -481131 -108715 219416 274933 235966 414443 824233 1179146 1246433 1060605
32804 1060605 815046 649560 546939 390279 130183 -114411 -189983 -122989 -70008 -49151
32794 -49151 92190 371457 534372 374880 43495 -133033 -33115 212488 438617 524879
32784 524879 352907 -82536 -524283 -606206 -212753 397743 827026 836001 478772 54197
32774 54197 -109176 74033 390647 585485 615427 609102 669129 773318 779112 503524 -38324
$$ packed form
32844h60535o1478L71332K31086j33905j04192L03544N56888M13947J49904L1274
32834H97865k4808j76278l41318l24641j03686J48208K45883J23814j29092k94718
32824B1229j83584J33257L33040K01073r2248k23935j59426j40388k39522k12466
32814e62970Q1839L72416L28131N5517l8967J78477M09790L54913O7287j85828
32804A060605k45559j65486j02621j56660k60096k44594p5572O6994N2981K0857
32794d9151J41341K79267J62915j59492l31385j76528R9918K45603K26129Q6262
32784E24879j71972m35443m41747q1923L93453O10496M29283Q975l57229m24575
32774E4197j63373J83209L16614J94838K9942o325O0027J04189N794k75588n41848
$$ plain form
32763 -38324 -438386 -196131 636385 1354168 1365072 847633 397180 244690 185943 124650
32753 124650 219623 469836 571915 343617 602 -150033 -76878 65887 209210 362563
32743 362563 443189 306922 -41898 -386962 -504762 -404575 -309102 -377791 -515301 -525805
32733 -525805 -380224 -183544 65340 451766 862985 976142 632035 43457 -435191 -575318
32723 -575318 -327236 112671 286366 -102732 -697150 -843127 -516380 -347723 -562975 -570444
32713 -570444 35541 756638 1022428 1074380 1303563 1331682 689813 -54760 54728 834295
32703 834295 1203154 873755 630374 838221 892836 480971 223410 506897 698759 231135
32693 231135 -390194 -456829 -242586 -462646 -1061485 -1396044 -1284484 -1072929 -880262 -509197
$$ packed form
32763c8324m00062K42255Q32516P17783J0904n17439m50453j52490n8747o1293
32753A24650R4973K50213J02079k28298l43015j50635P3155J42765J43323J53353
32743C62563Q0626j36267l48820l45064j17800J00187R5473o8689j37510j0504
32733e25805J45581J96680K48884L86426M11219J13157l44107n88578m78648j40127
32723e75318K48082M39907J73695l89098n94418j45977L26747J68657k15252p469
32713e70444O05985P21097K65790N1952K29183K8119o41869p44573J09488P79567
32703H34295L68859l29399k43381K07847N4615m11865k57561K83487J91862m67624
32693B31135o21329o6635K14243k20060n98839l34559J11560K11555J92667L71065
$$ plain form
32683 -509197 7820 394768 583820 678021 596281 242267 -124351 -181157 -73436 -170798
32673 -170798 -431475 -507869 -376708 -354659 -540011 -714691 -776061 -831262 -885942 -844385 -785348
32662 -785348 -850420 -911746 -737737 -410397 -163579 97609 629033 1241599 1390678 932002
32652 932002 313381 -74678 -283727 -431961 -410685 -174270 51000 82684 41815 124630
32642 124630 350240 659550 1016963 1286373 1237154 809286 213686 -279306 -490123 -330197
32632 -330197 69785 289325 44180 -328405 -237499 273542 511698 149621 -285471 -225578
32622 -225578 144099 319147 260967 206984 22511 -598755 -1399942 -1684471 -1262967 -723327
32612 -723327 -567456 -566775 -280462 184674 371074 219578 153962 425070 763379 796981
$$ packed form
32683e09197N17017L86948J89052R4201q1740l54014l66618n6806J07721r7362
32673a70798k60677p6394J31161K2049j85352j74680o1370n5201n4680M1557N9037
32662g85348o5072o1326J74009L27340K46818K61188N31424O12566J49079m58676
32652I32002o18621l88059k09049j48234K1276K36415K25270L1684m0869Q2815
32642A24630K25610L09310L57413K69410m9219m27868n95600m92992k10817J59926
32632c30197L99982K19540k45145l72585R0906N11041K38156l62077m35092N9893
32622b25578L69677J75048n8180n3983j84473o21266q01187k84529M21504N39640
32612g23327J55871O81K86313M65136J86400j51496o5616K71108L38309L3602
$$ plain form
32602 796981 511539 116735 -304176 -757479 -1092791 -1087135 -762045 -378280 -94927 142502
32592 142502 342708 366093 200428 83322 149427 168988 -94748 -426716 -400673 -31310
32582 -31310 180253 -57224 -398643 -328964 163426 636509 806095 817283 882051 921431
32572 921431 750915 463730 356648 470953 478822 171172 -152732 -28915 547072 1113569
32562 1113569 1321959 1230336 1004404 668152 295848 145947 344392 612710 567993 199455
32552 199455 -163747 -282582 -205832 -89184 -12412 20328 41522 105231 234089 382322
32542 382322 491491 553165 595038 649498 727436 760315 626295 347526 159014 182550 153461
32531 153461 -215868 -691326 -760245 -409313 -154070 -197625 -129213 299887 682104 640950
$$ packed form
32602G96981k85442l94804m20911m53303l35312N656L25090L83765K83353K37429
32592A42502K00206K3385j65665j17106O6105J9561k63736l31968K6043L69363
32582c1310K11563k37477l41419O9679M92390M73083J69586J1188O4768L9380
32572I21431j70516k87185j07082J14305P869l07650l23904J23817N75987N66497
32562A113569K08390r1623k25932l36252l72304j49901J98445K68318m4717l68538
32552A99455l63202j18835P6750J16648P6772L2740K1194O3709J28858J48233
32542C82322J09169O1674M1873N4460P7938L2879j34020k78769j88512K3536k9089
32531A53461l69329m75458o8919L50932K55243m3555O8412M29100L82217m1154
$$ plain form
32521 640950 506959 778357 1274720 1386208 925058 234775 -326216 -552130 -311421 182687
32511 182687 277957 -372773 -1189125 -1374240 -1030961 -898846 -1154141 -1251739 -927845 -556844
32501 -556844 -400756 -263655 -106697 -302655 -954572 -1529975 -1512772 -988996 -356719 99174
32491 99174 161530 -272723 -859002 -1009848 -683581 -486548 -755387 -1080127 -1037640 -821660
32481 -821660 -728344 -553081 -27602 560472 750036 623362 618660 828749 949749 781120
32471 781120 396086 -35025 -274321 -71433 489642 912098 869007 628856 583089 636170
32461 636170 464066 124313 -50118 1214 55729 18377 -48811 -176652 -381132 -436220
32451 -436220 -157475 188024 156775 -249698 -607985 -656975 -502236 -291552 -42856 220790
$$ packed form
32521F40950j33991K71398M96363J11488m61150o90283n60991k25914K40709M94108
32511A82687R5270o50730q16352j85115L43279J32115k55295r7598L23894L71001
32501e56844J56088J37101J56958j95958o51917n75403J7203N23776O32277M55893
32491I9174O2356m34253n86279j50846L26267J97033k68839l24740M2487K15980
32481h21660R3316J75263N25479N88074J89564j26674m702K10089J21000j68629
32471G81120l85034m31111k39296K02888N61075M22456m3091k40151m5767N3081
32461F36170j72104l39753j74431N1332N4515l7352o7188j27841k04480n5088
32451d36220K78745L45499l1249m06473l58287m8990J54739K10684K48696K63646
$$ plain form
32441 220790 464352 733629 1003724 1051142 774630 501088 607694 946986 1035609 738495
32431 738495 368293 164025 98886 192826 555903 1020760 1125476 643600 -101932 -560790
32421 -560790 -435301 137448 672419 662406 70293 -552212 -671390 -386232 -164090 -146075
32411 -146075 -130491 -113511 -315180 -651843 -697844 -295282 224323 541492 660563 610486
32401 610486 286891 -207940 -472256 -303579 23085 184190 203449 215834 167450 12126
32391 12126 -75137 35527 167155 97490 -108171 -258084 -341499 -441134 -504816 -437483 -291818
32380 -291818 -170496 -64828 41056 50800 -90116 -263528 -351599 -372416 -291988 82952
32370 82952 796179 1495851 1746663 1480679 944447 350881 -178663 -471789 -412167 -152434
$$ packed form
32441B20790K43562K69277K70095M7418k76512k73542J06606L39292Q8623k97114
32431G38495l70202k04268o5139R3940L63077M64857J04716m81876p45532m58858
32421e60790J25489N72749N34971j0013n92113o22505j19178K85158K22142J8015
32411a46075J5584J6980k01669l36663m6001M02562N19605L17169J19071n0077
32401F10486l23595m94831k64316J68677L26664J61105J9259J2385m8384j55324
32391A2126q7263J10664J31628o9665k05661j49913q3415r9635o3682O7333J45665
32380b91818J21322J05668J05884R744j40916j73412q8071k0817Q0428L74940
32370H2952P13227O99672K50812k65984n36232n93566n29544k93126N9622K59733
$$ plain form
32360 -152434 29588 76753 154211 334647 491644 508402 405800 237831 8373 -272079
32350 -272079 -537777 -684748 -599864 -250102 191680 433435 391431 301621 361611 417994
32340 417994 224766 -123477 -303279 -244634 -198515 -321885 -497513 -623128 -777922 -968323
32330 -968323 -970853 -630283 -142629 158606 191594 143721 205259 438518 803408 1135501
32320 1135501 1188586 900551 564644 537133 809546 1067749 1121052 1012237 732098 187137
32310 187137 -445365 -704987 -437324 -95060 -136009 -376407 -341143 -58913 525 -279717
32300 -279717 -487901 -394912 -304035 -459413 -583107 -345724 78836 322056 386907 484174
32290 484174 541291 345045 36478 -9794 239045 436844 388679 238682 136813 99379
$$ packed form
32360a52434J82022M7165P7458J80436J56997J6758j02602j67969k29458k80452
32350b72079k65698j46971Q4884L49762M41782K41755m2004q9810N9990N6383
32340D17994j93228l48243j79802N8645M6119j23370j75628j25615j54794j90401
32330i68323k530L40570M87654L01235L2988m7873O1538K33259L64890L32093
32320A135501N3085k88035l35907k7511K72413K58203N3303j08815k80139n44961
32310A87137o32502k59622K67663L42264m0949k40398L5264K82230N9438k80242
32300b79717k08184R2989R0877j55378j23694K37383M24560K43220O4851R7267
32290D84174N7117j96246l08567m6272K48839J97799m8165j49997j01869l7434
$$ plain form
32280 99379 199443 487685 696552 470934 -10609 -109215 393006 928263 937122 628930
32270 628930 567129 786797 785057 284056 -406482 -815964 -809197 -587619 -400150 -350888 -389924
32259 -389924 -404877 -323284 -145964 79490 272996 351275 310904 221350 59900 -302499
32249 -302499 -776979 -903324 -361043 455262 787368 457561 32610 -30064 84073 58048
32239 58048 -9109 82054 163890 -19326 -329097 -441144 -338239 -219896 -112778 45766
32229 45766 121223 -7675 -113730 60283 284616 139288 -248473 -304960 124734 545256
32219 545256 560799 352790 215655 83984 -189638 -458851 -516421 -442341 -420549 -416263 -307720
32208 -307720 -157299 -93063 -81611 -58585 -112967 -280746 -327619 -48323 349075 504926
$$ packed form
32280I9379J00064K88242K08867k25618m81543r8606N02221N35257Q859l08192
32270F28930o1801K19668j740n01001o90538m09482O767K21578J87469M9262l9036
32259c89924j4953Q1593J77320K25454J93506P8279m0371q9554j61450l62399
32249c02499m74480j26345N42281Q16305L32106l29807m24951o2674J14137k6025
32239E8048o7157R1163Q1836j83216l09771j12047J02905J18343J07118J58544
32229D5766P5457j28898j06055J74013K24333j45328l87761n6487M29694M20522
32219E45256J5543k08009j37135j31671k73622k69213n7570P4080K1792M286J08543
32208c07720J50421O4236J1452K3026n4382j67779m6873K79296L97398J55851
$$ plain form
32198 504926 473963 640847 1056271 1257531 896800 225567 -263625 -442424 -541846 -697187
32188 -697187 -780334 -656429 -379826 -91440 138621 324762 508553 698016 800330 661626
32178 661626 291696 2880 134511 603904 919455 738807 256347 -96002 -186079 -220529
32168 -220529 -331018 -370484 -172362 159128 321231 118117 -344984 -739052 -800352 -595485
32158 -595485 -447535 -519915 -569753 -281006 230982 500028 317000 -6991 -99287 -9728
32148 -9728 -37888 -245043 -395634 -331492 -160398 -27617 113300 385860 740452 960467
32138 960467 933908 811946 805571 884354 836529 637383 535673 651016 728961 560497 437794
32127 437794 772376 1333440 1382534 693392 -52376 -170791 134763 188067 -163036 -462913
$$ packed form
32198E04926l0963J66884M15424K01260l60731o71233m89192j78799r9422j55341
32188f97187q3147J23905K76603K88386K30061J86141J83791J89463J02314j38704
32178F61626l69930k88816J31631M69393L15551j80648m82460l52349r0077l4450
32168b20529j10489l9466J98122L31490J62103k03114m63101l94068o1300K04867
32158e95485J47950p2380m9838K88747N11988K69046j83028l23991r2296Q9559
32148i728k8160k07155j50591O4142J71094J32781J40917K72560L54592K20015
32138I60467k6559j21962o375P8783m7825j99146j01710J15343P7945j68464j22703
32127D37794L34582N61064M9094o89142p45768j18415L05554N3304l51103k99877
$$ plain form
32117 -462913 -421074 -253578 -220010 -267460 -295034 -433233 -811176 -1221458 -1261956 -796179
32107 -796179 -138133 259577 259089 123782 126394 166838 -46488 -465994 -652919 -395425 -93625
32096 -93625 -251244 -784122 -1178414 -1218415 -1161754 -1195517 -1123074 -738443 -216880 74848
32086 74848 726 -268216 -492753 -555013 -475289 -341197 -223629 -154352 -174595 -307818 -432350
32075 -432350 -340041 -65234 17234 -338493 -821020 -915523 -605299 -356856 -411470 -485805
32065 -485805 -272615 124989 419478 488569 330115 -27533 -366274 -331353 87314 384577
32055 384577 165797 -259444 -261067 264784 799768 904457 663670 412228 340556 459515
32045 459515 684595 817271 640364 183503 -226008 -290488 -27586 344596 681097 946471
$$ packed form
32117d62913M1839J67496L3568m7450k7574j38199l77943m10282m0498M65777
32107g96179O58046L97710m88j35307K612M0444k13326m19506j86925K57494L01800
32096i3625j57619n32878l94292m0001N6661l3763P2443L84631N21563K91728
32086G4848p4122k68942k24537o2260P9724J34092J17568O9277k0243j33223j24532
32075d32350R2309K74807Q2468l55727m82527r4503L10224K48443n4614p4335
32065d85805K13190L97604K94489O9091j58454l57648l38741L4921M18667K97263
32055C84577k18780m25241j623N25851N34984J04689k40787k51442p1672J18959
32045D59515K25080J32676j76907m56861m09511o4480K62902L72182L36501K65374
$$ plain form
32035 946471 1074931 972807 681720 421977 394009 554407 637922 426691 -13115 -394184
32025 -394184 -511990 -442368 -410293 -518522 -674842 -751275 -714480 -591349 -409370 -223351
32015 -223351 -120937 -122976 -130451 -63001 -19475 -177863 -506444 -691579 -454134 102187 548350
32004 548350 538787 116464 -371926 -606576 -549210 -428137 -479384 -677897 -755769 -525727
31994 -525727 -124843 145821 162967 41377 -95090 -227203 -318989 -268488 -54472 194183
31984 194183 339289 349457 267317 195148 302520 649938 988120 974352 640714 370616
31974 370616 329988 269346 52671 -33378 173995 246283 -256930 -990133 -1185179 -716080
31964 -716080 -206218 -50734 50728 399314 712851 607809 258016 132745 307530 448586
$$ packed form
32035I46471J28460j02124k91087k59743k7968J60398Q3515k11231m39806l81069
32025c94184j17806O9622L2075j08229j56320p6433L6795J23131J81979J86019
32015b23351J02414k039p475O7450M3526j58388l28581j85135K37445N56321M46163
32004E48350r563m22323m88390k34650N7366J21073n1247j98513p7872K30042
31994e25727M00884K70664J7146j21590j36467j32113r1786N0501K14016K48655
31984A94183J45106J0168q2140p2169J07372L47418L38182j3768l33638k70098
31974C70616m0628o0642k16675q6049K07373P2288n03213p33203j95046M69099
31964g16080N09862J55484J01462L48586L13537j05042l49793j25271J74785J41056
$$ plain form
31954 448586 368138 217693 142155 59510 -142610 -413018 -647158 -855177 -1094283 -1278089
31944 -1278089 -1179744 -700594 -94024 205302 31396 -336192 -527118 -497392 -470390 -585946
31934 -585946 -787477 -957932 -963434 -661753 -119712 258077 121145 -331425 -554230 -344949
31924 -344949 4516 253263 493587 765630 803166 424381 -114733 -435123 -506447 -563863
31914 -563863 -709817 -821016 -752679 -478382 -114259 113708 58792 -139497 -211966 -143287
31904 -143287 -150714 -254270 -209280 26973 134158 -73509 -332201 -336115 -135198 100633
31894 100633 355538 539147 387733 -37600 -146831 406995 1077661 1101689 582162 285062
31884 285062 491091 704522 519516 160077 12361 124698 362149 643662 821665 663242
$$ packed form
31954D48586q0448j50445p5538q2645k02120k70408k34140k08019k39106j83806
31944a278089R8345M79150O06570K99326j73906l67588j90926K9726K7002j15556
31934e85946k01531j70455n502L01681N42041L77789j36932m52570k22805K09281
31924c44949L49465K48747K40324K72043L7536l78785n39114l20390p1324n7416
31914e63863j45954j11199O8337K74297L64123K27967n4916j98289p2469O8679
31904a43287p427j03556M4990K36253J07185k07667k58692l914K00917K35831
31894A00633K54905J83609j51414m25333j09231N53826O70666K4028n19527k97100
31884B85062K06029K13431j85006l59439j47716J12337K37451K81513J78003j58423
$$ plain form
31874 663242 160713 -369470 -623068 -546503 -230131 146736 258789 -96686 -583877 -570165
31864 -570165 47666 612395 520805 -35761 -397154 -249749 158009 430307 374289 37605
31854 37605 -358411 -544188 -412925 -102367 185464 381051 534108 700906 871116 923274
31844 923274 700635 275431 38336 262399 647069 651933 276417 71675 292605 547835
31834 547835 533432 587296 1061097 1553956 1388012 655181 155973 302174 664157 731196
31824 731196 579113 506453 444713 149202 -251241 -329156 38932 464421 508385 148957
31814 148957 -281722 -473486 -364769 -101579 124246 229306 292864 441688 664331 790974
31804 790974 687111 406099 111111 -72882 -68284 175163 562626 797789 649225 262571
$$ packed form
31874F63242n02529n30183k53598P6565L16372L76867J12053l55475m87191J3712
31864e70165O17831N64729r1590n56566l61393J47405M07758K72298n6018l36684
31854C7605l96016j85777J31263L10558K87831J95587J53057J66798J70210N2158
31844I23274k22639m25204k37095K24063L84670M864l75516k04742K20930K55230
31834E47835j4403N3864M73801M92859j65944p32831m99208J46201L61983O7039
31824G31196j52083p2660o1740k95511m00443p7915L68088M25489M3964l59428
31814A48957m30679j91764J08717K63190K25825J05060O3558J48824K22643J26643
31804G90974j03863k81012k94988j83993M598K43447L87463K35163j48564l86654
$$ plain form
31794 262571 3735 -17339 -27565 -153227 -207764 -76407 -9424 -237879 -507876 -362688
31784 -362688 199038 705223 850837 830620 959843 1231076 1372874 1185882 732445 292721
31774 292721 138550 240244 254671 -35696 -362496 -285368 200531 650154 726893 478735
31764 478735 95187 -245533 -281056 144411 677273 677061 44514 -576034 -668825 -501613
31754 -501613 -557546 -712502 -490983 101378 567782 668369 647391 670713 529133 77774
31744 77774 -410303 -577147 -427036 -216662 -71600 61527 183442 198342 108914 77297
31734 77297 208548 372627 367211 234560 251189 515916 716176 525057 132549 51590
31724 51590 361015 513066 83447 -613297 -951313 -781519 -435910 -141569 130025 314014
$$ packed form
31794B62571k58836k1074j0226j25662n4537J31357O6983k28455k69997J45188
31784c62688N61726N06185J45614k0217J29223K71233J41798j86992m53437m39724
31774B92721j54171J01694J4427k90367l26800P7128M85899M49623P6739k48158
31764D78735l83548l40720l5523M25467N32862k12o32547o20548r2791J67212
31754e01613n5933j54956K21519N92361M66404J00587k0978K3322j41580m51359
31744G7774m88077j66844J50111K10374J45062J33127J21915J4900q9428l1617
31734G7297J31251J64079n416j32651J6629K64727K00260j91119l92508q0959
31724E1590L09425J52051m29619o96744l38016J69794L45609K94341K71594J83989
$$ plain form
31714 314014 235489 3751 -12463 247103 381049 156939 -65706 135978 569510 683908
31704 683908 376801 121678 269234 597954 696965 500286 221648 -43057 -370373 -733145
31694 -733145 -937016 -886506 -725095 -614881 -511102 -274125 78982 354142 364576 46929
31684 46929 -526416 -1113205 -1348199 -1036433 -433691 -51221 -97716 -263744 -164848 142859
31674 142859 259559 -5848 -358554 -339022 163342 770137 974795 633119 89809 -189205
31664 -189205 -72878 193002 338033 323911 238591 94597 -154373 -463809 -668724 -606673
31654 -606673 -254674 222403 566025 635131 526899 421441 337263 157272 -124197 -342369
31644 -342369 -373146 -249357 -42704 193896 332985 245383 64032 154319 661686 1260716
$$ packed form
31714C14014p8525k31738j6214K59566J33946k24110k22645K01684M33532J14398
31704F83908l07107k55123J47556L28720R9011j96679k78638k64705l27316l62772
31694g33145k03871N0510J61411J10214J03779K36977L53107K75160J0434l17647
31684D6929n73345n86789k34994L11766O02742L82470m6495j66028R8896L07707
31674A42859J16700k65407l52706J9532N02364O06795K04658l41676n43310k79014
31664a89205J16327K65880J45031j4122q5320j43994k48970l09436k04915O2051
31654f06673L51999M77077L43622O9106j08232j05458q4178j79991k81469k18172
31644c42369l0777J23789K06653K36600J39089q7602j81351R0287N07367N99030
$$ plain form
31634 1260716 1517025 1341092 919385 379761 -231659 -762280 -1018614 -1004278 -888671 -742788
31624 -742788 -474565 -32927 455585 771309 771107 528128 334763 428601 648125 562977
31614 562977 85242 -284862 -67042 539363 909460 773253 412733 170555 122209 212716
31604 212716 359867 384937 165604 -91380 -46315 245811 338272 18786 -411445 -626246
31594 -626246 -687236 -755390 -735565 -524158 -341519 -433028 -600891 -442754 -6651 194117
31584 194117 -110178 -566876 -700866 -543626 -517373 -793870 -1017265 -733350 23018 685701
31574 685701 724466 202582 -299128 -313662 47906 319263 264862 84005 37762 74976
31564 74976 -23492 -246161 -342129 -249790 -287768 -709210 -1203460 -1156894 -455069 264983 342337
$$ packed form
31634A260716K56309j75933m21707n39624o11420n30621k56334J4336J15607J45883
31624g42788K68223M41638M88512L15724k02k42979j93365R3838K19524q5148
31614E62977m77735l70104K17820O06405L70097j36207l60520k42178m8346R0507
31604B12716J47151K5070k19333k56984M5065K92126R2461l19486m30231k14801
31594f26246o0990o8154J9825K11407J82639r1509j67863J58137M36103K00768
31584A94117l04295m56698j33990J57240K6253k76497k23395K83915P56368O62683
31574F85701L8765n21884n01710j4534L61568K71357n4401j80857m6243L7214
31564G4976r8468k22669r5968R2339l7978m21442m94250M6566P01825P20052P7354
$$ plain form
31553 342337 -133070 -518852 -461256 -220242 -161705 -271363 -345960 -415258 -671821 -1049234
31543 -1049234 -1179472 -879770 -470612 -403272 -667426 -821492 -628499 -379747 -421700 -610118
31533 -610118 -555391 -286870 -257940 -630695 -953264 -763571 -216599 171770 204373 124345
31523 124345 180851 370484 555438 575235 272439 -337164 -914150 -1049297 -716770 -306755
31513 -306755 -182607 -351617 -571830 -621498 -444467 -166372 14306 39679 53091 149710
31503 149710 178362 -30914 -343740 -465092 -362097 -300669 -461007 -732814 -901677 -847007
31493 -847007 -562731 -170866 110634 204410 313726 594933 788562 513272 -110308 -525478
31483 -525478 -481800 -304439 -286148 -228562 127866 532963 467189 -160977 -863478 -1110169
$$ packed form
31553C42337m75407l85782N7596K41014N8537j09658p4597o9298k56563l77413
31543a049234j30238K99702M09158O7340k64154j54066J92993K48752m1953j88418
31533f10118N4727K68521K8930l72755l22569J89693N46972L88369L2603q0028
31523A24345N6506J89633J84954J9797l02796o09603n76986j35147L32527M10015
31513c06755J24148j69010k20213m9668J77031K78095J80678K5373J3412R6619
31503A49710K8652k09276l12826j21352J02995O1428j60338k71807j68863N4670
31493h47007K84276L91865K81500R3776J09316K81207J93629k75290o23580m15170
31483e25478M3678J77361J8291N7586L56428M05097o5774o28166p02501k46691
$$ plain form
31473 -1110169 -824722 -334151 41840 287258 580675 933652 1081323 837067 396137
31464 396137 69467 -153283 -481265 -859908 -999046 -843542 -633222 -473507 -251725 -28870
31454 -28870 -50977 -239651 -155486 302672 619707 385180 -120825 -404786 -437033 -455101
31444 -455101 -435033 -223744 44247 116988 35234 -31781 -164383 -469832 -661062 -353579
31434 -353579 300908 745528 743461 538106 331673 77576 -176277 -202135 31492 275953
31424 275953 403069 535826 676259 588051 239105 21915 260692 713417 835865 444194
31414 444194 -95582 -316064 -153194 26162 -131576 -543947 -806357 -722825 -518215 -422618
31404 -422618 -316221 -38529 196788 73314 -300309 -558423 -670944 -882681 -1093659 -872465
$$ packed form
31473a110169K85447M90571L75991K45418K93417L52977J47671k44256m40930
31464C96137l26670k22750l27982l78643j39138J55504K10320J59715K21782K22855
31454b8870k2107j88674Q4165M58158L17035k34527n06005k83961l2247j8068
31444d55101K0068K11289K67991P2741q1754o7015j32602l05449j91230L07483
31434c53579O54487M44620k067k05355k06433k54097k53853k5858K33627K44461
31424B75953J27116J32757J40433q8208l48946k17190K38777M52725J22448l91671
31414D44194n39776k20482J62870J79356j57738m12371k62410Q3532K04610R5597
31404d22618J06397K77692K35317j23474l73623k58114j12521k11737k10978K21194
$$ plain form
31394 -872465 -225747 197195 -31378 -481642 -467460 26378 415142 322990 -53573 -309433
31384 -309433 -261294 -42693 33081 -247237 -718824 -945691 -730808 -351981 -125621 40351
31374 40351 375798 713204 621157 51624 -519628 -688431 -552054 -406055 -289442 -71081
31364 -71081 181746 217484 -28583 -314579 -412479 -366141 -305191 -147963 283471 861726
31354 861726 1104312 671249 -196690 -891176 -1052177 -847644 -662096 -652861 -673746 -556145
31344 -556145 -364441 -318905 -463884 -509435 -148408 486221 889839 789602 460049 287262
31334 287262 260148 163851 68761 211506 447250 285194 -398130 -1060320 -1138531 -721574
31324 -721574 -313011 -124519 67248 415695 672778 485381 -119062 -688809 -804036 -520368
$$ packed form
31394h72465O46718M22942k28573m50264J4182M93838L88764r2152l76563k55860
31384c09433M8139K18601P5774k80318m71587k26867K14883L78827K26360J65972
31374D0351L35447L37406r2047n69533n71252j68803J36377J45999J16613K18361
31364g1081K52827L5738k46067k85996r7900M6338O0950J57228M31434N78255
31354H61726K42586m33063q67939o94486j61001K04533J85548R235k0885J17601
31344e56145J91704M5536j44979m5551L61027O34629M03618j00237l29553j72787
31334B87262k7114r6297r5090J42745K35744j62056o83324o62190p8211M16957
31324g21574M08563J88492J91767L48447K57083j87397o04443n69747j15227K83668
$$ plain form
31314 -520368 -299211 -494166 -982735 -1347271 -1320387 -962976 -516427 -231658 -252213 -472541
31304 -472541 -570413 -378614 -154542 -234325 -486591 -447745 -20128 338472 251253 -94839
31294 -94839 -307800 -335480 -380608 -488560 -522065 -431885 -294180 -149648 -15669 14538 -116069
31283 -116069 -282855 -333952 -324849 -404622 -520714 -446314 -97940 349597 676142 804118
31273 804118 774952 673488 588402 541568 452306 250123 -9822 -232133 -422540 -617314
31263 -617314 -721976 -588501 -263022 -6291 -15890 -228593 -443311 -556207 -618126 -709103
31253 -709103 -810946 -803853 -582330 -177895 242330 497797 502694 297141 51301 7526
31243 7526 277276 669244 868246 836379 856312 1074123 1213470 958222 455851 146518
$$ packed form
31314e20368K21157j94955m88569l64536K6884L57411M46549K84769k0555k20328
31304d72541r7872J91799K24072p9783k52266L8846M27617L58600q7219l46092
31294i4839k12961k7680m5128j07952l3505R0180J37705J44532J33979L0207j30607
31283a16069j66786n1097R103p9773j16092P4400L48374M47537L26545J27976
31273H04118k9166j01464q5086m6834q9262k02183k59945k22311j90407j94774
31263f17314j04662J33475L25479K56731r599k12703k14718j12896o1919r0977
31253g09103j01843P093K21523M04435M20225K55467M897k05553k45840m3775
31243G526K69750L91968J99002l1867J9933K17811J39347k55248n02371l09333
$$ plain form
31233 146518 162873 221187 120847 11407 44136 79661 -22376 -67654 197509 600439
31223 600439 676977 284238 -229930 -512373 -552013 -448285 -180989 150606 155212 -407922
31213 -407922 -1153006 -1419595 -1074190 -621333 -513792 -698860 -893456 -945533 -810330 -507336
31203 -507336 -243428 -260084 -426376 -339546 32993 260266 206788 333736 848445 1122567
31193 1122567 586070 -243415 -403993 113767 466470 332499 265963 586876 821274 559393
31183 559393 116891 -59243 -21590 45956 256225 631688 795273 532637 243558 354078
31173 354078 648415 666025 435359 319074 393100 456431 451892 446976 377355 183632 12254
31162 12254 -40139 -133274 -328277 -360933 -130793 -28204 -319758 -603094 -421493 -49847
$$ packed form
31233A46518J6355N8314j00340j09440L2729L5525j02037m5278K65163M02930
31223F00439P6538l92739n14168k82443l9640J03728K67296L31595M606n63134
31213d07922p45084k66589L45405M52857J07541j85068j94596n2077J35203L02994
31203e07336K63908j6656j66292Q6830L72539K27273n3478J26948N14709K74122
31193A122567n36497q29485j60578N17760L52703j33971o6536L20913K34398k61881
31183E59393m42502j76134L7653O7546K10269L75463J63585k62636k89079J10520
31173C54078K94337J7610k30666j16285P4026O3331m539m916o9621j93723j71378
31162A2254n2393r3135j95003l2656K30140J02589k91554k83336J81601L71646
$$ plain form
31152 -49847 -31036 -250034 -185081 166645 389561 509532 923254 1511739 1655941 1213051
31142 1213051 707710 442593 185559 -111562 -96400 214314 237554 -220561 -530887 -220819
31132 -220819 269026 343029 181301 287618 570075 561839 271341 148730 342235 562720
31122 562720 633320 678674 755542 694939 371723 -128172 -620617 -929892 -959281 -818910
31112 -818910 -751649 -766252 -540928 83288 722826 861847 493808 58262 -140899 -155105
31102 -155105 -129863 -149368 -316980 -692990 -1099418 -1193917 -817700 -187873 267999 253936
31092 253936 -128544 -432851 -324920 303 72408 -172252 -290643 -19040 332251 401107
31082 401107 313060 369635 532799 620143 723960 969595 1089957 774239 294335 210117
$$ packed form
31152d9847J8811k18998O4953L51726K22916J19971M13722N88485J44202m42890
31142A213051n05341k65117k57034k97121J5162L10714K3240m58115l10326L10068
31132b20819M89845P4003j61728J06317K82457q236k90498j22611J93505K20485
31122E62720P0600M5354P6868o0603l23216m99895m92445l09275k9389J40371
31112h18910O7261j4603K25324O24216O39538J39021l68039m35546j99161j4206
31102a55105K5242j9505j67612l76010m06428r4499L76217O29827M55872j4063
31092B53936l82480l04307J07931L25223P2105k44660j18391K71603L51291O8856
31082D01107q8047N6575J63164Q7344J03817K45635J20362l15718m79904q4218
$$ plain form
31072 210117 501810 597434 322670 199270 572255 1008179 959516 615114 589387 968822
31062 968822 1173456 775258 48304 -442046 -519097 -428381 -330845 -74516 440551 912896
31052 912896 919361 482260 79862 43936 208636 265522 191487 121491 38833 -122605 -228447
31041 -228447 -99057 182052 397298 545703 763589 959417 870201 499928 184849 149272
31031 149272 259807 302095 262948 236539 243697 240613 163373 -78677 -499328 -909067 -1071402
31020 -1071402 -1000190 -909550 -864391 -713571 -402203 -97848 64929 122903 91250 -92732
31010 -92732 -301215 -174983 417341 1075444 1277304 983178 609878 484845 546035 550662
31000 550662 370825 47020 -293809 -491343 -401930 1990 544627 894971 812695 432089
$$ packed form
31072B10117K91693R5624k74764j23400L72985M35924m8663l44402k5727L79435
31062I68822K04634l98198p26954m90350p7051R0716R7536K56329N15067M72345
31052I12896O465m37101m02398l5926J64700N6886p4035o9996q2658j61438j05842
31041b28447J29390K81109K15246J48405K17886J95828q9216l70273l15079l5577
31031A49272J10535M2288l9147k6409P158l084p7240k42050m20651m09739j62335
31020a071402P1212R0640M5159J50820L11368L04355J62777N7974l1653j83982
31010i2732k08483J26232N92324O58103K01860k94126l73300j25033O1190M627
31000E50662j79837l23805l40829j97534Q9413M03920N42637L50344q2276l80606
$$ plain form
30990 432089 220371 495147 1003667 1161558 734323 89555 -295735 -367237 -382054 -444411
30980 -444411 -401056 -157090 138054 288772 283411 215047 69132 -237186 -590315 -648817
30970 -648817 -248892 259710 344244 -19892 -267435 19211 566497 832132 720265 540618
30960 540618 437864 289423 109244 94539 198787 72133 -411316 -894781 -983731 -689116
30950 -689116 -290614 -24070 -24573 -271782 -436965 -118167 560301 915765 542988 -132351
30940 -132351 -453676 -384065 -357375 -522744 -618446 -497978 -328151 -257853 -251508 -276739 -362998
30929 -362998 -460486 -481117 -446822 -384738 -194070 121308 263439 34624 -264969 -277695
$$ packed form
30990D32089k11718K74776N08520J57891m27235o44768l85290p1502j4817o2357
30980d44411M3355K43966K95144J50718n361o8364j45915l06318l53129n8502
30970f48817L99925N08602Q4534l64136k47543K86646N47286K65635j11867j79647
30960E40618j02754j48441j80179j4705J04248j26654m83449m83465q8950K94615
30950f89116L98502K66544n03k47209j65183L18798O78468L55464l72777o75339
30940a32351l21325O9611K6690j65369r5702J20468J69827P0298O345k5231q6259
30929c62998r7488k0631L4295O2084J90668L15378J42131k28815k99593j2726
$$ [...]
##END NTUPLES=NMR SPECTRUM
##END=
