##TITLE=31Pdec_LY-TMF-6.24.R.t
 D2O, 24 sc
 28.2.2020
##JCAMPDX= 6.0         $$ Bruker NMR JCAMP-DX V2.0
##DATA TYPE= NMR SPECTRUM
##DATA CLASS= NTUPLES
##ORIGIN= UXNMR, Bruker Analytische Messtechnik GmbH
##OWNER= root
$$ XWIN-NMR		Version 3.5
$$ Fri Feb 28 13:51:07 2020 Russian Standard Time (UT+4h)  she@DPX200
##.OBSERVE FREQUENCY= 81.013821
##.OBSERVE NUCLEUS= ^31P
##.ACQUISITION MODE= SIMULTANEOUS
##.ACQUISITION SCHEME= undefined
##.AVERAGES= 24
##.DIGITISER RES= 17
##SPECTROMETER/DATA SYSTEM= spect
##.PULSE SEQUENCE= zgpg30
##.SOLVENT NAME= CDCl3
##.SHIFT REFERENCE= (INTERNAL, CDCl3, 0, 182.463)
##AUDIT TRAIL= $$ (NUMBER, WHEN, WHO, WHERE, WHAT)
$$ ##TITLE= Audit trail, XWIN-NMR		Version 3.5
$$ ##JCAMPDX= 5.01
$$ ##ORIGIN= Bruker BioSpin GmbH
$$ ##OWNER= she
$$ F:/spectra/data/she/nmr/P31/1/pdata/1/auditp.txt
$$ ##AUDIT TRAIL=  $$ (NUMBER, WHEN, WHO, WHERE, WHAT)
(   1,<2020-02-28 13:50:00.20 +0400>,<she>,<DPX200>,
      <created by zg, POWCHK disabled, PULCHK disabled
       configuration hash MD5:
       00 E9 B6 7A A2 85 ED C7 34 08 36 98 17 FE 4E 26
       data hash MD5: 32K
       0B 9B 33 5D 74 1C F3 5D D3 92 D2 26 95 4A FD EF>)
(   2,<2020-02-28 13:50:02.56 +0400>,<she>,<DPX200>,
      <Start of raw data processing
       efp BC_mod = 2 LB = 1 FT_mod = 6 PKNL = 1 PHC0 = -1608.045 PHC1 = 663.0013 SI = 64K 
       data hash MD5: 64K
       5B EE 56 D0 16 B9 AA 4B 63 8D C8 64 71 8A DE 91>)
(   3,<2020-02-28 13:50:18.48 +0400>,<she>,<DPX200>,
      <pk PHC0 = -2.455644 PHC1 = 0 
       data hash MD5: 64K
       12 CF C1 A6 8A 4B 47 D6 3A 05 CC 46 78 9C BA 9C>)
(   4,<2020-02-28 13:50:27.29 +0400>,<she>,<DPX200>,
      <abs ABSG = 5 
       data hash MD5: 64K
       CB 46 35 B1 6C 0F 9B D2 29 09 B7 C4 54 DB A2 75>)
$$ ##END=
$$ 
$$ hash MD5
$$ D7 FD 1B 70 48 8A 10 BA D8 D4 0D 40 0F 68 CF CC
##$RELAX= 
##$RELAX= 
##$RELAX= 
##$RELAX= 
##$RELAX= 
##$RELAX= 
##$RELAX= 
##$RELAX= 
$$ Bruker specific parameters
$$ --------------------------
##$DU= <F:/spectra>
##$EXPNO= 1
##$NAME= <P31>
##$PROCNO= 1
##$TYPE= <nmr>
##$USER= <she>
##$AMP= (0..31)
100 100 100 100 100 100 100 100 100 100 100 100 100 100 100 100 100 100 
100 100 100 100 100 100 100 100 100 100 100 100 100 100 
##$AQSEQ= 0
##$AQ_mod= 1
##$AUNM= <au_zg>
##$AUTOPOS= <>
##$BF1= 81.014009
##$BF2= 200.13
##$BF3= 200.13
##$BF4= 200.13
##$BF5= 200.13
##$BF6= 200.13
##$BF7= 200.13
##$BF8= 200.13
##$BYTORDA= 1
##$CFDGTYP= 0
##$CFRGTYP= 5
##$CHEMSTR= <none>
##$CNST= (0..31)
1 1 145 1 1 1 1 1 1 1 1 1 1 1 1 1 1 1 1 1 1 1 1 1 1 1 1 1 1 1 1 1 
##$CPDPRG= <waltz16>
##$CPDPRG1= <>
##$CPDPRG2= <waltz16>
##$CPDPRG3= <>
##$CPDPRG4= <mlev>
##$CPDPRG5= <mlev>
##$CPDPRG6= <mlev>
##$CPDPRG7= <mlev>
##$CPDPRG8= <mlev>
##$CPDPRGB= <>
##$CPDPRGT= <>
##$D= (0..31)
0 1 0 0 0 0 0 0 0 0 0 0.03 2e-05 3e-06 0 0 0 0 0 0 0 0 0 0 0 0 0 0 0 0 
0 0 
##$DATE= 1582883399
##$DBL= (0..7)
120 120 120 11 120 120 24 19 
##$DBP= (0..7)
150 150 150 150 150 150 150 150 
##$DBP07= 0
##$DBPNAM0= <>
##$DBPNAM1= <>
##$DBPNAM2= <>
$$ [...]
##$SUBNAM3= <"">
##$SUBNAM4= <"">
##$SUBNAM5= <"">
##$SUBNAM6= <"">
##$SUBNAM7= <"">
##$SUBNAM8= <"">
##$SUBNAM9= <"">
##$SW= 369.568048894756
##$SWIBOX= (0..15)
0 1 3 0 0 0 0 0 0 0 0 0 0 0 0 0 
##$SW_h= 29940.119760479
##$TD= 32768
##$TD0= 1
##$TE= 0
##$TE2= 300
##$TE3= 300
##$TEG= 300
##$TL= (0..7)
0 120 53 12 22 120 120 120 
##$TP= (0..7)
150 150 150 150 150 150 150 150 
##$TP07= 0
##$TPNAME0= <>
##$TPNAME1= <>
##$TPNAME2= <>
##$TPNAME3= <>
##$TPNAME4= <>
##$TPNAME5= <>
##$TPNAME6= <>
##$TPNAME7= <>
##$TPOAL= (0..7)
0.5 0.5 0.5 0.5 0.5 0.5 0.5 0.5 
##$TPOFFS= (0..7)
0 0 0 0 0 0 0 0 
##$TUNHIN= 0
##$TUNHOUT= 0
##$TUNXOUT= 0
##$USERA1= <user>
##$USERA2= <user>
##$USERA3= <user>
##$USERA4= <user>
##$USERA5= <user>
##$V9= 5
##$VALIST= <valist>
##$VCLIST= <CCCCCCCCCCCCCCC>
##$VD= 0
##$VDLIST= <DDDDDDDDDDDDDDD>
##$VPLIST= <PPPPPPPPPPPPPPP>
##$VTLIST= <TTTTTTTTTTTTTTT>
##$WBST= 1024
##$WBSW= 4
##$XGAIN= (0..3)
0 0 0 0 
##$XL= 0
##$YL= 0
##$YMAX_a= 13684
##$YMIN_a= -13553
##$ZGOPTNS= <>
##$ZL1= 120
##$ZL2= 120
##$ZL3= 120
##$ZL4= 120
##$ABSF1= 182.463
##$ABSF2= -187.1042
##$ABSG= 5
##$ABSL= 3
##$ALPHA= 0
##$AQORDER= 0
##$ASSFAC= 0
##$ASSFACI= 0
##$ASSFACX= 0
##$ASSWID= 0
##$AUNMP= <proc_1d>
##$AZFE= 0.1
##$AZFW= 0.5
##$BCFW= 0
##$BC_mod= 2
##$BYTORDP= 0
##$COROFFS= 0
##$CY= -3
##$DATMOD= 1
##$DC= 0
##$DFILT= <>
##$DTYPP= 0
##$F1P= 0
##$F2P= 0
##$FCOR= 1
##$FTSIZE= 65536
##$FT_mod= 6
##$GAMMA= 0
##$GB= 0
##$INTBC= 1
##$INTSCL= 5.30512e-09
##$ISEN= 30
##$LB= 1
##$LEV0= 0
##$LPBIN= 0
##$MAXI= 10000
##$MC2= 0
##$MEAN= 0
##$ME_mod= 0
##$MI= 50
##$NCOEF= 0
##$NC_proc= -4
##$NLEV= 6
##$NOISF1= 182.463
##$NOISF2= 159.3651
##$NSP= 0
##$NTH_PI= 0
##$NZP= 0
##$OFFSET= 182.463
##$PC= 4
##$PHC0= -1610.501
##$PHC1= 663.0013
##$PH_mod= 1
##$PKNL= yes
##$PPARMOD= 0
##$PSCAL= 0
##$PSIGN= 0
##$REVERSE= no
##$SF= 81.0140089999434
##$SI= 65536
##$SIGF1= 159.3651
##$SIGF2= -187.1042
##$SINO= 113.3802
##$SIOLD= 16384
##$SREGLST= <1H.CDCl3>
##$SSB= 0
##$STSI= 65536
##$STSR= 0
##$SW_p= 29940.119760479
##$SYMM= 0
##$S_DEV= 0
##$TDeff= 32768
##$TDoff= 0
##$TI= <>
##$TILT= no
##$TM1= 0
##$TM2= 0
##$TOPLEV= 0
##$USERP1= <user>
##$USERP2= <user>
##$USERP3= <user>
##$USERP4= <user>
##$USERP5= <user>
##$WDW= 1
##$XDIM= 65536
##$YMAX_p= 365569422
##$YMIN_p= -9307460
$$ End of Bruker specific parameters
$$ ---------------------------------
##NTUPLES= NMR SPECTRUM
##VAR_NAME=  FREQUENCY,     SPECTRUM/REAL,   SPECTRUM/IMAG
##SYMBOL=    X,             R,               I
##VAR_TYPE=  INDEPENDENT,   DEPENDENT,       DEPENDENT
##VAR_FORM=  AFFN,          ASDF,            ASDF
##VAR_DIM=   65536,         65536,           65536
##UNITS=     HZ,            ARBITRARY UNITS, ARBITRARY UNITS
##FACTOR=    0.456856943014862, 1,           1
##FIRST=     14782.0589164792, 0,            0
##LAST=      -15158.0608439998, 0,           0
##MIN=       -15158.0608439998, -9307460,    0
##MAX=       14782.0589164792, 365569422,    0
$$ Real data points
##PAGE= N=1
##DATA TABLE= (X++(R..R)), XYDATA
$$ [...]
36919h72902P4206M48313K36902l05972m80602n5084M33332M29778J11883P4075
36909I3929M20978N92521J62357n43466q49694n43311k1882K66381K61416J63582
36899B811J04261O3067j257o9262j05764j16672j23981j00165J3108J81025K38158
36888H5329Q6123j08715q1753J50398K78251J43759k8237J858J14865P8314k5310
36877F94882L3236J38977n9975n21223p29589m30076m3563n0466k72201j70204
36867a410202L16004O74737N47093J53414q4544l5195J44454K49514J40969j72247
36857E23997m49693m11233j12743P8708j4688j58315j22992k7669l0753J8405
36847g06976K66381M35803J70553l24176m68352j14769K92349L98507L02979J53074
$$ plain form
36919 -872902 -798696 -350383 -113481 -419453 -900055 -955139 -521807 -92029 19854 93929
36909 93929 514907 1107428 1269785 726319 -123375 -666686 -688568 -422187 -160771 2811
36899 2811 107072 170139 168882 99620 -6144 -122816 -246797 -346962 -333854 -152829 85329
36888 85329 171452 62737 -19016 131382 409633 553392 525155 527013 641878 720192 694882
36877 694882 728118 867095 807120 285897 -443692 -873768 -917331 -967797 -1239998 -1410202
36867 -1410202 -1094198 -419461 127632 281046 196502 161307 305761 555275 696244 523997
36857 523997 74304 -336929 -449672 -370964 -385652 -543967 -666959 -694628 -725381 -706976
36847 -706976 -440595 -4792 165761 -158415 -626767 -741536 -449187 -50680 252299 405373
36837D05373j10549l95847l41131J22612N03670M08843J02243K543j1641k74341
36827D11775n99467n10979q8008P4098k03001l93625j01910L37311L93262R3834
36817e86710j08036J178J99540K16208O0242n4297J7256J98345L04745K77147
36807E25618K00977Q1255j92861n36921n93379k27549J50642J26590q3983r728
36797e59339K53740J97016j96178l75525j38594P3568O25j2135K45308L50290
36787a61224j1646l76903j82899L13178M45635J60983l8426L0344Q2368O483J3422
36776B81315J15827L1693k84344m81470l16394M9537L46465M63158L70846J11496
36766F88129r4521m7803J04888P5209n4684O1911L86552M32043O453m32685m31402
$$ plain form
36837 405373 294824 -101023 -442154 -319542 184128 592971 695214 697757 686116 411775
36827 411775 -187692 -698671 -786679 -712581 -915582 -1309207 -1411117 -1073806 -680544 -586710
36817 -586710 -694746 -693568 -494028 -277820 -217578 -271875 -254619 -56274 248471 525618
36807 525618 726595 807850 614989 78068 -515311 -742860 -592218 -465628 -549611 -559339
36797 -559339 -305599 -108583 -304761 -680286 -818880 -745312 -744687 -756822 -511514 -161224
36787 -161224 -172870 -549773 -732672 -419494 26141 187124 148698 179042 261410 267893 281315
36776 281315 397142 428835 144491 -336979 -653373 -603836 -257371 205787 576633 688129
36766 688129 593608 545805 650693 725902 671218 733129 1119681 1551724 1558177 1125492 694090
36755F94090j67829r1097k15035j73842J38186L63852J73732k76117m99729k27888
36745b81677K82835N24086K99887q3050k34467j33277j4280L2426Q4019J01584
36735E78086m7725k77362l08304r0873P4654m3880k97008l81642k01215J05292
36725h89977L30545L14212N9789j84351j25780K09932M68254L81453N0188k30127
36715C84138k62760m1597K62776L70482J40771k04805l03487j19716L6874j3624
36705B49052j10348q5886n603N4183J63441K96991K31601p9414k93548j33231
36695B87238J58718J52600j24747k55300r0194N1564o2615j78596M3284M40323
36685D22275N04346J10466k56108j77266P7004l8082m56062n33827m6918L98082
$$ plain form
36755 694090 526261 435164 220129 46287 184473 548325 722057 445940 -53789 -281677
36745 -281677 1158 525244 825131 742081 507614 374337 360057 392483 476502 578086
36735 578086 530361 252999 -55305 -146178 -71524 -115404 -412412 -794054 -995269 -889977
36725 -889977 -559432 -245220 -185431 -369782 -495562 -285630 182624 564077 614265 384138
36715 384138 121378 79781 342557 713039 853810 649005 345518 225802 262676 249052
36705 249052 138704 52818 47215 101398 264839 561830 793431 714017 420469 287238
36695 287238 445956 598556 473809 218509 128315 179879 117264 -61332 -18048 422275
36685 422275 926621 1037087 780979 603713 680717 642635 186573 -347254 -394172 3910
36675C910K53398j51236j60610K08112M14470K86414R7223r4750m46440p08576
36665b98085m04558K52988M36948l8612l35759J15547O92345N35568j77492o09272
36655A69618m76483j84691l4388L9087R1656J04089J75088L27377L00730k1046
36645D91037k26227O1392M72882L53666k19354n18726k23633K10144K86947M8441
36635G36569j86313k32281r1385R4048J17639k8862q8892K5997J6397k44187l19831
36624b01101Q6288M49810J65149l83228l74248P7776J45987k13850j72764M23090
36614B909O40160J7642n95119l91484J88588L52871J92267J77298J54030k14337
36604E24825n53703k88223L28597N75644L59113J22530l8533l11243m66738j43453
$$ plain form
36675 3910 257308 106072 -54538 153574 568044 854458 951681 856931 410491 -298085
36665 -298085 -702643 -449655 -12707 -51319 -387078 -271531 420814 956382 778890 169618
36655 169618 -306865 -491556 -525944 -486857 -395201 -291112 -116024 211353 512083 491037
36645 491037 264810 326202 799084 1152750 933396 414670 191037 401181 688128 736569
36635 736569 550256 317975 226590 320638 438277 409415 320523 346520 362917 118730 -201101
36624 -201101 -114813 334997 500146 116918 -257330 -179554 -33567 -247417 -420181 2909
36614 2909 643069 660711 65592 -325892 -137304 215567 407834 585132 739162 524825
36604 524825 -28878 -317101 11496 587140 946253 1068783 1030250 719007 252269 108816
36594A08816L14419K23939k81042l82821R2466M16974K02414k1852J86001M23001
36584A282315J89268k44850k88046O8383L11057J28354l11733o47646o33607l02665
36574d49170L8788J22576L2690o945m2452j98164k08530K61996Q39377O98230
36564A088396k17065r38659p60765j14048K42231K43351K14825J51776n1080j27651
36554b68689J18746K89986J256l35993r8595M60083N48949J16237j05559J50815
36544H77236K87283r3546n22602m48067o7136P2614j22159k98581j95930J38589
36534c72299M75661N48566K61813j42851l40843l46183l79007l78044j06840K66851
36524e13176K80534l7785j31612J42108K29612j27917l48965J5343M35126K37500
$$ plain form
36594 108816 423235 647174 366132 -16689 75777 492751 695165 673313 859314 1282315
36584 1282315 1471583 1226733 938687 1007070 1318127 1446481 1134748 487102 -146505 -449170
36574 -449170 -410382 -287806 -255116 -262061 -304513 -502677 -711207 -449211 390166 1088396
36564 1088396 871331 -67328 -828093 -942141 -699910 -456559 -241734 -89958 -141038 -268689
36554 -268689 -149943 140043 141299 -194694 -293289 166794 715743 831980 726421 877236
36544 877236 1164519 1070973 548371 100304 33168 105782 -16377 -314958 -510888 -372299
36534 -372299 103362 651928 913741 770890 430047 83864 -295143 -673187 -780027 -513176
36524 -513176 -232642 -270427 -402039 -259931 -30319 -158236 -507201 -491858 -56732 180768
36514A80768k46816k08493L19339N54499K26885j19277j03705j1070j68418m60487
36504c6775o40560o09741k78789L41319Q31807O92002R0627k38053K5275M40643
36494F17755N62382M41350J96954k64875q02137r14374m62817J4275R8671P1464
36484d41352K57094L57048L4326l16036j00197M68474O17195J22667m72199o72395
36474a45375m79771q0751L53921N55675L46808l0847j88599j40022j52830j79281
36464a41072K5680L04871K43901p8596j45605J00143J04498l35118o42211l65993
36454i29502R1287J40167q0675k1571L58660N70556L60732N078j56291j10985
36444B27456n6683j19674k30266j97347L5342K15049Q0487j58428k4852M16773
$$ plain form
36514 180768 -66048 -274541 44798 599297 826182 706905 603200 592130 423712 -36775
36504 -36775 -677335 -1287076 -1565865 -1224546 -392739 299263 389890 151837 177112 617755
36494 617755 1180137 1621487 1818441 1553566 751429 -162945 -625762 -611487 -512816 -441352
36484 -441352 -184258 172790 207116 -108920 -209117 259357 876552 999219 527020 -145375
36474 -145375 -625146 -705897 -351976 203699 550507 519660 331061 191039 38209 -141072
36464 -141072 -115392 189479 433380 354784 209179 309322 413820 78702 -563509 -929502
36454 -929502 -838215 -698048 -778723 -800294 -441634 128922 489654 494732 338441 227456
36444 227456 170773 51099 -179167 -376514 -341172 -126123 -45636 -204064 -228916 187857
36434A87857M54584k25317q64898n74888L62237Q21119L65337k70763l47131p6117
36424a67980n5305k69453k13927K12743N05650K99058j07831j92466O9069K26688
36414C06246M3501j67734l8959K68665K74948j09230m32533l39251l8294N4273
36404a78368j01885k09446j10963N5950J42519J80414K47403L06261K48312L4470
36394F14667k32247l65973k71047n9592Q1337J21992J49367J20624r7686l91999
36384c30557m03742l6696L07151K34282j19443l33256k66075q5085R2241K47601
36374f93579K74539R2040j16550j03441M9841N6080r9336j40244M1800K42083
36364c96767K86582K12214P0331j33874k53020p7122K97016M77982K90653N706
$$ plain form
36434 187857 642441 417124 -447774 -1022662 -660425 160694 526031 255268 -91863 -167980
36424 -167980 -223285 -492738 -706665 -493922 11728 310786 202955 10489 79558 306246
36414 306246 349747 182013 143054 411719 686667 577437 144904 -194347 -232641 -178368
36404 -178368 -280253 -489699 -600662 -544712 -402193 -221779 25624 331885 580197 614667
36394 614667 382420 16447 -254600 -314192 -232855 -110863 38504 159128 61442 -330557
36384 -330557 -734299 -770995 -463844 -229562 -349005 -682261 -948336 -1033421 -941180 -693579
36374 -693579 -419040 -327000 -443550 -546991 -497150 -441070 -540406 -680650 -638850 -396767
36364 -396767 -110185 102029 172360 38486 -214534 -291656 5360 483342 773995 779701
36354G79701p8193k4258o0333k05501k86244j98129r592J17460N7692j30287j99578
36343b37262o951K36482K16126l7528k17026k03864j38047o0953J01274J88803
36333a58946o2235m35570l31919L07295P24090L72641k76571m57408j98051o7364
36323e84038j49363j9038L53133M33404R874l86068k44491J86941K92134n4126
36313a61638l64326j90475L41553O76953M38025j41836m53709k21180J79933K47300
36303C50600K820j44774k5962J56505K31201J99939J4008l54258n97285l22974
36293d90180K61416M35051k7261m44158k02046L26209L70720o6680k96083o2707
36283a95719J15152j47787m68902k93642K77848O52437N28405J61762q1766j41627
$$ plain form
36354 779701 701508 677250 616917 411416 125172 -72957 -82549 34911 92603 -37684 -237262
36343 -237262 -244213 -7731 208395 170867 -46159 -250023 -388070 -449023 -347749 -158946
36333 -158946 -221181 -656751 -988670 -681375 42715 415356 138785 -318623 -516674 -584038
36323 -584038 -733401 -752439 -399306 34098 43972 -342096 -586587 -399646 -107512 -161638
36313 -161638 -525964 -716439 -374886 302067 740092 598256 144547 -76633 103300 350600
36303 350600 353420 208646 182684 339189 570390 770329 784337 430079 -167206 -490180
36293 -490180 -228764 206287 179026 -265132 -467178 -140969 229751 163071 -133012 -195719
36283 -195719 -80567 -228354 -697256 -990898 -713050 -60613 467792 629554 547788 406161
36273D06161j84116k98131l72715k43525P4234L36103L20498J14264J3197J06307
36263B72277J40631p8008l30966k68693N1488K11935M2030j33232k108K49490
36253A54844K36441j7234j30588M098L5113k67059n78830m51990L4979L81286
36243e98940L27404Q8019o1599r7952p8847J7404J24827L9930k38418l47546k0930
36232h46648M50019N34907J67071j98999k18105j1485J56067K21358K06531N3628
36222E14344k09529l50984k11695M6878J73963J63584J52844J45790R1650R5503
36212F12348K44209L26348Q0861l23168m49481k54669j53136l17559l81883q7121
36202g03251K17220J10775j91549j58222K23357M42207K41410q2704k05184j62804
$$ plain form
36273 406161 222045 -76086 -448801 -692326 -618092 -281989 38509 152773 165970 272277
36263 272277 412908 334900 3934 -264759 -213271 -1336 40694 -92538 -94646 154844
36253 154844 391285 374051 243463 247561 282674 15615 -563215 -1015205 -980226 -598940
36243 -598940 -271536 -183517 -245116 -343068 -421915 -404511 -279684 -239754 -478172 -825718 -846648
36232 -846648 -396629 138278 305349 106350 -111755 -123240 32827 254185 460716 514344
36222 514344 304815 -46169 -257864 -210986 -37023 126561 279405 425195 516845 612348
36212 612348 856557 1182905 1263766 940598 491117 236448 83312 -234247 -616130 -703251
36202 -703251 -486031 -375256 -566805 -725027 -501670 -59463 181947 99243 -105941 -268745
36192b68745j03237k0455R0457J11080k25j23609k08723l29988m08494k02850
36182a464789K48930N11642L31555L7286N4667K77636K87308Q484k51071l12217
36172b70569k87161k67478j97287n7253J11488L30391N49332M90228R65n09813
36162a07157m59493P2479L98285K04818o1933O91J41428K3108j20287O2986L13922
36151D68847J30122l47681m86365j49359J14895l7841k74823k16458q946N1053
36141g56556L9087J65564L19063K48214P703j46662j70085j84192j34420J19396
36131d92888M04883L36856r3489l74208j03132M67617P23265L95785j92954n34199
36121E37536m41056j63643o7981k17264l06874p1592L20573M54099K29635M956
$$ plain form
36192 -268745 -371982 -392437 -301980 -190900 -191125 -314734 -523457 -853445 -1261939 -1464789
36182 -1464789 -1215859 -704217 -372662 -335376 -280709 -3073 284235 292719 41648 -270569
36172 -270569 -557730 -825208 -1022495 -1079748 -968260 -637869 -88537 401691 402656 -107157
36162 -107157 -566650 -494171 -95886 108932 46999 47690 189118 212226 91939 154925 468847
36151 468847 598969 251288 -235077 -384436 -269541 -307382 -582205 -798663 -807609 -756556
36141 -756556 -717469 -551905 -232842 15372 23075 -123587 -293672 -477864 -612284 -492888
36131 -492888 -88005 248851 155362 -218846 -321978 145639 868904 1264689 1071735 537536
36121 537536 96480 -67163 -135144 -352408 -659282 -730874 -410301 43798 273433 278389
36111B78389P9467K65280J71770k29158n69358n67281l09701l1560J67424K90995
36101d53733K98991J56871k4055n0976J11321K60704J89790m4355j76811p0036
36091A97711J15678J57911P3771M2464R3363P7887m2449j14607q1619j14733l01860
36080A03517m22868k66813j65O9391j6741N4723L35540N02972L29547m2935l77638
36069B68530n82276n60293j66362M54381P66798M14316k64316n97560l75896Q626
36059f34052J67376J36657J33326J67582P5326j84571m21575m05790j23463J80270
36049i08914K52034J27670Q4562K49290L91398K41781r8557k67408j18783J08497
36039F1570J22256q3700k74831k54904n0968J29005J15444k6511p9013K2992R5695
$$ plain form
36111 278389 357856 623136 794906 565748 -3610 -570891 -880592 -912152 -744728 -453733
36101 -453733 -154742 2129 -21926 -72902 38419 299123 488913 444558 267747 197711
36091 197711 313389 471300 545071 587535 680898 758785 716336 601729 520110 405377 103517
36080 103517 -319351 -586164 -586329 -516938 -533679 -478956 -143416 359556 689103 646168 268530
36069 268530 -313746 -874039 -1040401 -586020 180778 595094 330778 -266782 -642678 -634052
36059 -634052 -466676 -330019 -196693 -29111 46215 -138356 -559931 -965721 -1089184 -908914
36049 -908914 -656880 -529210 -444648 -195358 196040 437821 339264 71856 -46927 61570
36039 61570 183826 100126 -174705 -429609 -480577 -351572 -236128 -262639 -341652 -318660 -222965
36028b22965p660j80571k66155k85377k66616o4196L54747O37570M59743P9484
36018B38004P394J91298R6213l52100n42479j37056L50315L33132m017j41146
36008C9558p3170j23377k15083p044L84215M65027J60912p7627k6928L2136r0664
35997D67955j90075j56998k33206m84285n09810o2773M41196M71179J40828l4764
35987a50753O9985J25826j9623j18125J9496K12349J97451R30j22085k2655J55593
35976C48389J37805j09387k38330N0638M64758L62617l11376p52042l15646N13756
35966A51182O99322L0166o46785n88040o878L98997L32141M3034j23115o1399
35956B28625Q3270R3968n2596j01705J31390L90857K54631k26109n26314l67252
$$ plain form
36028 -222965 -230625 -411196 -677351 -962728 -1229344 -1293540 -938793 -301223 158520 238004
36018 238004 245398 436696 532909 180809 -361670 -498726 -148411 184721 180704 39558
36008 39558 -33612 -156989 -372072 -379116 5099 470126 631038 553411 526483 558619 467955
35997 467955 277880 120882 -112324 -596609 -1106419 -1169192 -727996 -256817 -115989 -150753
35987 -150753 -80768 45058 25435 -92690 -73194 139155 336606 337536 215451 192796 348389
35976 348389 486194 376807 138477 189115 653873 1016490 705114 -46928 -362574 151182
35966 151182 850504 880670 233885 -354155 -361033 37964 370105 413139 290024 228625
35956 228625 311895 405863 353267 251562 382952 773809 1028440 802331 276017 -91235
35946i1235o4475k026j17269j34138l766J44135K44799K53049P8718k05169l11697
35935b09074j21169J12760J52868J10406J38231R2616j58883l59418k05045J23521
35925c23187K02191J9066l5654K13609N01271N04616J59500l55877o89365m97208
35915c01038J29072N73276L91873p1953j86349O0196J84289P9562R0550K33106
35905A182584O9689m69518q08503n56873o6014J58239J11779M2546k605l7363
35895c76039O2008K77914L24931R5419j23569j33955j14814j62714l4666L05499
35885A20014M11083P1603k11701j3737K56530N1389l15021j69442L32975M22150
35875I55843j9575l13183j41981K2586j48479k85991m7750K52077J76155j40234
$$ plain form
35946 -91235 -155710 -157736 -275005 -409143 -412909 -268774 -23975 229074 307792 102623 -209074
35935 -209074 -330243 -217483 -64615 45791 184022 276638 117755 -241663 -446708 -323187
35925 -323187 -120996 -101930 -137584 76025 577296 1081912 1241412 885535 196170 -301038
35915 -301038 -171966 401310 793183 721230 534881 595077 779366 858928 949478 1182584
35905 1182584 1252273 782755 -25748 -582621 -648635 -490396 -378617 -336071 -338676 -376039
35895 -376039 -314031 -36117 288814 384233 260664 126709 11895 -150819 -185485 120014
35885 120014 531097 602700 390999 377262 633792 685181 370160 200718 533693 955843
35875 955843 936268 623085 481104 503690 355211 69220 21470 273547 449702 309468
35865C09468k55281o6113J77689K86436K61186J59090L7754n6911j34686j92934
35855E25698j32795Q2249K63039K27294Q3003o604j61601m87291o41719k63496
35845e12223L00818L72957Q842q0326K51272L12688j98949n92281l08184J42464
35835c02922N2087l17468k49158K04422L70212Q0129j71904j09445K3354N1669
35825c69024J19846K61449K52448J8846k17815k87154k26813p8191J41973K81050
35815a03385J93038Q272n4791n3404j38881j53453J24852M35227K86330k41759
35805C02046n18146k73855O7950J30777Q2762J36692J02457j68877l44985r9161
35795e82340K73957K41091j45846l09459J3213M39537N17517K69565J8649o2702
$$ plain form
35865 309468 54187 -11926 165763 452199 713385 872475 910229 853318 718632 525698
35855 525698 392903 475152 738191 965485 1048488 1041884 880283 392992 -248727 -512223
35845 -512223 -211405 161552 170394 90068 341340 654028 455079 -137202 -445386 -302922
35835 -302922 -250835 -568303 -817461 -613039 -242827 -162698 -334602 -444047 -420693 -369024
35825 -369024 -249178 12271 264719 283565 65750 -221404 -448217 -526408 -384435 -103385
35815 -103385 89653 97925 43134 -10270 -149151 -302604 -177752 257475 543805 302046
35805 302046 -216100 -489955 -422005 -291228 -208466 -71774 30683 -138194 -483179 -582340
35795 -582340 -308383 -67292 -213138 -522597 -509384 -69847 447670 717235 735884 673182
35785F73182m1869k2606m6684j40553k92320l71821k19445J06454K85477R6685
35775B6500k20824j86403K79104O51630M27987k01850n57530k95522K15462L88739
35765E27293Q7435l13193m18660k30487m9741m6416n9393R7577K73948J68191
35755C6554j65179l11088p0089K80820M37647M37307L73396J16392l60627o97855
35745G7278n79104j97636Q1650K54271M52088M85819J44839k73853l12125n2265
35735H0962J04081J54002L23576L82531n3374o32329n96317l0097K02734q4335
35725a48566r7115M44983O68124L5107o02352l45690K53771J31444n25842o62548
35715h48684j06134K90052J23744p5213R3176L44327L82693K98468J30444k11220
$$ plain form
35785 673182 631313 608707 562023 421470 129150 -242671 -462116 -355662 -70185 26500
35775 26500 -194324 -380727 -101623 550007 977994 776144 218614 -76908 138554 527293
35765 527293 614728 301535 -117125 -347612 -397353 -443769 -503162 -405585 -131637 36554
35755 36554 -128625 -439713 -509802 -228982 208665 645972 1019368 1135760 775133 77278
35745 77278 -501826 -699462 -617812 -363541 88547 574366 719205 445352 133227 80962
35735 80962 185043 339045 662621 1045152 991778 359449 -236868 -266965 -64231 -148566
35725 -148566 -245681 199302 867426 902533 300181 -45509 208262 339706 -186136 -848684
35715 -848684 -954818 -664766 -541022 -616235 -523059 -178732 203961 502429 632873 421653
35705D21653m54300j65400L97832M28065j96994o11840k43530L53394M05076R459
35695C43415k28358j36423K3940J28499K24171K44874J28191J561p1922k53509
35685D04439n33231n34891q8818L65802L84817J76003J64634K44693N5752k58528
35675C80672k48721J5264J9410k96356m08649j03757J58567K9383j68121l5388
35665f57696K19839J70903q0469o6370K74521M82656K70810p2843j36759L3899
35655D38491N5010k09017m39045l13839J7595J21714j06121k72026l8930L74242
35645c71926M83157J91042j40810k27629j51540q1749k3047K7959m2564k33272
35635e70379k85257j0458L80627N14202L16954K2878j90256l16029l24874j48710
$$ plain form
35705 421653 -32647 -198047 199785 627850 430856 -180984 -424514 -71120 333956 343415
35695 343415 115057 -21366 2574 131073 355244 600118 728309 729870 657948 404439
35685 404439 -128792 -663683 -752501 -386699 -1882 174121 338755 583448 639200 380672
35675 380672 131951 147215 166625 -129731 -538380 -642137 -483570 -454187 -622308 -657696
35665 -657696 -437857 -266954 -347423 -413793 -139272 343384 614194 541351 404592 438491
35655 438491 493501 284484 -154561 -468400 -450805 -329091 -435212 -707238 -746168 -371926
35645 -371926 111231 302273 161463 -66166 -217706 -299455 -322502 -294543 -337107 -570379
35635 -570379 -855636 -866094 -485467 28735 345689 368567 178311 -137718 -462592 -611302
35625f11302J03883J87083O8889Q846J51503K60742O2771l05470m46938k40313
35615g60306K9098R1099J3357J5320J42117K66076L06983K96534K56002J38540
35605G94820q4021l43012n01962m47211j80099J42810L01787K11111J0252r1283
35595a86808l6482O5147J08545Q9313L7307m6960j54754k34991k41549j83834
35585g85066j11330p3645r0724j24028r4682J4516J05464J00210R5571K35152
35575g28562M18642L40510o6197m06143k62811K18821M53673J57991k72761k77099
35565d23936J43245M36115K17398k48553m04998j10365K10032J36942k09935l72769
35555f26824j91328J6076l5104j60980j3177L38817M61097J94884r7020o6109
$$ plain form
35625 -611302 -507419 -320336 -251447 -242601 -91098 169644 232415 -73055 -519993 -760306
35615 -760306 -731208 -640109 -626752 -611432 -469315 -203239 103744 400278 656280 794820
35605 794820 710799 367787 -134175 -581386 -761485 -618675 -316888 -105777 -95525 -186808
35595 -186808 -223290 -158143 -49598 39715 77022 30062 -124692 -359683 -601232 -785066
35585 -785066 -896396 -970041 -1060765 -1184793 -1279475 -1264959 -1159495 -1059285 -963714 -728562
35575 -728562 -309920 30590 -35607 -441750 -704561 -485740 -32067 125924 -146837 -423936
35565 -423936 -280691 155424 372822 124269 -280729 -391094 -181062 -44120 -254055 -626824
35555 -626824 -818152 -802076 -837180 -998160 -1011337 -672520 -211423 -16539 -113559 -179668
35545a79668J36688J65132L5052K1791J25815O9492j52753j66302J68639M31429
35535F55315K28095k06869l71665k32485j56416k45733k42603q7235m7143j72901
35525h79640j35747J60590K94003O287k64363k5092M27921M15661m6995k60227
35515c07602N1339L20876P1538l26342k57259J91500M03538J50339j79503k33955
35505a15531j19217n8984n960J70930L32445J97368k05377m53774k13371L16602
35495a54869N95878L71762m6864k17366j06100k3473j13112j74980m5706R2568
35485A77738l9877l80896n25487j85155M35659P82247N10361j01236m11691j55556
35475A06107K51171L06247J06584R7910K90147K30989k00191n21893l93824j29338
$$ plain form
35545 -179668 -42980 122152 157204 178995 304810 374302 221549 55247 223886 655315
35535 655315 883410 676541 304876 72391 -84025 -329758 -572361 -659596 -706739 -879640
35525 -879640 -1015387 -854797 -560794 -554507 -818870 -843962 -416041 -380 -47375 -307602
35515 -307602 -256263 64613 136151 -190191 -447450 -255950 147588 297927 118424 -115531
35505 -115531 -234748 -293732 -299692 -128762 203683 401051 195674 -258100 -471471 -154869
35495 -154869 441009 812771 765907 548541 442441 418968 305856 130876 85170 177738
35485 177738 137861 -243035 -768522 -953677 -518018 264229 774590 673354 261663 106107
35475 106107 357278 663525 770109 868019 1158166 1389155 1188964 667071 273247 143909
35465A43909j24189k20486q9762J25226J01159m837J93983N45643M95760j0954
35455A155452l95816l16443q1898j7044J9221J91400K65297J6357l10495l47995
35445A78036j44641Q257N7635J33384J94054R3894j03209j92510j37857n7522
35435B9521J0027R0944J22812L8584q8400j61948j90699j49073N6359K82354J34544
35424A75025m13748p28659l18947L55377M80694R3863m3065K81369M15664o64
35414B96909l90250j79947K81645L21633m2425l03722l03227k12874L0668N51960
35404E0370R40443N95495k82174p57624m06455J51069K37057J4737l1082L4304
35394E46140j39292l98736k75312J53395K86900l8756k65777k5025K61350R9043
$$ plain form
35465 143909 19720 -200766 -290528 -165302 -64143 -68980 125003 670646 1166406 1155452
35455 1155452 759636 443193 361295 344251 363472 554872 820169 836526 526031 178036
35445 178036 33395 41652 99287 232671 426725 520619 417410 224900 87043 29521
35435 29521 39548 130492 253304 291888 203488 41540 -149159 -298232 -241873 40481 175025
35424 175025 -238723 -967382 -1286329 -930952 -450258 -356395 -399460 -118091 297573 296909
35414 296909 -93341 -273288 8357 329990 287565 -16157 -319384 -532258 -501590 50370
35404 50370 990813 1586308 1304134 546510 140055 291124 528181 542918 511836 546140
35394 546140 406848 8112 -267200 -113805 173095 134339 -131438 -156463 104887 203930
35384B03930k40240j77650J77040J77214k81835n44692k21803K08953J84609q4492
35374e98966m3788K86754M17174K18180L8498M1763K1146n8143Q4709M49168N38359
35363A394854N6487n86287q11641n91155k85772o8349J05821J90033J21517N2394
35353d22098J33980K13694J03966j9810R6067K65535J26376j80489j65522J70469
35343C22168K59136j34246n22119m67324k02689j13274q2146J63927M23109L01033
35333e2425q0617k27835m9184O2918m6578l7624K82290N30593K91603k24692m47818
35322F31k24231L9241p062k27645k95019j47000N1410K35586M52509N81642L53433
35311H13495k28521p21076p09161k93541J04064K83918L41753L17825J49544l5959
$$ plain form
35384 203930 -36310 -213960 -36920 140294 -141541 -686233 -908036 -699083 -514474 -598966
35374 -598966 -642754 -356000 61174 279354 317852 359615 380761 322618 407327 856495 1394854
35363 1394854 1451341 865054 53413 -537742 -823514 -891863 -786042 -596009 -474492 -422098
35353 -422098 -288118 -74424 29542 9732 105799 371334 497710 317221 151699 322168
35343 322168 581304 447058 -75061 -542385 -745074 -858348 -940494 -776567 -353458 -52425
35333 -52425 -133042 -360877 -410061 -347143 -393721 -431345 -149055 381538 673141 448449 631
35322 631 -223600 -184359 -191421 -419066 -714085 -861085 -809675 -574089 -121580 460062 813495
35311 813495 584974 -136102 -845263 -1138804 -1034740 -750822 -409069 -91244 58300 22341
35301B2341P949J95893J43058j87300l12683Q815K94298N8960l50940k53081K66269
35290a06421M53504P0897k67258j36630L3038k36909n89502l81744K28196M58241
35280d74588Q7092k19609P7174O07241O50415J18050m14958m91266k21071K2517
35270b59003N8998l0702r8839o5522O9434K51437M00968M44569L37666R6435j76580
35259A028861l49775l81192l26749k03802M0746L36726M05152P0211m08236n64898
35249c52956l08548j7836J0687o6672J9092J99427K18087N4490r7370j68548k30485
35238g40632k25004r00L53779N09023L05501n6405l03709l47582k06831O2004
35228f50756K63285J63475j51740k72304j4879K53130J06852k95773m02779m1285
$$ plain form
35301 22341 30290 226183 369241 181941 -130742 -121927 172371 231331 -119609 -372690 -106421
35290 -106421 347083 417980 150722 14092 47130 -189779 -779281 -1161025 -932829 -474588
35280 -474588 -387496 -607105 -529931 77310 727725 845775 430817 -60449 -281520 -259003
35270 -259003 -200005 -230707 -329546 -395068 -325634 -74197 326771 771340 1109006 1205441 1028861
35259 1028861 679086 297894 -28855 -232657 -191911 144815 549967 620178 211942 -352956
35249 -352956 -661504 -679340 -668653 -735325 -716233 -516806 -298719 -244229 -341599 -510147 -740632
35238 -740632 -965636 -966536 -612757 -103734 201767 145362 -158347 -505929 -712760 -650756
35228 -650756 -387471 -223996 -375736 -648040 -662919 -409789 -302937 -598710 -1001489 -1042774
35218a042774L40905K92853m8623j81415Q3657M10981M29730K09577O5508L1062
35208E91461j45132m52219m69763j4454M16038K65310k46749m26452j26007J26614
35198d81353K6854j13461l7139K1590j15312j49403J41933M06717K65526k4590
35188e8638J3593K93371L49960R9367j37333k25095k94255l16117j22718J69471
35178b28394K32031L9873r9015l8748O1363Q4751Q0528M9306m4677q2780M2924
35167I7162J49553K0608j61331o7044J94237K23474n259j42420p5017j995N9350
35156B91318K44709L40136m506m95657l90008L27392P28223K53334m82623o65964
35146A46354m00333k54705k52427l3882L20561L68446P6036j11728M0418K87074
$$ plain form
35218 -1042774 -701869 -409016 -457639 -639054 -555397 -144416 285314 494891 560399 591461
35208 591461 446329 -5890 -475653 -490107 -74069 191241 -55508 -481960 -607967 -481353
35198 -481353 -454499 -567960 -605099 -583509 -698821 -848224 -706291 -299574 -34048 -58638
35188 -58638 -45045 248326 598286 697653 560320 335225 40970 -275147 -397865 -228394
35178 -228394 3637 43510 -55505 -94253 -32890 51861 132389 181695 137018 54238 97162
35167 97162 246715 267323 105992 38948 233185 456659 451400 308980 233963 231968 291318
35156 291318 536027 876163 871657 376000 -14008 313384 1041607 1294941 812318 146354
35146 146354 -253979 -508684 -761111 -794993 -474432 -105986 -29950 -141678 -101260 185814
35136A85814L42051K01943q062k08203l31318l16292j66208P2393L19960M07071
35126D99149J82715k32290n03943m93772l77567k68197k6653L91153P08113O68069
35116E46777L61758K5614k42103m04610l93105k53807j37574l8110J60930L23708
35106e0522J62280k10228l23087r5850J1391j90399k77172m212K03145K773k21061
35095i92942j1757L85120M74895K78035Q1624j09341l06012k15382K03363L81286
35085A68889J1816k75195J01246N76730K85679m71113o89018k56838O1190L6598
35075d50016J56679M39615L09836j99829l07409J69554M28257L4683l64388j81923
35065C5059J76921J12286k05502k84753j24940j0762L3511J08303J44819Q7038
$$ plain form
35136 185814 527865 729808 721746 513543 182225 -134067 -300275 -227882 92078 499149
35126 499149 681864 449574 -54369 -548141 -925708 -1193905 -1220558 -829405 -121292 546777
35116 546777 908535 934149 692046 287436 -105669 -359476 -497050 -535160 -374230 -50522
35106 -50522 111758 -98470 -421557 -517407 -506016 -696415 -973587 -977799 -774654 -771881 -992942
35095 -992942 -1004699 -619579 -144684 133351 214975 105634 -200378 -415760 -212397 168889
35085 168889 180705 -94490 6756 583486 869165 398052 -290966 -547804 -486614 -450016
35075 -450016 -293337 146278 456114 256285 -51124 118430 546687 581370 216982 35059
35065 35059 211980 324266 118764 -165989 -290929 -301691 -268180 -159877 -15058 71980
35055G1980J212j63207m47958m69804J75091R83249Q97709j25451q41141m63678
35045c81998K53271L20180k3454j2695K36339P4510l96720m52052L8483M36133
35035I1997L39055R821k15264l18713l52632k83034j32351M7326K83427N14286
35025a6082N06809K19016k4324k5629n0337l03887m56610j65306K77313L55903
35015C16866J15844k1142J2952m0240j88021k06868j26830j73296l10016l07185
35005i27936j68970n8627P5617L57571N99464N16758K18861N6963R0513J02576
34995H62790R512j28628l25831n08829l79622J15377M51885J91572k77943k66003
34985b55720J76265L96242J71339j07021k12922l21120m24136k20535K59119N21052
$$ plain form
35055 71980 73192 -90015 -537973 -1007777 -832686 150563 1048272 922821 81680 -381998
35045 -381998 -128727 191453 167999 155304 391643 466153 69433 -382619 -344136 91997
35035 91997 431052 440873 225609 -93104 -445736 -728770 -861121 -813795 -530368 -16082
35025 -16082 490727 709743 685419 659790 609453 305566 -151044 -316350 -39037 316866
35015 316866 432710 411568 424520 384280 196259 -10609 -137439 -310735 -620751 -927936
35005 -927936 -1096906 -1155533 -1079916 -722345 -122881 393877 612738 669701 760214 862790
34995 862790 872302 743674 417843 -90986 -470608 -355231 96654 288226 10283 -255720
34985 -255720 -79455 316787 488126 381105 168183 -152937 -577073 -797608 -538489 -17437
34975a7437L06076o8414k31408j91399j09052l2964J3488J0560N9693K19955K75856
34964B34954K4430l02484l23998j13240m4240j41962j08764Q5322J98421K37633
34954b53928L94558N11104K45844k31256l65830p6382J65294J45880J16530J37375
34944G89189l6952l06700k43432P2196M5663l54134l77686K61444P73149M58457
34934A081194k47761n20118l08668j07004o1070K2450J42862J73655J79876K02411
34924E57827M9614k82167l75321k2770L20825J95385j71178l18718k67358k31345
34914e45206o9844L44993O14697L62567m4914m5935J58390j4550m38399m54534
34904a32735l0206J82103o737l1437L44612N17639M1527n58854n28691L3296M07030
$$ plain form
34975 -17437 288639 220225 -11183 -202582 -311634 -344598 -331110 -320550 -260857 -40902 234954
34964 234954 259384 -43100 -367098 -480338 -524578 -666540 -775304 -689982 -491561 -253928
34954 -253928 140630 651734 897578 666322 300492 224110 389404 535284 651814 789189
34944 789189 752237 445537 202105 274301 319964 -34170 -411856 -150412 622737 1081194
34934 1081194 833433 313315 4647 -102357 -163427 -140977 1885 175540 355416 557827
34924 557827 607441 325274 -50047 -72817 248008 443393 272215 -46503 -313861 -545206
34914 -545206 -615050 -270057 344640 707207 662293 616358 774748 760198 321799 -132735
34904 -132735 -162941 19162 12425 -19012 325600 843239 884766 325912 -202779 -169483 237547
34893B37547K87816L4920k6030m8210k81778n67191m83489M0217N00873L81232
34883G5907j71006m92059k44603K06314L78639K78652J70235P4492j21131k88121
34873a32681k12631P189J02938O4474O2920O8970n7762k00799j21929J08679K28008
34862h2624K49611L76064N07150L32935q1726l11201k17369q5538m6834R2483
34852G32951L10107K29870k20258n35343l50282K4696J47435R6545J53828K08656
34842G98205j1572l67291m72418k77984k8451K14291N04610N88244J37322n53009
34832E31947p02419q6855N72507N70204J21155j15066n4040j52716n03294o06703
34822d25280j91435K77526K44455j34658k56417M1331L02689J60026j87575l34223
$$ plain form
34893 237547 525363 560283 534253 486043 204265 -362926 -846415 -806198 -305325 75907
34883 75907 -95099 -587158 -831761 -625447 -246808 31844 202079 276571 155440 -132681
34873 -132681 -345312 -338123 -235185 -170711 -107791 -38821 -96583 -297382 -419311 -310632 -82624
34862 -82624 166987 543051 1050201 1383136 1301410 990209 772840 687302 640468 732951
34852 732951 1043058 1272928 1052670 517327 167045 191741 339176 435721 589549 798205
34842 798205 786633 419342 -53076 -331060 -359511 -145220 359390 947634 1084956 531947
34832 531947 -170472 -257327 315180 885384 1006539 891473 837433 684717 181423 -425280
34822 -425280 -616715 -339189 -94734 -229392 -485809 -444478 -141789 18237 -169338 -503561
34812e03561j99777m692Q4215P7203N7427J22713L20105M92689L42517j47968
34802F40871n01759k54302L75138O56659K63344l08593m17534j07853M8520j85309
34792B09182l99330j85942K26936K88845o1306k68060O0970N58761N56506j5176
34782I71386n27885m74071n5122K00038J32610j463l1000p0157j99066k48374
34772c03104o1582K16378L15135K07358Q8860K4503j42470m58732o66783n11777
34762a292214q8252L10855N54920O51892N07260N8170m04361m61885j69273k12
34752c33100q1587J5535M71552P43699L54423k76878l76763Q7256M66649M06959
34742A477745J40007r3398k73979k83110J2333L11841J36509l83236n89242k80708
$$ plain form
34812 -503561 -703338 -708030 -623815 -546612 -489185 -366472 -46367 446322 788839 640871
34802 640871 139112 -115190 259948 916607 1179951 871358 453824 345971 394491 209182
34792 209182 -190148 -376090 -149154 139691 78385 -189675 -128705 430056 986562 971386
34782 971386 443501 -30570 -85692 114346 246956 245493 214493 144336 -54730 -303104
34772 -303104 -364686 -148308 166827 374185 463045 487548 345078 -113654 -780437 -1292214
34762 -1292214 -1380466 -1069611 -514691 137201 644461 702631 298270 -163615 -332888 -333100
34752 -333100 -414687 -399152 72400 816099 1170522 893644 516881 604137 1070786 1477745
34742 1477745 1617752 1524354 1250375 967265 979598 1291439 1427948 1044712 455470 174762
34732A74762K0600l3966j23833N4120K29786Q3228j89385k41684r9342L5545J30068
34721C9899J83173J21804N2791J78525K98566k0332n73250n57358J57332O15237
34711D96387J90291m02994k75254K14128J78904k34309j60361M20128O13810Q6591
34701A127321m60668m41130j09452Q5992J18295Q8467m9999k12720j44315J34141
34691A35932K74056J29422p6442j85788k76105l41973k47566n2849K3498j2252
34681f30067K3121J07041J07124J53813M03006N44066J62799m65059o23981k16671
34671d34808J33325J07910P1979K48319K80642m6891l21910j59701J75924K29223
34661B84012J9031j34096j21603o2303n1748j14917j90250q4553K68482N24903
$$ plain form
34732 174762 195362 161396 37563 91683 321469 404697 215312 -26372 -125714 -90169 39899
34721 39899 223072 344876 397667 576192 874758 854426 281176 -276182 -118850 496387
34711 496387 686678 283684 8430 222558 401462 167153 6792 426920 1040730 1127321
34701 1127321 666653 225523 116071 202063 320358 408825 358826 146106 1791 135932
34691 135932 409988 539410 462968 277180 1075 -340898 -588464 -641313 -617815 -630067
34681 -630067 -606946 -499905 -392781 -238968 164038 708104 870903 405844 -218137 -434808
34671 -434808 -301483 -193573 -121594 126725 407367 360476 38566 -121135 54789 284012
34661 284012 303043 168947 47344 -14959 -66707 -181624 -371874 -456427 -187945 336958
34651C36958L18950j04098j78611O9824O0449l19878m79725j32351K15352J42264
34641g0866k7196R8532K78054J48340j06116j53607j22174k46791l18786o2751
34631e83361K77352L01917J29372J45686K96220J83917k38346n58322m55412k0230
34621e21207M17914N42878K63480j26504j92207P4350K14757P598j81549l1755
34611D67755J74471K9822l12801m03879j98502l5528p9017j81191j83665l5269
34601g57804K58033N37531N19646J61883j99655k94954k54392k87597l32132k68286
34591i17727j65284n5762J92329N12220N33473J47115k29954k89155k83527m57697
34581a013969n11975j43400L19830M09614K74145L30205M81433L37073l2293k12883
$$ plain form
34651 336958 655908 551810 373199 443023 503472 183594 -296131 -428482 -213130 -70866
34641 -70866 -98062 470 278524 426864 320748 167141 44967 -201824 -520610 -583361
34631 -583361 -306009 -4092 125280 270966 567186 751103 512757 -45565 -500977 -521207
34621 -521207 -103293 439585 703065 576561 384354 458704 673461 681059 499510 467755
34611 467755 642226 672048 359247 -44632 -243134 -278662 -357679 -538870 -722535 -757804
34601 -757804 -499771 37760 557406 719289 519634 224680 -29712 -317309 -649441 -917727
34591 -917727 -1083011 -1138773 -946444 -434224 99249 246364 16410 -272745 -556272 -1013969
34581 -1013969 -1525944 -1669344 -1349514 -939900 -665755 -335550 145883 482956 450663 237780
34571B37780j50788j21031j40027l593K14627K69886K16977K25651J17846k88433
34561E78895n70818j85693N27450O31087n3095o50634m97126J6340J76560o9654
34551i6688k71845j94203K4506J81855J78910L1497j00794l4465J89276L23614
34541B31663K31388K4279j21637j24575L090J39240Q9579j75927l99646l32758
34531d35304n1277K01228L27023L28124J59136j11590k11942l1191J51634J09077
34521D34918N0248J90355K62191l8260m01353l09483R1301J86210j22536l06501
34511C7090j20772M6626j01375k87778j66982J38181K95153K44478J64795J48434
34501C97850J07896o5963l10724l51388P891M89318N33560P4918k54592k8033
$$ plain form
34571 237780 86992 -34039 -174066 -177659 36968 306854 523831 749482 867328 578895
34561 578895 8077 -177616 349834 980921 927826 277192 -219934 -203594 -27034 -96688
34551 -96688 -368533 -562736 -538230 -356375 -177465 -145968 -246762 -281227 -91951 231663
34541 231663 463051 487330 365693 241118 244208 383448 473027 297100 -102546 -435304
34531 -435304 -486581 -285353 41670 369794 528930 417340 205398 174207 325841 434918
34521 434918 485166 675521 937712 899452 498099 188616 279917 466127 343591 37090
34511 37090 -83682 -37056 -138431 -426209 -593191 -455010 -159857 84621 249416 397850
34501 397850 505746 439783 129059 -222329 -214438 274880 808440 883358 628766 600733
34491F00733K92260Q4978l98549m23997L7817K90006L0049k68991k07299r286
34481B7721q90q5505k9400J07682Q9884j51363m20814m01819L6420N42874N21240
34470B36030j09799o94486o75160k64991Q8715M02533P49394P01543k947o63717
34460b32885m43032K97094M96228M0853j96436R2308K39583r9416l71795j84602
34450c62100O9127N3044O2200L08968M28703J57674j74235k25172r7378P8740
34440B99571L56799N30629K16567l62341m63388J8184L15512L6953k58892j45016
34430E44578k9175k30324k91503J01364L79521N4904l40924j34238L27422K88048
34420F69673j59301l28810q0470J35357J02440k4403j78450l46849l13524J0631
$$ plain form
34491 600733 892993 977971 579422 155425 193242 483248 513297 244306 37007 27721
34481 27721 26831 -58674 -88074 19608 109492 -41871 -462685 -864504 -828084 -285210 236030
34470 236030 126231 -568255 -1243415 -1508406 -1419691 -1017158 -267764 433779 430832 -232885
34460 -232885 -675917 -378823 117405 158258 -38178 54130 293713 194297 -177498 -362100
34450 -362100 -292973 -239929 -177729 131239 559942 717616 543381 318209 220831 299571
34440 299571 656370 1186999 1403566 1041225 577837 596021 911533 948486 689594 544578
34430 544578 515403 285079 -6424 94940 474461 529365 188441 54203 381625 669673
34420 669673 510372 181562 101092 236449 338889 314486 136036 -210813 -524337 -513706
34410e13706K71991J87903M1589J73419L75126L17298J52484J23635K2931l27459
34400H25211n09097j39292L36286K66849j22939j19451K46001K50905k74384o08417
34390A51672k06934N35887Q26898L70364m26958q94394p01078j67323J25584R2703
34380b93579J75333M90752N06362o8364o22521m50644J97405M98411J91404k66300
34370C58259m43917k77909J30898N40674N68273J26105l29573l71375j45821K3527
34360A79141J79356M07539M06311k5586m39522l20622Q0847J51901j14404k24670
34350B80291n7546M3713n7359j30546m1696J03604K06585K04587K7093j76375
34340D02351p1405K90233L70972j3197k99488r4401J41433o4939l22309j06408
$$ plain form
34410 -513706 -241715 -53812 -12223 161196 536322 853620 1006104 1129739 1152670 825211
34400 825211 316114 176822 513108 779957 657018 537567 783568 1034473 760089 151672
34390 151672 -55262 480625 1307523 1677887 1250929 356535 -344543 -511866 -386282 -293579
34380 -293579 -118246 372506 878868 810504 187983 -262661 -65256 433155 624559 358259
34370 358259 -85658 -363567 -232669 308005 876278 1002383 672810 301435 155614 179141
34360 179141 358497 766036 1172347 1146761 707239 386617 467464 619365 504961 280291
34350 280291 222745 266458 209099 78553 36857 140461 347046 551633 578726 402351
34340 402351 330946 621179 992151 978954 679466 585065 726498 661559 339250 232842
34330B32842K41179J34504j69283p6455K04097O7128l08662k66772J11404J84232
34320C54214n8318o9793J38124O4752j91755n1282L64121L17510j98458l57200
34310C11915Q1611L63514L1104m16865n01527m34953m29579k27275K52565N73695
34300c95795N00476L60161L49787J84853k16610l97550j03281K54032K51119L2780
34290H19972r3582j31871j64979j17202r875l1774j63297j37764R7371K82867
34280C49866K66190J21791r7262k91697j63835L21479N54263M7127o47684o14147
34270a53909K8426L47539R3872q3829Q2511J13533j50684k24649J3180M0676k51465
34259a44799k56187K03478M31330L9819l65193k20552J22402J27450p3761j12407
$$ plain form
34330 232842 474021 608525 439242 362787 566884 634012 325350 58578 169982 354214
34320 354214 295896 226103 364227 428979 237224 185942 550063 867573 669115 311915
34310 311915 393526 757040 788144 371279 -130248 -565201 -994780 -1222055 -969490 -395795
34300 -395795 104681 464842 814629 999482 782872 385322 282041 536073 787192 819972
34290 819972 726390 594519 429540 312338 302463 270689 107392 -30372 66999 349866
34280 349866 616056 737847 640585 348888 185053 506532 1060795 1107922 460238 -153909
34270 -153909 -125483 222056 315928 232099 314610 428143 277459 52810 65990 106666 -144799
34259 -144799 -400986 -197508 233822 273641 -91552 -312104 -189702 -62252 -136013 -248420
34249b48420k3330K6360P8891J01333n6878j89658J00531N83618N52374j3966
34239I10855l42382j56919o6957l44078m09909j8887J56948k49923n42930j50492
34229a214674L88238M09757K07661K97262M13468J22960k54300j96634J24128
34220B97866K58797K31450J99021k5338m43539n23568o9552K32504j40035o39565
34210f21959n52521j27561L0681M6421L46558P02042O19304K61104J26115J86573
34200A016757J14368j4773L3307Q5597q7663k57911j79423p9057j35873m5471
34190D49858K94227L35828j79759n57334k32203K00348k5216n06641l86751J64952
34180d42691L18485R427j33906O082n259j85071j32321J24985J81391L5964K2143
$$ plain form
34249 -248420 -271750 -245390 -166499 -65166 -122044 -311702 -211171 372447 924821 910855
34239 910855 568473 411554 344597 519 -409390 -428277 -271329 -521252 -1064182 -1214674
34229 -1214674 -826436 -416679 -209018 88244 501712 624672 370372 173738 297866
34220 297866 556663 788113 987134 961796 518257 -5311 -74863 157641 17606 -621959
34210 -621959 -1174480 -1302041 -1271360 -1224939 -878381 -176339 442965 704069 830184 1016757
34200 1016757 1131125 1116352 1149659 1235256 1147593 889682 710259 631202 495329 449858
34190 449858 744085 1079913 900154 342820 110617 310965 285749 -220892 -607643 -442691
34180 -442691 -124206 -114779 -248685 -242603 -247862 -432933 -565254 -440269 -258878 -222914 -200771
34169b00771J23623J12253J32801L89521N32258J59589l49879l45834K6677J33931
34159G14169k5572P6436M43868N20342J47991k56537m52124n66553n81820l03567
34149b83367J73019N16035N96461M50743N4878m31157n71045k87016j25029l65489
34139b71967m51773N1498N70839L94213j63760l43714j41806j4472P6698L43611
34129D9367M03845j16957o55408m52209J65983L14804j0311j17696J03093K02373
34119a13116J64373K64702K27655l30365q80215n81663K91761O85669L51943k8845
34109E1899j24180j81877j48698K45583O27649L83152j67802j69357K92226L31088
34099A139683j69670m02027j00124Q6539j54794l40698j96176n9918p9856K4438
$$ plain form
34169 -200771 -77148 35105 167906 557427 1089685 1249274 899395 553561 580238 714169
34159 714169 688597 765033 1208901 1729243 1877234 1620697 1168573 602020 20200 -283367
34149 -283367 -110348 405687 1002148 1452891 1507769 1076612 505567 218551 93522 -271967
34139 -271967 -723740 -672242 -101403 292810 129050 -214664 -356470 -370942 -294244 49367
34129 49367 453212 336255 -319153 -771362 -605379 -290575 -300886 -418582 -315489 -113116
34119 -113116 51257 315959 543614 213249 -666966 -1248629 -956868 -271199 80744 51899
34109 51899 -72281 -254158 -402856 -157273 470376 853528 685726 516369 808595 1139683
34099 1139683 970013 567986 467862 554401 399607 58909 -137267 -197185 -277041 -252603
34089b52603K29773J56956j29608j46804J16906J92167K0751M249J90812K56318
34079F38917K18981L36292M29313J55300k45441l21980k38941l55408l95158k0384
34069B01491K63270r7504n24073j89411M31122L05248l16044l46089J97973L21673
34059B47656j00809k31314R9651K39167J02991J90992L31375m9444n55211l08264
34049c3210L61351L68915j66537j68609L48230L38725k30280l15869J83080K63931
34039I49727k10591k77825K33215M28304J12366N733J24446j89308o18364k31295
34029C26408N33802L58481m97395m87885M26555O93876L2931j56708M41009M91377
34019B162451l07030n69817J17034M27294j39133m23204k7966m9213o75504o18524
$$ plain form
34089 -252603 -22830 134126 4518 -142286 -25380 166787 187538 191787 382599 638917
34079 638917 857898 1194190 1623503 1778803 1533362 1211382 972441 617033 221875 201491
34069 201491 464761 367257 -156816 -346227 84895 390143 74099 -271990 -74017 247656
34059 247656 146847 -84467 15184 254351 357342 548334 879709 830265 275054 -33210
34049 -33210 328141 697056 530519 361910 710140 1048865 818585 502716 685796 949727
34039 949727 739136 461311 694526 1122830 1235196 1240929 1365375 1176067 557703 326408
34029 326408 860210 1218691 721296 233411 659966 1353842 1386773 1230065 1671074 2162451
34019 2162451 1855421 1285604 1402638 1829932 1690799 1267595 1239629 1190416 514912 -103612
34009a03612L11545O46724K3959j45612M80114M43174n66437q96727m874N44300
33999G32554J05642N566N97696M06119p17576q63415L11156O35678n51370r91138
33989c29088L31873J259078M76245j97880M79193Q33623j99667q26190O2415O55531
33979B545133j75351o51509K42880O15107m53443q04758N39557J126434k96403
33970B687647j177769K6806R19375l9153n32583O92158R82210p62556j230048
33961A566087R60627J894831m39951j826892M86358K337705M08187j406625L88775
33952D369102J995856K0210j330369J436916L341348K90094j986281J653021N114993
33943A4904890K321713k17425M481680R201026O022071L737501J1983768J9724221
$$ plain form
34009 -103612 207933 854657 878616 733004 1213118 1656292 1089855 193128 188254 732554
33999 732554 838196 843762 1441458 1847577 1130001 266586 577742 1213420 662050 -329088
33989 -329088 2785 1261863 1738108 1540228 2019421 2853044 2653377 1827187 1889602 2545133
33979 2545133 2369782 1718273 1961153 2576260 2122817 1318059 1857616 2984050 2687647
33970 2687647 1509878 1536684 2456059 2416906 1884323 2576481 3558691 2796135 1566087
33961 1566087 2526714 4421545 3981594 2154702 2641060 4978765 5386952 3980327 4369102
33952 4369102 6364958 6385168 5054799 6491715 9833063 10123157 8136876 9789897 14904890
33943 14904890 17226603 17009178 21490858 30691884 36713955 40451456 52435224 72159445
33935G2159445J5976384K1083188N9772392J04312547Q9784368K481098q6681980
33928B78887442j04681464o1699678k1991039j5395528j8767636j1468965l745766
33921D1137366o416100r642694m442890P54849k064008n751768k791721J157145
33913A1940179n68663l315589j238057J607407m6786k587885j126631J216954
33905E880929O117j974356p19218J127148j77823k063566q34364J177270L57456
33896B779593j269172l12714J350735M59685j258160o09213R15048K88146j174625
33887A169323o45840O61558J33230r90051k17788J061524K08686j394859p93796
33878h08013J015267R92281m13698n02429N24123L68738p15585o04866M18595
$$ plain form
33935 72159445 88135829 109219017 168991409 273303956 363088324 365569422 278887442
33928 278887442 174205978 112506300 90515261 75119733 56352097 44883132 41137366
33921 41137366 34721266 25078572 20635682 21390531 19326523 13574755 10783034 11940179
33913 11940179 11371516 8055927 6817870 8425277 8378491 5790606 4663975 5880929
33905 5880929 5887046 3912690 3193472 4320620 4142797 2079231 1244867 2422137 2779593
33896 2779593 1510421 1197707 2548442 3008127 1749967 1140754 2055802 2343948 1169323
33887 1169323 523483 1185041 1318271 328220 110432 1171956 1380642 -14217 -808013
33878 -808013 207254 1199535 785837 283408 807531 1176269 460684 -144182 274413
33869B74413L23607o08659l98636P00170O98244l21272n00232K12879K02380n30702
33859E2192m70909L64929N13408r7699k08462J99686N1514m51715j68507O16552
33849D00989N98901j16900l02234O3312l3179n33942n18777j01827r8371k80821
33839i22849Q6591N47776K16897l99639k55059K68938J58330k47699k6316L96705
33829a76325J02815l70420j0895N89585K84736l50171l4385P36194N58077k59098
33819A070113l37867J50344l0556o35542l92915M13473L44971m90906o38102m431
33809e51418J06652m13667l40087L90799M86176k15261m07846K43677N70671J52120
33799B1816m4932L21344L59519j99830m59135j11535N7142j89439j44197K61381
$$ plain form
33869 274413 598020 -10639 -409275 290895 989139 667867 167635 380514 582894 52192
33859 52192 -418717 -53788 459620 361921 153459 353145 404659 -47056 -215563 400989
33849 400989 999890 882990 580756 644068 610889 76947 -441830 -543657 -642028 -922849
33839 -922849 -836258 -288482 -71585 -471224 -726283 -457345 -299015 -546714 -573030 -176325
33829 -176325 -73510 -443930 -454825 134760 419496 69325 34940 771134 1329211 1070113
33819 1070113 732246 882590 852034 216492 -176423 237050 582021 91115 -546987 -551418
33809 -551418 -444766 -858433 -1198520 -807721 -321545 -536806 -944652 -700975 -130304 21816
33799 21816 -23116 298228 657747 457917 -1218 -112753 -55611 -245050 -389247 -127866
33789a27866K23392k73792l03106J97454K16567m13117o52755j67543J50868m3077
33779a192975O916N15853O67165K27545J047K26332J61494l03592l00212K88142
33769B97715M42588j22382l96740M4186K79472j90365n55451k73056M4531J3330
33759d16172J83660O58396N94013j54240m80392N2338L45293k51442o97123j09833
33749b75502O44215M64290j94944l47351j47492k30219l56495j0688M42860L86668
33739C75342N6780j8384j6849k86113m70566j38499L12367K79980m5536j20531
33729g2009L8186J08625J08000J25536l8502l72267l91207N6021L67409J31139
33719F0931j99623j40351M3600j3909q7244N4800R1325j85798l56851j43382L7571
$$ plain form
33789 -127866 95526 -178266 -481372 -283918 -67351 -480468 -1133223 -1300766 -1149898 -1192975
33779 -1192975 -1186059 -670206 -3041 224504 225551 451883 613377 309785 9573 297715
33769 297715 740303 617921 221181 265367 544839 354474 -200977 -474033 -429502 -416172
33759 -416172 -232512 425884 1019897 865657 385265 437603 782896 531454 -165669 -275502
33749 -275502 368713 833003 638059 290708 143216 -87003 -443498 -454186 -11326 375342
33739 375342 432122 413738 396889 110776 -359790 -498289 -185922 94058 48522 -72009
33729 -72009 -33823 74802 182802 308338 269836 -102431 -493638 -437617 -70208 60931
33719 60931 -138692 -279043 -235443 -249352 -336596 -281796 -190471 -376269 -733120 -876502 -838931
33708h38931r2112o6526M06661P13094L00573l30666m20648r9808N4970K6416
33698c46977J13533J98041L3457j62898q8811Q2650R2008P2995J31932K798l60557
33687b31829m59738o3334K92367J66545q7125m0290J04517J02800J88273L87956
33677C60142J68766n16379p32690J9651P71592M78055l53237n46598q1696J81881
33667b50513O5069R4154L10223K58905k0151o4795R2376L6375j66844j31984R490
33656B32305j52990m16430k35575K46794L54824j0106k80291k00565p8840p4744
33646f15618k661J39962J20184n1699j48673j38405p5798J63871N09831M44744
33636C45738k01299o50172j96182N95094O71423J12781j30761J38785K24378p1472
$$ plain form
33708 -838931 -931043 -997569 -590908 122186 422759 92093 -328555 -428363 -373393 -346977
33698 -346977 -233444 -35403 -1946 -164844 -253655 -171005 -78997 -6002 125930 128728 -231829
33687 -231829 -691567 -754901 -462534 -295989 -383114 -423404 -318887 -216087 -27814 360142
33677 360142 528908 12529 -720161 -700510 71082 549137 195900 -350698 -432394 -250513
33667 -250513 -185444 -91290 218933 477838 457687 392892 485268 521643 354799 222815 232305
33656 232305 79315 -337115 -572690 -325896 28928 18822 -261469 -462034 -540874 -615618
33646 -615618 -618279 -478317 -358133 -409832 -558505 -696910 -772708 -608837 -99006 345738
33636 345738 144439 -505733 -701915 -106821 564602 677383 546622 685407 909785 838313
33626H38313j79714P49j31916n89902n02277L76548R84119M84252m32942o14118
33616B33112j10586J25516k14403m75058j63837L60114M74986J02919k93393l04047
33606b64677J6376K86480K41853l1554k84178l72317k74353k0057K51101L25316
33596a26010J71156R49o0460j40379k89158k84321j2692K44471K06016q5j21290
33585d11803j79593k55294j80600J67324N35975O28926N03174L13075M583l77021
33575G48746m84699k09199j16j70762l37298r4233K42756K17555O6135K07994
33565A86879L61174L9893m38729l99239K0032J30027q8352p3151J50576J9883
33555i1007l59518k34580M06630O34597R6631l68655j15585L15932K09559j83936
$$ plain form
33626 838313 658599 659348 527432 -62470 -564747 -188199 795920 1280172 847230 233112
33616 233112 122526 248042 33639 -441419 -605256 -245142 229844 332763 39370 -264677
33606 -264677 -248301 38179 280032 248478 -35700 -408017 -682370 -702427 -451326 -126010
33596 -126010 45146 46095 -14365 -154744 -443902 -728223 -740915 -496444 -290428 -290513 -411803
33585 -411803 -591396 -846690 -1027290 -859966 -323991 304935 808109 1121184 1125767 748746
33575 748746 264047 54848 54732 -116030 -453328 -547561 -304805 -87250 -21115 186879
33565 186879 548053 587946 149217 -250022 -229990 -99963 -188315 -261466 -110890 -91007
33555 -91007 -450525 -685105 -278475 356122 452753 84098 -31487 284445 494004 310068
33545C10068k30422J6847O5316j43695k61798j43686P1649K58082L25080J92208
33535D59649j1303k7137Q0792l4473l48403l75561J6563K84045O4023k11103m0051
33524a42959L07799K63760j04832k61868q1169N2147o7056k08829j63479k4632
33514d31118N3862O8822O0946K7419K848N6960J61255J83267O6062n9709k165
33503A88449K50355M52020L41874k3211l02103k95168j70023j51258j94877j64299
33493f8241j16987j48644j34321P0866L24361L96814L26859K63736J42583j22232
33483I34794l14930k05716J4985K7887p5069k2422O9113p7307k83523j72622R1770
33472a3040L3799k40503j63889K54697L60108j7742k16925J47681N16715K88152
$$ plain form
33545 310068 79646 96493 161809 18114 -243684 -387370 -315721 -57639 267441 459649
33535 459649 448346 421209 502001 467528 119125 -256436 -239873 44172 108195 -102908 -142959
33524 -142959 164840 428600 323768 61900 -19269 32878 -34178 -243007 -406486 -431118
33514 -431118 -377256 -308434 -247488 -220069 -217221 -160261 994 184261 250323 190614 188449
33503 188449 438804 890824 1232698 1209487 907384 612216 442193 290935 96058 -68241
33493 -68241 -185228 -333872 -468193 -397327 -72966 323848 650707 914443 1057026 934794
33483 934794 619864 414148 429133 457020 381951 359529 428642 351335 67812 -104810 -13040
33472 -13040 20759 -219744 -383633 -128936 231172 213430 -3495 144186 660901 949053
33462I49053k68468n22642l93807k27863j55303o3472O7185J91127L31750M14896
33452C22456K49639r3005k20693J1505K27936R9424j70747k27424r9530l2084
33442F7477o0785p2512p3592j19995j46613p3203N8155J58525J50040m5714l38774
33431d96991l70232N9145N50939N62023K02738J0786K1244j89736n27967l65692
33421e43743K72207M74812j33266o42411k05469O29269P54348J09594m20297l54298
33411e9254k2819J77299J83075k646l50273n90010m45396m7045K53885L55698
33401e47486L43469J74518j60319l70636k12248O6426O2871j46116j54028J13167
33391h30382L29528K98602J46654J7646p6353j14338n9846K1830M3462K3317k0369
$$ plain form
33462 949053 680585 157943 -235864 -463727 -619030 -682502 -615317 -424190 -92440 322456
33452 322456 572095 479090 258397 269902 497838 597262 426515 199091 99561 67477
33442 67477 6692 -65820 -139412 -259407 -406020 -479223 -421068 -262543 -112503 -158217 -496991
33431 -496991 -867223 -808078 -257139 304884 507622 518408 539652 349916 -178051 -543743
33421 -543743 -271536 203276 70010 -572401 -777870 -148601 605747 715341 295044 -59254
33411 -59254 -82073 95226 278301 275655 -74618 -664628 -1110024 -1157069 -903184 -547486
33401 -547486 -204017 -29499 -189818 -560454 -772702 -706276 -643405 -789521 -943549 -830382
33391 -830382 -500854 -202252 -55598 -37952 -114305 -228643 -288489 -266659 -223197 -199880 -220249
33380b20249j48826l10355k76966J3986K62722J91430n0325r6018J55219M42119
33370c7263M23914j717n18284n88308r2032L76888K71225o4637L7359L49066N6120
33359B12331p01662p92992N5230O29805J38631m66368q4408O79997N68588k05759
33349C3393l81207K26051N33907N4112m59180l93404j04072m3532o8864N947j5466
33338f12315k15228k92570r2867J35181J99172J68593L8878k50115m19631j06199
33328a447101M24556M88719K4842k60216L2047M37653M11988O6959j75971j70459
33318a66983K509K47751L84545K28369q8767k24867j37011r8776j70187j02617
33308a26034J56863L23651K33227L1022j41934k49037j67220J45634L45303Q1030
$$ plain form
33380 -220249 -369075 -679430 -956396 -942410 -679688 -488258 -538583 -634601 -479382 -37263
33370 -37263 386651 384934 -133350 -721658 -813690 -436802 -165577 -230214 -192855 156211 212331
33359 212331 -489331 -1282323 -1227093 -597288 -458657 -925025 -1009433 -329436 239152 33393
33349 33393 -347814 -121763 412144 466256 7076 -386328 -490400 -533932 -602796 -596849 -612315
33338 -612315 -827543 -1120113 -1212980 -1077799 -878627 -710034 -671156 -921271 -1340902 -1447101
33328 -1447101 -1022545 -533826 -508984 -769200 -737153 -299500 112488 179447 3476 -166983
33318 -166983 -164474 83277 467822 696191 607424 382557 245546 146770 -23417 -126034
33308 -126034 30829 354480 587707 618729 476795 227758 60538 206172 551475 632505
33298F32505l78271m62225j64763M6564R3380K89690N11078K51509l65336n49421
33288i5290q5029K78548M0678l07152k19922L0846J545j25074k9938N9550j49760
33277f00998l52255j37177K48658K82831L427j41302l4796O8921N8828L4835J4155
33266e54873l5205k3850Q4805J26739J1402j17060j89039l09382l50347L9475
33256a317335P05615Q60006J72708n63508m85515R5420K37644j89154m31543q3012
33246i98674M06173N03642K30438j14142l53192l92925j68302J99233M29425L77454
33236A19130J66250J6525L6794J24228M4964k35046l48214P271M39779K68486
33226F40167l51277m55521K40739P19376J69110o53279n15841L95119Q07776L11133
$$ plain form
33298 632505 254234 -207991 -372754 -326190 -232810 56880 567958 819467 454131 -95290
33288 -95290 -180319 98229 138907 -168245 -388167 -357321 -355776 -480850 -510788 -451238 -600998
33277 -600998 -953253 -1090430 -841772 -558941 -555514 -696816 -731612 -662691 -603863 -569028 -554873
33266 -554873 -590078 -613928 -529123 -402384 -390982 -508042 -697081 -1006463 -1356810 -1317335
33256 -1317335 -611720 248286 420994 -142514 -628029 -532609 -294965 -484119 -915662 -998674
33246 -998674 -592501 -88859 141579 27437 -325755 -718680 -886982 -687749 -258324 119130
33236 119130 285380 301905 338699 462927 507891 272845 -75369 -68098 371681 640167
33226 640167 288890 -166631 74108 793484 962594 309315 -206526 188593 996369 1307502
33216A307502k29385k05022m3496j86968l31083j61466j4901k33392m92117l48808
33206i39136K7231K26503K84755M28354M66328O2284n49812p23887k82631K48921
33196g51090L74758J84637K7162k7971j36272k89138k96828j34831k6875q7874
33186a164322j12465R5507L63007L92416K50891K55452L95821L07216p9443l25063
33176C79017j58490P6142k312j90481j15196O8480m8326l79772m66294k23465
33166a060697K0716J68870M12421O43816M74456l3512k97356r8690P5055j23908
33156A81171l24537j39360J01583r3498m84610m36729N8098L77453K46883O8127
33146d45419J51807K18547m5941l98207m00891r8255R7558N9934N8963K12782
$$ plain form
33216 1307502 1078117 873095 829599 642631 311548 150082 135181 -98211 -590328 -939136
33206 -939136 -911905 -685402 -400647 27707 494035 556319 6507 -717380 -1000011 -751090
33196 -751090 -376332 -191695 -164533 -192504 -328776 -617914 -914742 -1049573 -1076448 -1164322
33186 -1164322 -1276787 -1181280 -818273 -425857 -174966 80486 476307 783523 704080 379017
33176 379017 220527 296669 294357 103876 -11320 57160 8834 -370938 -837232 -1060697
33166 -1060697 -1039981 -871111 -458690 185126 659582 626070 328714 230024 305079 181171
33156 181171 -143366 -282726 -181143 -274641 -759251 -1195980 -1137882 -760429 -513546 -445419
33146 -445419 -293612 -75065 -121006 -519213 -920104 -1018359 -920801 -860867 -801904 -589122
33136e89122K35157r7035n19152n87312k61389Q4479J71629Q6830M3428J09517
33126a322970K36772L69334M35971L74448K31445J15658K7703j01705j95463q6187
33116H5006J57477K39409R0834J7038J94606L26344R3390k99447l94971j32680
33106C77006J51008K53760K40675J17099j93404n16121m96652j29590J44443L4786
33096a6990k15528k32214k3304J40932J52895J23096J43327K18503L42468M43654
33086A076839L40623l4555m20558m65904j91743J1506q2881k33693j20578J44676
33076B3732J63400j48889m05819k71839J19561M20916N12853M72492L04371M504
33066A195282k37274k28689r0590n2984l5180J57260K99958k4884o12783o85811
$$ plain form
33136 -589122 -353965 -451000 -970152 -1557464 -1818853 -1734374 -1562745 -1475915 -1432487 -1322970
33126 -1322970 -1086198 -716864 -280893 93555 325000 440658 468361 366656 171193 85006
33116 85006 242483 481892 572726 589764 784370 1110714 1204104 904657 509686 377006
33106 377006 528014 781774 1022449 1139548 946144 430023 -66629 -196219 -51776 -16990
33096 -16990 -232518 -464732 -488036 -347104 -194209 -71113 72214 290717 633185 1076839
33086 1076839 1417462 1382907 962349 496445 304702 316208 233327 -366 -120944 23732
33076 23732 187132 38243 -367576 -639415 -519854 -98938 413915 886407 1190778 1195282
33066 1195282 958008 729319 638729 585745 550565 707825 1007783 982899 370116 -315695
33056c15695j4861O10440M48542j76518m46498k07956N7963J13390J23985R7768
33046B90560j43275m32437l28443J78748N58966M71277J43326j05126k61310l62789
33036I497k69767M4355K90476K15338n6597k31724k13453r7604K3633R3488N9041
33025a33317n7203j39777j13539k8342J3558m1471j35041q9780K03912N16608
33015d392M31463n6579l89857j92063J63959J65701M45J55165M29405J79134m87968
33004C94413o83439j26095L38916N5252m26327k99314J96175K56345j31750k35552
32994f61376J82498N43610M27638J03431j01118k74612m54514k88902L49320Q36652
32984F62627M89041m02660q25186l58857L05212L68172l8204k23592j8499R9645
$$ plain form
33056 -315695 -330556 279884 728426 551908 105410 -102546 -44583 68807 192792 290560
33046 290560 147285 -285152 -613595 -434847 124119 595396 738722 633596 372286 9497
33036 9497 -260270 -215915 74561 289899 233302 1578 -211875 -309479 -285846 -192358 -133317
33025 -133317 -190520 -330297 -443836 -472178 -458620 -500091 -635132 -724912 -521000 -4392
33015 -4392 427071 370492 -19365 -211428 -47469 118232 118677 273842 703247 882381 394413
33004 394413 -289026 -415121 -76205 -20953 -447280 -746594 -550419 -294074 -425824 -661376
32994 -661376 -478878 64732 492370 595801 494683 220071 -234443 -523345 -174025 662627
32984 662627 1151668 749008 -76178 -435035 -129823 238349 200145 -23447 -41946 57699
32974E7699j13421k82463r1196J86537J85376N6230J20667K42223Q9874j80805
32964B70721j28284J69609J65416k36866m68423k16752O5654o1795k89209j06107
32954h36036L08719L57761q735k16919K3799K81519P1685m11446n45887j11765
32944a087305M28606N20760J85474p4211L5562K46809J69539j42427l09335j78479
32934b05007L8723J38109J28596N9207n9426j14900L3641K71809L04500R6305
32924F91557n6667l64M3033j25346l39401l43238j84015j03059j81778k79307
32914h78585k27503J2043K87831L46214J41063L866K33961N74094M90504q987
32904I74501l26051j73395P734j85643m42772k71568J78271L46923R7354j86927
$$ plain form
32974 57699 -55722 -338185 -429381 -242844 -57468 -1238 119429 361652 451526 270721
32964 270721 142437 312046 477462 240596 -227827 -444579 -378925 -440720 -729929 -836036
32954 -836036 -527317 -169556 -178291 -395210 -371411 -89892 -18207 -429653 -975540 -1087305
32944 -1087305 -658699 -137939 47535 -26676 8886 255695 425234 282807 -26528 -205007
32934 -205007 -166284 -28175 100421 159628 100202 -14698 18943 290752 595252 691557
32924 691557 634890 634526 677559 552213 212812 -130426 -314441 -417500 -599278 -878585
32914 -878585 -1106088 -1094045 -806214 -460000 -318937 -315071 -81110 492984 983488 974501
32904 974501 648450 475055 482789 297146 -145626 -417194 -238923 108000 205354 18427
32894A8427k32221j49600r2698k1680J22618K58868K56967Q2648j40043j78847
32884g5561O5088L28472K18363k45525n88677n00271j85478N7251K47729M66373
32874b12236N49434L79410J76931J44830R6171j86130m82539m45642j52221P7905
32864e4087K06812L69507M28891J50280k81936m26052k28550m9225o1753q7444
32854c3557m2501q7199k34480k21799O7585L63187L48171M4248k40858k22435
32844b59638J03198L97037K77497j73840m02766j03537L04986K66909r9992k46427
32834F3427n7289Q0096n856p6008m2898j51448m49098n85248l53386j1433J53918
32823a435223K04315K74073K75072J29500j360K1116O3342l0325j49438j15431
$$ plain form
32894 18427 -213794 -363394 -456092 -477772 -355154 -96286 160681 243329 103286 -75561
32884 -75561 -10473 317999 536362 290837 -297840 -798111 -983589 -926338 -678609 -212236
32874 -212236 337198 716608 893539 1038369 1134540 948410 465871 20229 -131992 -54087
32864 -54087 152725 522232 951123 1101403 819467 393415 164865 115640 53887 -33557
32854 -33557 -76058 -163257 -397737 -619536 -551951 -188764 159407 203655 -37203 -259638
32844 -259638 -156440 240597 518094 344254 -58512 -162049 142937 409846 309854 63427
32834 63427 6138 86234 80378 4370 -38528 -189976 -639074 -1224322 -1577708 -1589141 -1435223
32823 -1435223 -1230908 -956835 -681763 -552263 -553623 -532507 -469165 -499490 -648928 -764359
32813g64359M650J7317p8191r9797M2787K40416L37617L01677K32231K27335K57097
32802G18780K18171R7002m9271k61816n84815p65237m37954K02875L92251j52236
32792f22250o32914k32946O05238P62936J04232l79260j19559K97709K46961P617
32782C7764P2253K43195R4144j82979j16329J74682J51080k38663m60013k15155
32772d40021J54594K02947n5043k57216j50491J83595M48595M27554J93771q221
32762G00064r0405j84593l42395l89072k02903N6209J67168J45049J48500K11341
32752B18963K28217J28124n2935k04413j96611j1975J56166Q5574j76586l68715
32742a94191l63382k50818j02895O3150J03783j01958k88020k0796N83935Q17496
$$ plain form
32813 -764359 -759709 -742392 -820583 -920380 -877593 -637177 -299560 2117 234348 461683 718780
32802 718780 936951 1033953 984682 722866 138051 -627186 -1065140 -862265 -470014 -622250
32792 -622250 -1255164 -1488110 -882872 -119936 -15704 -394964 -514523 -216814 30147 37764
32782 37764 110017 353212 447356 264377 148048 322730 473810 235147 -224866 -440021
32772 -440021 -285427 -82480 -137523 -394739 -545230 -361635 86960 514514 708285 700064
32762 700064 609659 425066 82671 -306401 -509304 -453095 -285927 -140878 7622 218963
32752 218963 447180 575304 522369 317956 121345 109370 265536 351110 174524 -194191
32742 -194191 -557573 -808391 -911286 -848136 -744353 -846311 -1134331 -1155127 -571192 246304
32732B46304K96665m77666p78334n09563q0217K32347L88562L31225P2852j17258
32722c95083r986K09737K06826P079j06306q9810j47929k96702k98111n7855K22476
32711g55664L42122L03459J82940K7212p6904l0702J07704J27872q8277m04741
32701b64979n56470m09721r7865J14338J39783J71888L60179N00586L13069m3810
32691B26998j22074J13563J81824j46418m31632k27451K27113L71709R7310k47715
32681D3227m01707l45044j04005J96489K41397j06810m72490l93395L3980L36582
32671i71776L65287L49496L35337J09580k66406l77355r1921J64988L9154k05835
32661e49451r5229L31889N68818L49888j3472j00292M0363N042l20157n24343
$$ plain form
32732 246304 542969 65303 -713031 -1222594 -1302811 -1070464 -681902 -350677 -277825 -395083
32722 -395083 -405069 -195332 11494 18573 -87733 -177543 -325472 -622174 -920285 -978140 -755664
32711 -755664 -413542 -110083 72857 100069 23165 -7537 100167 228039 139762 -264979
32701 -264979 -821449 -1231170 -1329035 -1214697 -1074914 -903026 -542847 -42261 270808 226998
32691 226998 104924 218487 400311 253893 -177739 -405190 -178077 193632 290942 43227
32681 43227 -358480 -703524 -807529 -611040 -369643 -476453 -948943 -1342338 -1308358 -971776
32671 -971776 -606489 -256993 78344 187924 -78482 -455837 -547758 -382770 -343616 -549451
32661 -549451 -644680 -312791 256027 605915 592443 492151 532514 537556 217399 -306944
32651c06944k55512J91052K22534j97047m77559k48402J80515L79173L63200L12612
32641A63622J60850j32076k58185J1831L51489L12735J4381r9669J0494L3677
32631E69149o3728m5317L7220j06743l96685m07194p4826J78672J41749Q6855
32621h0848J86836J93315n7712k95203k66388j43920j64736j96793m194L02182
32611e27461M06031K24251n3328k43793k87525j91550l1153O1971K8386n7739
32601f71910r8428o0875M5902J77460K54675K56732K44584J98361k94k75055l08410
32590b37258m8086O4893k20264m04264L7937O64802N98196q1454l90182K8586
32580A2906L92517J00341l66719l65145r1779l4405j10508n0602m4538k58054
$$ plain form
32651 -306944 -562456 -371404 -148870 -345917 -823476 -1071878 -891363 -512190 -148990 163622
32641 163622 324472 192396 -65789 -53958 297531 610266 624647 524978 535472 569149
32631 569149 505421 460104 497324 390581 -6104 -413298 -488124 -309452 -167703 -80848
32621 -80848 105988 299303 241591 -53612 -320000 -463920 -628656 -825449 -829643 -527461
32611 -527461 -121430 102821 49493 -194300 -481825 -673375 -704528 -642557 -614171 -671910
32601 -671910 -770338 -831213 -785311 -607851 -353176 -96444 148140 346501 346207 71152 -237258
32590 -237258 -285344 -220451 -440715 -844979 -807042 -142240 455956 374502 -15680 12906
32580 12906 405423 505764 139045 -226100 -317879 -352284 -462792 -513394 -557932 -815986
32570h15986k41555L43367Q61245N10451l16988n03216J00546N05111J79944k33604
32560C89315j17310J66638M6666k76353k77813l0831O368j75321j70552R0893
32550c48300K20298L7580j18898Q1068M50883N36849K18180j61456k39836m9329
32540F27039R1563J2328j26450j02213N8909J40275J4437k41780m43047m18990
32530c87929j42120J63911J76910j19523l38806j91672R2993J25582l1945j135
32520f53734K46391L25932J03646m3727J67733M58975M09635O6835j81203j61271
32510G39212n4255p1639k15249l11687j75888J60603L51969R5996l57154m06996
32500b45088L4460L25631N1716k85000o2796L85872K56256l83982o19314j10881
$$ plain form
32570 -815986 -1057541 -714174 147071 657522 340534 -162682 -62136 442975 622919 389315
32560 389315 272005 438643 485309 208956 -68857 -99688 -93320 -268641 -439193 -348300
32550 -348300 -128002 -90422 -209320 -128252 322631 859480 1077660 916204 676368 627039
32540 627039 718602 730930 604480 502267 561176 701451 715888 474108 31061 -387929
32530 -387929 -530049 -366138 -189228 -308751 -647557 -839229 -746236 -620654 -652599 -653734
32520 -653734 -407343 -81411 22235 -21492 146241 605216 1014851 1081686 900483 739212
32510 739212 684957 613318 398069 86382 -89506 71097 423066 519062 161908 -245088
32500 -245088 -210628 115003 166719 -118281 -181077 204795 461051 77069 -542245 -653126
32490f53126L93259K67244q8572m7573K27183K16120k0444o4581M1195o1974k92071
32479h3340k45553K1216M8863j86038j95404J54753L77500J64536j56956k29311
32469c29734j76564k02480j69311O4280K87542K69968J17793Q373r1796j80178
32459d02107p0440K19009L25419J03769r0146k0091m22k69163m18307l3110N00427
32448a55162M98223J3718l07424k22909p2860o8539m7446Q4505K19276L25710
32438B67092L90310K08935k59306n39501k47875J76490P1519l25192k27500L37646
32428a47382N28388J16817j43843J46651L75766N9716l05409j59375J56364O1405
32418F89098k72583l24231j19776k5841l4446R3490K77087K74903J21032n5135
$$ plain form
32490 -653126 -259867 7377 -81195 -128768 98415 314535 294091 229510 270705 208731 -83340
32479 -83340 -328893 -307677 -258814 -444852 -640256 -485503 -108003 56533 -100423 -329734
32469 -329734 -506298 -708778 -878089 -813809 -526267 -256299 -138506 -130133 -221929 -402107
32459 -402107 -472547 -253538 71881 175650 85504 65413 64991 -204172 -622479 -655589 -155162
32448 -155162 343061 356779 49355 -173554 -246414 -314953 -362399 -277894 -58618 267092
32438 267092 657402 866337 607031 67530 -180345 -3855 67664 -257528 -485028 -147382
32428 -147382 381006 497823 353980 500631 876397 936113 630704 471329 627693 689098
32418 689098 416515 92284 -27492 -53333 -87779 5711 282798 557701 678733 623598
32408F23598k99894n04195k61829M32576Q36277M20603k83642m77015k66297k60987
32398d0805m07810j70891L49591M59307J0480l83933l51701j80751j22795k8118
32388h67426J51495J74220K2052J142J55963J65158k4928o9447R4378O6900k69580
32377d00073m46997j71718J81706K02089M4778L298l6032k48046l82075j24695
32367a377765L33785N52752M38989J95448q7177l71572m32795j40042J78015J23456
32357e86906j17986j4512M41882O36351K34877k94383l42378J4214K15762L8108
32347B25029k09991k62094k42936l03714k65764O5890M45494M40972R9467n7906
32337f5553J94480M24957J93357k75419m24482j49069J62235K55073K40960K00160
$$ plain form
32408 623598 323704 -180491 -442320 -9744 826533 1247136 963494 486479 220182 -40805
32398 -40805 -448615 -619506 -269915 189392 199872 -184061 -535762 -716513 -839308 -867426
32388 -867426 -715931 -541711 -519659 -518517 -362554 -197396 -222324 -291771 -197393 -130493 -400073
32377 -400073 -847070 -1018788 -837082 -634993 -590215 -586917 -622949 -870995 -1253070 -1377765
32367 -1377765 -1043980 -491228 -52239 143209 56032 -315540 -748335 -888377 -710362 -586906
32357 -586906 -704892 -719404 -277522 358829 593706 299323 -43055 -28841 186921 225029
32347 225029 15038 -247056 -489992 -793706 -1059470 -993580 -548086 -107114 -7647 -65553
32337 -65553 128927 553884 747241 471822 47340 -101729 60506 315579 556539 756699
32327G56699r153l89743n92404l20689K19505N09605L12633q8022k65776j54158
32317b1503o4441k06055l57787j85456K28760M71063L96962K85194L06860K54783
32307A108380P864j58500n2332L7268j56206l30399r4693K85561K37502j93622
32297F90823m16897k43671j07778k64843l89586j70412J97977L62401K76396J05053
32287C9463l8593r6781m3864M3157Q0270J17225J64237K6103l50708n56763k25312
32276h41566K96440L58505j5834k22573r0798m7153k16598j86541J32990K46457
32266e86671j061m1086M25493Q02976N24408n2901k80208j72701j08253j01980
32256D08016m3417j66959n68133o88818p2119P17472P63381J45030k39140n8987
$$ plain form
32327 756699 747546 357803 -234601 -555290 -335785 173820 486453 398431 132655 -21503
32317 -21503 -85944 -291999 -649786 -835242 -606482 -135419 261543 546737 853597 1108380
32307 1108380 1116244 957744 905412 942680 786474 456075 361382 646943 884445 690823
32297 690823 273926 30255 -77523 -342366 -731952 -902364 -704387 -341986 -65590 39463
32287 39463 870 -95911 -139775 -96618 -16348 100877 265114 291217 -59491 -616254 -841566
32276 -841566 -545126 -186621 -202455 -425028 -515826 -562979 -779577 -966118 -833128 -586671
32266 -586671 -587732 -628818 -203325 599651 1124059 1071158 790950 618249 509996 408016
32256 408016 364599 197640 -370493 -1059311 -1131430 -413958 349423 494453 255313 196326
32246A96326J22329p3866l01400k23216n2634n7837r3197M7249K29129K30069
32236B2952R2559l813N128Q9052J96513K29977J32835K443p8106k24592m87610
32225b2662n52427j30809M32021M75118q223k83405N3028M57402K50775l79768
32215B91050o70503l43734J16475K25051R8023J28862L37157L36663o1223m74833
32205a7012l93142J06659L88361R1577l64677l59574P5895L46684J48062j64718
32195a41885j37019J75760L44506J44025j87291k37792J07736N16636N63295K23384
32185A371355j14920j69629q7054j10314j66690o2765P9134m5463l83143m91107
32175a80596j52140K72639K97713m9071k59179J0044M86597N87668J38436l76063
$$ plain form
32246 196326 318655 244789 -56611 -279827 -332461 -390298 -483495 -436246 -207117 22952
32236 22952 115511 111698 116826 205878 402391 632368 765203 767646 689540 464948 -22662
32225 -22662 -575089 -705898 -273877 201241 193018 -90387 -37359 420043 670818 291050
32215 291050 -379453 -723187 -606712 -381661 -283638 -154776 182381 519044 457821 -17012
32205 -17012 -410154 -303495 84866 176443 -188234 -547808 -471913 -125229 22833 -141885
32195 -141885 -278904 -103144 241362 385387 198096 -39696 68040 584676 1147971 1371355
32185 1371355 1256435 1086806 999752 889438 722748 659983 739117 693654 310511 -180596
32175 -180596 -332736 -60097 237616 188545 -70634 -60590 426007 1013675 1152111 776048
32165G76048m04484l5613J63513k8653k13137m4112K18668J32273k37214m21402
32155i4113k06042J63990L71772L31989J38870n5094j23305q6745r9811k10373
32145A31138k64637j60787q621Q9687J73721J90113n2230m55318n20640j7270
32135h94844N58823O10560K43332j6630m2264j04117k44135k45964j43584j79143
32125d57966k72665r3157L09521M83014K65334j347o0657p0460j91825k85656
32115c75864k11188o9234L4107J63294L31999L69823J64521j50147l42042k86517
32105c71248l9204J62970Q4638j59514j48027K23487M65163J98228k06516k02912
32095G065M3738l242k75992k36929J33848L02740J29500L3904J41427Q3254j97003
$$ plain form
32165 776048 371564 335951 499464 470811 257674 213562 432230 564503 327289 -94113
32155 -94113 -300155 -136165 235607 567596 706466 651372 528067 441322 341511 131138
32145 131138 -133499 -294286 -302907 -213220 -39499 150614 98384 -356934 -877574 -894844
32135 -894844 -336021 274539 517871 501241 458977 354860 110725 -135239 -278823 -457966
32125 -457966 -730631 -823788 -514267 -31253 234081 232734 172077 101617 -90208 -375864
32115 -375864 -587052 -656286 -622179 -458885 -126886 242937 407458 257311 -84731 -371248
32105 -371248 -410452 -247482 -162844 -322358 -470385 -246898 218265 416493 209977 7065
32095 7065 50803 47561 -228431 -465360 -331512 -28772 100728 134632 276059 359313 162310
32084A62310k52885K0357J44023o2597j46129J01327K18061n0396k15033R8889
32074A7927M45367K84655j65263l66968k37692K8823L89642O88864N11012j47372
32064A448995n87129l62678M948j07779l99543k23303K69753L92056K7884l03885
32054A59319l04530j22874J04580L18504L17205M2599j28600P3701K67359R356
32044G36619l94628l60861q853Q9526r7620j27788K8432j193j82704j08140J88431
32033b38779K48213L1384l9756R6144P4146q7064M9410M33437M39714q4022m88987
32022D33840l45134l5393P464o3404k6892p0950l01673l70239n9722K68712K59623
32011c03768J14927J38251K02550J10795K7764R2298M2768k81997m94926k50926
$$ plain form
32084 162310 -90575 -70218 73805 11208 -134921 -33594 184467 134071 -80962 17927
32074 17927 463294 747949 582686 215718 -21974 6849 396491 1085355 1596367 1448995
32064 1448995 861866 499188 504136 396357 -3186 -226489 43264 435320 463204 159319
32054 159319 -145211 -268085 -163505 154999 472204 514803 386203 459904 727263 736619
32044 736619 341991 -18870 -27723 61803 -35817 -163605 -135173 -136366 -319070 -427210 -238779
32033 -238779 9434 40818 1062 97206 171352 84288 133698 567135 1006849 922827 433840
32022 433840 88706 53313 60777 -2627 -29519 -100469 -402142 -772381 -832103 -563391 -303768
32011 -303768 -188841 -50590 151960 262755 290519 382817 425585 143588 -351338 -602264
32001f02264J00889M0750k68607k77863M1790K39388J87887J91622L27220L06877
31991B87689O8571o9753O604j3007k78843m26909j34850L07404L78396Q7025o9864
31980A42463J15478K46652m0873m54590m16745O2396L27865Q472m12402k71483
31970f92767L23553O64869M31181J2315j63814j40916j20346o4850J18155K90017
31960F57397K54172M0987j80891l22578l55012k46170o2388L7433K8669N6483
31950i1898J50328J46742K0204J773J77133K62550M8449k03680j49858N9949L680
31939D25372l13406m16187o5844L64168L83731R316l15807k97784q2141J9050
31929b89532q0947k14597k33643j62213p3105K5174J00991O1424o7169q4200P8469
$$ plain form
32001 -602264 -501375 -460625 -729232 -1007095 -965305 -725917 -538030 -346408 -19188 287689
31991 287689 356260 286507 293111 280104 1261 -425648 -560498 -253094 125302 212327 142463
31980 142463 257941 504593 463720 9130 -407615 -345219 -17354 -8882 -421284 -692767
31970 -692767 -369214 295655 726836 739151 575337 434421 314075 249225 367380 657397
31960 657397 911569 952556 771665 449087 94075 -152095 -214483 -177050 -148381 -91898
31950 -91898 58430 205172 225376 227149 404282 666832 715281 511601 361743 421692 425372
31939 425372 111966 -304221 -370065 -5897 377834 387150 71343 -226441 -308582 -289532
31929 -289532 -370479 -585076 -818719 -980932 -1054037 -1028863 -927872 -866448 -933617 -1017817 -939348
31918i39348J73838J7173j42650P471K57956J47021k32165k76208J67683M91482
31908c27747K56315j33414j18245J40627J53804K0807K40057P18393P17362m2302
31898A625657q30830q18290j38812L62423K23992k15738m33705l30448j02574
31889f58325J48461M03382N12976L37119M1796p5257o1732k35820n51842n03151
31879f42393Q1483N99448M70992O210q9337J89362K25780j50327m12988k47932
31869C0298k3266j16766l42216l37118p2863K73231N50092N49128J35071l55649
31859B89942l46144J32538L63654j3754m67715m39785j53810p8704j33313j1468
31849h58559J54113Q4578m6110O6718K39854J36084m9242J05287M54524M72620
$$ plain form
31918 -939348 -765510 -748337 -890987 -883516 -625560 -478539 -710704 -986912 -819229 -327747
31908 -327747 -71432 -204846 -323091 -182464 -28660 -7853 232204 950597 1667959 1625657
31898 1625657 794827 -23463 -162275 200148 424140 208402 -225303 -555751 -658325
31889 -658325 -509864 -106482 406494 743613 785409 710152 648420 412600 -139242 -642393
31879 -642393 -560910 38538 509530 515740 426403 615765 841545 691218 278230 30298
31869 30298 7032 -109734 -451950 -789068 -861931 -588700 -38608 510520 645591 289942
31859 289942 -56202 76336 439990 426236 -41479 -481264 -635074 -713778 -847091 -858559
31849 -858559 -704446 -619868 -665978 -599260 -359406 -223322 -272564 -167277 287247 759867
31839G59867J13403j59487j42205q1529j17298j10866n1423j09958k48258k36296
31829c84050q0153r390m9967j9899Q7567J14104N7095j854j42153l61988l20068
31818a110756J57657N65255L56591j28146j40468K39562K42470k48259m80599
31809e46693j18595K38093J40546l0284Q5148J66878k5927l9165M37470P95860
31799A103331L74607m11978o47439k62019L1848n9693j20777R1262K53597J31633
31789D84372L763J56959L84247K95766j01550m10003l58191j17356l7166j56232
31779A44609j65208O5148J82653j16605m82213l43826J46436K66643j03181k25756
31769f31300K62447O37629J93081n70714o34244N6027O05590M84353M6283k18593
$$ plain form
31839 759867 873270 713783 571578 490049 372751 261885 210462 100504 -147754 -384050
31829 -384050 -464203 -473593 -523560 -543459 -455892 -341788 -284693 -286547 -428700 -790688 -1110756
31818 -1110756 -953099 -387844 -31253 -159399 -299867 -60305 182165 -66094 -546693
31809 -546693 -665288 -427195 -286649 -316933 -231785 -64907 -90834 -129999 307471 1103331
31799 1103331 1477938 1065960 418521 156502 188350 128657 7880 99142 352739 484372
31789 484372 488135 645094 1029341 1325107 1223557 813554 455363 338007 300841 144609
31779 144609 -20599 44549 227202 110597 -371616 -715442 -569006 -302363 -405544 -631300
31769 -631300 -368853 268776 461857 -108857 -743101 -687074 -81484 402869 449152 230559
31759B30559k43087j23326R3031K27689P2217k16186k48674r801J09532l6376
31749a44422j31591J9214J46166q354k34966j71633J62893M09983L17269k2213
31739C42346k85029k02158J57281L82401J64318k81208m58997k42557Q033N736
31729d09834j04758o4965J01585J90950J29995K6023J8049J60279L45046L34832
31719G27202L4916k89258l02947r7207q1913l44511m92873k83520j4398j7610
31709a162119j04069R7459M85668O29826M59558L28359L64214K47015j77285m97553
31699F71073l14444P8469O7828l38503m82979p1084L26275J26667l40385l23748
31689f00831J61720L31590j40617o02899m43866r681L8467j74687k148N62845
$$ plain form
31759 230559 -12528 -135854 -42823 184866 257083 40897 -207777 -217578 -108046 -144422
31749 -144422 -276013 -256799 -110633 -118987 -353953 -525586 -362693 47290 364559 342346
31739 342346 57317 -144841 12440 394841 559159 277951 -181046 -423603 -415570 -409834
31729 -409834 -514592 -579557 -477972 -287022 -157027 -131004 -112955 47324 392370 727202
31719 727202 762118 472860 169913 72706 -9207 -353718 -846591 -1130111 -1144509 -1162119
31709 -1162119 -1266188 -1168729 -683061 -53235 406323 734682 1098896 1345911 1168626 671073
31699 671073 356629 435098 502926 164423 -318556 -389640 -63365 63302 -277083 -600831
31689 -600831 -439111 -107521 -248138 -851037 -1294903 -1304584 -1266117 -1440804 -1442952 -880107
31679h80107P78961L05292k45020k11102J96629L22490M4512j88045j33329n3823
31669f3542j87027l47484k65534m5363Q508r7073l5531K87633M91913K59180j11011
31658a05331n6649M02724O19597K31524l07367l79339l0475K35801K24996J48975
31648I84456J10323j0181j77184j87025q5271j58047m00199m17212l4309L77934
31638C285M16989J68674l5413j00466j22524q1890R2777K63946J81285j67964
31628F18699m87464m66173p6896L75909M93697J83674j82889j91807M9810N5791
31618C72351k90521n14077k63063J43630K24707P4736J27455L66217L24927j01621
31608D64741l81954j12446L36848L04821k26661n81770k89931L03035N08548J67713
$$ plain form
31679 -880107 -101146 204146 -40874 -251976 -55347 267143 311655 123610 -9719 -63542
31669 -63542 -250569 -598053 -863587 -908950 -900442 -997515 -1033046 -745413 -253500 5680 -105331
31658 -105331 -161980 240744 860341 1091865 784498 405159 374684 610485 835481 984456
31648 984456 1094779 1084598 907414 720389 635118 477071 76872 -340340 -374649 3285
31638 3285 420274 588948 553535 453069 330545 248655 341432 605378 786663 618699
31628 618699 131235 -334938 -411834 -35925 457772 641446 458557 266750 316560 372351
31618 372351 81830 -432247 -695310 -551680 -326973 -252237 -124782 241435 566362 464741
31608 464741 82787 -29659 307189 612010 385349 -196421 -486352 -183317 325231 492944
31598D92944k42550l17362j92476j83626k74672k48066j14076m4602J6565K75481
31588h32440O29719O97343L77542l671k13927l76209n51130m98692j37316J53671
31578g55110N5775j81556j52680N6226P7568q1659q3829J33799K70329J73981
31568d87156L1933J3368P8188J78160L18662L81453K07703q8802j99010p0330
31558C64169K2731o3906j29042q00J55809R5428j38229k89251k28773p3977j2386
31547b98227p8695j04159P2590L21991L02090n8771l52758j97888K23521M40442
31537B70136L57251K54878K25326O9381k25442l73152k69881j68674k20560k28242
31527c08979m6689J27745R4104k8979m0221M2388J15688J79631K11741J05099
$$ plain form
31598 492944 250394 -66968 -259444 -443070 -717742 -965808 -1079884 -1124486 -1107921 -832440
31588 -832440 -202721 494622 872164 868493 654566 278357 -272773 -771465 -908781 -755110
31578 -755110 -699335 -880891 -1033571 -977345 -899777 -981436 -1065265 -931466 -661137 -487156
31568 -487156 -455223 -441855 -363667 -185507 133155 514608 722311 633509 434499 364169
31558 364169 386900 322994 193952 193152 348961 444389 306160 16909 -211864 -285841 -298227
31547 -298227 -376922 -481081 -408491 -86500 215590 156819 -195939 -393827 -170306 270136
31537 270136 627387 882265 1107591 1176972 951530 578378 308497 139823 -80737 -308979
31527 -308979 -355668 -227923 -133819 -162798 -203019 -160631 -44943 134688 346429 451528
31517D51528r9174j77944q2415m4027j67863k45680j59438j11155k12060k11646
31507a059874O6965L67316L98597K64136J65326L9523j35947p6133L10857N43476
31497H84242K44391j61696q8652J88118m3154o58793p74345j47174M04002K52189
31487I9128j73046j98518Q8150J86265L7945m8737k7567j16602l12657l44715
31477h10354p8046L15890N50319M26577k3704m63924n01214j46849J76716K00632
31467c53957J02744R5252P6088n9380j10848P7190K53909J50629j0280J51871
31457C73218M97475N14052R4612l07896l61348k65456l34816n06587m80734j64072
31447i41552K09649L26157P3779l48398n67723l60193J29733N26819N71806L14523
$$ plain form
31517 451528 352354 174410 91995 47968 -119895 -365575 -525013 -636168 -848228 -1059874
31507 -1059874 -992909 -625593 -226996 37140 202466 241989 106042 29909 340766 884242
31497 884242 1128633 966937 878285 1066403 1023249 364456 -409889 -557063 -153061 99128
31487 99128 -73918 -272436 -184286 1979 39924 -8813 -36380 -152982 -465639 -810354
31477 -810354 -888400 -572510 -22191 404386 380682 -83242 -584456 -731305 -554589 -353957
31467 -353957 -251213 -155961 -79873 -139253 -250101 -172911 80998 231627 221347 373218
31457 373218 870693 1384745 1479357 1171461 810113 544657 209841 -296746 -777480 -941552
31447 -941552 -731903 -405746 -331967 -680365 -1248088 -1608281 -1478548 -951729 -379923 -65400
31437f5400L0193k1092J59715K77327P9154k65953l34717m0035K29115J80141
31427B28448J978m0071n3138k25034l79600k51638J494K3061j47785j75563k6420
31416a044268L2863q377J23465M21558N31547L56791K25428K90466K55342o9684
31406A115131l91094m04620k57296k22895k48141j47214L1301J44913K18571K83473
31396A22129K11641o445r8245O3628J63012o6243l41123k63565Q744M6890r2736
31385b52313L564L14831L73720R2169n6823J34500K33056n6815l15717j01021
31375C69151K29955K0999n89239p55961j30012O31669P62699L31213k8702j5487
31365H26285R6608r711k73032m04316k43961R4712L24199K16683j55498m32807
$$ plain form
31437 -65400 -35207 -56299 103416 380743 459897 193944 -140773 -180808 48307 228448
31427 228448 230426 190355 137217 -87817 -467417 -719055 -717561 -694500 -842285 -1017848 -1044268
31416 -1044268 -1011405 -1019782 -896317 -474759 56788 413579 639007 929473 1184815 1115131
31406 1115131 724037 319417 62121 -160774 -408915 -556129 -524828 -379915 -161344 122129
31396 122129 333770 327325 229080 292708 455720 389477 48354 -215211 -206467 -159577 -252313
31385 -252313 -248749 66082 439802 531971 475148 609648 842704 785889 470172 369151
31375 369151 599106 620105 30866 -725095 -855107 -223438 539261 870474 841772 826285
31365 826285 922893 913182 640150 235834 -8127 86585 410784 627467 471969 39162
31355C9162l39780j0248J93477J28230n4986k22685l58889l48007j8654M65276
31345e27104O16249K58814j65953k16388m7488k1696n0674J49313L78744J77830
31335E51647l41771n54057k60960Q0362J97619L59020O25445M94950k17048p90432
31325A44775n50698P2651J73877k68942m54427l6439M46755M74428J90987j7475
31315A75492m6375K8564J39817J37074j18019m27393l93833j0014K64952J57011
31305i2724q0304j44981j13308j50681j53826K0279K37361K86283J90934Q5477
31295H4510r377o5805M4368K54238J72476l87126r30993p70812N9166P66711P43200
31284c9444K11424j85021j58774N6438J41941L8721j31429k80833l78002l49945
$$ plain form
31355 39162 -300618 -310866 -117389 10841 -44145 -266830 -625719 -973726 -992380 -527104
31345 -527104 89145 347959 182006 -34382 -81870 -103566 -154240 -4927 373817 551647
31335 551647 209876 -344181 -605141 -524779 -327160 31860 657305 1152255 935207 144775
31325 144775 -405923 -333272 -159395 -428337 -882764 -919203 -472448 1980 192967 175492
31315 175492 129117 157681 297498 434572 316553 -110840 -504673 -514687 -249735 -92724
31305 -92724 -173028 -318009 -431317 -581998 -735824 -715545 -478184 -191901 -967 84510
31295 84510 75133 9328 53696 307934 480410 93284 -837709 -1608521 -1549355 -782644 -39444
31284 -39444 171980 -13041 -171815 -115377 26564 65285 -66144 -346977 -724979 -1074924
31274a074924j25862J98392L77835K84348N0224j44355k90016m06676l46181j979
31264a479194L76741M08840J21240o0433Q4977L11652L51091K76118K41238J75557
31254H07827k1321k31399l17894l46782l64229k07260J57393L60702J04877k77014
31244c35100k18919K04037L38077n1366l92729j61574L44482M78183J79638l7895
31234C46834Q5312K33723R0206j85795k67292j52058n9576k2830P9608J64475
31224C12607k747l41795m22846q4600K44121J35940j88932k04026J09235K71526
31214a71517R7386m1613J19999K92515J28157j94648k47687O051K08854J36845
31204C34342q3776k44108k65580j42893J03640L67658M84160L69009R0811j81806
$$ plain form
31274 -1074924 -1200786 -1002394 -624559 -340211 -289987 -434342 -724358 -1131034 -1477215 -1479194
31264 -1479194 -1102453 -693613 -572373 -632806 -547829 -236177 114914 391032 632270 807827
31254 807827 786506 555107 237213 -109569 -473798 -681058 -523665 -162963 -58086 -335100
31244 -335100 -554019 -349982 -11905 -63271 -456000 -617574 -273092 205091 384729 346834
31234 346834 432146 665869 756075 570280 302988 150930 91354 68524 148132 312607
31224 312607 309860 -31935 -454781 -539381 -295260 -159320 -348252 -552278 -443043 -171517
31214 -171517 -74131 -115744 4255 296770 424927 230279 -17408 -11357 197497 334342
31204 334342 250566 6458 -259122 -402015 -298375 69283 553443 922452 1013263 831457
31194H31457k99013k71886k88552m58773n69031l20128J72672M24968K39972j2490
31184e50804K6942J88700J34095o7601j17541k5878k6487q0122O8173L60539M10090
31173C20106Q5990k74799l59494k50454j59870q7817N9262K13378K14025M2202
31163a97471j43715j64967K4501K87736M11878L21140J33255m1503k11127l09042
31153A10685j26925L10801N27732J36781n18909p08366k80187J67648J60895o5333
31143b85178n2261J99344L29225J62991j25656k84777k27400p2713k7393j39363
31133e23181j79096O4792M14101M91843K67561P1978L8912n4359k73236l11238
31123H077l8316J59969n5188m18361m66261k20725k6598O2585K34014L87490K10655
$$ plain form
31194 831457 532444 260558 -27994 -486767 -1055798 -1375926 -1203254 -778286 -538314 -550804
31184 -550804 -523862 -335162 -201067 -268668 -386209 -412087 -438574 -518696 -450523 -89984 320106
31173 320106 406096 131297 -228197 -478651 -638521 -726338 -667076 -453698 -239673 -197471
31163 -197471 -341186 -506153 -481652 -193916 217962 539102 672357 630854 419727 110685
31153 110685 -16240 294561 822293 959074 440165 -268201 -548388 -380740 -219845 -285178
31143 -285178 -337439 -138095 191130 354121 228465 -56312 -283712 -356425 -383818 -523181
31133 -523181 -702277 -637485 -223384 268459 536020 607998 646910 592551 319315 8077
31123 8077 -30239 129730 74542 -343819 -810080 -1030805 -1057403 -994818 -760804 -373314 -162659
31112a62659k04155l39830L34L58036K63295j11868k30974O8058M03465L69995
31102D13697J1701k69010j75535J69561L79271K43535o2943k49933k59508k07488
31092f652r9613J34594L42467K03798k67717n50651k27157L77496N21429K0819
31082D48813m71442l38425J72933L47066K5845k50045j35207K7323j37674l63777
31072f74590j95199J93208K17703j71200l70682l3505M46457N53630K97622j0494
31062B52950k25894l17077j92603R0694K32454J17048N4145K64981M44681K51581
31052I72960o2938l4850K14535J59391k39894m54869k45180J0749L845n3355O3501
31041C33895J27949j03423l63631k25178K30690N03269L40936q568j84058r7437
$$ plain form
31112 -162659 -366814 -706644 -706310 -348274 -84979 -196847 -427821 -359763 43702 413697
31102 413697 425398 156388 -19147 150414 529685 773220 710277 460344 200836 -6652
31092 -6652 -106265 28329 370796 574594 306877 -243774 -470931 -93435 427994 448813
31082 448813 -22629 -361054 -188121 158945 184790 -65255 -200462 -173139 -310813 -674590
31072 -674590 -869789 -676581 -458878 -630078 -1000760 -1034265 -587808 -34178 263444 252950
31062 252950 27056 -290021 -482624 -391930 -159476 -42428 11717 276698 721379 972960
31052 972960 910022 875172 1089707 1249098 1009204 554335 309155 319904 323749 270394 333895
31041 333895 461844 358421 -5210 -230388 302 503571 844507 835939 651881 554444
31031E54444N7945K4891k53415m95647l40407J52093M70982L11106K337j4390
31021D69939J15195n5043m30364m10039J52978O01633L73351k03258m14344j43829
31011E6219J20919Q6813m1468l3049M4757O1994L1783k7100j33645j64151N0073
31000E3145L36678K60472k19825n42003k79852K32378L83912J26909j05864j24038
30990A21912j12425j26357J0326K54987K86792L5092j59544q8195J2044r6037
30980A38595k42979j65311N2735J42170O2307q926L7564J62807K61760J86034
30970F26756j44407n20312n43236j11541L89097N35605L07572m6508l15751l41300
30960a64025l9973L51987L64599r4250n00846l96450j1445J47492L9478j7114
$$ plain form
31031 554444 612389 637280 383865 -111782 -452189 -300096 170886 481992 484329 469939
31021 469939 585134 530091 99727 -310312 -157334 444299 817650 614392 200048 56219
31011 56219 177138 263951 222483 189434 234191 296185 327968 300868 167223 3072 53145
31000 53145 389823 650295 430470 -111533 -391385 -159007 224905 351814 245950 121912
30990 121912 9487 -116870 -106544 148443 435235 470327 310783 222588 234632 138595
30980 138595 -104384 -269695 -216960 -74790 -12483 -21409 16155 178962 440722 626756
30970 626756 482349 -37963 -581199 -692740 -303643 231962 539534 493026 177275 -164025
30960 -164025 -203998 147989 512588 418338 -82508 -478958 -490403 -342911 -303433 -320547
30950c20547M8332M9604j3399J1941N3880o6875k26647j62842K4196O323j85023
30939g81057j96996L1103J84758J24990L5636j7188j72866l51838k49237J26352
30929a266343L82962L41624K37451K09326R7730r1394o1102K07114K83116k5500
30919C14984l16662k53411r7284j93157l62662k58563L7413K25603K98375M00553
$$ plain form
30950 -320547 -272215 -222611 -236010 -224069 -170189 -237064 -463711 -626553 -602357 -596034 -781057
30939 -781057 -978053 -946950 -762192 -637202 -601566 -618754 -791620 -1143458 -1392695 -1266343
30929 -1266343 -883381 -541757 -304306 -94980 2750 -88644 -149746 57368 340484 314984
30919 314984 -1678 -255089 -352373 -545530 -908192 -1166755 -1129342 -903739 -605364 -204811
$$ [...]
##END NTUPLES=NMR SPECTRUM
##END=
