##TITLE=31Pdec_LY-TMF-5.70.3
 D2O, 24 sc
 28.2.2020
##JCAMPDX= 6.0         $$ Bruker NMR JCAMP-DX V2.0
##DATA TYPE= NMR SPECTRUM
##DATA CLASS= NTUPLES
##ORIGIN= UXNMR, Bruker Analytische Messtechnik GmbH
##OWNER= root
$$ XWIN-NMR		Version 3.5
$$ Fri Feb 28 15:22:50 2020 Russian Standard Time (UT+4h)  she@DPX200
##.OBSERVE FREQUENCY= 81.013821
##.OBSERVE NUCLEUS= ^31P
##.ACQUISITION MODE= SIMULTANEOUS
##.ACQUISITION SCHEME= undefined
##.AVERAGES= 24
##.DIGITISER RES= 17
##SPECTROMETER/DATA SYSTEM= spect
##.PULSE SEQUENCE= zgpg30
##.SOLVENT NAME= CDCl3
##.SHIFT REFERENCE= (INTERNAL, CDCl3, 0, 182.463)
##AUDIT TRAIL= $$ (NUMBER, WHEN, WHO, WHERE, WHAT)
$$ ##TITLE= Audit trail, XWIN-NMR		Version 3.5
$$ ##JCAMPDX= 5.01
$$ ##ORIGIN= Bruker BioSpin GmbH
$$ ##OWNER= she
$$ F:/spectra/data/she/nmr/P31/1/pdata/1/auditp.txt
$$ ##AUDIT TRAIL=  $$ (NUMBER, WHEN, WHO, WHERE, WHAT)
(   1,<2020-02-28 15:21:07.53 +0400>,<she>,<DPX200>,
      <created by zg, POWCHK disabled, PULCHK disabled
       configuration hash MD5:
       00 E9 B6 7A A2 85 ED C7 34 08 36 98 17 FE 4E 26
       data hash MD5: 32K
       11 D1 6F 8B E4 40 DE E7 E2 F0 4D 1A 68 9E 17 D5>)
(   2,<2020-02-28 15:21:27.53 +0400>,<she>,<DPX200>,
      <Start of raw data processing
       efp BC_mod = 2 LB = 1 FT_mod = 6 PKNL = 1 PHC0 = -1537.296 PHC1 = 663.0013 SI = 64K 
       data hash MD5: 64K
       A8 4E 40 FF A7 4B 58 26 0E 51 61 39 AD E0 24 C7>)
(   3,<2020-02-28 15:21:44.95 +0400>,<she>,<DPX200>,
      <pk PHC0 = -71.06712 PHC1 = 0 
       data hash MD5: 64K
       2B 7F F0 14 23 15 B6 44 77 DD DB 10 BE BA 98 29>)
(   4,<2020-02-28 15:21:50.46 +0400>,<she>,<DPX200>,
      <abs ABSG = 5 
       data hash MD5: 64K
       63 E6 E0 7A EF FB E4 67 D1 9F 9A 11 0C AA E6 13>)
(   5,<2020-02-28 15:22:08.01 +0400>,<she>,<DPX200>,
      <pk PHC0 = -2.002715 PHC1 = 0 
       data hash MD5: 64K
       03 1F 6A 7F 59 6D C7 57 8F AD 05 11 62 D8 70 27>)
(   6,<2020-02-28 15:22:13.60 +0400>,<she>,<DPX200>,
      <abs ABSG = 5 
       data hash MD5: 64K
       90 E6 87 96 73 16 1B 05 80 B3 F1 F4 28 05 61 0C>)
$$ ##END=
$$ 
$$ hash MD5
$$ F1 E9 DC 09 CB BC 17 05 B7 C3 9A D7 A1 EC 6C 1C
##$RELAX= 
##$RELAX= 
##$RELAX= 
##$RELAX= 
##$RELAX= 
##$RELAX= 
##$RELAX= 
##$RELAX= 
$$ Bruker specific parameters
$$ --------------------------
##$DU= <F:/spectra>
##$EXPNO= 1
##$NAME= <P31>
##$PROCNO= 1
##$TYPE= <nmr>
##$USER= <she>
##$AMP= (0..31)
100 100 100 100 100 100 100 100 100 100 100 100 100 100 100 100 100 100 
100 100 100 100 100 100 100 100 100 100 100 100 100 100 
##$AQSEQ= 0
##$AQ_mod= 1
##$AUNM= <au_zg>
##$AUTOPOS= <>
##$BF1= 81.014009
##$BF2= 200.13
##$BF3= 200.13
##$BF4= 200.13
##$BF5= 200.13
##$BF6= 200.13
##$BF7= 200.13
##$BF8= 200.13
##$BYTORDA= 1
##$CFDGTYP= 0
##$CFRGTYP= 5
##$CHEMSTR= <none>
##$CNST= (0..31)
1 1 145 1 1 1 1 1 1 1 1 1 1 1 1 1 1 1 1 1 1 1 1 1 1 1 1 1 1 1 1 1 
##$CPDPRG= <waltz16>
##$CPDPRG1= <>
##$CPDPRG2= <waltz16>
##$CPDPRG3= <>
##$CPDPRG4= <mlev>
##$CPDPRG5= <mlev>
##$CPDPRG6= <mlev>
$$ [...]
##$SUBNAM3= <"">
##$SUBNAM4= <"">
##$SUBNAM5= <"">
##$SUBNAM6= <"">
##$SUBNAM7= <"">
##$SUBNAM8= <"">
##$SUBNAM9= <"">
##$SW= 369.568048894756
##$SWIBOX= (0..15)
0 1 3 0 0 0 0 0 0 0 0 0 0 0 0 0 
##$SW_h= 29940.119760479
##$TD= 32768
##$TD0= 1
##$TE= 0
##$TE2= 300
##$TE3= 300
##$TEG= 300
##$TL= (0..7)
0 120 53 12 22 120 120 120 
##$TP= (0..7)
150 150 150 150 150 150 150 150 
##$TP07= 0
##$TPNAME0= <>
##$TPNAME1= <>
##$TPNAME2= <>
##$TPNAME3= <>
##$TPNAME4= <>
##$TPNAME5= <>
##$TPNAME6= <>
##$TPNAME7= <>
##$TPOAL= (0..7)
0.5 0.5 0.5 0.5 0.5 0.5 0.5 0.5 
##$TPOFFS= (0..7)
0 0 0 0 0 0 0 0 
##$TUNHIN= 0
##$TUNHOUT= 0
##$TUNXOUT= 0
##$USERA1= <user>
##$USERA2= <user>
##$USERA3= <user>
##$USERA4= <user>
##$USERA5= <user>
##$V9= 5
##$VALIST= <valist>
##$VCLIST= <CCCCCCCCCCCCCCC>
##$VD= 0
##$VDLIST= <DDDDDDDDDDDDDDD>
##$VPLIST= <PPPPPPPPPPPPPPP>
##$VTLIST= <TTTTTTTTTTTTTTT>
##$WBST= 1024
##$WBSW= 4
##$XGAIN= (0..3)
0 0 0 0 
##$XL= 0
##$YL= 0
##$YMAX_a= 26763
##$YMIN_a= -26280
##$ZGOPTNS= <>
##$ZL1= 120
##$ZL2= 120
##$ZL3= 120
##$ZL4= 120
##$ABSF1= 182.463
##$ABSF2= -187.1042
##$ABSG= 5
##$ABSL= 3
##$ALPHA= 0
##$AQORDER= 0
##$ASSFAC= 0
##$ASSFACI= 0
##$ASSFACX= 0
##$ASSWID= 0
##$AUNMP= <proc_1d>
##$AZFE= 0.1
##$AZFW= 0.5
##$BCFW= 0
##$BC_mod= 2
##$BYTORDP= 0
##$COROFFS= 0
##$CY= -3
##$DATMOD= 1
##$DC= 0
##$DFILT= <>
##$DTYPP= 0
##$F1P= 0
##$F2P= 0
##$FCOR= 1
##$FTSIZE= 65536
##$FT_mod= 6
##$GAMMA= 0
##$GB= 0
##$INTBC= 1
##$INTSCL= 5.30512e-09
##$ISEN= 30
##$LB= 1
##$LEV0= 0
##$LPBIN= 0
##$MAXI= 10000
##$MC2= 0
##$MEAN= 0
##$ME_mod= 0
##$MI= 50
##$NCOEF= 0
##$NC_proc= -3
##$NLEV= 6
##$NOISF1= 182.463
##$NOISF2= 159.3651
##$NSP= 0
##$NTH_PI= 0
##$NZP= 0
##$OFFSET= 182.463
##$PC= 4
##$PHC0= -1610.366
##$PHC1= 663.0013
##$PH_mod= 1
##$PKNL= yes
##$PPARMOD= 0
##$PSCAL= 0
##$PSIGN= 0
##$REVERSE= no
##$SF= 81.0140089999434
##$SI= 65536
##$SIGF1= 159.3651
##$SIGF2= -187.1042
##$SINO= 113.3802
##$SIOLD= 16384
##$SREGLST= <1H.CDCl3>
##$SSB= 0
##$STSI= 65536
##$STSR= 0
##$SW_p= 29940.119760479
##$SYMM= 0
##$S_DEV= 0
##$TDeff= 32768
##$TDoff= 0
##$TI= <>
##$TILT= no
##$TM1= 0
##$TM2= 0
##$TOPLEV= 0
##$USERP1= <user>
##$USERP2= <user>
##$USERP3= <user>
##$USERP4= <user>
##$USERP5= <user>
##$WDW= 1
##$XDIM= 65536
##$YMAX_p= 322700847
##$YMIN_p= -1817135
$$ End of Bruker specific parameters
$$ ---------------------------------
##NTUPLES= NMR SPECTRUM
##VAR_NAME=  FREQUENCY,     SPECTRUM/REAL,   SPECTRUM/IMAG
##SYMBOL=    X,             R,               I
##VAR_TYPE=  INDEPENDENT,   DEPENDENT,       DEPENDENT
##VAR_FORM=  AFFN,          ASDF,            ASDF
##VAR_DIM=   65536,         65536,           65536
##UNITS=     HZ,            ARBITRARY UNITS, ARBITRARY UNITS
##FACTOR=    0.456856943014862, 1,           1
##FIRST=     14782.0589164792, 0,            0
##LAST=      -15158.0608439998, 0,           0
##MIN=       -15158.0608439998, -1817135,    0
##MAX=       14782.0589164792, 322700847,    0
$$ Real data points
##PAGE= N=1
##DATA TABLE= (X++(R..R)), XYDATA
$$ [...]
39505 -158810 -153688 -72690 -153638 -358128 -424126 -222982 93233 279558 226772 11835 -201011
39494 -201011 -298204 -289131 -250255 -220696 -200418 -225705 -341930 -477475 -458822 -230896 15808
39483 15808 42350 -143967 -288068 -187553 78022 248308 169490 -58612 -210199 -170604
39473 -170604 -28190 49150 -10149 -136188 -210951 -182201 -108386 -108066 -233748 -381061 -375959
39462 -375959 -185165 23366 84040 27079 -12771 -5683 -16941 -38350 2414 62630 -4034
39451 -4034 -198102 -305320 -187284 -5809 -10910 -194743 -320864 -256427 -107438 -13276 40750
39440 40750 143012 287658 362877 264465 -14903 -363776 -594757 -571280 -339385 -94578
39430 -94578 17223 23752 25419 42648 30653 -16676 -80586 -203168 -436295 -697157 -802445
39419 -802445 -697834 -542504 -489548 -485422 -397540 -256854 -222058 -331272 -439173 -413103 -264983
39408 -264983 -71223 107929 195516 120810 -57818 -166459 -125624 -46938 -52114 -105483 -109393
39397 -109393 -52343 38144 172746 305495 279239 29230 -249541 -319096 -211232 -127811
39387 -127811 -93547 42018 260316 309638 81904 -174824 -176008 20726 124829 15541
39377 15541 -119999 -33744 295527 629553 699737 486646 254703 249722 401282 442826 298807
39366 298807 176834 248243 426778 545014 575971 563518 482465 306363 101143 -76521
39356 -76521 -270587 -498066 -645487 -624311 -517928 -436974 -351131 -224415 -184507 -344013
39346 -344013 -548778 -540774 -319559 -111039 -15058 69249 179391 217888 183367 216933 338392
39335 338392 370026 228273 77738 72395 144771 193289 277749 440879 510215 318642 20885
39324 20885 -54909 163523 425884 514892 468533 421821 410545 399524 368588 296617 162575
39313 162575 24293 -658 98512 165761 66192 -136907 -283934 -337774 -384827 -446692 -433083
39302 -433083 -317283 -228156 -272078 -352523 -302030 -155267 -126516 -284826 -419510 -339322 -173734
39291 -173734 -199783 -427879 -562570 -399753 -81370 125644 156075 131399 123016 81686 -31490
39280 -31490 -175024 -296132 -379005 -413408 -389487 -338072 -313283 -316953 -292405 -212948 -131820
39269 -131820 -118768 -177990 -253183 -293704 -291443 -256765 -177366 -21999 199502 395505 457293
39258 457293 379998 275689 236154 226687 162866 49137 -34113 -60118 -78925 -97997 -37521
39247 -37521 134751 296173 292811 148973 54526 122135 248262 279487 243964 297380 446608
39236 446608 468550 188378 -251584 -525308 -492464 -305403 -148953 -30589 98852 160724
39226 160724 42461 -181439 -287636 -175518 32045 188723 286863 347477 286686 45317
39216 45317 -213654 -220966 59600 355857 417463 300100 224501 258141 282979 225369 146091
39205 146091 88971 -282 -142702 -245425 -241269 -204806 -227238 -263550 -222081 -133196 -89037
39194 -89037 -63826 46333 214527 275363 153790 -42403 -200233 -327725 -437656 -452230
39184 -452230 -338683 -231440 -279092 -425334 -469802 -321742 -87507 75182 90787 -31092
39174 -31092 -218502 -350269 -339288 -233940 -171447 -207636 -255515 -218618 -121000 -58372 -64972
39163 -64972 -86920 -72944 -39661 -36202 -78256 -142040 -207980 -275381 -325446 -304655 -179931 3083
39151 3083 153408 224659 243471 257818 293047 347848 387386 348941 208785 38130 -66233
39140 -66233 -95197 -96473 -51703 94038 266040 270974 47045 -222904 -344861 -345069 -349575 -346236
39128 -346236 -238302 -72076 -20886 -142630 -312244 -409753 -426680 -359983 -159277 145818
39118 145818 387047 419504 271909 71210 -111602 -275224 -412098 -493598 -497609 -405160
39108 -405160 -212566 12927 146345 132641 59032 41372 76592 75893 19379 -3937 74768
39097 74768 194933 229531 142356 41685 49905 135336 131745 -44215 -255210 -300732 -179028
39086 -179028 -84073 -135240 -230171 -220622 -125658 -69451 -76208 -51294 47335 129896 91038 -72190
39074 -72190 -285403 -467795 -534503 -396738 -51329 334762 514598 390074 122825 -31395
39064 -31395 9883 102215 88979 2009 -962 143248 320521 382450 315833 242873 279266
39053 279266 412830 513952 464843 290922 153012 180394 315352 359568 187294 -111642
39043 -111642 -315284 -283106 -80405 97701 115892 8967 -96186 -143576 -188753 -277302
39033 -277302 -352198 -332474 -239987 -178552 -198224 -240908 -227635 -153929 -80304 -52098 -49975 -28978
39021 -28978 -4452 -57678 -207361 -317861 -242467 -52545 18104 -100186 -202024 -120303 11471
39010 11471 -23170 -168951 -179165 6305 183054 178779 35222 -121747 -220689 -230537 -162669
38999 -162669 -100202 -81662 19724 315379 632732 674870 455864 290335 290950 198532 -143960
38988 -143960 -464883 -446623 -185581 -2648 7588 -42364 -132085 -297638 -411515 -324576
38978 -324576 -169710 -208959 -401725 -440001 -231893 -40984 -77328 -234456 -337712 -395852
38968 -395852 -464327 -477848 -389471 -309885 -333204 -346436 -186877 87453 248025 188664 39908
38957 39908 -12724 64247 153887 160686 144514 244699 464055 614270 553330 391343 327893
38946 327893 355291 305704 156838 70454 111518 159844 159769 220856 363226 394264 200670
38935 200670 -34042 -92892 -35089 -31703 -50421 34186 127387 17906 -230336 -293607 -52661
38924 -52661 219711 243980 93014 25183 126069 284456 412518 506174 530653 416510
38914 416510 191628 1127 -47115 10635 71977 96769 118133 162649 208913 221929 196660
38903 196660 160282 149072 185301 253000 287024 219072 67739 -39787 14229 198750 356776
38892 356776 370692 259228 111490 -3094 -32977 64210 255757 408741 416201 329516 285193
38881 285193 306410 267779 84909 -141107 -230569 -133895 32211 139228 166679 156489 118717
38870 118717 39454 -51142 -89850 -64807 -31129 -22214 3959 99458 249597 393637 482108
38859 482108 486519 408286 314437 288495 286344 138496 -195445 -470605 -424786 -146841 30049
38848 30049 -9007 -50447 39929 73569 -123366 -351513 -278586 76288 368698 405941 343150
38837 343150 372769 448053 410572 227069 -13262 -228203 -370209 -405810 -353814 -283803 -212474
38826 -212474 -68558 175961 415800 535406 556206 566611 560455 459371 268053 86833
38816 86833 -30619 -118130 -183564 -180455 -135893 -174218 -320835 -394390 -227418 82874 301957
38805 301957 386225 489894 646213 675134 497644 318547 318025 335914 112422 -252200 -370158
38794 -370158 -110645 198699 211562 -11030 -156850 -90531 38041 29526 -161079 -415256
38784 -415256 -548224 -453112 -216484 -42518 -17416 -30711 19547 65974 18208 -44281 23927
38773 23927 199142 303125 227110 27841 -166844 -242541 -138948 63873 139140 -54839
38763 -54839 -339305 -357485 15245 514540 773551 676839 402172 195895 155364 195993
38753 195993 200626 179792 228413 325716 307500 112547 -79671 -91125 -4083 -3559 -65307 -19644
38741 -19644 139465 250201 258385 249801 217944 71861 -99487 -65617 162994 281211 142034
38730 142034 -19104 21131 128834 82835 -50004 -71767 5419 49106 72951 120495 27651
38719 27651 -360111 -818710 -949122 -728828 -515319 -484049 -422209 -166437 103835 175511
38709 175511 115325 76116 30054 -83717 -145891 -42943 75142 -17127 -256494 -362592
38699 -362592 -240714 -86839 -85741 -203461 -313621 -362198 -353703 -302952 -253748 -251766 -269937
38688 -269937 -244596 -186067 -149636 -106415 17060 157824 139005 -71169 -281203 -340240 -324049
38677 -324049 -344908 -337865 -209182 -66868 -79250 -178462 -154884 -26550 -38522 -239154 -340185
38666 -340185 -152050 83114 29087 -237052 -338514 -149522 64154 79196 8627 45063
38656 45063 134330 92690 -80966 -210513 -210722 -173448 -184300 -202612 -166426 -105409 -82813 -92745
38644 -92745 -83156 -46455 -27128 -50672 -95057 -137720 -188154 -251125 -289628 -268546 -226769 -249038
38632 -249038 -341526 -389151 -294238 -124815 -46353 -109464 -190120 -164535 -59340 24951 65713
38621 65713 109596 158046 163702 134842 142085 189586 167104 53 -202380 -238084 -53651
38610 -53651 176198 243812 134061 4037 -31779 -19550 -55080 -129012 -147242 -77227 -3491
38599 -3491 -25947 -148083 -284078 -348033 -322473 -262213 -242325 -283221 -319916 -264943 -108407
38588 -108407 61072 137572 85308 -46888 -171946 -229444 -234782 -264331 -363261 -470042 -466261
38577 -466261 -304635 -57381 161495 288372 331878 355339 447717 655662 907661 1039753
38567 1039753 942708 683013 452349 385583 434163 434918 310854 168954 151009 223700 228042
38556 228042 147489 171779 401221 635105 623040 425652 314153 363275 385418 276183
38546 276183 171180 185338 231196 218291 226142 323219 391946 317803 210577 239323 355490
38535 355490 383560 304921 240934 205555 89316 -120722 -295343 -345581 -291922 -160253 20787
38524 20787 121308 -199 -268559 -418819 -305551 -48666 165707 278661 302684 232957
38514 232957 108002 40678 94233 207584 301455 364898 386776 319203 187116 124809 203807
38503 203807 308388 285143 155322 81087 160614 337414 482146 499017 377650 191054
38493 191054 24533 -109310 -241972 -338619 -306201 -137997 47170 152586 192669 190455
38483 190455 107003 -50639 -167702 -166647 -111134 -66406 24866 196470 308826 222995 37755
38472 37755 -45498 -34758 -102854 -255896 -291406 -122579 89055 198149 249240 281435 189514
38461 189514 -48964 -208028 -106215 76881 43566 -145748 -140255 154260 400246 302763
38451 302763 6365 -146869 -67826 66101 118588 104539 61313 15504 60550 280455 573779
38440 573779 706924 583149 344706 187145 183314 294155 414051 386120 130813 -190795
38430 -190795 -300390 -161678 -56199 -198598 -435682 -474641 -280263 -69245 3345 -30078
38420 -30078 -89564 -142484 -167692 -153726 -126449 -97034 -37210 14235 -67416 -276997 -380825
38409 -380825 -225909 -18841 -42490 -199892 -165443 52416 83008 -206790 -464026 -368650
38399 -368650 -76009 84183 77997 69494 71709 -370 -70024 4814 153163 184763 113281
38388 113281 122064 232686 275196 205985 195028 325316 431666 353275 175087 85405 110033
38377 110033 121623 50261 -37224 -63486 -66674 -160714 -373038 -554797 -516506 -270417 -53651
38366 -53651 -50062 -175046 -229001 -175079 -123794 -105713 -41879 64744 90856 -5573 -92294
38355 -92294 -40011 119288 271872 354384 343451 224863 66729 32341 198101 405290
38345 405290 420190 240063 120043 248130 489137 552969 378944 217850 286934 469776
38335 469776 486149 281820 63467 -47163 -174860 -420048 -626042 -586655 -357013 -167179
38325 -167179 -103496 -67241 -6100 12686 -33558 -60122 -15298 43149 42981 -27652 -143514 -246711
38313 -246711 -247750 -126365 3940 47084 77806 190195 269807 140734 -98025 -154659 10740
38302 10740 107968 -29780 -199815 -196295 -162005 -335470 -625238 -706151 -463671 -114591 88377
38291 88377 95544 17644 -15199 42263 95484 -2970 -237508 -383511 -279451 -52580 55278
38280 55278 -1018 -82705 -113408 -138319 -182109 -220357 -270713 -352660 -376684 -241357 -37743
38269 -37743 11158 -165344 -410329 -562348 -600539 -547598 -399489 -212326 -113106 -149320 -240011
38258 -240011 -323598 -425189 -529008 -541024 -462559 -440416 -519737 -499845 -216242 141856 214162
38247 214162 -64718 -389247 -484303 -384233 -258862 -160665 -71852 -48726 -135866 -214880 -133797
38236 -133797 31460 44233 -127367 -217543 -49585 169145 139314 -63551 -78770 204489
38226 204489 485686 507890 409158 439490 534428 432641 119012 -124649 -109500 53713
38216 53713 178445 223180 208075 95218 -115363 -283911 -256204 -39284 224483 397955
38206 397955 406566 246457 26083 -73439 16009 147846 134822 -17265 -138770 -115433 23699
38195 23699 205405 381525 499102 510444 438868 354364 267743 132305 -29819 -101501 -26618
38184 -26618 84683 81911 -42723 -174774 -248448 -300094 -341554 -281127 -48908 244422 378961
38173 378961 278462 103807 31558 17675 -102495 -323481 -446871 -375358 -247418 -181780
38163 -181780 -68410 204219 456281 413618 144533 10353 147911 288816 198228 14144
38153 14144 -32239 15972 12291 50579 309151 648087 714034 454068 203486 191376 251696
38142 251696 149458 -68230 -225264 -311555 -410046 -467558 -360295 -121876 81139 171765
38132 171765 213674 264555 308427 322980 307412 246581 124625 -35236 -191631 -311029 -342314
38121 -342314 -238075 -44696 115887 197396 252046 266911 151015 -27964 -5599 309107
38111 309107 611753 572655 276381 44569 -39082 -130745 -258463 -296197 -273686 -366619 -551111
38100 -551111 -593556 -442059 -313460 -309588 -262029 -76428 74882 62406 26085 115008 246993
38089 246993 309081 364092 467837 505059 406422 311801 313175 261213 58059 -88781 16931
38078 16931 194410 148873 -64055 -163994 -103904 -61460 -69179 -6273 92863 72054 -19258
38067 -19258 29552 203330 246097 77220 -89471 -110543 -99127 -153252 -177620 -99153 -19143
38056 -19143 -22329 -43063 -37775 -89890 -222924 -296389 -213184 -69427 8585 17804 -20552 -132481
38044 -132481 -257483 -230213 -32611 99005 -32033 -313703 -486246 -450772 -291346 -112777
38034 -112777 7111 6639 -87208 -152487 -128608 -82845 -53684 27482 161769 195545 53350
38023 53350 -85755 -15426 206735 366904 394279 367482 300168 128454 -104660 -234229
38013 -234229 -174976 -27335 36283 -73981 -302682 -479810 -456345 -267454 -103751 -72876
38003 -72876 -84251 -36601 7283 -47659 -131082 -92390 80514 261723 354190 338120 210782
37992 210782 -242 -205606 -329785 -364566 -289944 -65329 207730 281487 85434 -98066
37982 -98066 14194 316716 514468 572584 657749 722014 524068 87954 -224686 -209093
37972 -209093 -73971 -67794 -138352 -144456 -145473 -246111 -349025 -311990 -215665 -234916 -343352
37961 -343352 -377633 -318273 -268598 -204610 -1003 289570 431812 343154 218772 225836 260291
37950 260291 145583 -65521 -151570 -14111 232179 418773 448237 295254 23051 -194396
37940 -194396 -193848 -10266 142277 111037 -49974 -197247 -263037 -254856 -186083 -85945 -10836
37929 -10836 29731 98090 211142 273768 214110 104511 43985 5678 -72121 -137284 -132340
37918 -132340 -158897 -312700 -421490 -228779 164480 353980 196284 2471 35717 137194
37908 137194 71322 -50500 454 133639 87202 -113010 -198409 -104185 -28515 -55168 -53808
37897 -53808 -1222 -77095 -327131 -507217 -421751 -211452 -142015 -257276 -390663 -408058 -309409
37886 -309409 -172265 -96445 -137681 -227481 -230714 -124716 -23689 16957 97176 298566 522206
37875 522206 594013 464661 238464 65867 49331 175608 295596 250676 57636 -114060
37865 -114060 -169466 -177448 -197398 -158706 -255 184492 249956 174350 49117 -40119 -49103
37854 -49103 36440 168332 248472 237954 196908 168922 108505 -9699 -93907 -41606 105558
37843 105558 194338 120813 -87888 -310524 -409875 -324153 -123794 59167 172238 260002
37833 260002 348753 408465 440046 488665 538871 506379 372572 220985 111426 39075 38784
37822 38784 165113 313574 247486 -85031 -413904 -449961 -197914 133663 377777 438525
37812 438525 250834 -100499 -345257 -300099 -87055 70733 145033 222195 280693 281353 344314
37801 344314 552657 678310 434861 -29127 -240641 -48833 176689 96035 -174479 -351291
37791 -351291 -405634 -453412 -437279 -205488 191755 529934 686701 696289 582419 346576
37781 346576 105834 33773 130152 217707 203770 176701 191859 155684 40672 33268 264710
37770 264710 511576 426261 45207 -208910 -102176 103935 80982 -80252 -80342 65842 70566
37759 70566 -110920 -174888 51924 353220 471947 426899 312937 68977 -310978 -564272
37749 -564272 -450665 -114076 116691 165203 174490 161717 28834 -145985 -161260 -34214
37739 -34214 14448 -67503 -104539 -31329 20861 26426 122581 265137 169606 -228446 -560292
37728 -560292 -497537 -185653 39623 142216 306049 535184 647168 587880 481872 405505
37718 405505 332330 266062 224598 134716 -58259 -224684 -205006 -84956 -83563 -189773 -166376
37707 -166376 62907 287295 334691 282562 247042 193356 95832 77285 202433 295360 176818
37696 176818 -29831 -60219 85511 141432 -15059 -185524 -158496 -7509 45734 -55542
37686 -55542 -168588 -171242 -91050 -30083 -55284 -163783 -289689 -347718 -321589 -291148 -317757
37675 -317757 -339185 -261447 -123280 -52609 -61870 -22370 118951 231762 189449 52099 -34073
37664 -34073 -26382 30143 118691 222969 254891 155157 22824 323 57930 37165 -111013
37653 -111013 -280422 -388701 -443286 -432219 -325773 -207948 -222081 -336656 -346768 -177667
37643 -177667 -4993 18288 -29398 -23183 -1847 -26771 9156 216856 454965 465515 230689
37632 230689 -7322 -81012 -69989 -108398 -179207 -178653 -96770 -51295 -146080 -318086 -362338
37621 -362338 -171960 72015 87842 -106105 -167208 92635 409298 439128 252803 189391
37611 189391 332604 450249 422294 394291 447293 425309 225376 13614 -9334 125717
37601 125717 271111 374945 431398 379649 225211 133171 218639 338138 263817 -6323
37591 -6323 -276914 -433319 -524706 -605507 -652769 -635457 -544139 -363393 -113803 109861 235141
37580 235141 292491 304164 187768 -78918 -287456 -202305 98710 297035 239909 64867
37570 64867 -81606 -202056 -275426 -195034 -7774 24083 -211575 -436846 -329110 29006
37560 29006 280817 289513 250867 334819 453452 434900 252387 15545 -145777 -147700 -7035
37549 -7035 143273 187958 181092 252253 368908 345317 120465 -128876 -222225 -187272 -153223
37538 -153223 -156508 -162145 -181329 -242026 -297917 -279939 -211213 -182262 -228405 -293580 -294048 -178629
37526 -178629 26961 192967 171646 -19224 -156747 -38598 287098 581857 663777 532430
37516 532430 303094 101950 -5164 -56906 -153715 -324358 -470812 -484460 -360144 -156689
37506 -156689 70052 237624 246758 112594 -10761 -35517 -60928 -172348 -253728 -175984 -54465
37495 -54465 -90465 -229592 -236208 -87758 -24246 -163904 -324937 -323865 -234662 -226677 -314014
37484 -314014 -396293 -423003 -402821 -347025 -291660 -287718 -307965 -260704 -143763 -76330 -137041
37473 -137041 -286685 -475785 -681879 -810662 -738731 -512360 -321873 -216083 -52804 179406
37463 179406 241389 14169 -232848 -172287 138605 375196 387106 293345 221204 180801 167555
37452 167555 198589 253227 305084 377214 465513 485639 399920 290739 197805 24805 -252998
37441 -252998 -453398 -438045 -331787 -288696 -226919 -53920 37412 -161593 -449249 -444073 -171049
37430 -171049 -22787 -159063 -348094 -425665 -494055 -581901 -516301 -277659 -111775 -122597
37420 -122597 -103018 51533 122544 -17607 -132675 -47114 -4118 -246111 -526294 -456037
37410 -456037 -135982 4435 -119278 -181383 -21061 149948 167806 160876 260474 386347
37400 386347 458215 549901 677905 669902 422185 109658 -34801 -10747 37523 64539 102346
37389 102346 102515 -1114 -124918 -119892 -4858 65012 68416 163458 399325 561771 436688
37378 436688 103696 -188864 -353191 -474531 -538738 -396411 -73304 108867 -97328 -500808
37368 -500808 -675678 -472138 -140001 31303 3635 -99854 -189314 -228363 -186579 -73182
37358 -73182 39500 87459 77709 66455 115172 247200 386798 391328 240787 125365 193992
37347 193992 285055 126361 -222941 -396458 -226434 50953 189508 244347 327659 334971
37337 334971 166981 9738 98719 342261 471240 461501 501695 601278 562048 359599 239877
37326 239877 343519 493165 483162 371162 329188 365948 370180 332961 356967 472242 572234
37315 572234 550131 431691 354422 434916 649875 841344 859108 697566 465149 234387
37305 234387 -16764 -301621 -527463 -559851 -376387 -113806 62468 118314 137500 146378
37295 146378 35596 -266677 -606350 -719860 -534549 -228488 14801 169344 263043 283456
37285 283456 259753 278805 325213 261611 77804 -14128 108824 237711 110007 -189271
37275 -189271 -342607 -247242 -103631 -75962 -100475 -68565 -3766 16645 -14910 -52200 -52071
37264 -52071 4003 74513 59184 -83735 -250124 -303255 -234005 -127960 -37420 21932 27496
37253 27496 4187 22863 37793 -128815 -484776 -720049 -588121 -285332 -171798 -241801
37243 -241801 -206920 -21572 66828 -9065 -21210 106372 114423 -162180 -497433 -603549 -506301
37232 -506301 -398493 -333007 -256520 -179111 -133814 -97974 -80355 -147941 -275090 -335516 -326127
37221 -326127 -393542 -544425 -569854 -389066 -213276 -190415 -140881 119655 414862 444002
37211 444002 233214 78915 137235 304874 425675 402202 180955 -166650 -407742 -368726
37201 -368726 -136556 88387 229588 287169 209934 8995 -138084 -108491 -37560 -91516
37191 -91516 -175281 -111241 19738 -277 -152590 -220805 -148340 -70820 -27610 66850 167647
37180 167647 100853 -146359 -385769 -512285 -598841 -679049 -663033 -512234 -296739 -53041
37170 -53041 219767 421446 429544 324858 307216 375486 338345 161570 32425 33044 34397
37159 34397 -9541 43250 217718 299677 177732 44375 71382 130256 54751 -39803 34369
37148 34369 170285 97898 -193806 -430551 -431871 -295667 -183696 -104811 24023 211282
37138 211282 361720 390874 336881 329947 423447 502537 442578 309082 265578 318056 333094
37127 333094 299635 340606 422379 317748 -21486 -306036 -301278 -157943 -134009 -183987 -101708
37116 -101708 64951 63167 -134856 -250895 -105666 123996 151851 -57464 -266791 -229343
37106 -229343 77572 432441 563503 397867 115634 -52325 -29057 115672 268954 312115
37096 312115 171187 -70046 -200421 -123877 20158 69978 52189 58196 48895 -45293 -145310
37085 -145310 -143498 -111437 -172736 -242790 -139201 82716 158852 -7984 -237051 -364004 -413950
37074 -413950 -429343 -361351 -227192 -164339 -208123 -199499 -47363 86317 23346 -145542 -193512
37063 -193512 -85778 10233 2396 -14883 57581 169916 209426 163561 127687 161406 184235
37052 184235 59386 -210004 -433024 -452560 -372143 -441335 -706319 -906358 -786103 -414782
37042 -414782 -102293 -49839 -172220 -249486 -180438 -63445 -51070 -153734 -221581 -133029 52820
37031 52820 183943 201830 156849 85797 -3364 -41178 65392 271253 388894 298283 74310
37020 74310 -129453 -236450 -261251 -267002 -339443 -503524 -636972 -574133 -324833 -73624 62318
37009 62318 129793 158884 71118 -135354 -282518 -238691 -118541 -109868 -208049 -269504 -233859
36998 -233859 -143209 -24135 99929 153039 105465 50497 47377 -5439 -170973 -265668 -81617
36987 -81617 256352 410887 285297 104595 39898 13858 -68357 -145235 -155535 -162622 -213923
36976 -213923 -247718 -233262 -234076 -242008 -133769 90233 205738 54876 -211678 -339893 -293220
36965 -293220 -212040 -170207 -144628 -139660 -170473 -177367 -96317 43934 212271 465708 798678
36954 798678 999267 851855 437739 52788 -143369 -221537 -257346 -211680 -61230 114027
36944 114027 217536 206558 82011 -80527 -124340 21430 199275 203909 69551 -4252
36934 -4252 23971 16462 -46346 -11661 143994 218195 96658 -68289 -122898 -133632 -190183
36923 -190183 -205424 -106493 -28501 -85144 -111172 98810 412794 512227 357476 208781 196206
36912 196206 169871 35614 -44254 74387 251406 248828 64899 -80252 -37127 123549
36902 123549 235768 218052 118244 35692 30055 99914 216187 325479 328517 152904 -106315
36891 -106315 -226037 -127897 -11839 -90516 -285039 -353050 -244018 -120063 -66078 -18608
36881 -18608 15626 -64637 -198769 -149175 131352 358714 315849 175784 208896 354835 365145
36870 365145 250791 261962 440088 509830 301658 16995 -80498 -44996 -124745 -365370
36860 -365370 -544175 -492195 -315826 -239858 -328266 -439487 -418652 -259595 -73668 40664
36850 40664 58835 -4916 -132477 -287270 -399930 -397705 -254231 -20877 185875 263062 224831
36839 224831 200066 277845 386160 392795 294690 206808 176976 137533 55696 -10693 -56698
36828 -56698 -174296 -352781 -380537 -105304 301368 519237 472148 363678 334087 283489
36818 283489 97349 -124873 -193308 -88942 24277 16129 -83504 -174095 -212328 -210933 -162103
36807 -162103 -31968 159666 310125 334896 275341 244591 268013 246842 102367 -105790
36797 -105790 -236295 -188390 49351 392094 660165 678274 452407 189555 71597 65172
36787 65172 17360 -134969 -331471 -485330 -517939 -375985 -127308 39760 44577 56131 240495
36776 240495 453297 417506 171638 59190 219895 374326 256251 15744 -23558 160486
36766 160486 306042 270391 162195 84655 -19031 -205411 -395886 -497259 -539880 -600690
36756 -600690 -666667 -666396 -592157 -509640 -466221 -450695 -428537 -361852 -210053 20206 219641
36745 219641 245217 86741 -85877 -96953 44438 183850 220176 185958 141882 93506 44586
36734 44586 41386 101144 159875 155242 108629 60650 -20515 -183570 -379885 -487095 -435336
36723 -435336 -253409 -17929 179509 245261 140380 -80862 -327852 -531323 -612815 -490914
36713 -490914 -211228 15427 37866 -28983 34853 234512 369533 340342 255981 214895 166761
36702 166761 61451 -22268 5066 100664 146738 82199 -63368 -196407 -213442 -122309 -92783
36691 -92783 -249418 -431159 -349785 -13105 229943 147598 -86679 -188319 -140088 -105438
36681 -105438 -131540 -142546 -119451 -93151 -33827 79346 140784 31601 -200271 -411346 -549963
36670 -549963 -633588 -615424 -440595 -189302 -9286 60152 68278 22858 -67430 -87566 62981
36659 62981 276623 343218 236604 132782 152333 241425 301474 285110 169518 -20044 -170146
36648 -170146 -200478 -197728 -282513 -389619 -357089 -190367 -36387 66806 179596 220386 14203
36637 14203 -374536 -628343 -584000 -411545 -291923 -169530 34791 201471 190255 63759
36627 63759 -45150 -140711 -272887 -376549 -367303 -281089 -175977 -23233 164370 243590 144968
36616 144968 27156 52602 144931 155355 131395 207306 351411 450229 528147 636891 640257
36605 640257 400799 102820 63065 239039 258000 -27848 -335895 -385930 -240818 -93551
36595 -93551 15882 114439 152746 114432 86353 77391 -45991 -298101 -448907 -341922 -152818
36584 -152818 -123257 -202736 -193166 -110656 -127064 -231849 -238626 -114622 -41515 -114923 -206606
36573 -206606 -184714 -92411 -48802 -117213 -307516 -562397 -709719 -584514 -249724 38399
36563 38399 123703 77298 15163 -40065 -70320 -19950 73315 69523 -59116 -161540 -146921
36552 -146921 -118461 -157091 -157891 -31766 111843 166314 233693 405129 501679 313444 -25610
36541 -25610 -212942 -242328 -348849 -532429 -531469 -315671 -193885 -287961 -289937 20197 353385
36530 353385 319374 -1819 -239569 -290421 -322248 -344873 -182998 135617 337816 311886
36520 311886 241565 249258 204086 18421 -131594 -69609 96409 155260 113446 126420 202585
36509 202585 192573 55888 -45033 39703 251667 399496 374659 245798 151264 132243
36499 132243 110511 41596 20912 152397 348182 384890 182373 -79793 -165462 -17549
36489 -17549 238219 429187 435734 256484 36292 -46732 28702 121090 131892 105690 85127
36478 85127 9740 -144896 -251212 -180212 16972 194917 296691 324307 217964 -56473
36468 -56473 -332215 -339635 -23539 355652 485369 296996 -15459 -200633 -152581 39186
36458 39186 214873 313586 379542 407882 303173 60109 -138409 -135397 -21332 13153 -29093
36447 -29093 3961 117844 145542 39175 -35763 19049 53766 -100722 -366364 -526125 -502496
36436 -502496 -387535 -262977 -133514 -8959 77876 139175 218150 294356 283466 152774
36426 152774 -23764 -149676 -202573 -227099 -264481 -310346 -325469 -275655 -171354 -72199 -39978
36415 -39978 -80336 -137755 -151299 -105910 -22635 83239 199531 270100 206398 -2742 -227253
36404 -227253 -314595 -257445 -162018 -69003 66911 208767 224350 127160 148184 395953 591743
36393 591743 392403 -86888 -349673 -143664 249111 432534 366279 266003 234946 211812
36383 211812 175633 176356 185503 106514 -38904 -81324 78341 312017 393429 244720 3697
36372 3697 -144131 -157935 -138326 -151907 -133739 -14890 122489 130129 11004 -76858 -45288
36361 -45288 26845 52131 48579 38144 -19947 -104174 -84303 75174 193906 109773 -71961
36350 -71961 -133101 -58382 -6037 -25658 -20815 25172 6807 -92035 -147396 -112692 -98029 -151846
36338 -151846 -144707 10583 177944 187759 95661 89937 214601 350268 427531 481825 492203
36327 492203 346231 40033 -221503 -238965 -58696 116096 209102 327251 525143 663952
36317 663952 599206 408816 294773 294265 238635 20643 -234456 -328547 -217816 -10813 165665
36306 165665 219538 112007 -62928 -92675 128032 427690 541169 433054 309549 323422
36296 323422 402528 386659 219647 -20756 -195531 -194402 -33403 138508 202096 203552 237403
36285 237403 260265 172544 38036 26383 139814 202554 147979 101562 126894 122564 67834
36274 67834 131085 375615 566039 467537 179592 -29172 -77622 -49976 50103 264123
36264 264123 470138 475256 310331 209674 288979 442287 562383 648708 657915 462573 63918
36253 63918 -298749 -364530 -110576 256463 504398 543213 452286 364651 304269 184144 521
36242 521 -88489 10381 144392 135251 74576 170433 367688 391831 167517 -69312 -109869
36231 -109869 19360 218589 426589 520018 376435 124854 63334 224566 307132 164522
36221 164522 47028 166951 340469 330058 262158 370088 535309 455968 143103 -109939
36211 -109939 -180483 -206594 -266370 -281365 -231633 -190784 -153083 -71577 -30981 -122183 -199599
36200 -199599 -63740 160352 172623 14641 50271 375825 648356 628228 505325 492846
36190 492846 462567 254444 43832 73387 230520 219757 16930 -155337 -210865 -262882
36180 -262882 -345284 -339444 -195076 -24981 43805 -18299 -158183 -248068 -141973 133774 319413
36169 319413 219556 -2862 -23178 198581 382951 337276 170067 46678 -56482 -227380
36159 -227380 -388635 -353352 -77438 256241 426841 398098 320807 327744 378593 350915 235358
36148 235358 136169 89123 21073 -67660 -33288 200219 482504 608694 555894 439041 334593
36137 334593 274318 308904 420858 453640 289554 38929 -98227 -94262 -63391 -46358 -7301
36126 -7301 20858 -8153 -2509 141405 291368 206629 -73672 -222136 -62970 213319 360999
36115 360999 380799 388047 380962 306825 216480 182917 158078 60568 -61309 -93842 -46564 -52892
36103 -52892 -186928 -365098 -438639 -340703 -144323 5673 30002 -14679 -19519 49088 141041
36092 141041 191340 135553 -71255 -342974 -442171 -232461 86364 179772 8836 -139382
36082 -139382 -74693 61840 64724 -40643 -102003 -85354 -67831 -82778 -95614 -69041 26751
36071 26751 192482 332600 313122 150143 30658 79152 218788 326370 383345 386697 265250
36060 265250 16390 -199679 -248319 -208699 -237287 -329924 -364784 -317978 -288269 -330389 -378858
36049 -378858 -337472 -186488 -20161 10425 -135436 -274341 -178466 104704 273007 167693
36039 167693 -30583 -95592 -47396 -10154 29347 128394 205667 165106 95391 145452 288660
36028 288660 394700 444399 489265 496679 434367 410834 511674 582222 416677 108471 -36228
36017 -36228 89409 301191 429951 485987 512116 498201 472211 482873 471367 341657 159567
36006 159567 84520 100337 31168 -148659 -245193 -148159 -3255 4669 -117858 -236237 -252452
35995 -252452 -150892 8689 114616 119116 115510 183470 216675 79076 -124366 -159257 -22761
35984 -22761 47296 -71016 -260739 -411073 -521609 -528728 -316523 14397 162396 24382
35974 24382 -164748 -204699 -191002 -268974 -373014 -380729 -318839 -249366 -138069 10881 76105
35963 76105 24401 7756 110865 202192 188516 198627 330541 433244 355125 211274 169420
35952 169420 147996 -23322 -292967 -485721 -579083 -640002 -616027 -444484 -261761 -251267
35942 -251267 -370795 -459359 -506823 -575216 -571920 -383301 -145115 -86914 -168194 -160461 -43825
35931 -43825 -16826 -125032 -183647 -99295 516 496 -74667 -190816 -335374 -403338 -283261
35920 -283261 -71671 26340 10882 54933 165080 165279 52501 61800 287708 517222 545264
35909 545264 403832 181757 -110919 -372119 -376531 -93767 187011 226494 127336 93217
35899 93217 112554 82260 49727 95751 121091 -13694 -231070 -327382 -247522 -92951 64628
35888 64628 205087 270186 223585 141899 94842 2814 -230967 -513470 -651941 -603583 -482584
35877 -482584 -365210 -244811 -146107 -124079 -152461 -139881 -53630 66154 182061 258106 243704
35866 243704 165306 155522 257318 285322 58305 -295168 -471325 -402409 -306402 -311656 -277041
35855 -277041 -77015 150388 199642 101126 53370 124932 192112 160600 103015 130818 221243
35844 221243 243789 132081 -28222 -95410 -25311 94778 149780 103406 9744 -41807 4573
35833 4573 107298 126970 -45990 -336368 -515349 -424141 -123926 191021 357682 301875
35823 301875 44571 -267671 -423245 -341624 -166923 -90588 -138896 -214546 -266044 -292375 -243363
35812 -243363 -73342 121464 173833 75221 -1384 48161 107353 12059 -207685 -348612 -271508
35801 -271508 -54509 101315 97484 40978 91803 230568 269787 127726 -23905 17243 205408
35790 205408 324589 284217 182926 107430 35758 -47618 -94571 -88022 -67746 -34344 47000
35779 47000 128431 113039 40569 73447 232517 319078 204023 31805 -3020 62877 79102
35768 79102 62429 141768 278604 277267 97806 -44302 32008 235050 347808 301768 191758
35757 191758 89420 -29106 -175603 -278735 -272777 -207200 -200364 -282715 -347535 -299125 -199930
35746 -199930 -183771 -235505 -173320 101161 435551 594527 524704 360588 232529 184323
35736 184323 229589 340496 388672 251436 9275 -100233 24307 231085 350604 399645
35726 399645 443577 403714 187277 -68795 -99706 130440 355987 348633 178897 56728
35716 56728 35401 -8408 -167416 -389523 -549534 -562406 -445272 -313596 -274559 -281708 -169129
35705 -169129 98114 300755 223158 -30151 -145923 -12013 169106 200119 125779 74923
35695 74923 56099 38216 70490 159038 162670 2774 -142197 -79405 54436 -34514 -324196
35684 -324196 -486799 -394370 -279672 -291456 -237558 21043 236247 142197 -78814 -72630 94845
35673 94845 40202 -286300 -480775 -289351 51049 219504 225101 223972 216916 169171 193258
35662 193258 348111 446806 338371 212272 313070 485684 365703 -31168 -285543 -171421
35652 -171421 79090 204381 267253 399802 475970 292440 -86001 -389769 -454308 -293128
35642 -293128 24396 372980 538851 406544 153729 74297 211659 334233 280338 155240
35632 155240 138116 242245 354139 411907 444614 479872 501996 500870 497986 496462 446671 319004
35620 319004 200445 227919 377837 421002 201185 -117087 -243120 -158387 -110879 -211238
35610 -211238 -288138 -219614 -141236 -171509 -177243 -26594 138046 136001 70648 116475 140782
35599 140782 -102433 -489220 -627917 -438843 -248894 -255956 -277499 -148207 -10008 -26373
35589 -26373 -112256 -149660 -199983 -285566 -222264 67143 294357 159758 -194477 -389260 -350154
35578 -350154 -326722 -428722 -468756 -304404 -70641 23618 -42512 -130360 -127411 -52348 -32419
35567 -32419 -170211 -382827 -436988 -227634 63244 199575 185638 175720 185028 97280 -82423
35556 -82423 -198708 -179514 -113927 -76245 -41800 -4433 -13705 -54615 -40480 27024 29504 -82547
35544 -82547 -200335 -212178 -141841 -74343 -35133 -1563 29211 26181 -54866 -226538 -401353
35533 -401353 -423444 -256475 -72993 -30156 -27705 134614 409884 538919 435051 296231
35523 296231 278716 294305 238414 202255 295033 414040 372420 162240 -59494 -175423 -174457
35512 -174457 -88096 15125 32754 -54086 -112844 -14806 186995 333936 366131 343033 300839
35501 300839 210634 72827 -49254 -104640 -94392 -32519 69436 172261 219620 197316 152287
35490 152287 144948 200796 301984 397777 417078 299219 55438 -180847 -213521 22862 334195
35479 334195 442117 320486 222596 301969 378067 233839 -20952 -126131 -89705 -121038
35469 -121038 -200848 -82700 229410 377091 169927 -116383 -172212 -95124 -139627 -270274
35459 -270274 -275742 -160287 -99235 -106724 -55496 35671 32805 -26960 26371 168536 181050 23492
35447 23492 -68274 51699 213683 201514 60884 -5638 77777 213152 278013 217529 53708
35436 53708 -116588 -187824 -168794 -185571 -317554 -491138 -582811 -572190 -538735 -537710 -525116
35425 -525116 -409844 -178006 46421 113675 33026 -34493 -7109 5786 -92043 -195544 -163094
35414 -163094 -60593 -43064 -68120 31514 211314 217341 -21571 -252298 -259858 -164338 -208001
35403 -208001 -402701 -553502 -533937 -386891 -208154 -54811 51283 107028 109202 42396
35393 42396 -67609 -113920 -29086 73932 33894 -89796 -80586 71915 119857 -31163 -125632
35382 -125632 33498 215798 74948 -330993 -630275 -652953 -551067 -451617 -309598 -129227
35372 -129227 -26853 9077 152463 416732 538670 344035 35074 -70027 56860 192043
35362 192043 200211 150441 149488 226262 360118 493291 533310 449910 340694 300764 274417
35351 274417 158647 11077 1367 157411 307426 300584 155556 -40025 -236237 -361794
35341 -361794 -291099 10855 371456 539846 421321 143363 -72567 -77114 102079 272954
35331 272954 256896 98826 28173 160798 334356 326540 148874 2073 -3146 53872 60006
35320 60006 1262 -60365 -47023 85923 269643 319968 126976 -176628 -353217 -336623 -237454
35309 -237454 -115693 59945 226589 225979 59707 -53130 22097 145357 124127 -36165
35299 -36165 -223490 -391983 -493512 -402684 -106915 155366 160442 12991 -18454 98115
35289 98115 158776 83625 24598 94443 211977 269514 264655 204999 55753 -137489 -217661
35278 -217661 -99306 112222 245158 227639 107885 1619 27141 183085 288414 169747
35268 169747 -92021 -246881 -205852 -109672 -54633 30530 164979 203639 83858 -9773 93113
35257 93113 268290 271693 88767 -90336 -174785 -245760 -345082 -383366 -293181 -134663 -1603
35246 -1603 86799 168286 275810 406000 499996 470008 305523 131862 88709 160765 202816
35235 202816 129984 10325 -40147 10621 103732 164254 155118 83313 -19007 -115990 -180027
35224 -180027 -207555 -245652 -372457 -593354 -772834 -753147 -552881 -360999 -305122 -315461
35214 -315461 -261857 -128025 22517 163987 287452 318511 173817 -102419 -340419 -400153
35204 -400153 -291860 -153675 -136509 -284273 -494705 -615334 -587416 -465671 -314590 -163045
35194 -163045 -54707 -28081 -20303 78772 221674 198406 -61578 -318977 -303595 -62993 134908
35183 134908 177235 194986 296954 402575 381295 223254 20004 -131220 -169947 -101350
35173 -101350 -12585 5021 -36267 -53417 -30109 -39048 -113889 -178963 -138794 12923 189923
35162 189923 276728 200294 -1298 -174762 -172748 2658 208090 306462 274599 183343 117913
35151 117913 109408 110295 54692 -35577 -56274 24090 81081 -12470 -198236 -292579 -209624 -38290
35139 -38290 78300 54942 -110227 -314978 -375909 -193012 95286 225233 96796 -140055
35129 -140055 -297593 -338080 -315545 -249063 -141992 -57139 -71807 -171687 -260238 -278159 -260869
35118 -260869 -259715 -251955 -180027 -67188 -20735 -81496 -135457 -54502 116987 216264 176619
35107 176619 71226 -37736 -146638 -207767 -156718 -72580 -111278 -220818 -156144 113488
35097 113488 273988 131029 -51677 48002 289026 290972 34164 -152277 -135039 -100986
35087 -100986 -123367 -16854 258975 416465 252853 -24619 -86804 103568 336072 437513
35077 437513 362377 157217 -28489 -41508 56557 32908 -158658 -272425 -159594 -35433
35067 -35433 -149919 -377210 -388441 -126360 136822 169705 11093 -149423 -167914 -40945
35057 -40945 91549 79310 -38462 -69672 22973 19645 -212495 -452369 -413947 -162686 4814
35046 4814 788 -6100 62029 83115 3930 -30532 99051 306916 421958 362603 157914
35035 157914 -78430 -174402 -38782 191434 263692 94101 -172940 -384659 -511915 -550948
35025 -550948 -465967 -289056 -133823 -44473 40844 120258 70023 -152196 -379933 -435475 -354641
35014 -354641 -285188 -243073 -127161 55238 144701 53338 -91927 -113223 -16941 39175 -6048
35003 -6048 -21287 113803 305568 359195 251650 154748 180164 248665 262861 257658 276976
34992 276976 238849 77076 -77385 -34874 175730 335589 323222 213596 96205 -35196
34982 -35196 -177598 -254201 -216804 -108482 15804 132856 192250 132656 2177 -47447 56420
34971 56420 221473 332683 381611 399530 365666 265716 166109 140619 167429 173657 152365
34960 152365 169920 264953 380249 401103 264247 42877 -101047 -87699 -10138 880 -45638
34949 -45638 -51580 -15613 -36004 -131648 -197575 -165353 -87448 -35367 -33006 -108621 -265150 -359357
34937 -359357 -179541 267695 692021 841441 760915 632079 508089 356511 234051 222465
34927 222465 255632 193498 41117 -61010 -43481 40505 149041 281236 371650 312643 123076
34916 123076 -29860 -30288 54041 80509 790 -110201 -139110 -36890 112319 141084 -12947
34905 -12947 -196154 -211981 -81296 -7989 -89957 -208246 -234366 -199193 -182724 -165288 -95404
34894 -95404 -16656 -13731 -83939 -156914 -197241 -195463 -100763 121147 366191 440415 277772
34883 277772 43975 -36565 67203 172169 124107 5575 30066 240131 423448 397839
34873 397839 275192 299433 480247 578869 465947 287298 203415 168995 103946 96489 237730
34862 237730 388392 344712 165468 98253 209610 321656 317137 267841 219621 90626 -123236
34851 -123236 -253446 -198296 -94335 -124312 -287531 -458252 -524699 -383759 6968 439885
34841 439885 537016 222468 -75116 55875 447098 608019 421639 217383 189025 146827
34831 146827 -54710 -207491 -76644 213971 357151 275331 154930 158861 270946 371707
34821 371707 348491 177196 -26925 -104067 -49445 -21983 -98900 -151025 -49671 135787 265553
34810 265553 337069 428611 531032 580720 588074 590879 536335 353460 113007 -11954 62685
34799 62685 262865 443593 470744 277504 -59809 -343929 -440375 -397225 -324899 -247431 -159217
34788 -159217 -118602 -152175 -154325 -29421 137546 205579 208527 291252 453349 527728 408068
34777 408068 157413 -96962 -253364 -257506 -170233 -166024 -312306 -406917 -220509 145258 362074
34766 362074 325068 256773 326260 411480 340144 157742 20205 -22375 3463 112702 300907
34755 300907 442963 392610 161094 -88715 -210158 -186435 -103789 -50172 -31904 7198 72223
34744 72223 77888 -17605 -104516 -45837 144102 351950 526681 654613 659833 520590 417846
34733 417846 529568 704537 608759 217256 -118075 -154627 -34086 26695 31816 40046 -20675
34722 -20675 -158393 -171192 52753 276811 231378 44454 59685 307410 464129 334967
34712 334967 99990 20479 118901 244888 304177 314191 314798 310750 281940 220766 162770 159095
34700 159095 201911 221556 184449 135595 112532 89332 42600 -12346 -88488 -219392 -330063
34689 -330063 -250497 44264 327912 373329 209910 23864 -82849 -106403 -37132 87001
34679 87001 109397 -80119 -353457 -473850 -379616 -201968 -56632 27411 20333 -94384 -229770
34668 -229770 -264254 -190788 -79212 64985 260479 416005 412085 304131 273818 369467 450691
34657 450691 407532 289738 198633 184114 261966 396694 453637 313044 60093 -77811
34647 -77811 -18912 82555 75407 3487 -6360 71148 169085 238043 274340 297061 343404 430411
34635 430411 494063 436256 260471 85141 -10928 -75635 -168114 -233550 -171771 4198 152144
34624 152144 148090 8081 -149394 -231258 -226142 -148903 -4019 151663 189795 61793 -82232
34613 -82232 -72315 8978 -81007 -367926 -597272 -614855 -571987 -628183 -694323 -656559 -618135
34602 -618135 -668335 -623107 -311187 42551 83276 -118149 -163884 41074 160244 -11169
34592 -11169 -235791 -231988 -66795 33321 17318 -36951 -112956 -212925 -262109 -211167 -130746
34581 -130746 -94138 -69949 -11175 65409 148461 246019 287093 181936 36815 101916 403781
34570 403781 634014 543486 267238 102518 127426 212567 270536 301306 281584 185244 63081
34559 63081 -19185 -59292 -49862 60641 240686 337918 287558 224687 256270 273461 165217
34548 165217 68430 167607 339054 263000 -116052 -474757 -504102 -246242 13748 60237
34538 60237 -100486 -300582 -372861 -303678 -235168 -283123 -392577 -428820 -347941 -191557 19961
34527 19961 269904 466243 511016 432803 336904 243930 100840 -56548 -88576 70456 323414
34516 323414 529649 624728 600486 468821 297970 204110 236838 317093 346622 343163 398116
34505 398116 511699 554002 436142 262843 220092 311360 320393 106921 -156295 -171220 100217
34494 100217 381335 418543 243304 65004 24113 108827 221527 264125 218506 176310 231897
34483 231897 349288 423907 455664 519253 561796 416101 75003 -229311 -318531 -275802 -243566
34472 -243566 -183105 -4932 191858 214996 54977 -111141 -163125 -134545 -84543 -12031 93532
34461 93532 217495 343412 443126 462006 380624 264510 188847 144505 78315 -8146 -58485
34450 -58485 -34608 44035 100766 38202 -154507 -334744 -354709 -274376 -272046 -325792 -199564
34439 -199564 161129 445286 363142 41021 -176374 -181344 -135179 -146005 -163094 -154846 -161624
34428 -161624 -160166 -61337 130498 297868 364845 359104 332720 331784 411628 558332 633439 534863
34416 534863 377803 361616 475825 502298 319230 47970 -135786 -199433 -207174 -186345 -121352
34405 -121352 -37812 -30899 -185765 -452676 -626931 -536904 -267056 -91747 -150683 -303620
34395 -303620 -348864 -241070 -31033 226567 394230 280668 -77179 -336665 -257803 -29822
34385 -29822 36933 -17904 71320 325258 506111 521184 501494 477074 313490 37719 -87994
34374 -87994 54293 235892 200428 -15705 -216717 -321791 -355526 -303142 -138424 69299
34364 69299 193848 171562 33318 -136074 -242437 -238005 -148752 -14365 159236 329893
34354 329893 385155 298840 247685 407271 671010 747418 527677 195084 -23554 -55711
34344 -55711 55540 211591 267052 141793 -50438 -115275 -15575 127821 224177 237674 91036
34333 91036 -226002 -478567 -378752 9817 303490 294912 184229 229152 391615 468766 403226
34322 403226 310393 292092 332192 328245 193837 -11809 -88090 63237 252769 222547 -1557
34311 -1557 -175861 -209629 -221624 -245060 -170764 -32815 -53172 -284892 -462862 -350115 -27884
34300 -27884 281508 478761 550337 474107 319514 273238 406525 549172 528429 406033
34290 406033 351450 397464 447331 435971 385809 369248 455931 606149 621393 355581 -19005
34279 -19005 -152873 39517 292406 396286 451152 600430 737289 648000 309245 -92921
34269 -92921 -339597 -303707 -31354 237770 268836 97805 -38522 -36445 6309 49544 176622
34258 176622 361522 448220 434492 490613 606695 533918 207658 -91759 -174901 -220406 -394947
34247 -394947 -503351 -304494 67799 304051 355269 380948 415724 377446 299698 289218 318214
34236 318214 276590 171698 102471 105061 162051 266788 357546 318234 168611 103453 214082
34225 214082 337439 314868 215026 153747 95412 3490 -14271 103033 228693 280302 379740
34214 379740 584034 687834 534763 312813 277202 370495 387211 330790 315162 273530 75812
34203 75812 -179723 -282758 -227820 -160009 -106636 -11947 68938 66142 87040 264101 502822
34192 502822 619775 638683 713886 848875 919803 894533 816850 668108 448653 288303
34182 288303 269176 252241 87953 -115374 -139426 37165 263727 425685 461813 327993
34172 327993 113319 23688 94418 124464 41053 51734 245077 368212 261852 177499 336975
34161 336975 509580 414271 234145 290652 471377 456950 304184 316374 492683 573572
34151 573572 502955 412053 291027 109854 97136 429946 799792 775541 462729 305573
34141 305573 370631 364136 254825 303116 501441 539559 349378 190671 180324 199614 257083
34130 257083 471500 706484 694103 510105 466858 573289 579110 494186 540534 640681 518299
34119 518299 283152 323376 605072 688839 491316 408622 588661 699373 559901 404927
34109 404927 354384 201893 -70557 -123862 162683 449171 488985 457788 532086 601831 602846
34098 602846 695587 918257 1063102 1048481 1026000 1029490 934873 810164 835421 863794 604818
34087 604818 249623 278626 600370 600022 177952 -26629 305650 653795 553171 311382
34077 311382 385850 648672 744653 686455 649262 596074 498270 543253 785042 952009 875675
34066 875675 743053 714940 697316 655115 702800 752476 575909 318125 371147 646465 647392
34055 647392 383446 439280 934456 1243854 1046644 813056 885483 928867 731634 697972
34045 697972 1021548 1187930 874044 566267 687376 870717 728664 586658 779780 952052
34035 952052 768955 624952 897180 1167107 960908 632313 713244 974664 931344 726109
34025 726109 720220 737111 499506 304023 488140 734750 659821 557752 797042 1031952
34015 1031952 823247 500237 571708 799568 701939 474568 560741 784431 752517 653542
34005 653542 838397 1077387 1027575 944149 1153170 1352242 1202541 1032851 1189753 1337771
33995 1337771 1186217 1174887 1595396 1834331 1417896 979301 1195652 1618965 1602067 1470099
33985 1470099 1654962 1645260 1033513 605754 1045443 1569950 1295760 899515 1335342 1973343
33975 1973343 1774139 1293307 1619789 2273256 2157585 1714591 2052313 2784091 2872693 2754062
33965 2754062 3377378 4032623 3543743 2739768 3165892 4192599 4143532 3465604 3855942
33956 3855942 5027994 5439364 5454322 6487072 7798268 7710033 7214598 8513160 10786966
33947 10786966 11667285 12040519 14606747 18524540 20960615 23192755 28886237 36965592
33939 36965592 43592302 50756715 63974340 81883497 100554561 129843644 187685666
33932 187685666 266894992 322700847 312721735 244552034 167183923 117861382 94065012
33925 94065012 76860585 60543354 49941418 44122235 37298614 29489010 25015183 23528267
33917 23528267 20940878 16983196 14744544 14312240 12948741 10449593 9039801 8783762
33909 8783762 7741692 6019614 5487710 5990304 5619098 4345918 3917327 4451544 4347467
33900 4347467 3370362 2878242 3106724 2932565 2254063 2122809 2571091 2582612 2125553 2089645
33890 2089645 2355189 1977815 1132834 892920 1233725 1178411 742912 825559 1311204 1188821
33880 1188821 487651 259870 654826 774075 442770 399394 684765 534822 -21471 -84155
33870 -84155 453802 707153 420199 307286 605000 718593 502629 514740 792987 710175
33860 710175 246323 114131 421730 482448 151701 79658 406796 475653 120095 5778
33850 5778 357938 537302 254919 83844 356133 599680 487896 374963 481829 464120
33840 464120 179601 32010 193933 289699 151792 101006 216753 135466 -175506 -249457
33830 -249457 31675 212275 104822 61204 204266 206377 35911 90366 377117 410813
33820 410813 142229 112136 437310 544127 202345 -76676 -2118 38091 -145130 -108804
33810 -108804 326599 603689 359530 51897 132132 315743 214716 31725 75242 167554
33800 167554 57541 -90819 -78476 -55741 -144786 -170903 -91643 -157430 -352181 -270741 140846
33789 140846 364416 164647 -6861 159020 290192 71159 -159285 -57433 110414 40600
33779 40600 -15537 201063 368670 137867 -209704 -241209 -83144 -95355 -232702 -266578
33769 -266578 -271279 -379387 -403875 -181628 51091 64806 50948 209839 327588 201387
33759 201387 69829 159566 224334 18942 -189176 -97119 52902 -83767 -309812 -254041
33749 -254041 -46374 -46702 -192094 -183848 -68880 -82030 -138389 -14221 176658 193322 149178
33738 149178 296335 529170 569483 444215 335596 186161 -92969 -263997 -90803 200560
33728 200560 259560 177280 241754 375998 329138 199821 242515 353677 274955 114772 137367
33717 137367 220523 69926 -201153 -269112 -216046 -360731 -603630 -556106 -256331 -150342
33707 -150342 -372257 -613739 -715107 -824439 -928963 -779654 -386810 -112773 -153520 -323983
33697 -323983 -426330 -454217 -396948 -221478 -76947 -152354 -327300 -324300 -174076 -137104 -209242
33686 -209242 -148241 19127 -19782 -327940 -593066 -597852 -431111 -200779 67783 222446
33676 222446 86786 -179311 -216094 -3042 129487 56232 11119 140089 313837 440337
33666 440337 553828 552189 286803 -34243 -11613 282925 304909 -154659 -647486 -748260
33656 -748260 -585455 -455478 -358565 -214857 -150589 -246434 -319645 -251508 -231644 -388594 -476663
33645 -476663 -255694 68300 119504 -118009 -355631 -427530 -369721 -203727 66354 311502
33635 311502 377580 292724 204090 166754 139796 113208 93954 34759 -94795 -224912 -272692
33624 -272692 -251318 -219985 -198779 -190029 -202876 -215626 -197755 -181022 -205412 -210319 -120566 -16702
33612 -16702 -40266 -148389 -177648 -147536 -246467 -480114 -603000 -483309 -284098 -179015
33602 -179015 -130101 -67010 -48059 -93686 -71302 91335 253339 266022 164091 20847 -204491
33591 -204491 -517454 -751577 -758882 -618013 -497436 -416790 -291028 -125282 -24782 -53035
33581 -53035 -167653 -264215 -259393 -192604 -224203 -419436 -575923 -442435 -84249 186975 242320
33570 242320 237259 258519 172763 -64194 -233571 -162201 16428 82864 29654 -19377 -21544
33559 -21544 -3452 9160 -63501 -304333 -587850 -630034 -381286 -147500 -159027 -246644 -145251
33548 -145251 97843 260207 308841 360200 407127 356848 261599 260524 335337 342823 261127
33537 261127 205441 212962 189457 76240 -65559 -143136 -113638 -3734 79062 13717 -177429
33526 -177429 -315504 -291033 -209112 -214485 -280428 -293463 -247190 -210035 -181578 -130210 -114599
33515 -114599 -218789 -396677 -506832 -482902 -371572 -234147 -109323 -46043 -74365 -145255
33505 -145255 -164998 -91021 32836 114578 80301 -50977 -156998 -138154 -48371 -27631 -123298
33494 -123298 -268908 -403206 -485355 -433579 -215612 20420 89398 32708 38320 110688 66179
33483 66179 -120480 -237935 -179208 -100117 -141017 -241354 -331935 -444897 -509366 -324707 87675
33472 87675 375633 309333 103328 62716 133955 63302 -180744 -404861 -476803 -389302 -166507
33461 -166507 88423 182021 59331 -83974 -80708 -18023 -18721 -5439 103751 173080 74061
33450 74061 -53670 -31187 44563 -9976 -128692 -141711 -100303 -146724 -205928 -139437 -79120
33439 -79120 -246394 -523215 -572345 -350510 -155661 -172643 -293973 -390576 -446500 -409777 -210247
33428 -210247 40200 131555 60329 298 -22920 -150100 -375559 -508604 -487664 -458596 -484121
33417 -484121 -432158 -224772 26442 200393 290131 309596 263367 228651 287671 382014 406892
33406 406892 399643 431998 401209 191797 -35644 -30858 126597 139235 -11830 -66920 13046
33395 13046 -27102 -237714 -321826 -139055 45816 12003 -78049 -8726 143287 231084 310242
33384 310242 434952 446526 239604 20760 30250 184483 245297 179692 108162 48407 -42880
33373 -42880 -97612 -38744 43647 16232 -100143 -226251 -381111 -556968 -587423 -363580 -64919
33362 -64919 44874 -48484 -182660 -300770 -423203 -445934 -242319 78970 268525 266624
33352 266624 213246 158030 7551 -233698 -418411 -501076 -603961 -763502 -814493 -639241
33342 -639241 -369928 -208767 -159809 -80096 68875 164617 114419 -12147 -87499 -97287 -135940
33331 -135940 -242319 -315250 -236530 -32272 152313 218364 192534 161425 196813 325903 493784
33320 493784 572191 496323 373873 354312 416769 420675 343408 293241 278371 166001 -69240
33309 -69240 -254690 -275798 -242169 -274669 -293620 -173340 24970 138952 127174 58659 -28971
33298 -28971 -116234 -134822 -69476 -53587 -200227 -390852 -400870 -213344 -47722 -67459 -196146
33287 -196146 -258912 -204696 -134570 -155042 -246956 -295986 -260681 -257888 -395861 -563473 -540252
33276 -540252 -323142 -149265 -129550 -78714 150095 371144 326555 89642 -52239 -29431
33266 -29431 -24462 -99815 -85136 95354 239094 157692 -17288 146 257247 497440 481517
33255 481517 249932 23517 -76219 -124028 -222398 -331326 -331363 -205201 -58217 37308 118631
33244 118631 226591 313864 312041 232022 150434 126840 147434 121264 -37739 -263803 -333482
33233 -333482 -123215 182733 305772 252705 266606 408026 458524 312420 180210 242685
33223 242685 342781 230720 -59359 -284156 -306662 -157456 78186 252972 182809 -122113
33213 -122113 -381644 -390019 -288054 -289506 -317364 -184625 20529 61304 -31614 -16079 132274
33202 132274 192664 101941 41568 74415 23115 -196992 -421083 -526848 -608452 -717169 -681139
33191 -681139 -367621 62172 336375 374047 270262 122466 5839 -9507 47858 46669
33181 46669 -50062 -103027 -13602 117548 176118 235229 402794 580014 568903 367102 172428
33170 172428 109097 110849 86020 53915 73547 142203 220672 293836 355308 367814 282250 94041
33158 94041 -127208 -259088 -193467 74624 398954 547905 381672 6697 -277653 -255480
33148 -255480 -20727 138893 87711 -25822 -14441 97930 166324 153173 119512 52851 -126887
33137 -126887 -394119 -593615 -613021 -478857 -280733 -104662 -34987 -100502 -201946 -196833
33127 -196833 -66007 101582 273265 482891 668687 663601 413799 82295 -140235 -227546
33117 -227546 -251118 -224243 -115171 40306 137826 110948 -8228 -128903 -185383 -197584 -247075
33106 -247075 -366698 -470555 -438551 -256631 -26536 143114 205163 167521 86569 40117
33096 40117 41775 19109 -54552 -68205 78866 283381 324959 138869 -112109 -236465 -184344
33085 -184344 -28617 121409 186768 179738 183738 214900 171023 4555 -152075 -168609 -127552
33074 -127552 -180443 -278575 -252763 -103054 11057 29553 13105 -60998 -272096 -531808 -642213
33063 -642213 -588653 -523893 -466101 -304891 -116270 -125587 -292775 -303582 -95371 -7416 -215972
33052 -215972 -403483 -268703 -22028 -21873 -197193 -231030 -111527 -67057 -77368 98324 426727
33041 426727 561132 371127 153362 185488 357264 403289 282605 151596 103589 102308
33031 102308 104300 120634 173087 250993 306102 283222 180228 61183 -27136 -117713 -250150
33020 -250150 -377795 -418583 -367624 -293025 -249135 -250091 -289196 -327652 -307707 -227067 -148181 -96670
33008 -96670 -31549 39102 22308 -105912 -222172 -225097 -176613 -171210 -174142 -111805 -23718 5390
32996 5390 -23114 -80542 -201979 -385567 -502057 -451313 -314916 -208125 -89555 113246
32986 113246 299271 315984 204816 127573 123168 136103 201230 369557 516659 473644 307663
32975 307663 222100 215750 120431 -34032 -5942 251478 466730 440401 299439 233736 216997
32964 216997 149284 75050 72460 70221 -41223 -204498 -252439 -114007 142448 411616 609555
32953 609555 684551 639156 505570 292966 44974 -65867 131567 528447 755183 586303
32943 586303 199322 -81054 -177931 -259502 -419947 -527556 -404642 -64035 275032 393407
32933 393407 282815 120351 16038 -130821 -433261 -767685 -900459 -825242 -760618 -793904
32923 -793904 -755817 -527600 -255972 -132441 -138344 -161324 -212184 -348187 -490110 -499117 -376277
32912 -376277 -233036 -112341 20833 150795 210093 193886 169837 184765 235180 295410 305512
32901 305512 189040 -30122 -187806 -157781 -20880 48582 18796 3393 56128 90126 11331
32890 11331 -167679 -364031 -495664 -502633 -367995 -141602 95752 292566 419210 430657
32880 430657 305733 121450 20274 72203 193885 222740 71347 -183002 -360982 -350761
32870 -350761 -211102 -82004 -19253 19655 45161 -4647 -148939 -307427 -407037 -459883 -484813
32859 -484813 -445390 -335764 -234050 -175357 -56666 205144 472910 494424 215884 -128952
32849 -128952 -281442 -225985 -144751 -161023 -202844 -134508 24762 85354 -77299 -331621 -422845
32838 -422845 -280216 -87892 -35897 -113487 -199842 -253792 -323106 -423233 -487022 -415911 -161794
32827 -161794 185278 391083 276554 -35855 -209880 -103907 56711 32950 -63846 37415
32817 37415 321291 489290 399039 247565 241767 292998 177374 -126311 -406506 -471849 -315631
32806 -315631 -48681 227963 458734 603190 624072 521440 371135 297399 371003 534802
32796 534802 655298 650064 551868 460690 448855 489048 452675 217912 -175064 -513761 -626407
32785 -626407 -582048 -592223 -718977 -794463 -679664 -493417 -463893 -596469 -637447 -411160
32775 -411160 -77587 43520 -153324 -465934 -635236 -575463 -363271 -136607 -41537 -139890
32765 -139890 -291171 -249793 24654 280376 313844 251125 311672 433732 397831 242983
32755 242983 240756 439186 552965 406811 199956 175170 274496 316241 301886 321381 316220
32744 316220 177882 -26908 -155677 -231313 -364652 -500844 -468213 -256994 -50263 16076
32734 16076 -47800 -207526 -442139 -656980 -732765 -685640 -634369 -598027 -476508 -252387 -60004
32723 -60004 -5469 -39650 -59048 -34305 3349 21504 -1582 -63174 -123094 -157044 -202542 -283666
32711 -283666 -327101 -248781 -98385 -13388 -39832 -92826 -84404 -3758 114663 221307 266551
32700 266551 248734 211050 149173 15956 -116407 -46602 266081 545222 519438 280451
32690 280451 104919 39394 -68591 -217463 -250276 -178314 -176495 -236403 -155001 73988 196079
32679 196079 125130 98765 253830 376053 281092 142700 180747 280717 223350 87484 95758
32668 95758 198748 147700 -87531 -280475 -301079 -232273 -141220 4143 164793 212889 137801
32657 137801 77325 93570 89986 -909 -112020 -181997 -252095 -354083 -425638 -406027 -315107
32646 -315107 -182834 223 203679 318384 264720 84254 -115258 -248238 -262784 -144554
32636 -144554 43716 185637 218578 180101 134036 110917 137713 243243 382975 427056 297650
32625 297650 84651 -43196 -26642 46589 86363 108713 167226 233317 216413 96680 -29369
32614 -29369 -60876 -1697 72651 106867 81528 -10718 -141248 -239879 -280001 -321316 -392350
32603 -392350 -401228 -280265 -147272 -155704 -234016 -185662 -34477 -16757 -184711 -292823 -191251
32592 -191251 -58781 -69576 -91047 45854 210048 204327 140177 217803 272564 -28182 -568884
32581 -568884 -820336 -580898 -269851 -303214 -539155 -595457 -421505 -240727 -130395 -5426
32571 -5426 79624 -49636 -361024 -581333 -547262 -394339 -334171 -400629 -482630 -481934 -369387
32560 -369387 -181700 -25604 -8036 -103929 -154354 -48954 137976 240619 190459 65223
32550 65223 -20824 -23137 31333 104940 186796 273346 331797 311047 200444 54839 -60832
32539 -60832 -134452 -190269 -231454 -238112 -213250 -187904 -175036 -151632 -92640 8340 156090
32528 156090 348446 529261 584274 438657 167077 -31100 -3813 200640 374347 365612
32518 365612 246285 231506 424583 683645 781003 666016 506628 470778 538983 568342
32508 568342 481453 329403 202719 152539 187946 276792 339650 308335 207954 123977 81089
32497 81089 33835 -6947 46097 183889 225309 41831 -221259 -306549 -191256 -100153 -168802
32486 -168802 -277315 -273111 -182964 -100261 -11373 122623 219290 173673 45494 -7849 44546
32475 44546 95773 98277 119206 181574 196533 108772 -4902 -48450 -31267 -17814 -30802 -73730
32463 -73730 -181151 -359108 -513975 -529007 -407381 -273976 -230214 -258773 -280633 -253343 -177314
32452 -177314 -36550 202293 499598 687366 582549 198004 -202945 -333461 -168839 45033
32442 45033 75546 -60343 -167447 -121338 14503 98421 69460 -25575 -121333 -200484 -264698
32431 -264698 -278501 -192426 -33439 75129 37770 -82773 -126537 -47321 8789 -100323 -288312
32420 -288312 -316505 -96888 189958 324011 286250 186447 62051 -90904 -150388 44680
32410 44680 406889 617008 529458 364197 348267 365598 193867 -67794 -117210 70452
32400 70452 212224 181345 166118 276444 322838 165302 -3673 31851 137952 42975 -225104
32389 -225104 -393508 -348462 -224230 -144551 -119384 -164423 -289231 -381395 -322078 -208564 -249921
32378 -249921 -450942 -619905 -683486 -748816 -831954 -787368 -577454 -368327 -262938 -166347
32368 -166347 -22120 49104 -12649 -48148 67818 200111 167527 22607 -76344 -122033 -174822
32357 -174822 -164861 -29724 57008 -113565 -396398 -406709 -63585 255253 204422 -110053
32347 -110053 -343384 -364209 -316376 -338889 -413814 -466311 -464128 -396923 -262051 -111935 -48121
32336 -48121 -112912 -211406 -196125 -47258 70030 -14308 -238851 -335406 -145735 155193 254889
32325 254889 86599 -116007 -153348 -87567 -58253 -28606 115459 302787 334211 208379
32315 208379 173147 365209 587077 594113 456144 424933 527437 541191 373578 210837
32305 210837 207824 257464 216347 174637 299036 523418 618128 521798 399197 372244 381155
32294 381155 344471 290464 263366 224214 123033 -8057 -90987 -79138 23325 160373 236240
32283 236240 200015 120853 100965 118555 54445 -120402 -295379 -384098 -428187 -490504 -540798
32272 -540798 -513000 -412679 -308526 -251452 -234614 -210548 -144283 -69118 -55477 -89644 -55768
32261 -55768 87132 200466 156903 42203 2043 -23010 -185733 -408757 -439989 -235354
32251 -235354 -11641 118130 262288 422352 379765 85314 -146140 -83633 28546 -168076
32241 -168076 -578308 -785183 -648403 -431180 -351543 -326149 -220076 -91443 -67662 -136183
32231 -136183 -170029 -90118 50835 111185 910 -177665 -191980 39214 299904 319760
32221 319760 100059 -116584 -143031 -1378 157149 172883 -9617 -233309 -222019 85719
32211 85719 400173 436648 292356 261766 382767 436108 351618 317746 445422 586644 582634
32200 582634 485265 422615 406008 377792 325803 254652 140384 -6299 -106269 -102427 -32540
32189 -32540 15635 -22314 -149599 -287426 -323031 -242507 -161203 -150486 -129106 -35299 13607
32178 13607 -101899 -278252 -340046 -311891 -303532 -227025 67674 424295 487223 203695 -98035
32167 -98035 -186181 -169558 -191151 -202781 -168572 -188114 -263971 -225344 -40476 72126 10425
32156 10425 -26737 79485 113060 -82800 -242792 -50844 336128 494402 321332 74776
32146 74776 -61699 -104217 -37102 179851 383530 325708 57632 -96954 -5425 106527
32136 106527 19010 -200435 -367218 -408024 -316348 -79189 226824 416950 393030 248679
32126 248679 106099 -26627 -156135 -198360 -97778 31359 11957 -167965 -320132 -259017
32116 -259017 -8428 203021 162971 -98848 -339574 -377170 -268502 -167409 -105097 -21810
32106 -21810 65770 84170 50129 36830 10644 -124010 -301364 -297622 -26498 313416 474916
32095 474916 436754 353965 324613 311845 257153 180470 157754 226950 319659 304271 131921
32084 131921 -78686 -151863 -37338 162033 313685 349313 279511 195044 214363 339702
32074 339702 407717 287960 83604 6046 92783 207217 289398 412968 578102 650855
32064 650855 570768 439203 329335 192072 44419 52617 274618 486333 453047 249170
32054 249170 107578 56644 -52694 -212441 -220353 -12240 209085 272290 268250 350960 467822
32043 467822 463602 357059 321754 415084 495777 430533 243624 29263 -148688 -215741 -90367
32032 -90367 163298 302201 169313 -82157 -186269 -129383 -124981 -239752 -277830 -110346
32022 -110346 93019 103556 -55122 -203545 -294995 -415834 -564854 -627254 -557061 -425611
32012 -425611 -285126 -121316 51432 172527 224079 233388 194974 102462 40392 107802 248033
32001 248033 291407 180612 21268 -98408 -181892 -192679 -30292 274595 488502 417503
31991 417503 133251 -133925 -248408 -235781 -176878 -130406 -115843 -102713 -46785 31762 56957
31980 56957 978 -90123 -181805 -264987 -276907 -143936 56404 127787 27025 -45102 66046
31969 66046 229330 223036 54208 -86497 -107856 -75969 -38392 21842 62402 -12207 -186280
31958 -186280 -313757 -307095 -233613 -186658 -172997 -181669 -258698 -424034 -574863 -568450 -397092
31947 -397092 -216985 -179426 -257895 -275341 -118581 99622 147812 -44095 -280629 -328078
31937 -328078 -189094 -68600 -96841 -189495 -197575 -100972 5981 64513 106586 165175 200469
31926 200469 158702 72356 38851 88817 132302 73445 -66905 -194063 -263222 -293963 -299296
31915 -299296 -285356 -291790 -329946 -303630 -118230 135989 257076 207761 156146 195662 210763
31904 210763 114549 25541 49134 48038 -160480 -489245 -685445 -680279 -608352 -521304 -329161
31893 -329161 -41575 163140 166779 23598 -193617 -456213 -636570 -540183 -205388 35460
31883 35460 -40725 -247892 -267593 -73956 120023 207700 231637 163329 -77757 -384563 -506337
31872 -506337 -391012 -259154 -263450 -297113 -245544 -198943 -244373 -244287 -48375 212853 292519
31861 292519 189571 84882 -14723 -254183 -547518 -564324 -221664 110829 90836 -154688
31851 -154688 -296729 -304188 -387050 -575239 -675929 -613107 -519614 -479174 -432868 -372514 -381376
31840 -381376 -427946 -354494 -150350 -15809 -55982 -121416 -68546 28671 70078 130796 284135
31829 284135 389991 282053 58044 -38139 37532 105963 56026 -33208 -65111 -55775 -60033
31818 -60033 -87310 -127595 -184023 -254492 -317815 -333956 -254798 -94016 12728 -66402 -246165
31807 -246165 -295016 -183943 -167767 -389553 -613138 -555690 -305983 -150871 -128505 -62384
31797 -62384 51347 37220 -95342 -128525 -26497 -18905 -189439 -288307 -118993 142809 212148
31786 212148 81384 -52511 -93698 -84361 -47453 21584 73493 65113 48724 87879 145201
31775 145201 154796 141243 174109 266367 386459 486355 459530 200721 -195304 -429719 -329392
31764 -329392 -69595 71570 63585 56869 74083 -6133 -196126 -352801 -399770 -402752 -386478
31753 -386478 -263873 -30071 130834 63601 -117877 -136724 119809 471842 656348 602191
31743 602191 460297 390135 378873 303596 124062 -67237 -181072 -221931 -211657 -119443 62420
31732 62420 245385 331645 330286 314651 307019 276918 210492 107292 -45828 -213880 -273323
31721 -273323 -136818 104152 260857 258743 174740 83494 -18331 -129867 -208942 -254141 -322775
31710 -322775 -417720 -444549 -342962 -187665 -87195 -41291 17741 82134 67310 -48048 -175085
31699 -175085 -240637 -282184 -357485 -418200 -363085 -195648 -29196 75311 169139 270444 275351
31688 275351 112650 -101907 -197832 -180385 -182164 -221978 -190664 -83182 -48205 -139892 -198804
31677 -198804 -89621 90156 171589 163242 184470 235424 201856 55458 -98328 -169496 -165013
31666 -165013 -117485 -28533 97176 214556 242686 105760 -168673 -380669 -309022 -1032
31656 -1032 218402 136871 -77240 -143735 -71106 -73163 -184713 -234628 -182046 -188671 -289408
31645 -289408 -257606 57424 457632 633806 542603 378402 268175 177380 78606 35638
31635 35638 85311 151135 135334 48164 -1996 57791 164503 176065 39384 -133793 -204921
31624 -204921 -192567 -240204 -404844 -571066 -605307 -511006 -377559 -246946 -112187 -14959
31614 -14959 -52550 -254767 -492446 -559683 -372379 -69574 120724 116405 35189 15799 71582
31603 71582 155060 256245 344929 313934 119975 -78062 -79331 83258 183580 113567 -11059
31592 -11059 -75117 -115337 -179130 -190965 -71656 112648 229372 242782 213628 188235 161430
31581 161430 115302 45291 -25953 -47190 2269 56691 39878 -14179 -18028 2370 -58526 -161193
31569 -161193 -100343 201690 519222 563956 317670 17611 -129915 -130195 -134208 -254360 -421355
31558 -421355 -427192 -184059 92815 114654 -72252 -120936 115319 360255 330465 139962
31548 139962 76523 161110 189554 86137 -59432 -227595 -452497 -594722 -423166 20648
31538 20648 376826 375774 127235 -64576 -31254 163269 319003 247155 -53886 -336073
31528 -336073 -334788 -80366 153161 208928 185323 189114 151802 -12661 -224182 -329828 -284473
31517 -284473 -154579 -28435 17444 -43513 -131438 -137711 -94143 -145180 -312194 -427759 -369978
31506 -369978 -224248 -137058 -144935 -223754 -357099 -464382 -422362 -270794 -227507 -361987 -438317
31495 -438317 -268400 -37243 -20803 -123520 -17312 316453 524791 403120 170438 115110
31485 115110 216549 265659 168256 -24944 -236631 -359599 -268448 2641 195972 107760
31475 107760 -146472 -300234 -294629 -281631 -309629 -225730 62351 407776 600351 594784 468427
31464 468427 262901 -1397 -218414 -256049 -128089 11108 72139 126320 242208 324204
31454 324204 221352 -43547 -268573 -305454 -202659 -90020 -20048 10132 -35160 -187113
31444 -187113 -362674 -414280 -311905 -189745 -175690 -243175 -276499 -224825 -133750 -60433 -14403
31433 -14403 33753 124449 268924 401527 403342 224706 -35528 -223343 -284741 -279307 -269314
31422 -269314 -270302 -294083 -343793 -354403 -238060 -25881 128921 141872 98120 93816 80590
31411 80590 -17736 -119406 -74285 95734 209234 176242 72779 -49820 -235539 -432501
31401 -432501 -433057 -157000 156169 227752 112064 82602 214558 324719 326619 382260 599318
31390 599318 793500 726243 451201 238347 209792 225365 132468 -19592 -73632 16281 139330
31379 139330 181652 166593 211153 355873 487917 471858 321239 172532 109468 106528 143299
31368 143299 244391 355583 315933 66817 -206477 -281960 -193181 -162568 -266485 -336667
31358 -336667 -230026 -40210 51375 26852 14386 71177 107387 36843 -88877 -146528 -96043
31347 -96043 -10848 39143 74955 145686 221644 218573 124103 27426 -1869 -1526 -46270 -146256
31335 -146256 -256691 -330665 -318361 -187004 -7765 54849 -66078 -225981 -252435 -175692
31325 -175692 -145287 -183322 -195451 -188793 -265176 -382176 -346572 -118588 85459 97371 2634
31314 2634 -88363 -257352 -558668 -764041 -606867 -192571 113734 173823 172801 225393 186629
31303 186629 -51080 -335887 -486299 -538448 -586620 -545626 -288702 77848 296792 278404
31293 278404 148743 4401 -178964 -368758 -408818 -233593 -9744 64679 15692 7760
31283 7760 48250 -50478 -363849 -652039 -603222 -236463 87895 94790 -99066 -193584 -108153
31272 -108153 -18726 -41321 -75094 -3779 118397 181200 187894 188378 147173 24488 -82898
31261 -82898 -47984 66822 61098 -122531 -318790 -373200 -314069 -238008 -159978 -66366 -7810
31250 -7810 -24286 -45795 15314 108333 93925 -53030 -191952 -197355 -115077 -83652 -140053 -176300
31238 -176300 -106704 -19820 -86432 -314696 -493358 -447396 -270210 -179478 -192394 -125159 63278
31227 63278 139274 -60833 -315934 -260985 119159 449046 425622 132752 -159605 -329909
31217 -329909 -419057 -441852 -358394 -200662 -78389 -33427 9493 109910 211669 226755 154191
31206 154191 51834 -56386 -158155 -174607 -30429 177580 214042 -8908 -279741 -341076
31196 -341076 -223989 -179822 -315253 -475012 -507855 -467087 -471954 -527524 -585595 -645966 -673929
31185 -673929 -545989 -231598 74190 168936 112033 98965 146257 116958 11036 -19128 49707
31174 49707 67300 1263 23439 200487 330969 248005 91965 91221 213665 239258 87008
31163 87008 -123240 -275525 -343344 -302797 -127139 125741 333710 415885 354264 174753
31153 174753 -10028 -36692 108326 223909 173125 107965 218308 369970 267811 -62014
31143 -62014 -254483 -111068 151634 243382 144549 -480 -108314 -141335 -66317 30894 -28118
31132 -28118 -235249 -337059 -212423 -94441 -198608 -333975 -181686 175299 343360 196627
31122 196627 23823 50417 121241 -10553 -303448 -499634 -449206 -233934 -43873 -11417
31112 -11417 -107740 -164803 -62793 106646 159302 80646 26906 63683 76642 -14904 -125392
31101 -125392 -154082 -116493 -52506 44462 130196 105338 -1340 -22290 65379 46789 -178371
31090 -178371 -356249 -226884 55045 136998 -4967 -86412 -19993 -37735 -242198 -378996
31080 -378996 -231175 20003 53578 -141011 -302673 -290553 -216837 -216955 -271847 -279118 -175907
31069 -175907 30279 262028 392101 344262 190040 82626 86058 127884 125932 95109 101791
31058 101791 165032 245309 304293 332227 321516 256181 149835 67416 69742 140937 208206
31047 208206 229565 211350 143273 3322 -145017 -169752 -61397 -3418 -135418 -335503
31037 -335503 -387546 -288052 -195915 -130326 37379 282667 388411 291510 210108 276733 283056
31026 283056 7521 -388574 -556800 -441579 -292902 -252494 -202324 -43317 124427 184313
31016 184313 186321 244022 356768 416301 334888 137288 -32643 -23990 133357 211324 65314
31005 65314 -132186 -95105 188100 455887 535879 492051 410235 284775 178071 240591 446253
30994 446253 524390 314151 6948 -132446 -117391 -116040 -131247 -52566 64138 40755 -110106
30983 -110106 -161618 -8206 176220 188851 45855 -106382 -194638 -228754 -205509 -123038 -46970
30972 -46970 -53113 -105902 -78889 75922 239121 259581 154629 97835 180955 266043 159097
30961 159097 -112928 -316562 -304545 -169720 -69841 -26722 17873 51927 17843 -62851 -94381
30950 -94381 -21935 117627 233060 231943 96097 -58335 -80773 3820 -4834 -194929 -386562
30939 -386562 -388454 -284515 -288650 -408316 -464656 -404338 -371572 -462275 -602802 -698189 -716902
30928 -716902 -596044 -256785 215655 577995 698050 672006 607146 466035 238160 89074
30918 89074 157103 307319 277493 28069 -213331 -247158 -109755 22964 34029 -55200 -129578
30907 -129578 -81750 82627 230694 230211 96228 -18915 11474 147258 207974 57857 -217883
30896 -217883 -361117 -225025 24669 92155 -75949 -228469 -148661 81094 227406 199861
30886 199861 91806 13681 1416 37421 57332 -25163 -203025 -317790 -214843 56593
30876 56593 279789 298200 143892 -41404 -145510 -154979 -137875 -152902 -159673 -66607 110696
30865 110696 224109 183651 86572 77534 168304 290940 426813 543991 500394 203602 -168715
30854 -168715 -310202 -163507 21682 37849 -51808 -87596 -35322 60726 189029 312209
30844 312209 326444 221588 183295 378070 695769 861394 773460 581375 437580 336442
30834 336442 235658 179672 203179 219403 135018 26623 61868 234439 313076 136308 -130259
30823 -130259 -159896 124228 429237 431344 138045 -169220 -283428 -246142 -195229 -172933 -143027
30812 -143027 -115878 -162386 -303328 -438113 -421881 -226977 -13227 9868 -182555 -378873
30802 -378873 -361828 -147903 76445 215737 343204 510987 617220 540393 320981 112447
30792 112447 -6407 -75424 -120592 -73188 133429 429942 633896 623619 463915 325102
30782 325102 285419 268791 195481 114004 107865 132457 64896 -96532 -206882 -171267 -57262
30771 -57262 23884 43749 24345 -9154 10108 155652 356874 408406 239118 54741 72696
30760 72696 218642 261934 175452 146367 247939 322438 237693 75928 -7320 31226 142829
30749 142829 256409 269565 120012 -60747 -30236 222372 385865 229940 -58681 -141222
30739 -141222 1653 110828 83109 74473 159525 174826 866 -228534 -329916 -301071 -214465
30728 -214465 -56076 158321 257339 120470 -82136 -83691 86668 134780 -63581 -278747
30718 -278747 -249151 -10877 194420 211524 70884 -103235 -184427 -121517 -15137 -49778
30708 -49778 -264371 -458615 -422948 -201761 -21541 -5279 -78166 -128290 -125559 -72155 34000
30697 34000 139755 147340 51838 -12660 58438 187441 222462 160705 150188 255049 330172
30686 330172 209098 -41088 -161686 -11965 251074 356393 224533 15040 -97691 -96055
30676 -96055 -55331 -10653 43847 81323 55069 -18755 -52267 20989 167682 277272 254820
30665 254820 99924 -93852 -221548 -247299 -194170 -83063 61836 154451 82277 -149244
30655 -149244 -365043 -380336 -196608 369 23721 -150858 -375375 -471161 -414394 -370036
30645 -370036 -475738 -619010 -563823 -310519 -141576 -219157 -337173 -250839 -78894 -117087
30635 -117087 -354797 -486267 -386565 -256637 -232040 -165887 42127 177453 13624 -298233
30625 -298233 -409181 -249870 -80852 -100016 -225151 -285676 -243409 -166240 -111449 -93682 -92480
30614 -92480 -66825 -20718 -39177 -179326 -350556 -404239 -322460 -200572 -59579 169325 444561
30603 444561 559454 379218 28805 -242820 -307535 -202600 -34419 64039 -23500 -259224
30593 -259224 -416706 -329897 -137899 -114125 -261587 -283505 -20622 287874 328753 139409
30583 139409 -1471 -9091 -59736 -231184 -343180 -243447 -28047 153755 310040 446060
30573 446060 390465 47386 -301278 -268085 83097 272038 55546 -262741 -317547 -193126
30563 -193126 -211237 -407940 -517143 -395820 -191034 -81389 -75849 -107899 -146334 -153505 -81386
30552 -81386 24119 37736 -55987 -96016 47013 277063 380503 278529 85657 -51820
30542 -51820 -82809 -16672 142143 361948 528845 510885 305057 66117 -61362 -104080
30532 -104080 -186667 -321246 -367171 -221345 39044 249029 323924 291379 219907 163807 125309
30521 125309 38616 -140263 -305152 -272536 -43437 129474 40363 -206282 -349207 -290368
30511 -290368 -121419 76322 276641 406228 393856 313994 301258 314447 170458 -147795
30501 -147795 -394358 -351068 -85510 158930 228034 145833 29090 -21682 -3172 -8908 -92138
30490 -92138 -147692 -31880 219044 424336 503992 528032 516289 390259 181412 79111
30480 79111 155047 215095 69186 -188062 -310319 -200016 56025 335390 522212 513426
30470 513426 343903 212814 226758 216464 -3256 -282236 -283614 37637 340789 324437
30460 324437 51260 -210324 -292757 -192125 20659 221193 250991 48224 -252001 -425582
30450 -425582 -379316 -236205 -200053 -342149 -524961 -551386 -381868 -154361 10610 126539
30440 126539 217434 202680 27755 -177380 -229570 -142398 -86065 -118313 -131584 -83141 -88858
30429 -88858 -211106 -308648 -214024 33838 236876 253238 86576 -170830 -393086 -465985
30419 -465985 -369822 -206450 -92171 -46866 -26662 -17225 -31109 -49146 -41071 -34009 -90648 -209154
30407 -209154 -297764 -269157 -125096 69905 260890 408995 450761 327244 92473 -67976
30397 -67976 -17163 145942 181286 15555 -150185 -100743 125609 319182 354416 242982
30387 242982 19121 -253999 -400410 -254620 91331 327702 283416 117797 89909 251845
30377 251845 448073 519675 425261 238562 104308 131305 266441 339941 278904 181880 129500
30366 129500 49916 -123390 -281085 -279816 -177685 -153942 -224067 -212648 -28868 191958 279534
30355 279534 227587 117399 -47334 -301001 -558531 -637804 -474043 -220442 -73282 -55704
30345 -55704 -55980 -39487 -94451 -242679 -343679 -285923 -169149 -157581 -223184 -202399 -66984
30334 -66984 59091 150215 319061 545312 594966 345604 7579 -143986 -113076 -88400
30324 -88400 -135655 -177969 -185842 -182900 -125084 31256 184371 191236 75676 -38874 -141982
30313 -141982 -279519 -345353 -179615 135722 332568 329519 300822 338056 313823 164145 37586
30302 37586 35486 50761 14414 53685 209062 232638 -62624 -425143 -441901 -108353 171335
30291 171335 131832 -73682 -172005 -112101 -19581 27854 66932 156081 279549 333019 220905
30280 220905 -9272 -188867 -224797 -186206 -143377 -56144 76756 116161 -5110 -112700
30270 -112700 -41544 71739 -4450 -207555 -296524 -281085 -380981 -563657 -516637 -175763 101453
30259 101453 75063 -5536 171787 461982 491897 230603 -1975 -10832 91989 155322 169799
30248 169799 152567 68844 -65179 -146530 -117134 -51072 -77506 -251951 -486877 -593789 -467621
30237 -467621 -251007 -188425 -273807 -231512 44383 255265 108068 -229944 -357362 -182619
30227 -182619 60902 245512 445767 628189 609237 393416 236580 261014 281253 138253
30217 138253 -48429 -113819 -106474 -140722 -175248 -118466 -13525 40903 35563 -11274 -127077
30206 -127077 -265797 -255001 -15074 278660 393730 306651 160417 70638 85465 208772
30196 208772 336742 297060 75060 -131730 -198283 -237919 -337941 -333268 -65246 298673
30186 298673 457795 374599 238711 149276 85099 80298 151369 141164 -69732 -277638 -205677
30175 -205677 24628 39129 -189784 -294522 -118082 47063 -32066 -170296 -132379 -25068
30165 -25068 -49257 -124775 -62364 77672 95491 -1446 -31155 60154 160443 199434 192914
30154 192914 135027 33246 -2569 109375 244830 206562 13434 -108689 -17479 206931
30144 206931 405990 494072 465004 361417 252265 176040 125565 127709 252009 458588 540978
30133 540978 351069 8541 -243871 -325216 -322846 -291802 -215400 -123643 -86036 -101368 -128771
30122 -128771 -194531 -327667 -432396 -387044 -241906 -153172 -145131 -117794 -73946 -130388 -280281
30111 -280281 -354925 -287317 -221407 -262408 -288674 -146212 88449 186210 53655 -169563 -285797
30100 -285797 -239416 -139095 -109258 -131498 -65946 149509 390045 500792 486318 438524 355957
30089 355957 188711 5794 -70421 -75916 -154372 -294332 -328885 -229119 -176752 -272489 -379654
30078 -379654 -356082 -253133 -176336 -127436 -99997 -152986 -261323 -274268 -169459 -163118 -387618
30067 -387618 -636637 -648616 -488423 -393707 -366147 -212880 63334 228060 194325 159480
30057 159480 279486 431024 414050 229867 42979 -23553 33871 136411 169385 72071
30047 72071 -64875 -69196 98418 276500 299087 189257 100844 120388 183367 161930 -1354
30036 -1354 -238802 -421974 -472988 -390998 -189470 100934 343279 343888 94613 -150301 -182846
30025 -182846 -124040 -215422 -417631 -463115 -283141 -111801 -118969 -196798 -203758 -175185 -150934
30014 -150934 -22340 248937 435241 301869 -40350 -265308 -254535 -177213 -177746 -201743 -164796
30003 -164796 -108934 -106603 -121708 -53682 123972 316198 385940 284855 119503 51553 107369
29992 107369 148711 73710 -41757 -80741 -69679 -109660 -197402 -252440 -269928 -297494 -295083
29981 -295083 -176947 19924 167802 247418 352841 485997 519010 399480 229465 92936
29971 92936 -30567 -128744 -122499 -57010 -130035 -389493 -577652 -459036 -170168 -40837 -159723
29960 -159723 -325151 -369203 -321181 -269222 -253610 -300874 -392174 -396852 -211234 32538 87791
29949 87791 -49460 -108929 61363 270890 264842 51557 -185405 -349886 -439252 -406533 -218753
29938 -218753 -5017 41428 -84664 -190307 -145425 -34333 -11096 -95353 -162286 -94315 85116
29927 85116 221304 188400 44980 -28670 30134 88086 40285 -8291 81951 226004 216604
29916 216604 44594 -85170 -67600 -25411 -67362 -108317 -36647 88201 134557 91703 42502
29905 42502 23463 28118 84742 216129 366107 461081 497510 484291 369406 136828 -87959
29894 -87959 -168808 -158173 -218795 -361955 -420517 -301793 -118912 -24063 -41864 -127186 -261334
29883 -261334 -402691 -446117 -342191 -194741 -142092 -189258 -245901 -274378 -285297 -222667 -1922
29872 -1922 307584 465519 310012 -41525 -320373 -396553 -360480 -334943 -309229 -205731 -39814
29861 -39814 75991 79816 34416 26297 54034 67545 67570 86705 95294 26708 -86900 -108641
29849 -108641 9833 113255 21985 -217516 -375195 -322790 -163221 -55458 -28882 -30963
29839 -30963 -50841 -94064 -109978 -67752 -62056 -205687 -424101 -500565 -359470 -173085 -124568
29828 -124568 -181710 -190019 -91492 47452 144925 141028 5284 -186716 -267166 -188386 -126145
29817 -126145 -214808 -287971 -115025 176092 217915 -39021 -220095 -91531 91971 12993
29807 12993 -215989 -275525 -148607 -71362 -100812 -87355 -27023 -81104 -222849 -211992 -10038
29796 -10038 98046 -60161 -268795 -268190 -129895 -62401 -46086 63778 200618 154052 -58688
29785 -58688 -164694 -27965 146772 101844 -128558 -284616 -224122 -83133 -81671 -238829
29775 -238829 -350902 -262587 -81301 -36683 -176470 -336541 -403322 -435114 -478929 -453747 -323702
29764 -323702 -220117 -239489 -254171 -97512 164896 326039 314915 208155 52717 -121028
29754 -121028 -180322 -13777 250682 362479 266077 104032 -54819 -248213 -407131 -395055
29744 -395055 -289855 -338898 -563311 -684629 -535774 -267980 -50705 124696 207774 11001
29734 11001 -400717 -583499 -297459 70495 41054 -243882 -281804 -8582 164914 50281
29724 50281 -97498 -97301 -91581 -157125 -120659 46819 68837 -150984 -257027 25330 394101
29713 394101 380778 33237 -206710 -167667 -84260 -119889 -151753 -84529 -39523 -105427 -151536
29702 -151536 -37612 163394 290293 317301 326529 343262 322518 267028 260711 366426 527360
29691 527360 596276 477867 234651 15718 -112737 -195100 -240602 -166791 52181 290508
29681 290508 407789 385472 255340 29056 -192831 -205765 28343 236593 173873 -21229
29671 -21229 -63544 392 -123565 -460826 -696449 -661427 -544969 -522464 -501797 -393737 -329756
29660 -329756 -403594 -453133 -334219 -200838 -265263 -447656 -512069 -417818 -297770 -201975 -98064
29649 -98064 -30299 -48254 -59983 21409 67066 -101565 -407493 -612556 -652334 -636758 -582269
29638 -582269 -415698 -210932 -133795 -144311 -33922 208676 343989 249413 74999 -39424
29628 -39424 -135700 -229682 -201688 -37377 58398 -48280 -218026 -282964 -293477 -343981 -345137
29617 -345137 -185090 28783 110023 70299 54105 84717 70420 -7777 -99640 -213340 -362515
29606 -362515 -447939 -374601 -237884 -213982 -307677 -385098 -405633 -418638 -368049 -141935 163024
29595 163024 267875 87813 -112967 -57277 203169 403993 412264 320469 261117 255076 240245
29584 240245 172864 79420 24717 31517 49628 26643 -27171 -87148 -167206 -242135 -187099 62055
29572 62055 327150 353850 175508 104010 279607 440763 301063 -18630 -164518 -59488
29562 -59488 26908 -86298 -250425 -270120 -201966 -203928 -242314 -161053 29993 155657 156966
29551 156966 156982 197254 126091 -121116 -311166 -184914 160090 379014 337423 241514 294123
29540 294123 433891 493007 436970 340263 261104 250422 364669 547948 601027 398490 70114
29529 70114 -144024 -155641 -50541 68075 142117 134566 65599 25114 56369 96965 118111
29518 118111 202982 362035 412484 230839 4930 1415 170147 240951 152317 84701 85414
29507 85414 -4045 -193875 -261555 -147706 -112759 -307836 -484657 -390208 -204603 -266432 -525266
29496 -525266 -617280 -419330 -188422 -130314 -131199 -10673 193836 327858 349749 330855 319190
29485 319190 306819 279001 226396 147639 77873 67736 106777 123906 94319 84852 145407 203221
29473 203221 130874 -89398 -322063 -419498 -381946 -341633 -384636 -435006 -360251 -157234 45461
29462 45461 160875 218031 243019 189990 68103 25684 173466 377467 373017 90975 -240696
29451 -240696 -345422 -169543 109021 266978 206272 4536 -165744 -196151 -132399 -88638
29441 -88638 -99577 -110259 -87115 -57892 -40153 -15433 1491 -49970 -170141 -247512 -187232
29430 -187232 -57449 -27286 -157067 -320985 -367265 -295679 -216879 -174745 -104564 21944 115866
29419 115866 101450 41259 27661 13957 -105484 -276359 -318509 -205578 -135025 -238941 -383099
29408 -383099 -374686 -236954 -122730 -53608 73711 270538 427962 501038 556393 610290 565370
29397 565370 365964 110529 -52265 -71320 1928 92945 151684 167747 164327 149784 85253
29386 85253 -54130 -207843 -285860 -278828 -240379 -181596 -75810 40805 80552 34276 -4131
29375 -4131 29648 95653 131873 127993 86151 -12234 -159837 -305828 -415176 -487905 -505170
29364 -505170 -432876 -304425 -219269 -220287 -244422 -234769 -229675 -291837 -410858 -524640 -583745
29353 -583745 -555758 -430437 -271060 -198658 -261451 -363512 -378996 -294199 -180789 -79396
29343 -79396 8528 43862 -30633 -170875 -216786 -66908 164426 245494 101599 -80387 -80766
29332 -80766 79708 200404 200682 199984 267850 279826 139931 -13075 1887 127210 186139
29321 186139 198420 331670 570464 694438 609514 454580 331813 182959 10983 -39921
29311 -39921 45118 53366 -111563 -223117 -86438 110029 65367 -167795 -286764 -216813 -178691
29300 -178691 -299587 -442100 -457826 -371819 -251080 -85945 122028 302997 408737 442465
29290 442465 381399 204636 6127 -78032 -74734 -135695 -260736 -252551 -28367 206691 224502
29279 224502 69311 -54359 -76113 -77278 -82262 -15547 120964 177827 46915 -146612 -139265
29268 -139265 161234 519010 594938 322704 -28559 -194383 -200875 -227273 -310040 -348720 -327139
29257 -327139 -321497 -309037 -185993 -1750 44938 -81376 -146160 35794 342669 530417
29247 530417 524163 395722 202823 13882 -35241 98592 226874 128729 -165460 -446362
29237 -446362 -612352 -703517 -708021 -554028 -295848 -99795 -3228 125741 324878 416690
29227 416690 266462 25872 -29391 156055 364026 377831 209289 33552 -31085 -24909
29217 -24909 -42060 -83128 -65200 42111 177740 306424 467272 634625 642424 383557 18756
29206 18756 -169555 -106609 37880 116912 136631 118773 32363 -78761 -81217 46683 158038
29195 158038 178105 236218 423295 572310 465849 163879 -67835 -102263 -43769 -8923
29185 -8923 2299 9542 -9833 -46579 -43044 17204 97014 189553 311797 410847 390947 251838
29173 251838 96612 -11232 -93978 -158700 -172455 -153194 -155824 -146310 -32667 144784 214568
29162 214568 124106 18431 -17977 -113347 -360206 -582797 -552402 -324953 -151658 -121006
29152 -121006 -108120 -48462 -30475 -86627 -100908 -4199 94154 60666 -86844 -233359 -303773
29141 -303773 -281355 -176971 -52873 -13747 -106747 -262941 -369483 -367940 -284397 -217628 -277062
29130 -277062 -446484 -534448 -383790 -120203 -35103 -198510 -364551 -322616 -155863 -43550
29120 -43550 7788 69043 75904 -74343 -296437 -397734 -346116 -265980 -194849 -49188 155965
29109 155965 255292 159390 -30862 -200687 -359319 -519122 -581106 -463948 -254492 -109385
29099 -109385 -64978 -49124 -30513 -39727 -62651 -32944 42990 46815 -103811 -312368 -378608
29088 -378608 -220606 30435 186754 213088 217617 256308 250515 140812 23273 31107 131595
29077 131595 157386 35017 -117821 -140457 933 207763 350146 361092 281409 211653
29067 211653 180831 103477 -62610 -181261 -96095 108729 178661 36227 -123108 -139538
29057 -139538 -103360 -146677 -194311 -101049 71701 112766 -47387 -267076 -391268 -369277 -197991
29046 -197991 82577 320448 341418 166597 16451 36316 127331 120036 12337 -62580 -34270
29035 -34270 45940 109732 137779 126751 73164 9640 4319 97684 258392 403599 447708
29024 447708 351966 166530 13387 -23470 3946 -29188 -146516 -224562 -162243 -31449 21795
29013 21795 -14255 -16965 65375 134848 118503 101153 187779 327162 399615 413622 459602 501865
29001 501865 404851 194480 104000 266237 513287 606917 542690 472434 424816 301130 116218
28990 116218 37618 141686 295745 361151 382810 469063 572977 528258 287553 21168
28980 21168 -48526 136208 425927 599347 538853 315372 117419 68990 108308 81242 -37481
28969 -37481 -86593 53163 231733 167556 -165864 -437815 -347428 -2862 237626 229958 148018
28958 148018 135788 100239 -48080 -156009 -17473 307155 544922 529791 315049 21076
28948 21076 -255708 -405514 -361158 -221176 -172443 -259470 -359455 -399554 -437113 -482054 -423671
28937 -423671 -238908 -113935 -206486 -398018 -450288 -334974 -223793 -184170 -92938 102562
28927 102562 229070 122507 -96166 -145298 42970 226154 174717 -28510 -116178 -976
28917 -976 125953 74302 -99604 -205448 -182729 -134061 -142264 -185182 -227549 -271154 -290147 -234410
28905 -234410 -139631 -122900 -214280 -303464 -317542 -320460 -333889 -207173 148905 495800 477568
28894 477568 96494 -249877 -262916 -64459 71862 100877 140182 178400 86552 -128633
28884 -128633 -298051 -324846 -269095 -180841 -29337 150573 221415 151253 107308 211741 326680
28873 326680 241508 -8911 -189213 -188797 -126391 -127958 -169838 -187403 -193876 -214364 -207865 -137200
28861 -137200 -43025 21838 70457 131548 177596 166981 115159 69479 50343 60230 109195 191694
28849 191694 281333 377992 499248 589624 520117 249470 -72806 -239883 -185701 2694
28839 2694 208709 346679 353747 220653 25147 -119863 -141452 -22602 181919 313475
28829 313475 205558 -101258 -336695 -300406 -101159 14465 -23213 -106294 -171965 -239910
28819 -239910 -276148 -213210 -94388 -22676 23701 145313 298179 314906 169961 31235
28809 31235 15536 83204 201149 386293 532090 441930 147589 -40992 48798 206343
28799 206343 179520 45009 15193 66304 34367 -47195 -1460 162436 254520 221530 198959
28788 198959 235245 212548 87486 -12588 -403 54913 82358 93875 57645 -102256 -282822
28777 -282822 -198649 228686 647118 651668 288806 -26546 -50176 48033 -6157 -232968 -433450
28766 -433450 -453729 -310010 -118666 3120 -99 -75507 -87033 44182 226505 295325 227997
28755 227997 169579 210454 252585 191689 120935 178889 259437 123338 -162844 -175029 311947
28744 311947 932536 1143667 893287 594594 514125 520030 455636 405475 442579 415529 224092
28733 224092 82212 218504 461802 449662 188692 60668 230424 389217 241573 -43197
28723 -43197 -119319 -7893 -38241 -323311 -610637 -679257 -592554 -459802 -219814 150008
28713 150008 419415 354327 71805 -97787 -41969 81683 183154 343462 538478 542508
28703 542508 243611 -151635 -373563 -381552 -270311 -71653 170997 294182 202568 58268
28693 58268 68753 175493 172325 49570 -31470 -56080 -169491 -367505 -448430 -328195 -151043
28682 -151043 -9459 192326 472989 612609 440754 112184 -97788 -147348 -192379 -296320
28672 -296320 -369149 -344856 -249107 -111077 53695 186891 231008 218415 223753 252573 263334
28661 263334 258005 252952 207849 101702 41051 153862 385470 537718 522399 441601 390433
28650 390433 325951 201620 99577 110275 163712 118625 -13481 -77151 -22938 -6414 -153922
28639 -153922 -337651 -326074 -115811 54005 44417 425 91989 225382 192639 18630 -66607
28628 -66607 5177 30461 -140359 -369174 -448712 -399090 -383081 -426676 -405676 -277107 -159269
28617 -159269 -156686 -217410 -207638 -69355 126813 262145 295945 312047 414091 580769 685649
28606 685649 665896 585631 509680 421863 318682 267093 287542 290580 230614 210824 306318
28595 306318 388482 290638 71176 -74987 -120730 -218456 -412310 -546784 -510587 -389060
28585 -389060 -290662 -171735 53736 326001 475169 413865 232851 116535 165850 270193
28575 270193 191253 -145264 -488734 -530481 -307806 -159662 -254309 -372834 -267274 -39313
28565 -39313 21038 -146535 -323466 -338357 -255327 -223592 -282942 -357151 -344234 -182097 102447
28554 102447 385078 534912 521666 398353 213958 13113 -120478 -133972 -109275 -175120
28544 -175120 -305642 -345595 -274388 -276976 -440413 -534928 -295152 159711 423521 330187 146137
28533 146137 147794 233057 143198 -85755 -156283 43708 277043 285956 79105 -187597 -423714
28522 -423714 -566493 -488739 -133255 326867 623026 659521 530049 318893 36609 -266007
28512 -266007 -482200 -581086 -634630 -678051 -650789 -519492 -366310 -301513 -350315 -453994 -517269
28501 -517269 -443441 -216620 20253 71776 -68870 -178532 -78227 135953 232943 149376
28491 149376 25856 -30876 -76773 -184054 -289868 -287785 -203908 -162183 -184410 -151198 -9814
28480 -9814 97416 23429 -143735 -184021 -56988 66890 98786 148044 266291 290858 109547
28469 109547 -95164 -90035 45553 57648 -58111 -64495 91912 171437 38167 -108079 -40507
28458 -40507 167924 292494 270240 199681 149700 124740 127445 121349 15804 -193261 -355870
28447 -355870 -353746 -259422 -199087 -165647 -96242 -22624 8318 62902 204290 340015 361912
28436 361912 347346 417644 474831 322643 17017 -162016 -107634 -9557 -27610 -80653 -53123
28425 -53123 10373 48871 132504 305874 437016 399376 288575 273099 314808 238660 40365
28414 40365 -80340 -9690 136965 215173 238706 276266 283849 172869 -9075 -98351 -23922
28403 -23922 102181 136210 71702 7844 5088 45926 115397 232058 375651 456061 411146
28392 411146 300375 241088 259605 258771 148061 -30147 -134114 -76197 82301 206451 242797
28381 242797 255163 290714 272588 97751 -186453 -394217 -397715 -236169 -25897 142118
28371 142118 193608 76613 -152567 -330376 -347294 -251402 -145947 -69745 -35476 -72413 -129653
28360 -129653 -43831 252159 554954 579520 298098 -35946 -178137 -88780 123191 310999
$$ [...]
##END NTUPLES=NMR SPECTRUM
##END=
