##TITLE=31Pdec_LY-TMF-5.24.R.t
 D2O, 24 sc
 28.2.2020
##JCAMPDX= 6.0         $$ Bruker NMR JCAMP-DX V2.0
##DATA TYPE= NMR SPECTRUM
##DATA CLASS= NTUPLES
##ORIGIN= UXNMR, Bruker Analytische Messtechnik GmbH
##OWNER= root
$$ XWIN-NMR		Version 3.5
$$ Fri Feb 28 14:11:45 2020 Russian Standard Time (UT+4h)  she@DPX200
##.OBSERVE FREQUENCY= 81.013821
##.OBSERVE NUCLEUS= ^31P
##.ACQUISITION MODE= SIMULTANEOUS
##.ACQUISITION SCHEME= undefined
##.AVERAGES= 24
##.DIGITISER RES= 17
##SPECTROMETER/DATA SYSTEM= spect
##.PULSE SEQUENCE= zgpg30
##.SOLVENT NAME= CDCl3
##.SHIFT REFERENCE= (INTERNAL, CDCl3, 0, 182.463)
##AUDIT TRAIL= $$ (NUMBER, WHEN, WHO, WHERE, WHAT)
$$ ##TITLE= Audit trail, XWIN-NMR		Version 3.5
$$ ##JCAMPDX= 5.01
$$ ##ORIGIN= Bruker BioSpin GmbH
$$ ##OWNER= she
$$ F:/spectra/data/she/nmr/P31/1/pdata/1/auditp.txt
$$ ##AUDIT TRAIL=  $$ (NUMBER, WHEN, WHO, WHERE, WHAT)
(   1,<2020-02-28 14:10:50.76 +0400>,<she>,<DPX200>,
      <created by zg, POWCHK disabled, PULCHK disabled
       configuration hash MD5:
       00 E9 B6 7A A2 85 ED C7 34 08 36 98 17 FE 4E 26
       data hash MD5: 32K
       C8 D6 DF 54 3A 79 FC 1C 4A 3F AF 11 39 41 55 76>)
(   2,<2020-02-28 14:10:53.12 +0400>,<she>,<DPX200>,
      <Start of raw data processing
       efp BC_mod = 2 LB = 1 FT_mod = 6 PKNL = 1 PHC0 = -1611.474 PHC1 = 663.0013 SI = 64K 
       data hash MD5: 64K
       6E 07 FE 26 07 1B 96 F1 AE BC B9 55 AD 83 88 FA>)
(   3,<2020-02-28 14:11:06.85 +0400>,<she>,<DPX200>,
      <pk PHC0 = 5.077301 PHC1 = 0 
       data hash MD5: 64K
       BE 6E 45 C4 6A 2E ED 7F 35 4F 76 4D F4 35 BA D8>)
(   4,<2020-02-28 14:11:17.09 +0400>,<she>,<DPX200>,
      <abs ABSG = 5 
       data hash MD5: 64K
       5D A6 34 5B 30 B9 B2 88 A5 30 52 A4 CE 1E 57 F3>)
$$ ##END=
$$ 
$$ hash MD5
$$ 31 0F B4 75 3D 70 03 08 8E 14 5C 4F F2 D9 B6 49
##$RELAX= 
##$RELAX= 
##$RELAX= 
##$RELAX= 
##$RELAX= 
##$RELAX= 
##$RELAX= 
##$RELAX= 
$$ Bruker specific parameters
$$ --------------------------
##$DU= <F:/spectra>
##$EXPNO= 1
##$NAME= <P31>
##$PROCNO= 1
##$TYPE= <nmr>
##$USER= <she>
##$AMP= (0..31)
100 100 100 100 100 100 100 100 100 100 100 100 100 100 100 100 100 100 
100 100 100 100 100 100 100 100 100 100 100 100 100 100 
##$AQSEQ= 0
##$AQ_mod= 1
##$AUNM= <au_zg>
##$AUTOPOS= <>
##$BF1= 81.014009
##$BF2= 200.13
##$BF3= 200.13
##$BF4= 200.13
##$BF5= 200.13
##$BF6= 200.13
##$BF7= 200.13
##$BF8= 200.13
##$BYTORDA= 1
##$CFDGTYP= 0
##$CFRGTYP= 5
##$CHEMSTR= <none>
##$CNST= (0..31)
1 1 145 1 1 1 1 1 1 1 1 1 1 1 1 1 1 1 1 1 1 1 1 1 1 1 1 1 1 1 1 1 
##$CPDPRG= <waltz16>
##$CPDPRG1= <>
##$CPDPRG2= <waltz16>
##$CPDPRG3= <>
##$CPDPRG4= <mlev>
##$CPDPRG5= <mlev>
##$CPDPRG6= <mlev>
##$CPDPRG7= <mlev>
##$CPDPRG8= <mlev>
##$CPDPRGB= <>
##$CPDPRGT= <>
##$D= (0..31)
0 1 0 0 0 0 0 0 0 0 0 0.03 2e-05 3e-06 0 0 0 0 0 0 0 0 0 0 0 0 0 0 0 0 
0 0 
##$DATE= 1582884650
##$DBL= (0..7)
120 120 120 11 120 120 24 19 
##$DBP= (0..7)
150 150 150 150 150 150 150 150 
##$DBP07= 0
##$DBPNAM0= <>
##$DBPNAM1= <>
##$DBPNAM2= <>
$$ [...]
##$SUBNAM3= <"">
##$SUBNAM4= <"">
##$SUBNAM5= <"">
##$SUBNAM6= <"">
##$SUBNAM7= <"">
##$SUBNAM8= <"">
##$SUBNAM9= <"">
##$SW= 369.568048894756
##$SWIBOX= (0..15)
0 1 3 0 0 0 0 0 0 0 0 0 0 0 0 0 
##$SW_h= 29940.119760479
##$TD= 32768
##$TD0= 1
##$TE= 0
##$TE2= 300
##$TE3= 300
##$TEG= 300
##$TL= (0..7)
0 120 53 12 22 120 120 120 
##$TP= (0..7)
150 150 150 150 150 150 150 150 
##$TP07= 0
##$TPNAME0= <>
##$TPNAME1= <>
##$TPNAME2= <>
##$TPNAME3= <>
##$TPNAME4= <>
##$TPNAME5= <>
##$TPNAME6= <>
##$TPNAME7= <>
##$TPOAL= (0..7)
0.5 0.5 0.5 0.5 0.5 0.5 0.5 0.5 
##$TPOFFS= (0..7)
0 0 0 0 0 0 0 0 
##$TUNHIN= 0
##$TUNHOUT= 0
##$TUNXOUT= 0
##$USERA1= <user>
##$USERA2= <user>
##$USERA3= <user>
##$USERA4= <user>
##$USERA5= <user>
##$V9= 5
##$VALIST= <valist>
##$VCLIST= <CCCCCCCCCCCCCCC>
##$VD= 0
##$VDLIST= <DDDDDDDDDDDDDDD>
##$VPLIST= <PPPPPPPPPPPPPPP>
##$VTLIST= <TTTTTTTTTTTTTTT>
##$WBST= 1024
##$WBSW= 4
##$XGAIN= (0..3)
0 0 0 0 
##$XL= 0
##$YL= 0
##$YMAX_a= 8192
##$YMIN_a= -8697
##$ZGOPTNS= <>
##$ZL1= 120
##$ZL2= 120
##$ZL3= 120
##$ZL4= 120
##$ABSF1= 182.463
##$ABSF2= -187.1042
##$ABSG= 5
##$ABSL= 3
##$ALPHA= 0
##$AQORDER= 0
##$ASSFAC= 0
##$ASSFACI= 0
##$ASSFACX= 0
##$ASSWID= 0
##$AUNMP= <proc_1d>
##$AZFE= 0.1
##$AZFW= 0.5
##$BCFW= 0
##$BC_mod= 2
##$BYTORDP= 0
##$COROFFS= 0
##$CY= -3
##$DATMOD= 1
##$DC= 0
##$DFILT= <>
##$DTYPP= 0
##$F1P= 0
##$F2P= 0
##$FCOR= 1
##$FTSIZE= 65536
##$FT_mod= 6
##$GAMMA= 0
##$GB= 0
##$INTBC= 1
##$INTSCL= 5.30512e-09
##$ISEN= 30
##$LB= 1
##$LEV0= 0
##$LPBIN= 0
##$MAXI= 10000
##$MC2= 0
##$MEAN= 0
##$ME_mod= 0
##$MI= 50
##$NCOEF= 0
##$NC_proc= -5
##$NLEV= 6
##$NOISF1= 182.463
##$NOISF2= 159.3651
##$NSP= 0
##$NTH_PI= 0
##$NZP= 0
##$OFFSET= 182.463
##$PC= 4
##$PHC0= -1606.397
##$PHC1= 663.0013
##$PH_mod= 1
##$PKNL= yes
##$PPARMOD= 0
##$PSCAL= 0
##$PSIGN= 0
##$REVERSE= no
##$SF= 81.0140089999434
##$SI= 65536
##$SIGF1= 159.3651
##$SIGF2= -187.1042
##$SINO= 113.3802
##$SIOLD= 16384
##$SREGLST= <1H.CDCl3>
##$SSB= 0
##$STSI= 65536
##$STSR= 0
##$SW_p= 29940.119760479
##$SYMM= 0
##$S_DEV= 0
##$TDeff= 32768
##$TDoff= 0
##$TI= <>
##$TILT= no
##$TM1= 0
##$TM2= 0
##$TOPLEV= 0
##$USERP1= <user>
##$USERP2= <user>
##$USERP3= <user>
##$USERP4= <user>
##$USERP5= <user>
##$WDW= 1
##$XDIM= 65536
##$YMAX_p= 437446401
##$YMIN_p= -10395738
$$ End of Bruker specific parameters
$$ ---------------------------------
##NTUPLES= NMR SPECTRUM
##VAR_NAME=  FREQUENCY,     SPECTRUM/REAL,   SPECTRUM/IMAG
##SYMBOL=    X,             R,               I
##VAR_TYPE=  INDEPENDENT,   DEPENDENT,       DEPENDENT
##VAR_FORM=  AFFN,          ASDF,            ASDF
##VAR_DIM=   65536,         65536,           65536
##UNITS=     HZ,            ARBITRARY UNITS, ARBITRARY UNITS
##FACTOR=    0.456856943014862, 1,           1
##FIRST=     14782.0589164792, 0,            0
##LAST=      -15158.0608439998, 0,           0
##MIN=       -15158.0608439998, -10395738,   0
##MAX=       14782.0589164792, 437446401,    0
$$ Real data points
##PAGE= N=1
##DATA TABLE= (X++(R..R)), XYDATA
$$ [...]
$$ plain form
36799 2475425 2354329 1091038 26472 35236 737387 1283606 1211692 495997 -500144 -959380
36789 -959380 -232518 1185869 1962456 1544405 821738 737967 927777 453527 -594528
36780 -594528 -1164284 -806537 -298194 -472961 -1095534 -1333377 -961762 -601087 -850160 -1577129
36770 -1577129 -2142619 -2070487 -1366853 -353863 596095 1195394 1325230 1096881 760268
36761 760268 491781 322720 278810 445641 799252 1084419 1009425 537439 -98087 -617598
36751 -617598 -851367 -739591 -316583 271252 785657 993147 824255 492750 353943 501703
36741 501703 602915 344068 -59005 -118235 202630 422614 249582 -84223 -310440 -474027
36731 -474027 -590705 -452527 -79382 118257 -5860 -15492 321870 467115 -56618 -749671
$$ packed form
36799B475425j21096j263291j064566Q764P02151N46219p1914p15695r96141m59236
36789i59380P26862J418387P76587m18051p22667q3771J89810m74250j048055
36780e94528n69756L57747N08343j74767o22573k37843L71615L60675k49073p26969
36770a577129n65490P2132P03634J012990R49958N99299J29836k28349l36613
36761G60268k68487j69061m3910J66831L53611K85167p4994m71986o35526n19511
36751f17598k33769J11776M23008N87835N14405K07490j68892l31505j38807J47760
36741E01703J01212k58847m03073n9230L20865K19984j73032l33805k26217j63587
36731d74027j16678J38178L73145J97639j24117r632L37362J45245n23733o93053
$$ plain form
36721 -749671 -829235 -464754 -434831 -791169 -851806 -467589 -257925 -427628 -349236 328723
36711 328723 1050249 1282315 1274383 1357591 1242092 682635 197542 328966 670218 498620
36701 498620 54426 235259 1098280 1634811 1252413 634801 654183 1067061 989938 372955
36691 372955 200664 1075493 2236043 2473453 1712694 1055363 1245449 1748517 1673724 1037563
36681 1037563 508875 269850 -66938 -490735 -423344 214434 518124 -284508 -1697189
36672 -1697189 -2515249 -2292476 -1723027 -1620848 -1960966 -2051851 -1435159 -454136 114961 -3832
36662 -3832 -205289 201708 977408 1189305 464796 -555237 -1194308 -1574790 -2068225 -2420261
36652 -2420261 -2054237 -1030769 -101084 198879 63087 -31655 62411 123025 -66312 -413821
$$ packed form
36721g49671p9564L64481K9923l56338o0637L84217K09664j69703P8392O77959
36711C28723P21526K32066p932Q3208j15499n59457m85093J31424L41252j71598
36701D98620m44194J80833Q63021N36531l82398o17612J9382M12878p7123o16983
36691C72955j72291Q74829J160550K37410p60759o57331J90086N03068p4793o36161
36681A037563n28688k39025l36788m23797O7391O37778L03690q02632j412681
36672a697189q18060K22773N69449J02179l40118r0885O16692R81023N69097j18793
36662c832k01457M06997P75700K11897p24509j020033o39071l80482m93435l52036
36652b420261L66024J023468R29685K99963j35792r4742R4066O0614j89337l47509
$$ plain form
36642 -413821 -576734 -362003 -31745 11850 -128796 115577 888344 1423223 870950 -565202
36632 -565202 -1745690 -1837993 -1136019 -604133 -823409 -1460962 -1707875 -1223170 -569247 -529203
36622 -529203 -1053131 -1251666 -529499 681044 1511337 1554821 896706 -264925 -1530262
36613 -1530262 -2200204 -1905267 -1191514 -917720 -1151318 -1210033 -747526 -176931 89098 223236
36603 223236 538612 931083 1140542 1265424 1606364 2113476 2346998 2025191 1377755 853599
36593 853599 607076 413779 73088 -256133 -220591 296103 1016818 1503960 1463916 929481
36583 929481 297688 54145 221099 219800 -386934 -1157240 -1243932 -540049 220622 538967
36573 538967 658476 828639 810254 519533 481230 1049111 1685097 1636483 935125 131984
$$ packed form
36642d13821j62913K14731L30258M3595j40646K44373P72767N34879n52273j436152
36632e65202j180488r2303P01974N31886k19276o37553k46913M84705O53923M0044
36622e29203n23928j98535P22167J210543Q30293M3484o58115j161631j265337
36613a530262o69942K94937P13753K73794k33598n8715M62507N70595K66029J34138
36603B23236L15376L92471K09459J24882L40940N07112K33522l21807o47436n24156
36593H53599k46523j93297l40691l29221L5542N16694P20715M87142m0044n34435
36583I29481o31793k43543J66954j299o06734p70306q6692P03883P60671L18345
36573E38967J19509J70163j8385k90721l8303N67881O35986m8614p01358q03141
$$ plain form
36563 131984 -573550 -1293292 -1871613 -2031905 -1874037 -1619001 -1131605 -335147 221222 -14592
36553 -14592 -638614 -776752 -371627 -131035 -304424 -454425 -467635 -802860 -1518596 -1966799
36543 -1966799 -1801637 -1511310 -1560178 -1685764 -1451979 -914170 -357085 113868 413756 419261
36533 419261 308632 410019 530322 128920 -594195 -621866 402126 1423794 1355394 513069
36523 513069 -64851 -137140 -220154 -451226 -453413 -186753 -66626 -197011 -184894 186992
36513 186992 672073 1038045 1326160 1513126 1375697 898119 488034 551271 1001941 1356717
36503 1356717 1283018 985225 981097 1434687 1853291 1701083 1184971 968143 1109367 914693
36493 914693 68673 -739702 -779285 -331080 -199003 -551464 -860854 -734440 -227900 463715
$$ packed form
36563A31984p05534p19742n78321j60292J57868K55036M87396P96458N56369k35814
36553a4592o24022j38138M05125K40592j73389j50001j3210l35225p15736m48203
36543a966799J65162K90327m8868j25586K33785N37809N57085M70953K99888N505
36533D19261j10629J01387J20303m01402p23115k7671J023992J021668o8400q42325
36523E13069n77920p2289q3014k31072k187K66660J20127j30385J2117L71886
36513A86992M85081L65972K88115J86966j37429m77578m10085O3237M50670L54776
36503A356717p3699k97793m128M53590M18604j52208n16112k16828J41224j94674
36493I14693q46020q08375l9583M48205J32077l52461l09390J26414N06540O91615
$$ plain form
36483 463715 1085056 1276271 960112 573524 440837 246579 -262540 -466555 311645 1385771
36473 1385771 1226454 -414517 -1932659 -1876113 -687277 143587 -2399 -506776 -637552
36464 -637552 -302807 164374 381582 103048 -524819 -885463 -434517 618149 1429249
36455 1429249 1406018 816062 453828 772716 1395239 1526090 886437 91957 -116516 124327
36445 124327 9032 -694663 -1192588 -791692 17097 194387 -397386 -877411 -663608 -197368
36435 -197368 -110645 -287417 -224836 100605 333352 487057 918561 1543677 1758109 1388822
36425 1388822 1121976 1529959 2136274 2056502 1282807 624808 466175 343866 -97734 -468432
36415 -468432 -310176 177433 565142 886647 1354377 1723713 1559227 967576 477181 246125
$$ packed form
36483D63715O21341J91215l16159l86588j32687j94258n09119k04015P78200J074126
36473A385771j59317j640971j518142N6546J188836Q30864j45986n04377j30776
36464f37552L34745M67181K17208k78534o27867l60644M50946J052666Q11100
36455A429249k3231n89956l62234L18888O22523J30851o39653p94480k08473K40843
36445A24327j15295p03695m97925M00896Q08789J77290n91773m80025K13803M66240
36435a97368Q6723j76772O2581L25441K32747J53705M31504O25116K14432l69287
36425A388822k66846M07983O06315p9772p73695o57999j58633j22309m41600l70698
36415d68432J58256M87609L87709L21505M67730L69336j64486n91651m90395k31056
$$ plain form
36405 246125 -57574 -558468 -883637 -727037 -315581 -133406 -427849 -1063205 -1621420 -1637730
36395 -1637730 -1033282 -334611 -159320 -489940 -812471 -936704 -1159534 -1510570 -1444196 -652468
36385 -652468 273233 476000 -137459 -938227 -1427465 -1582645 -1498963 -1198290 -804319 -477062
36375 -477062 -125507 416310 871282 645526 -309655 -1159841 -1055323 -108983 794173 969800
36365 969800 412750 -485452 -1269847 -1558141 -1305905 -988834 -1118019 -1499747 -1418378 -693472
36355 -693472 -25027 50574 36913 729410 1909179 2494204 1947011 882979 175474 34129
36345 34129 170765 352830 466774 410890 258868 271529 498318 637399 520920 430470
36335 430470 647623 986224 1105629 1038932 1049346 1162093 1204386 1147936 1051660 816024
$$ packed form
36405B46125l03699n00894l25169J56600M11456J82175k94443o35356n58215j6310
36395a637730O04448O98671J75291l30620l22531j24233k22830l51036O6374P91728
36385f52468R25701K02767o13459q00768m89238j55180Q3682L00673L93971L27257
36375d77062L51555N41817M54972k25756r55181q50186J04518R46340R03156J75627
36365I69800n57050q98202p84395k88294K52236L17071j29185l81728Q1369P24906
36355f93472O68445P5601j3661O92497J179769N85025n47193j064032p07505j41345
36345C4129J36636J82065J13944n5884j52022J2661K26789J39081j16479r0450
36335D30470K17153L38601J19405o6697J0414J12747M2293n6450r6276k35636
$$ plain form
36325 816024 382320 56624 207615 683067 952943 864385 833517 1148402 1451089 1191476
36315 1191476 415689 -193500 -97974 438568 625480 85910 -650365 -761563 -105895 714718
36305 714718 1191462 1391422 1544256 1629321 1615045 1698975 1991900 2278977 2358538 2255161
36295 2255161 1842956 777885 -744893 -1688013 -1284918 -94908 732340 898796 870568
36286 870568 684391 -63026 -1031430 -1119642 -59783 927625 715740 -213160 -593893 -198348
36276 -198348 85813 -179196 -275739 539898 1875378 2706546 2735796 2622972 2819433 2804739
36266 2804739 1958857 814505 680454 1963036 3551221 4132038 3505318 2255164 819918
36257 819918 -485649 -1110698 -794343 -171005 -56260 -302532 -107201 700029 1453288
$$ packed form
36325H16024m33704l25696J50991M75452K69876q8558l0868L14885L02687k59613
36315A191476p75787o09189R5526N36542J86912n39570p36275j11198O55668Q20613
36305G14718M76744J99960J52834Q5065j4276Q3930K92925K87077P9561j03377
36295B255161m12205j065071j522778r43120M03095J190010Q27248J66456k8228
36286H70568j86177p47417r68404q8212J059859R87408k11885r28900l80733L95545
36276a98348K84161k65009r6543Q15637J335480Q31168K9250j12824J96461j4694
36266B804739q45882j144352j34051J282582J588185N80817o26720j250154j435246
36257H19918j305567o25049L16355O23338J14745k46272J95331Q07230P53259
$$ plain form
36248 1453288 1642003 1357139 837808 334232 299055 852934 1157964 311151 -1149618
36239 -1149618 -1739012 -1153161 -696824 -1230806 -1932869 -1753232 -1002901 -624922 -735593
36230 -735593 -810962 -684479 -475595 -32569 709801 1203823 887178 23764 -652906 -803758
36220 -803758 -496278 162527 843139 986322 621055 623385 1441481 2181307 1850309 919286
36210 919286 543323 674400 258100 -826026 -1386361 -741179 235123 389281 -230337
36201 -230337 -719403 -551389 65194 700269 1119791 1319895 1387593 1325883 1064277 708318
36191 708318 533816 538606 355361 -80901 -257131 23512 11522 -947847 -2179837 -2470962
36181 -2470962 -1843674 -1445716 -1740669 -2012598 -1851219 -1873918 -2436940 -2733532 -1991446 -762213
$$ packed form
36248A453288J88715k84864n19331n03576l5177N53879L05030q46813j460769
36239a149618n89394N85851M56337n33982p02063J79637P50331L77979j10671
36230g35593p5369J26483K08884M43026P42370M94022l16645q63414o76670j50852
36220h03758L07480O58805O80612J43183l65267K330Q18096P39826l30998r31023
36210I19286l75963J31077m16300j084126n60335O45182R76302J54158o19618
36201b30337m89066J68014O16583O35075M19522K00104O7698o1710k61606l55959
36191G08318j74502M790j83245m36262j76230K80643j1990r59369j231990k91125
36181b470962O27288L97958k94953k71929J61379k2699n63022k96592P42086J229233
$$ plain form
36171 -762213 -101928 -10098 347102 1101977 1314597 270723 -1473900 -2606192 -2323985
36162 -2323985 -961012 447721 1093529 961886 581330 329868 118464 -292832 -878888
36153 -878888 -1319289 -1286590 -770349 -185330 -49371 -436566 -915964 -1171762 -1398398 -1815876
36143 -1815876 -2137347 -1958771 -1399432 -839905 -277382 451118 1028492 977888 514455 289376
36133 289376 308498 -33505 -749076 -1031683 -547403 -67359 -309706 -884813 -983687 -540034
36123 -540034 -97965 43977 -11077 -130853 -208684 -133057 -60460 -356536 -931418 -1101266
36113 -1101266 -538348 131674 212566 -48397 25900 401759 472275 131610 -70175 151688
36103 151688 413556 301597 -114550 -550190 -854710 -932448 -668248 -121245 438053 832305
$$ packed form
36171g62213O60285R1830L57200P54875K12620j043874j744623j132292K82207
36162b323985J362973J408733O45808j31643l80556k51462k11404m11296n86056
36153h78888m40401L2699N16241N85019J35959l87195m79398k55798k26636m17478
36143a815876l21471J78576N59339N59527N62523P28500N77374n0604m63433k25079
36133B89376J9122l42003p15571k82607M84280M80044k42347n75107r8874M43653
36123e40034M42069J41942n5054j19776p7831P5627P2597k96076n74882j69848
36113a101266N62918O70022Q0892k60963P4297L75859P0516l40665k01785K21863
36103A51688K61868j11959m16147m35640l04520p7738K64200N47003N59298L94252
$$ plain form
36093 832305 1165667 1607092 2088435 2298122 1970414 1203124 461301 142714 155971 128566
36083 128566 19894 198932 807432 1410933 1531220 1242338 940925 732726 369588 -302780
36073 -302780 -1108315 -1742959 -2056266 -2111695 -1996056 -1603857 -813747 -9978 -44288 -1191135
36063 -1191135 -2422815 -2437690 -1301813 -260091 53759 200101 541606 476909 -293681
36054 -293681 -792767 -14414 1564492 2671527 2885488 2690062 2412996 2099455 2015409
36045 2015409 2254942 2183076 1293276 301888 284619 983686 1191404 674743 384007 691753
36035 691753 824682 378883 75841 451504 951321 1009882 1026053 1503692 2067283 2115259
36025 2115259 1748500 1310724 671411 -271217 -982771 -988016 -668266 -617718 -712130 -576272
$$ packed form
36093H32305L33362M41425M81343K09687l27708p67290p41823l18587J3257k7405
36083A28566j08672J79038O08500O03501J20287k88882l01413k08199l63138o72368
36073c02780q05535o34644l13307n5429J15639L92199P90110Q03769l4310j146847
36063a191135j231680j4875J135877J041722L13850J46342L41505o4697p70590
36054b93681m99086P78353J578906J107035K13961j95426k77066l13541q4046
36045B015409K39533p1866q89800r91388j7269O99067K07718n16661k90736L07746
36035F91753J32929m45799l03042L75663M99817N8561J6171M77639N63591M7976
36025B115259l66759m37776o39313r42628p11554n245L19750N0548r4412J35858
$$ plain form
36015 -576272 -432444 -606483 -682618 -136371 589101 706233 469371 746362 1362006 1198848
36005 1198848 83828 -765652 -624275 -366547 -988301 -2036046 -2405695 -1973227 -1494725
35996 -1494725 -1390812 -1521610 -1774823 -1991133 -1632216 -478684 553630 332143 -800411
35987 -800411 -1339227 -753875 -137733 -315900 -535761 102224 955511 844569 104098 143935
35977 143935 1126252 1619365 893209 127109 534160 1429643 1336559 309219 -205405 362715
35967 362715 897628 360148 -690448 -962303 -170303 776884 995769 395618 -648257
35958 -648257 -1764697 -2557015 -2538164 -1510742 2690 993820 847522 -47074 -740729
35949 -740729 -790616 -635369 -779196 -926241 -341290 1026686 2254805 2422625 1565403
$$ packed form
36015e76272J43828j74039p6135N46247P25472J17132k36862K76991O15644j63158
36005A198848j115020q49480J41377K57728o21754j047745l69649M32468M78502
35996a494725J03913j30798k53213k16310L58917J153532J032314k21487j132554
35987h00411n38816N85352O16142j78167k19861O37985Q53287j10942p40471L9837
35977A43935R82317M93113p26156p66100M07051Q95483r3084j027340n14624N68120
35967C62715N34913n37480j050596k71855P92000R47187K18885o00151j043875
35958f48257j116440p92318J8851J027422J513432R91130j46298q94596o93655
35949g40729m9887J55247j43827j47045N84951J367976J228119J67820q57222
$$ plain form
35940 1565403 495271 -61285 45899 525141 979281 1172862 1173565 1241720 1496662 1727434
35930 1727434 1588570 933874 -51554 -943060 -1303742 -1017780 -476973 -239432 -376629
35921 -376629 -362869 192811 905842 1028341 428425 -212636 -274105 62845 192409 -12220
35911 -12220 -48976 437236 1070762 1171673 609548 -49364 -248361 -50213 57671 -211125
35901 -211125 -663606 -875519 -579877 109922 710310 668649 -127399 -1095822 -1392502 -727351
35891 -727351 311163 836331 532610 -128111 -484833 -339224 45178 397795 639424
35882 639424 682717 401362 -31787 -95187 462412 1158477 1328882 1017693 860561 1134716
35872 1134716 1453614 1456973 1216853 777709 -70763 -1185701 -1822781 -1549352 -954886 -811592
$$ packed form
35940A565403j070132n56556J07184M79242M54140J93581P03O8155K54942K30772
35930A727434j38864o54696r85428q91506l60682K85962N40807K37541j37197
35921c76629J3760N55680P13031J22499n99916o41061o1469L36950J29564k04629
35911a2220l6756M86212O33526J00911n62125o58912j98997J98148J07884k68796
35901b11125m52481k11913K95642O89799O00388m1661p96048r68423k96680O65151
35891g27351J038514N25168l03721o60721l56722J45609L84402L52617K41629
35882F39424M3293k81355m33149o3400N57599O96065J70405l11189j57132K74155
35872A134716L18898L359k40120m39144q48472j114938o37080K73429N94466J43294
$$ plain form
35862 -811592 -887161 -369451 701377 1295834 824271 -36923 -282298 182709 633408 533462
35852 533462 68984 -200809 20016 448075 471950 -203233 -1175776 -1746450 -1644049 -1164168
35842 -1164168 -676312 -304559 -101023 -180883 -509155 -750126 -516627 249309 1169769 1691407
35832 1691407 1538320 972152 502109 316080 205576 63565 64791 206976 162578 -97655
35822 -97655 -42755 589795 1190035 1091809 539344 145846 -151177 -725075 -1263805 -1221171
35812 -1221171 -1012157 -1516525 -2428386 -2450183 -1352336 -461203 -611144 -958323 -582822
35803 -582822 -7511 -77013 -371330 -11438 663165 554423 -437699 -1352147 -1678832 -1792030
35793 -1792030 -1892810 -1588791 -748830 33993 133575 -438404 -1162976 -1432316 -910424 99885
$$ packed form
35862h11592p5569N17710J070828N94457m71563q61194k45375M65007M50699r9946
35852E33462m64478k69793K20825M28059K3875o75183r72543n70674J02401M79881
35842a164168M87856L71753K03536p9860l28272k40971K33499P65936R20460N21638
35832A691407j53087n66168m70043j86029j10504j42011J226J42185m4398k60233
35822i7655N4900O32550O00240r8226n52465l93498k97023n73898n38730M2634
35812a221171K09014n04368r11861k1797J097847Q91133j49941l47179L75501
35803e82822N75311o9502k94317L59892O74603j08742r92122r14448l26685j13198
35793a792030j00780L04019Q39961P82823R9582n71979p24572k69340N21892J010309
$$ plain form
35783 99885 789596 761090 545786 707160 832908 180939 -980632 -1610062 -1358191 -868548
35773 -868548 -623429 -451968 -293773 -447170 -755904 -487735 515233 1360254 1290113 660004
35763 660004 213880 53713 -54260 62544 664897 1398497 1614366 1211053 620409 158937
35753 158937 -111999 -121690 67922 56137 -384598 -735255 -280806 814964 1597524 1537005
35743 1537005 1081935 878194 993098 1142148 1191730 1122115 881661 606415 644388 1009124
35733 1009124 1129610 568444 -281643 -723155 -766019 -983381 -1422667 -1429770 -803456 -409072
35723 -409072 -1091523 -2425796 -3174705 -2750078 -1623107 -454683 486486 1012853 842242
35714 842242 55165 -725765 -953418 -692965 -343031 -112192 30830 179593 477392 1014088
$$ packed form
35783I9885O89711k8506k15304J61374J25748o51969j161571o29430K51871M89643
35773h68548K45119J71461J58195j53397l08734K68169J002968Q45021p0141o30109
35763F60004m46124j60167j07973J16804O02353P33600K15869m03313n90644m61472
35753A58937k70936r691J89612j1785m40735l50657M54449J095770P82560o0519
35743A537005m55070k03741J14904J49050M9582o9615k40454k75246L7973L64736
35733A009124J20486n61166q50087m41512m2864k17362m39286p103O26314L94384
35723d09072o82451j334273p48909M24627J126971J168424R41169N26367j70611
35714H42242p87077p80930k27653K60453L49934K30839J43022J48763K97799N36696
$$ plain form
35704 1014088 1537271 1548569 905985 58592 -533318 -918109 -1350160 -1774300 -1918004 -1648557
35694 -1648557 -950512 185334 1512879 2406617 2383466 1659214 925206 687972 991630
35685 991630 1534461 1815810 1437004 551478 -195316 -382677 -184588 126177 549960 941856
35675 941856 826466 165278 -230907 254062 1011616 982629 122573 -711059 -1035314 -994944
35665 -994944 -551481 520681 1780210 2275795 1810300 1210458 1073957 1039193 607571
35656 607571 -66654 -593622 -903205 -1014151 -853870 -655380 -917501 -1591536 -1918595 -1492198
35646 -1492198 -874875 -692696 -740992 -576866 -423796 -742123 -1294160 -1429792 -1105764 -871405
35636 -871405 -896151 -731673 -173399 267360 109956 -235194 185869 1651686 3221357
$$ packed form
35704A014088N23183J1298o42584q47393n91910l84791m32051m24140j43704K69447
35694a648557O98045J135846J327545Q93738k3151p24252p34008k37234L03658
35685I91630N42831K81349l78806q85526p46794j87361J98089L10765M23783L91896
35675I41856j15390o61188l96185M84969P57554k8987q60056q33632l24255M0370
35665i94944M43463J072162J259529M95585m65495n99842j36501l4764m31622
35656F07571o74225n26968l09583j10946J60281J98490k62121o74035l27059M26397
35646a492198O17323J82179m8296J64126J53070l18327n52037j35632L24028K34359
35636h71405k4746J64478N58274M40759j57404l45150M21063J465817J569671
$$ plain form
35627 3221357 3669788 2860983 1815995 1352122 1188321 760727 319391 421214 721981
35618 721981 350355 -566545 -917127 -387973 -46988 -593845 -1140365 -592361 649469
35609 649469 1397858 1416285 1325776 1235194 677781 -233933 -720371 -489088 -49964 242744
35599 242744 599176 1052749 1135235 643527 98550 74789 538106 1111545 1541496 1664214
35589 1664214 1395508 1056963 1266856 2134915 2914555 2841018 2045792 1254165 800865 406056
35579 406056 -139262 -531241 -362092 289416 892232 1012155 688722 303928 216380 531800
35569 531800 1058799 1377683 1109860 337009 -326286 -333219 144877 441621 267307 21582
35559 21582 158476 602375 976477 1089398 953651 591980 114341 -186975 -86266 301501
$$ packed form
35627C221357M48431q08805j044988m63873j63801m27594m41336J01823L00767
35618G21981l71626r16900l50582N29154L40985n46857n46520N48004J241830
35609F49469P48389J8427r0509r0582n57413r11714m86438K31283M39124K92708
35599B42744L56432M53573Q2486m91708n44977k3761M63317N73439M29951J22718
35589A664214k68706l38545K09893Q68059P79640p3537p95226p91627m53300l94809
35579D06056n45318l91979J69149O51508O02816J19923l23433l84794q7548L15420
35569E31800N26999L18884k67823p72851o63295o933M78096K96744j74314k45725
35559B1582J36894M43899L74102J12921j35747l61671m77639l01316J00709L87767
$$ plain form
35549 301501 624682 590618 174125 -258057 -119120 704427 1397405 1054331 43351 -217829
35539 -217829 860469 2178925 2470075 1891365 1346886 917417 5271 -1337311 -2310184
35530 -2310184 -2498770 -2169330 -1497222 -473152 367922 162470 -998645 -1852060 -1473889
35521 -1473889 -358252 425668 542542 379713 254007 208390 289924 501545 618058 435957
35511 435957 103261 -92934 -157316 -320490 -590786 -634914 -203998 413459 519423 -257931
35501 -257931 -1395804 -1951450 -1718839 -1492303 -1855397 -2198986 -1611250 -427514 22529
35492 22529 -749924 -1715169 -1798923 -1251926 -1023073 -1360308 -1712585 -1712191 -1566522 -1485935 -1253305
35481 -1253305 -564876 435217 1162293 1141000 491589 -207678 -545919 -608570 -623294 -573130
$$ packed form
35549C01501L23181l4064m16493m32182J38937Q23547O92978l43074j010980k61180
35539b17829J078298J318456K91150n78710n44479m29469r12146j342582r72873
35530b310184j88586L29440O72108J024070Q41074k05452j161115q53415L78171
35521a473889J115637P83920J16874j62829j25706m5617Q1534K11621J16513j82101
35511D35957l32696j96195o4382j63174k70296m4128M30916O17457J05964p77354
35501b57931j137873n55646K32611K26536l63094l43589N87736J183736M50043
35492B2529p72453r65245q3754N46997K28853l37235l52277L94J45669Q0587K32630
35481a253305O88429J000093P27076k1293o49411o99267l38241o2651j4724N0164
$$ plain form
35471 -573130 -405163 -315634 -421089 -402877 626 352367 14593 -795495 -1159674 -718848
35461 -718848 -77530 167970 79143 -132824 -481633 -754575 -486688 139749 147985 -826031
35451 -826031 -1674476 -1218883 31847 510851 -255543 -1144135 -1141124 -610292 -485072 -883527
35441 -883527 -1108710 -741178 -190299 -84665 -405619 -486720 82319 782182 715343 -199991
35431 -199991 -1018837 -942470 -297639 14481 -268284 -606879 -590635 -504309 -840358 -1578443
35421 -1578443 -2149964 -2013258 -1186499 -254236 172009 43984 -128195 109582 671120
35412 671120 1091423 993824 339738 -561174 -1185910 -1188896 -805454 -618880 -775269 -762400
35402 -762400 -244205 244371 -57512 -954185 -1356221 -659842 436051 853841 573946
$$ packed form
35471e73130J67967Q9529j05455J8212M03503L51741l37774q10088l64179M40826
35461g18848O41318K45500q8827k11967l48809k72942K67887O26437Q236r74016
35451h26031q48445M55593J250730M79004p66394q88592L011N30832J25220l98455
35441h83527k25183L67532N50879J05634l20954q1101N69039O99863o6839r15334
35431a99991q18846P6367O44831L12120k82765l38595J6244Q6326l36049p38085
35421a578443n71521J36706Q26759R32263M26245j28025j72179K37777N61538
35412F71120M20303r7599o54086r00912o24736k986L83442J86574j56389J2869
35402g62400N18195M88576l01883q96673m02036O96379J095893M17790k79895
$$ plain form
35393 573946 596358 1424773 2182506 1744216 422808 -288968 228742 828990 326958 -675191
35383 -675191 -715068 231657 678308 -113542 -1087840 -1040837 -207408 471775 756672 944692
35373 944692 991438 711709 405756 412068 355480 -325838 -1334964 -1817412 -1587180 -1288436
35363 -1288436 -1373725 -1620655 -1685963 -1516091 -1151465 -651437 -238844 -48667 216786 881792
35353 881792 1629227 1808114 1372933 920591 773099 639877 300963 29490 99914 324214
35343 324214 325444 -1493 -412566 -478561 101565 1024251 1361740 509651 -887051 -1461348
35333 -1461348 -616172 927595 2034428 2146756 1447312 572333 165345 237137 47350
35324 47350 -870467 -1791268 -1653501 -668746 -120944 -523381 -1010031 -792935 -178919 271274
$$ packed form
35393E73946K2412Q28415P57733m38290j321408p11776N17710O00248n02032j002149
35383f75191l9877R46725M46651p91850r74298M7003Q33429O79183K84897J88020
35373I44692M6746k79729l05953O312n6588o81318j009126m82448K30232K98744
35363a288436q5289k46930o5308J69872L64626N00028M12593J90177K65453O65006
35353H81792P47435J78887m35181m52342j47492j33222l38914k71473P0424K24300
35343C24214J230l26937m11073o5995N80126R22686L37489q52089j396702n74297
35333a461348Q45176J543767J106833J12328o99444q74979m06988P1792j89787
35324D7350r17817r20801J37767R84755N47802m02437m86650K17096O14016M50193
$$ plain form
35314 271274 577902 780962 519165 -129917 -294542 377966 878591 252687 -889269
35305 -889269 -1352017 -1179562 -1239503 -1491731 -1142267 -341420 -194341 -909719 -1386169 -1066230
35295 -1066230 -832328 -1357668 -1811944 -1238681 -265215 -162046 -735808 -533913 896400
35286 896400 2199888 2048417 869745 111692 303256 572638 5889 -1121429 -1739817
35277 -1739817 -1324192 -434329 114895 238852 421867 809049 991917 755348 516007
35268 516007 738382 1294149 1728231 1846191 1687298 1230540 573862 149946 246976 493408
35258 493408 368991 74797 232524 768709 878628 267442 -349088 -352807 -135293 -362280
35248 -362280 -888334 -1079208 -858570 -732191 -932288 -1168815 -1191213 -1071430 -922931 -770355
$$ packed form
35314B71274L06628K03060k61797o49082j64625O72508N00625o25904j141956
35305h89269m62748J72455n9941k52228L49464Q00847J47079p15378m76450L19939
35295a066230K33902n25340m54276N73263R73466J03169n73762K01895J430313
35286H96400J303488j51471j178672p58053J91564K69382n66749j127318o18388
35277a739817M15625Q89863N49224J23957J83015L87182J82868k36569k39341
35268E16007K22375N55767M34082J17960j58893m56758o56678m23916R7030K46432
35258D93408j24417k94194J57727N36185J09919o11186o16530l719K17514k26987
35248c62280n26054j90874K20638J26379k00097k36527k2398J19783J48499J52576
$$ plain form
35238 -770355 -703598 -807268 -964575 -1002900 -882419 -466895 554929 2044268 3066078
35229 3066078 2854665 1900506 1321142 1320289 1146759 514021 35890 84573 235404 201401
35219 201401 361619 878708 1194961 1003353 880397 1256449 1534444 1036985 143405 -392881
35209 -392881 -639755 -1028618 -1247670 -717610 160344 392944 -89405 -396508 -147726 89232
35199 89232 -50069 -161511 59534 277952 213669 136648 302541 532474 690325 982130
35189 982130 1445082 1693763 1516292 1218215 1052336 805477 299982 -157874 -209184 58108
35179 58108 371767 665306 877818 731696 96364 -679887 -1132683 -1185637 -1054099 -859995
35169 -859995 -576201 -201703 151669 228406 -252410 -1129722 -1544903 -721248 887296 1836035
$$ packed form
35238g70355O6757j03670j57307l8325J20481M15524J021824J489339J021810
35229C066078k11413r54159n79364q53j73530o32738m78131M8683J50831l4003
35219B01401J60218N17089L16253j91608j22956L76052K77995m97459q93580n36286
35209c92881k46874l88863k19052N30060Q77954K32600m82349l07103K48782K36958
35199H9232j39301j11442K21045K18418o4283p7021J65893K29933J57851K91805
35189I82130M62952K48681j77471k98077j65879k46859n05495m57856n1310K67292
35179E8108L13659K93539K12512j46122o35332p76251m52796n2954J31538J94104
35169h59995K83794L74498L53372P6737m80816q77312m15181Q23655J608544R48739
$$ plain form
35159 1836035 1383885 417344 268768 1064475 1791653 1740660 1284187 1200287 1638185 1957192
35149 1957192 1507890 460081 -284859 -95478 679764 1251737 1386021 1389344 1294376 761719
35139 761719 -136839 -745266 -698604 -382326 -215555 -38237 406431 872214 922608 463081
35129 463081 -386566 -1512267 -2490421 -2509068 -1183157 771519 2143791 2360930 1724384
35120 1724384 826222 159462 58438 507281 1039584 1174158 930652 697688 691765 765846
35110 765846 680853 411585 222533 430776 955165 1229740 881362 340171 286959 627017
35100 627017 694211 434324 514179 1088928 1420346 1121713 840350 1109420 1407767 1127177
35090 1127177 681755 735652 974082 660969 -60873 -479535 -583087 -947347 -1542595 -1708380
$$ packed form
35159A836035m52150r66541j48576P95707P27178n0993m56473q3900M37898L19007
35149A957192m49302j047809p44940J89381P75242N71973J34284L323r4968n32657
35139G61719q98558o08427M6662L16278J66771J77318M44668M65783N0394m59527
35129D63081q49647j125701r78154j8647J325911J954676J372272K17139o36546
35120A724384q98162o66760j01024M48843N32303J34574k43506k32964n923P4081
35110G65846q4993k69268j89052K08243N24389K74575l48378n41191n3212L40058
35100F27017O7194k59887P9855N74749L31418k98633k81363K69070K98347k80590
35090A127177m45422N3897K38430l13113p21842m18662j03552l64260n95248j65785
$$ plain form
35080 -1708380 -1300645 -913145 -887146 -930033 -784037 -502316 -23068 742828 1345739 1142958
35070 1142958 341334 -114041 122943 394901 246910 186415 743132 1466856 1513425 818592
35060 818592 92564 -128173 68007 336042 470647 438487 312952 261552 465891 956151
35050 956151 1500270 1700111 1323613 579809 -75988 -435602 -620657 -660794 -370045 211371
35040 211371 683218 851328 1001629 1308282 1453373 1234827 1030998 1136038 1150681 678579
35030 678579 132936 73626 179023 -204841 -801226 -705876 162855 912058 1006319 844261
35020 844261 905297 1157912 1455147 1755917 1823301 1412348 834331 619686 607727 181839
35010 181839 -553350 -736713 -51465 806960 1158797 1001490 496717 -262038 -742352 -250474
$$ packed form
35080a708380M07735L87500K5999m2887J45996K81721M79248P65896O02911k02781
35070A142958q01624m55375K36984K71958j47991o0495N56717P23724M6569o94833
35060H18592p26028k20737J96180K68035J34605l2160j25535n1400K04339M90260
35050I56151N44119J99841l76498p43804o55797l59614j85055m0137K90749N81416
35040B11371M71847J68110J50301L06653J45091k18546k03829J05040J4643m72102
35030F78579n45643n9310J05397l83864n96385R5350Q68731P49203R4261j62058
35020H44261O1036K52615K97235L00770O7384m10953n78017k14645j1959m25888
35010A81839p35189j83363O85248Q58425L51837j57307n04773p58755m80314M91878
$$ plain form
35000 -250474 890986 1395907 706945 -269988 -608689 -597512 -910478 -1432263 -1675056 -1659745
34990 -1659745 -1628995 -1476981 -1153928 -1064786 -1391896 -1580584 -1175095 -623351 -568794 -880127
34980 -880127 -1087021 -1231515 -1503083 -1519384 -831204 193315 771234 706026 321519 -201666
34970 -201666 -683849 -586443 306645 1178131 1099817 431796 302070 829011 961460 182800
34960 182800 -706419 -858535 -516053 -361982 -444631 -391119 -249277 -438034 -980682 -1332282
34950 -1332282 -1079812 -487352 -136658 -169006 -150692 287998 1004111 1737605 2575052 3517391
34940 3517391 3871146 2867542 917316 -566701 -810186 -359795 109775 707925 1541769
34931 1541769 2002362 1656895 1068022 822228 477720 -454026 -1148009 -436345 1208592
$$ packed form
35000b50474J141460N04921o88962r76933l38701J1177l12966n21785k42793J5311
34990a659745L0750J52014L23053Q9142l27110j88688M05489N51744N4557l11333
34980h80127k06894j44494k71568j6301O88180J024519N77919o5208l84507n23185
34970b01666m82183R7406Q93088Q71486p8314o68021j29726N26941J32449p78660
34960A82800q89219j52116L42482J54071q2649N3512J41842j88757n42648l51600
34950a332282K52470N92460L50694l2348J8314M38690P16113P33494Q37447R42339
34940C517391L53755j003604j950226j484017k43485M50391M69570N98150Q33844
34931A541769M60593l45467n88873k45794l44508r31746o93983P11664J644937
$$ plain form
34922 1208592 2081991 1608511 947919 1057701 1459532 1404494 1125175 1196148 1440735 1255454
34912 1255454 576857 -106542 -449803 -511261 -504353 -597398 -816224 -983488 -905504 -638474
34902 -638474 -343545 36808 593954 1040825 975419 534800 249185 207861 -54168 -723851
34892 -723851 -1341518 -1454730 -1112602 -509661 312224 1131348 1450596 1122925 673451 625485
34882 625485 839332 878606 729988 752212 1077207 1406658 1349534 786011 -11049 -545544
34872 -545544 -574862 -452114 -699222 -1187927 -1182191 -407224 392387 386869 -192203 -410762
34862 -410762 12043 374902 168526 -56949 484213 1468548 1673443 608426 -749424
34853 -749424 -1244302 -994678 -892519 -1052392 -711598 360819 1373768 1733729 1837397
$$ packed form
34922A208592Q73399m73480o60592J09782M01831n5038k79319P0973K44587j85281
34912A255454o78597o83399l43261o1458O908r3045k18826j67264P7984K67030
34902f38474K94929L80353N57146M46871o5406m40619k85615m1324k62029o69683
34892g23851o17667j13212L42128O02941Q21885Q19124L19248l27671m49474m7966
34882F25485K13847L9274j48618K2224L24995L29451n7124n63523p97060n34495
34872e45544k9318J22748k47108m88705N736P74967P99611n518n79072k18559
34862d10762M22805L62859k06376k25475N41162R84335K04895j065017j357850
34853g49424m94878K49624J02159j59873L40794J072417J012949L59961J03668
$$ plain form
34844 1837397 2154536 2366143 2088927 1711396 1680418 1564938 757099 -366371 -962844
34835 -962844 -1046445 -1281868 -1719706 -1789933 -1411180 -1060947 -819458 -398766 -77511 -460283
34825 -460283 -1224344 -1286664 -439279 350087 573652 886670 1668654 2101905 1486288 502269
34815 502269 260741 795160 1326510 1461252 1371163 1251888 1248754 1483136 1649417 1149828
34805 1149828 137332 -270108 538758 1683428 2041548 1802690 1858331 2225460 2147348
34796 2147348 1417241 563620 -87298 -581723 -731577 -296523 286768 281224 -212413 -349712
34786 -349712 155043 654364 632767 345422 172367 76016 4132 184741 654921 1008883
34776 1008883 965625 773449 744320 757204 527179 74099 -339669 -508721 -344804 108720
$$ packed form
34844A837397L17139K11607k77216l77531l0978j15480q07839j123470n96473
34835i62844q3601k35423m37838p0227L78753L50233K41489M20692L21255l82772
34825d60283p64061o2320Q47385P89366K23565L13018P81984M33251o15617r84019
34815E02269k41528N34419N31350J34742r0089j19275l134K34382J66281m99589
34805A149828j012496m07440Q08866J144670L58120k38858N5641L67129p8112
34796B147348p30107q53621o50918m94425j49854M35054N83291n544m93637j37299
34786c49712N04755M99321k1597k87345j73055r6351p1884J80609M70180L53962
34776A008883m3258j92176k9129J2884k30025m53080m13768j69052J63917M53524
$$ plain form
34766 108720 554486 587455 165754 -228488 -41818 831464 1971709 2693279 2455079 1340823
34756 1340823 163085 -223927 214365 771927 911876 711623 378292 -157003 -901432
34747 -901432 -1476259 -1512627 -1133024 -705089 -311922 194157 774149 1224468 1532306 1797936
34737 1797936 1801900 1117938 -147748 -1130186 -1086800 -291783 333401 355079 153233 144775
34727 144775 223189 169686 119771 218864 176089 -319697 -920017 -879529 21311 1220995
34717 1220995 1999560 1974865 1108465 -231932 -1212676 -1133288 -266186 361472 183774 -327662
34707 -327662 -406006 181610 1179414 2170975 2649889 2307454 1521257 1051801 1019558 780310
34697 780310 94687 -325142 50578 594641 398571 -417191 -1049571 -1245040 -1352969 -1463014
$$ packed form
34766A08720M45766L2969m21701l94242J86670Q73282J140245P21570k38200j114256
34756A340823j177738l87012M38292N57562J39949k00253l33331n35295p44429
34747i01432n74827l6368L79603M27935L93167N06079N79992M50319L07838K65630
34737A797936L964o83962j265686r82438M3386P95017O25184K1678k01846q458
34727A44775P8414n3503m9915R9093m2775m95786o00320M0488R00840J199684
34717A220995P78565k4695q66400j340397r80744P9388Q67102O27658j77698n11436
34707c27662p8344N87616R97804R91561M78914l42435p86197m69456l2243k39248
34697G80310o85623m19829L75720N44063j96070q15762o32380j95469j07929j10045
$$ plain form
34687 -1463014 -1385426 -1337256 -1739224 -2296789 -2125213 -994379 221413 590637 111144
34678 111144 -557704 -887945 -769355 -366447 38038 208267 81381 -314322 -925270 -1498110
34668 -1498110 -1611179 -1222603 -943439 -1315826 -1987063 -2069760 -1195865 228887 1617897
34659 1617897 2491707 2364420 1095773 -564120 -1437301 -1145158 -427745 -124872 -299746
34650 -299746 -502922 -447983 -214476 -90778 -350700 -951400 -1436461 -1369106 -776877 54692
34640 54692 951470 1649689 1646809 893678 264310 491222 924030 408594 -741022 -956069
34630 -956069 206405 1280362 1071011 324424 288841 703538 478350 -331568 -622817
34621 -622817 -44784 588731 724821 774358 1128986 1421635 1207208 688130 268903 -125798
$$ packed form
34687a463014P7588M8170m01968n57565J71576J130834J215792L69224m79493
34678A11144o68848l30241J18590M02908M04485J70229j26886l95703o10948n72840
34668a498110j13069L88576K79164l72387o71237q2697Q73895J424752J389010
34659A617897Q73810j27287j268647j659893q73181K92143P17413L02873j74874
34650b99746k03176N4939K33507J23698k59922o00700m85061O7355N92229Q31569
34640E4692Q96778O98219k880p53131o29368K26912M32808n15436j149616k15047
34630i56069J162474J073957k09351p46587l5583M14697k25188q09918k91249
34621f22817N78033O33515J36090M9537L54628K92649k14427n19078m19227l94701
$$ plain form
34611 -125798 -774216 -1479533 -1665285 -1120771 -338563 -26685 -390796 -953772 -1094223 -744122
34601 -744122 -442493 -637688 -1114940 -1310607 -1042387 -611985 -226465 293795 1077703 1781497
34591 1781497 1907336 1449975 965594 973565 1461425 2007120 2199827 1846230 966341 -163936
34581 -163936 -1025245 -1185574 -712756 -113246 183772 151947 21391 63565 520792 1381386
34571 1381386 2093403 1891916 683910 -683397 -1285964 -950674 -23460 1163003 2136148
34562 2136148 2153010 1023673 -201840 -233846 807616 1540089 1142855 185683 -533999
34553 -533999 -1070221 -1770211 -2361063 -2264042 -1466857 -562814 -122266 -329649 -969462 -1509957
34543 -1509957 -1506696 -1141550 -996704 -1123359 -882262 -28774 675227 494439 -171715 -445140
$$ packed form
34611a25798o48418p05317j85752N44514P82208L11878l64111n62976j40451L50101
34601g44122L01629j95195m77252j95667K68220M30402L85520N20260P83908P03794
34591A781497J25839m57361m84381P971M87860N45695J92707l53597q79889j130277
34581a63936q61309j60329M72818N99510K97018l1825j30556M2174M57227Q60594
34571A381386P12017k01487j208006j367307o02567L35290R27214J186463R73145
34562B136148J6862j129337j225513l2006J041462P32473l97234r57172p19682
34553e33999n36222o99990n90852R7021P97185R04043M40548k07383o39813n40495
34543a509957L261L65146J44846j26655K41097Q53488P04001j80788o66154k73425
$$ plain form
34533 -445140 -346279 -636028 -1413127 -1797535 -1229422 -347483 -149526 -727592 -1288442 -1222176
34523 -1222176 -750712 -497776 -648115 -702119 -125844 847686 1348235 949963 318304 378388
34513 378388 1001764 1097366 139203 -956756 -922898 199288 1052816 616445 -633556
34504 -633556 -1403341 -1033259 51443 1054513 1509067 1346561 747635 49995 -513352
34495 -513352 -1075219 -1843194 -2542956 -2597770 -1960645 -1240271 -796560 -321711 327015 579006
34485 579006 76584 -447023 -80982 856557 1273257 950665 728939 1067406 1444792 1399535
34475 1399535 1249225 1405528 1688785 1701183 1352715 799681 378491 638702 1728672
34466 1728672 2700728 2334616 850453 -187060 400 462695 254174 -48026 526486
$$ packed form
34533d45140R8861k89749p77099l84408N68113Q81939J97957n78066n60850O6266
34523a222176M71464K52936j50339n4004N76275R73530N00549l98272o31659O0084
34513C78388O23376R5602r58163j095959L3858J122186Q53528m36371j250001
34504f33556p69785L70082J084702J003070M54554j62506n98926o97640n63347
34495e13352n61867p67975o99762n4814O37125P20374M43711M74849O48726K51991
34485E79006n02422n23607L66041R37539M16700l22592k21726L38467L77386m5257
34475A399535j50310J56303K83257J2398l48468n53034m21190K60211J089970
34466A728672R72056l66112j484163j037513J87460M62295k08521l02200N74512
$$ plain form
34457 526486 1645026 2248254 2174628 2024239 1835540 1144810 221959 44852 855436 1679242
34447 1679242 1602516 865105 379053 635880 1351037 1866675 1708611 932640 32250 -528568
34437 -528568 -608583 -255392 362348 778761 461763 -490238 -1303676 -1475277 -1294318 -1121543
34427 -1121543 -775930 -142663 239644 -93970 -701744 -870481 -684225 -705890 -962561 -1065838
34417 -1065838 -1062920 -1332821 -1808046 -2054679 -1957136 -1642228 -1014258 -136500 278284 -291118
34407 -291118 -1109337 -1007792 -103101 422857 162855 -142831 -142402 -409872 -1057166 -1122820
34397 -1122820 -62485 1196132 1527404 1141600 985236 1218532 1197593 638995 -17653
34388 -17653 -328013 -355049 -470660 -964913 -1770984 -2399419 -2331779 -1604493 -750871 -116687
$$ packed form
34457E26486J118540O03228p3626j50389j88699o90730r22851j77107Q10584Q23806
34447A679242p6726p37411m86052K56827P15157N15638j58064p75971r00390n60818
34437e28568q0015L53191O17740M16413l16998r52001q13438j71601J80959J72775
34427a121543L45613O33267L82307l33614o07774j68737J86256k1665k56671j03277
34417a065838K918k69901m75225k46633R7543L14908O27970Q77758M14784n69402
34407b91118q18219J01545R04691N25958k60002l05686M29k67470o47294o5654
34397a122820J060335J258617L31272l85804j56364K33296k0939n58598o56648
34388a7653l10360k7036j15611m94253q06071o28435O7640P27286Q53622O34184
$$ plain form
34378 -116687 372387 702562 590111 53135 -348164 -190127 289610 654329 874482 1148673
34368 1148673 1450363 1573961 1401139 937764 358691 87599 396423 803774 410109
34359 410109 -918942 -2209469 -2498030 -1792615 -640135 652264 1885942 2582294 2361708
34350 2361708 1492052 619930 132933 34199 111573 -22636 -620633 -1229859 -971896 198987
34340 198987 1101207 763840 -263704 -705592 -191446 656339 1329839 1723580 1604921
34331 1604921 805874 -113816 -338783 29138 176831 2793 270369 1070678 1280050
34322 1280050 217114 -1106011 -1315909 -614464 -336461 -915675 -1397077 -1002652 -192836
34313 -192836 176307 45332 25636 476056 1116859 1392022 1001903 232612 -173442 271694
$$ packed form
34378a16687M89074L30175j12451n36976m01299J58037M79737L64719K20153K74191
34368A148673L01690J23598j72822m63375n79073k71092L08824M07351l93665
34359D10109j329051j290527k88561P05415J152480J292399J233678O96352k20586
34350B361708q69656q72122m86997r8734P7374j34209n97997o09226K57963J170883
34340A98987R02220l37367j027544m41888N14146Q47785O73500L93741j18659
34331A604921p99047r19690k24967L67921J47693j74038K67576Q00309K09372
34322A280050j062936j323125k09898P01445K78003n79214m81402L94425Q09816
34313a92836L69143j30975j9696M50420O40803K75163l90119p69291m06054M45136
$$ plain form
34303 271694 1181134 1722846 1691733 1661292 1964892 2190644 2027041 1896944 2133767 2167238
34293 2167238 1415301 541902 737593 1888445 2591968 2132936 1375175 1342385 1877898
34284 1877898 2223535 2120499 1762528 1324488 1084499 1400769 2059110 2279182 1863240
34275 1863240 1596218 1909284 1993858 1092395 -107349 -431200 17213 203131 -147202
34266 -147202 -398992 -297634 -197001 -101759 334267 821971 596194 -268793 -753362 -362602
34256 -362602 221334 226436 -306457 -948086 -1389382 -1275676 -338317 994466 1807301 1776757
34246 1776757 1431133 1239288 1177480 1283541 1758168 2284976 2101954 1060065 -127999
34237 -127999 -906323 -1355352 -1502886 -1105518 -395921 -71333 -161430 121305 975003 1480654
$$ packed form
34303B71694R09440N41712l1113l0441L03600K25752j63603j30097K36823L3471
34293B167238p51937q73399J95691J150852P03523m59032p57761l2790N35513
34284A877898L45637j03036l57971m38040k39989L16270O58341K20072m15942
34275A863240k67022L13066Q4574r01463j199744l23851M48413J85918l50333
34266a47202k51790J01358J00633R5242M36026M87704k25777q64987m84569L90760
34256c62602N83936N102n32893o41629m41296J13706R37359J332783Q12835l0544
34246A776757l45624j91845o1808J06061M74627N26808j83022j041889j188064
34237a27999p78324m49029j47534L97368P09597L24588r0097K82735Q53698N05651
$$ plain form
34227 1480654 1053731 418994 397764 603316 187881 -802079 -1634413 -1904941 -1641343 -930457
34217 -930457 -94262 280321 77129 -110602 43328 81306 -233287 -236397 550901 1463530
34207 1463530 1733995 1753019 2218996 2657593 2070452 753568 173392 966320 2102656
34198 2102656 2261336 1275908 6770 -648992 -441157 148955 413961 198063 3198
34189 3198 133236 149890 -412731 -1202091 -1455439 -968754 -177294 441468 602344 205604
34179 205604 -418699 -622465 -289878 -164583 -770578 -1457164 -1232880 -217328 516947
34170 516947 389525 -107089 -208135 331360 1198460 1778806 1523078 515824 -386069
34161 -386069 -390256 302952 727616 239499 -863807 -1720202 -1752155 -1246830 -1068042 -1562220
$$ packed form
34227A480654m26923o34737k1230K05552m15435r89960q32334k70528K63598P10886
34217i30457Q36195L74583k03192j87731J53930L7978l14593l110P87298R12629
34207A463530K70465J9024M65977M38597n87141j316884n80176P92928J136336
34198B102656J58680r85428j269138o55762K07835N90112K65006k15898j94865
34189C198J30038J6654n62621p89360k53348M86685P91460O18762J60876l96740
34179B05604o24303k03766L32587J25295o05995o86586K24284J015552P34275
34170E16947j27422m96614j01046N39495Q67100N80346k55728j007254r01893
34161c86069m187O93208M24664m88117j103306q56395l1953N05325J78788m94178
$$ plain form
34151 -1562220 -1957261 -1377166 -239889 203863 -304088 -685517 -197048 617071 996441
34142 996441 935283 645869 131680 -201230 338934 1390963 1544150 423118 -535433
34133 -535433 -312619 83235 -522033 -1344740 -997670 79753 355058 -306053 -673669
34124 -673669 -299598 51745 -41137 -173338 -155324 -250605 -382253 -191209 193259 377511
34114 377511 465333 718954 863875 644583 529058 861385 975322 295261 -403252 -144439
34104 -144439 558659 630953 357252 738975 1525414 1669736 1309364 1436956 1892514 1584413
34094 1584413 578891 90488 398516 582395 351917 329361 458093 -3358 -759253
34085 -759253 -648494 207002 331866 -636466 -1289891 -789270 -59680 8941 -129665 80355
$$ packed form
34151a562220l95041N80095J137277M43752n07951l81429M88469Q14119L79370
34142I96441o1158k89414n14189l32910N40164J052029J53187j121032r58551
34133e35433K22814L95854o05268q22707L47070J077423K75305o61111l67616
34124f73669L74071L51343r2882j32201J8014r5281j31648J91044L84468J84252
34114C77511Q7822K53621J44921k19292j15525L32327J13937o80061o98513K58813
34104a44439P03098P2294k73701L81723P86439J44322l60372J27592M55558l08101
34094A584413j005522m88403L08028J83879k30478k2556J28732m61451p55895
34085g59253J10759Q55496J24864r68332o53425N00621P29590O8621j38606K10020
$$ plain form
34075 80355 271320 154463 218315 715154 1134823 1230598 1392920 1617088 1399679 1012165
34065 1012165 1425280 2508533 2811157 1744718 541983 334598 610807 361375 -406815
34056 -406815 -1062887 -1298938 -1095557 -576508 -222513 -361858 -390726 421858 1441182 1370693
34046 1370693 443523 305096 1494846 2662053 2661049 1908484 1256597 944903 1019255 1417394
34036 1417394 1394470 231754 -1390123 -2151356 -2111246 -2314196 -2597916 -1800938 -117353
34027 -117353 891451 744540 384318 46919 -892130 -1864226 -1425190 106679 861540
34018 861540 521168 544037 1078322 678438 -448112 -201701 1560286 2244943 746445
34009 746445 -783802 -728332 -362685 -870713 -1126574 -244995 536848 337318 301414 1118503
$$ packed form
34075H0355J90965j16857O3852M96839M19669R5775J62322K24168k17409l87514
34065A012165M13115J083253L02624j066439j202735k07385K76209k49432p68190
34056d06815o56072k36051K03381N19049L53995j39345k8868Q12584J019324p0489
34046A370693r27170j38427J189750J167207j004p52565o51887l11694P4352L98139
34036A417394k2924j162716j621877p61233M0110k02950k83720P96978J683585
34027a17353J008804j46911l60222l37399r39049r72096M39036J531869P54861
34018H61540l40372K2869N34285l99884j126550K46411J761987O84657j498498
34009G46445j530247N5470L65647n08028k55861Q81579P81843j99530l5904Q17089
$$ plain form
33999 1118503 1527339 846681 285428 324700 -307629 -1715400 -2031952 -870341 -190514
33990 -190514 -432707 391405 2317539 2481644 421468 -322926 1728441 3150369 1678973
33981 1678973 201105 1290956 2628497 1733845 562921 1202434 1602637 64579 -606345
33972 -606345 1785989 4070232 3096398 1414574 2304844 3659841 2439990 732870 1467098
33963 1467098 2580996 1564208 1112290 3804170 6078357 4412285 2326902 3872410
33955 3872410 5745091 3986415 2496692 5810828 9722107 9126114 8393097 12716631
33947 12716631 16722919 14754691 14195839 23067312 33416463 35900649 40963751 61423787
33939 61423787 84693007 96484309 126070768 219945576 356974770 437446401 390373165
$$ packed form
33999A118503M08836o80658n61253L9272o32329j407771l16552J161611O79827
33990a90514k42193Q24112J926134J64105k060176p44394K051367J421928j471396
33981A678973j477868J089851J337541q94652j170924O39513M00203j538058o70924
33972f06345K392334K284243r73834j681824Q90270J354997j219851j707120P34228
33963A467098J113898j016788m51918K691880K274187j666072k085383J545508
33955C872410J872681j758676j489723L314136L911279n95993p33017M323534
33947A2716631M006288j968228n58852Q871473J0349151K484186N063102K0460036
33939F1423787K3269220J1791302K9586459R3874808J37029194Q0471631m7073236
$$ plain form
33932 390373165 260246279 150726389 106700629 93317906 73268318 52215417 44790856
33925 44790856 42177201 32274519 22148942 21365616 23257129 18725646 12663314 12565996
33917 12565996 14115505 10846523 6781775 7660669 9477296 6747452 3426269 5123922
33909 5123922 8193101 6609383 2921962 2746731 4355234 2999650 358181 759470
33901 759470 2506263 1441470 -757838 95143 2544514 2355084 485705 828375 2633629
33892 2633629 2293757 448843 539786 2153935 2215260 1146433 1722076 3248586 2805049
33883 2805049 1070724 1246647 3132553 3609601 2184896 1053775 537405 -640646 -1419407
33874 -1419407 313315 3127450 3486941 1303876 -415248 -877204 -1882752 -3357532
$$ packed form
33932C90373165j30126886j09519890m4025760j3382723k0049588k1052901p424561
33925D4790856k613655r902682j0125577p83326J891513m531483o062332r7318
33917A2565996J549509l268982m064748Q78894J816627k729844l321183J697653
33909E123922L069179j583718l687421j75231J608503j355584k641469M01289
33901G59470J746793j064793k199308Q52981K449371j89430j869379L42670J805254
33892B633629l39872j844914R0943J614149O1325j068827N75643J526510m43537
33883B805049j734325J75923J885906M77048j424705j131121n16370j178051p78761
33874a419407J732722K814135L59491k183065j719124m61956j005548j474780
$$ plain form
33866 -3357532 -3186626 -1497685 -723085 -1248963 -1111450 -110987 -108901 -1010132 -571018
33857 -571018 1304108 2031250 790011 -243747 92155 295168 -463393 -736238 268767
33848 268767 1173800 1076551 1028260 1714224 2102369 1499786 774008 603346 532039 463237
33838 463237 1062516 2087085 2352063 1864922 1917860 2617861 2528884 1293999 340107 283214
33828 283214 -121658 -1553093 -2736387 -2529512 -1601673 -1006372 -634116 -22982 629658
33819 629658 1031487 1202651 866673 -329193 -1714605 -2075467 -1430916 -914087 -817615
33810 -817615 -377081 432573 707954 427954 567502 1100693 841929 -296508 -888614
33801 -888614 -409957 -69091 -503069 -637617 218472 1025752 864379 429346 491674 414317
$$ packed form
33866c357532J70906J688941P74600n25878J37513J000463K086r01231M39114
33857e71018J875126P27142j241239j033758L35902K03013p58561k72845J005005
33848B68767R05033r7249m8291O85964L88145o02583p25778j70662p1307o8802
33838D63237N99279J024569K64978m87141N2938P00001q8977j234885r53892n6893
33828B83214m04872j431435j183294K06875R27839N95301L72256O11134O52640
33819F29658M01829J71164l35978j195866j385412l60862O44551N16829R6472
33810h17615M40534Q09654K75381k80000J39548N33191k58764j138437n92106
33801h88614M78657L40866m33978j34548Q56089Q07280j61373m35033O2328p7357
$$ plain form
33791 414317 -506945 -1524269 -1542715 -709350 191669 951543 1560341 1605167 1055585 796109
33781 796109 1438893 2345794 2610200 2259501 1801256 1382405 1073288 1183083 1619854 1670642
33771 1670642 997768 139151 -413816 -793904 -1014543 -641332 271660 899955 882755 891808
33761 891808 1384479 1756866 1390980 620444 -28682 -667092 -1391108 -1640182 -987321 90923
33751 90923 888856 1283624 1350106 919212 124119 -334071 -114445 184380 -47307 -504383
33741 -504383 -508285 49446 757060 1195769 1106175 584195 292848 823996 1727944 1956506
33731 1956506 1359089 810173 753149 733554 591680 853759 1498783 1588614 744475 -138528
33721 -138528 -299753 -159761 -305179 -507246 -471552 -536547 -888469 -1065913 -930385 -1070427
$$ packed form
33791D14317r21262j017324j8446Q33365R01019P59874O08798M4826n49582k59476
33781G96109O42784R06901K64406l50699m58245m18851l09117J09795M36771N0788
33771A670642o72874q58617n52967l80088k20639L73211R12992O28295j7200R053
33761H91808M92671L72387l65886p70536o49126o38410p24016k49074O52861J078244
33751I0923P97933L94768O6482m30894p95093m58190K19626K98825k31687m57076
33741e04383l902N57731P07614M38709q9594n21980k91347N31148R03948K28562
33731A956506n97417n48916n7024j9595j41874K62079O45024Q9831q44139q83003
33721a38528j61225J39992j45418k02067L5694o4995l51922j77444J35528j40042
$$ plain form
33711 -1070427 -1536836 -1371015 -276755 448573 -252078 -1509931 -1862852 -1299364 -729911
33702 -729911 -341093 129693 239043 -534964 -1503591 -1561308 -967263 -963447 -1765888 -2229699
33692 -2229699 -1566247 -318019 511498 484916 -167215 -818981 -876258 -459270 -428587 -1219929
33682 -1219929 -2073260 -2057350 -1360388 -768841 -362401 296710 1041938 1256875 1013400 1026595
33672 1026595 1442802 1577271 992142 84480 -564575 -820711 -827958 -696207 -493367 -236786
33662 -236786 111439 420027 344950 -200567 -769628 -894575 -629478 -297689 -19765 204745
33652 204745 302033 321479 472872 734922 861603 914230 1148235 1243966 590703 -342666
33642 -342666 -106305 1546849 2755085 1916572 -4483 -835684 -105493 849929 1172289
$$ packed form
33711a070427m66409J65821J094260P25328p00651j257853l52921N63488N69453
33702g29911L88818M70786J09350p74007r68627n7717N94045L816q02441m63811
33692b229699O63452J248228Q29517k6582o52131o51766n7277M16988L0683p91342
33682a219929q53331J5910O96962N91547M06440O59111P45228K14937k43475J3195
33672A026595M16207J34469n85129r07662o49055k56136p247J31751K02840K56581
33662b36786L48225L08588p5077n45517n69061j24947K65097L31789K77924K24510
33652B04745R7288J9446J51393K62050J26681N2627K34005R5731o53263r33369
33642c42666K36361J653154J208236q38513j921055q31201P30191R55422L22360
$$ plain form
33633 1172289 1288948 1547638 1515244 882671 -14481 -800504 -1331936 -1308516 -494393 585105
33623 585105 999099 571496 -44461 -463675 -942022 -1575491 -1924813 -1662998 -1010887 -370649
33613 -370649 26854 109528 36825 177161 582129 737300 340775 -62710 88044 331059
33603 331059 -125337 -991122 -1238884 -725138 -341725 -468646 -389245 418576 1351909 1547508
33593 1547508 1028288 511534 489038 851566 1165729 1118439 826328 692451 850399 1009815
33583 1009815 1040132 1234895 1633168 1678526 1129553 672056 856338 1069756 542911 -225982
33573 -225982 -256705 172791 -31744 -838976 -1075189 -356383 421117 698183 918997 1231939
33563 1231939 948500 -100640 -911096 -742443 -205149 -201043 -662950 -1039694 -1222334 -1279529
$$ packed form
33633A172289J16659K58690l2394o32573q97152p86023n31432K3420Q14123J079498
33623E85105M13994m27603o15957m19214m78347o33469l49322K61815O52111O40238
33613c70649L97503Q2674p2703J40336M04968J55171l96525m03485J50754K43015
33603C31059m56396q65785k47762N13746L83413j26921P9401Q07821R33333J95599
33593A547508n19220n16754k2496L62528L14163m7290k92111j33877J57948J59416
33583A009815L0317J94763L98273M5358n48973m57497J84282K13418n26845p68893
33573b25982l0723M29496k04535q07232k36213P18806P77500K77066K20814L12942
33563A231939k83439j049140q10456J68653N37294M106m61907l76744j82640n7195
$$ plain form
33553 -1279529 -992801 -368885 1233 -226762 -502916 -210760 337873 370632 -246055 -920651
33543 -920651 -1068851 -543635 347967 956777 798481 210459 73403 642233 1155023 874633
33533 874633 -10283 -834109 -1278861 -1403065 -1323268 -1215646 -1244427 -1259648 -994624 -681336
33523 -681336 -866086 -1435250 -1548211 -882550 -248625 -498164 -1404653 -2111380 -2190897 -1793804
33513 -1793804 -1195379 -662738 -431622 -438839 -341525 15666 494344 1044715 1639854 1810020
33503 1810020 1021553 -277392 -801525 29887 1398577 2219837 2208098 1562066 537398
33494 537398 -242378 -41586 829340 1050738 131362 -786275 -732867 -443993 -990634 -1830778
33484 -1830778 -1634372 -465870 328796 171106 -194464 -181285 -116590 -291170 -344433 -13783
$$ packed form
33553a279529K86728O23916L70118k27995k76154K92156N48633L2759o16687o74596
33543i20651j48200N25216Q91602O08810j58296n88022j37056N68830N12790k80390
33533H74633q84916q23826m44752j24204P9797J07622k8781j5221K65024L13288
33523f81336j84750n69164j12961O65661O33925k49539r06489p06727p9517L97093
33513a793804N98425N32641K31116p217R7314L57191M78678N50371N95139J70166
33503A810020p88467j298945n24133Q31412J368690Q21260j1739o46032j024668
33494E37398p79776K00792Q70926K21398r19376r17637N3408K88874n46641q40144
33484a830778J96406J168502P94666j57690l65570J3179O4695j74580n3263L30650
$$ plain form
33474 -13783 294644 120103 -397774 -817519 -970176 -980375 -973937 -949067 -832465 -636169
33464 -636169 -569161 -804629 -1100762 -1004697 -536653 -208182 -206295 -162710 9928 -189741
33454 -189741 -842727 -1079018 -292132 757778 899307 107913 -739774 -1204202 -1448756
33445 -1448756 -1450791 -1058155 -636278 -731293 -1219363 -1604636 -1916254 -2388841 -2508467 -1503340
33435 -1503340 230436 1291027 1025744 187898 -303922 -317317 -15487 608546 1316670
33426 1316670 1552956 1214039 851399 784587 669250 269389 -23885 132444 417874 345184
33416 345184 -91314 -624179 -1107971 -1357652 -1056365 -227515 568382 866422 797830 661856
33406 661856 390857 -158450 -689202 -707100 -175630 405684 542313 158829 -467397 -988836
$$ packed form
33474a3783L08427j74541n17877m19745j52657j0199O438K4870J16602J96296
33464f36169O7008k35468k96133R6065M68044L28471J887M3585J72638j99669
33454a89741o52986k36291P86886J049910J41529p91394q47687m64428k44554
33445a448756k035L92636M21877r5015m88070l85273l11618m72587j19626J005127
33435a503340J733776J060591k65283q37846m91820j3395L01830O24033P08124
33426A316670K36286l38917l62640o6812j15337l99861k93274J56329K85430p2690
33416C45184m36498n32865m83792k49681L01287Q28850P95897K98040o8592j35974
33406F61856k70999n49307n30752j7898N31470N81314J36629l83484o26226n21439
$$ plain form
33396 -988836 -1162604 -837460 59058 1300368 2165540 1894793 593418 -684081 -1094463
33387 -1094463 -892228 -778669 -857676 -860805 -944800 -1385745 -1759078 -1425126 -742988 -753264
33377 -753264 -1575432 -2190250 -2044215 -1774323 -1927413 -2063555 -1786536 -1642924 -2085735 -2368378
33367 -2368378 -1581839 -259882 257231 -149792 -201721 782226 1806731 1638547 547806
33358 547806 -112675 314580 1179906 1636773 1649727 1595343 1406893 735478 -236820 -846252
33348 -846252 -889391 -837169 -880555 -531485 329592 802614 222111 -550563 -204535 1005064
33338 1005064 1587718 1088363 667136 1153787 1854904 1888102 1538345 1449716 1379396 733954
33328 733954 -237465 -701461 -358213 381397 1002362 1131395 645952 118487 591911 2163489
$$ packed form
33396i88836j73768L25144Q96518J241310Q65172k70747j301375j277499m10382
33387a094463K02235J13559p9007l129q3995m40945l73333L33952O82138j0276
33377g53264q22168o14818J46035K69892j53090j36142K77019J43612m42811k82643
33367b368378P86539J321957N17113m07023n1929R83947J024505j68184j090741
33358E47806o60481M27255Q65326M56867J2954n4384j88450o71415r72298o09432
33348h46252m3139N2222m3386L49070Q61077M73022n80503p72674L46028J209599
33338A005064N82654m99355m21227M86651P01117L3198l49757q8629p0320o45442
33328G33954r71419m63996L43248P39610O20965J29033m85443n27465M73424J571578
$$ plain form
33318 2163489 3301559 2491478 259198 -1364372 -1243286 -132248 648486 637030 199027
33309 199027 -160468 -159957 117098 262296 39555 -181899 125843 860681 1406856 1452883
33299 1452883 1190515 779119 195578 -366912 -537877 -333236 -199623 -382231 -675378
33290 -675378 -866294 -970180 -946441 -657795 -238939 -65011 -216414 -375299 -340531 -205072
33280 -205072 42918 545985 1050609 964806 250059 -322023 -239440 -51230 -512696 -1330121
33270 -1330121 -1495982 -722610 217194 664980 874851 1296937 1649565 1335519 548145
33261 548145 244493 848675 1558403 1389440 556638 174919 636085 998939 321643 -955547
33251 -955547 -1536881 -911712 151639 714320 681138 531333 494685 350212 -113076 -714270
$$ packed form
33318B163489J138070q10081k232280j623570J21086J111038P80734j1456m38003
33309A99027l59495N11K77055J45198k22741k21454L07742P34838N46175M6027
33299A452883k62368m11396n83541n62490j70965K04641J33613j82608k93147
33290f75378j90916j03886K3739K88646M18856J73928j51403j58885L4768J35459
33280b05072K47990N03067N04624q5803p14747n72082Q2583J88210m61466q17425
33270a330121j65861P73372R39804M47786K09871M22086L52628l14046p87374
33261E48145l03652O04182P09728j68963q32802l81719M61166L62854o77296j277190
33251i55547n81334O25169J063351N62681l3182j49805l6648j44473m63288o01194
$$ plain form
33241 -714270 -1023767 -869048 -644215 -914949 -1607624 -1898204 -1250088 -300223 -153192 -867728
33231 -867728 -1305768 -659984 477155 923971 303877 -822847 -1842591 -2532034 -2794260
33222 -2794260 -2551920 -2001300 -1570139 -1437097 -1278858 -607281 706216 2212611 3118176
33213 3118176 2872161 1696798 436314 -257611 -419580 -319356 91763 832387 1305071
33204 1305071 807287 -354206 -1009346 -618024 97099 400464 667397 1530916 2489064
33195 2489064 2394739 1166723 -4892 -271400 -17717 112871 151234 248478 19839 -795127
33185 -795127 -1584937 -1593115 -1006140 -521938 -189640 382879 881732 460672 -816855 -1761441
33175 -1761441 -1654879 -1152415 -1089648 -1251889 -1076214 -896568 -1501330 -2724162 -3419905
$$ packed form
33241g14270l09497J54719K24833k70734o92675k90580O48116R49865J47031p14536
33231h67728m38040O45784J137139M46816o20094j126724j019744o89443k62226
33222b794260K42340N50620M31161J33042J58239O71577J313497J506395R05565
33213C118176k46015j175363j260484o93925j61969J00224M11119P40624M72684
33204A305071m97784j161493o55140L91322P15123L03365K66933Q63519R58148
33195B489064r4325j228016j171615k66508K53683J30588L8363R7244k28639q14966
33185g95127p89810q178N86975M84202L32298N72519M98853m21060j277527r44586
33175a761441J06562N02464O2767j62241J75675J79646o04762j222832o95743
$$ plain form
33166 -3419905 -2916924 -1802868 -1089047 -1093411 -1362080 -1348657 -940598 -462781 -273667 -318872
33156 -318872 -162716 440966 1182690 1585147 1555120 1287657 841111 203120 -338921 -344159
33146 -344159 230815 977652 1562204 1962309 2141767 1890259 1188566 454064 162681 323608
33136 323608 485694 222484 -452399 -1095330 -1217637 -694641 194137 1079035 1714649 1914003
33126 1914003 1596181 1061556 875782 1166805 1345009 936832 388333 442629 927511 943553
33116 943553 277507 -220343 65100 662020 944097 1134462 1610603 1826106 996334 -374826
33106 -374826 -812948 108241 1121392 1110323 667385 1010407 2014303 2387792 1590807
33097 1590807 520559 152801 411824 736209 971514 1153383 1024536 453890 -63407
$$ packed form
33166c419905N02981J114056P13821m364k68669J3423M08059M77817J89114m5205
33156c18872J56156O03682P41724M02457l0027k67463m46546o37991n42041n238
33146c44159N74974P46837N84552M00105J79458k51508p01693p34502k91383J60927
33136C23608J62086k63210o74883o42931j22307N22996Q88778Q84898O35614J99354
33126A914003l17822n34625j85774K91023J78204m08177n48499N4296M84882J6042
33116I43553o66046m97850K85443N96920K82077J90365M76141K15503q29772j371160
33106c74826m38122R21189J013151j1069m42938L43022J003896L73489p96985
33097A590807j070248l67758K59023L24385K35305J81869j28847n70646n17297
$$ plain form
33088 -63407 -16073 287409 185719 -243256 -326152 56058 286880 65842 -166046 -67982
33078 -67982 105667 169869 412710 891649 1038495 540815 -5012 23373 291594 144507
33068 144507 -270373 -371902 -244442 -374292 -498860 175734 1517894 2276605 1702856
33059 1702856 538864 -50418 140530 511745 604639 346981 -199392 -742453 -694195 217916
33049 217916 1392373 1907930 1617811 1257861 1402887 1724933 1536052 821327 336915
33040 336915 615455 1209073 1239132 529360 -287861 -816864 -1425884 -2380617 -3031296 -2545928
33030 -2545928 -1175524 -68494 106047 -285019 -608341 -606057 -223627 480831 1047484
33021 1047484 882015 110562 -374060 -29390 654572 890967 560098 136558 86342 635758
$$ packed form
33088f3407M7334L03482j01690m28975q2896L82210K30822k21038k31888R8064
33078f7982J73649O4202K42841M78939J46846m97680n45827K8385K68221j47087
33068A44507m14880j01529J27460j29850j24568O74594J342160P58711n73749
33059A702856j163992n89282J90948L71215R2894k57658n46373n43061M8258R12111
33049B17916J174457N15557k90119l59950J45026L22046j88881p14725m84412
33040C36915K78540N93618L0059p09772q17221n29003o09020r54733o50679M85368
33030b545928J370404J107030J74541l91066l23322K284L82430P04458N66653
33021A047484j65469p71453m84622L44670O83962K36395l30869m23540n0216N49416
$$ plain form
33011 635758 1713915 2813266 3303679 3153915 2916083 2789025 2303822 1286544 440246
33002 440246 380796 677506 562702 129060 36883 386849 735767 1015582 1550366 2214372
32992 2214372 2428511 2076267 1648289 1341149 787213 -61585 -528552 -141777 584081
32983 584081 803010 406959 -42539 -212208 -359796 -866927 -1741545 -2587255 -2887620 -2381710
32973 -2381710 -1332869 -397925 -100890 -419440 -896981 -1091378 -908845 -604830 -494255
32964 -494255 -605144 -649749 -406405 -21026 212477 226682 100675 -239744 -861111 -1409851
32954 -1409851 -1333565 -660759 -151373 -409350 -1149763 -1639238 -1604512 -1339467 -1088174 -781525
32944 -781525 -413942 -270697 -569221 -1097500 -1428307 -1385238 -1121060 -823496 -550254 -323343
$$ packed form
33011F35758J078157J099351M90413j49764k37832j27058m85203j017278q46298
33002D40246n9450K96710j14804m33642r2177L49966L48918K79815N34784O64006
32992B214372K14139l52244m27978l07140n53936q48798m66967L86775P25858
32983E84081K18929l96051m49498j69669j47588n07131q74618q45710l00365N05910
32973b381710J048841R34944K97035l18550m77541j94397J82533L04015J10575
32964d94255j10889m4605K43344L85379K33503J4205j26007l40419o21367n48740
32954a409851P6286O72806N09386k57977p40413m89475L4726K65045K51293L06649
32944g81525L67583J43245k98524n28279l30807M3069K64178K97564K73242K26911
$$ plain form
32934 -323343 -154320 70972 501939 999133 1123651 656503 -41127 -429539 -403325 -216528
32924 -216528 42494 481727 970218 1154938 978427 726688 488831 104040 -222816 58009
32914 58009 842938 1109574 284398 -714199 -643646 256669 629939 22986 -545242 -219300
32904 -219300 487718 584667 -74065 -922071 -1555960 -1862648 -1688876 -1029084 -338495 -115843
32894 -115843 -271862 -328411 -138534 -23689 -271973 -830712 -1424974 -1722491 -1537963 -1154066
32884 -1154066 -1192616 -1762888 -2011299 -1130941 321258 889582 114312 -845669 -869355 -389410
32874 -389410 -542115 -1347870 -1724636 -1188162 -527687 -519583 -814724 -635140 39588 638740
32864 638740 938022 1108877 1072220 583316 -71167 -215659 243206 663547 681420 696708
$$ packed form
32934c23343J69023K25292M30967M97194J24518m67148o97630l88412K6214J86797
32924b16528K59022M39233M88491J84720j76511k51739k37857l84791l26856K80825
32914E8009P84929K66636q25176r98597P0553R00315L73270o06953n68228L25942
32904b19300P07018R6949o58732q48006o33889l06688J73772O59792O90589K22652
32894a15843j56019n6549J89877J14845k48284n58739n94262k97517J84528L83897
32884a154066l8550n70272k48411Q80358J452199N68324p75270r59981k3686M79945
32874c89410j52705q05755l76766N36474O60475Q104k95141J79584O74728N99152
32864F38740K99282J70855l6657m88904o54483j44492M58865M20341J7873J5288
$$ plain form
32854 696708 1046804 1393591 1412194 1458679 1912477 2356028 2151925 1485948 1060847 1000634
32844 1000634 872279 631404 649449 815439 551693 -112054 -411053 -124127 -77219 -827327
32834 -827327 -1635905 -1499329 -628255 -55172 -106593 -148000 212264 474815 36199 -890608
32824 -890608 -1457340 -1100858 -136811 523793 299148 -391011 -586035 -3037 562071 298885
32814 298885 -554726 -1145765 -1152345 -907425 -613488 -171414 213478 22696 -709297 -1132232
32804 -1132232 -600862 447236 1064209 961440 655777 598570 647236 492273 244541 307315
32794 307315 734670 995613 586130 -201079 -453435 233845 1109890 1151312 427151 10549
32784 10549 453076 974862 567971 -565065 -1282523 -1021785 -411785 -315306 -823713 -1440130
$$ packed form
32854F96708L50096L46787J8603M6485M53798M43551k04103o65977m25101o0213
32844A000634j28355k40875J8045J65990k63746o63747k98999K86926M6908p50108
32834h27327q08578J36576Q71074N73083n1421m1407L60264K62551m38616r26807
32824h90608n66732L56482R64047O60604k24645o90159j95024N82998N65108k63186
32814B98885q53611n91039o580K44920K93937M42074L84892j90782p31993m22935
32804a132232N31370J048098O16973j02769l05663n7207M8666j54963k47732O2774
32794C07315M27355K60943m09483p87209k52356O87280Q76045M1422p24161m16602
32784A0549M42527N21786m06891j133036p17458K60738O10000R6479n08407o16417
$$ plain form
32774 -1440130 -1802941 -1830005 -1427056 -549141 473385 1076558 1043397 685435 365802 115543
32764 115543 -141961 -273782 -105681 278470 691243 1164653 1794785 2333043 2312260 1651138
32754 1651138 814996 245944 -105535 -526674 -1036565 -1313539 -1014177 -92878 1051197
32745 1051197 1750968 1658089 1177696 986547 1094510 882429 225740 -69408 594467 1603461
32735 1603461 1930938 1503584 980799 518235 -232364 -984056 -847628 179039 812425
32726 812425 186661 -884599 -1107640 -499339 -73654 -195887 -286021 -36425 81294 -267736
32716 -267736 -627770 -373520 485805 1401791 1849988 1637277 988377 462200 447885 627264
32706 627264 280706 -765771 -1866154 -2344024 -2169773 -1725351 -1338993 -1242530 -1506763
$$ packed form
32774a440130l62811k7064M02949Q77915J022526O03173l3161l57962l19633k50259
32764A15543k57504j31821J68101L84151M12773M73410O30132N38258k0783o61122
32754A651138q36142n69052l51479m21139n09891k76974K99362R21299J144075
32745A051197O99771r2879m80393j91149J07963k12081o56689k95148O63875J008994
32735A603461L27477m27354n22785m62564p50599p51692J36428J026667O33386
32726H12425o25764j071260k23041O08301M25685j22233r0134K49596J17719l49030
32716b67736l60034K54250Q59325R15986M48197k12711o48900n26177j4315J79379
32706F27264l46558j046477j100383m77870J74251M44422L86358R6463k64233
$$ plain form
32697 -1506763 -1726471 -1238833 -31822 1007208 1193523 955261 1086737 1521306 1613141
32688 1613141 1372659 1484684 2061874 2309115 1742417 937232 557838 318728 -362336
32679 -362336 -1110999 -895626 430558 1680710 1750335 952335 457538 680212 826823
32670 826823 142647 -938297 -1340276 -780998 -43389 236375 390215 947721 1606326
32661 1606326 1644712 1070310 582013 451096 228298 -307226 -687348 -564168 -289821 -244090
32651 -244090 -183301 210978 669847 850609 1046043 1621429 2071755 1528195 136932 -923950
32641 -923950 -954001 -526402 -506462 -899336 -1082533 -758362 -223201 118364 164591 107212
32631 107212 207297 549760 946992 1124578 972749 540972 -78871 -679098 -904532 -575397
$$ packed form
32697a506763k19708M87638J207011J039030J86315k38262J31476M34569R1835
32688A613141k40482J12025N77190K47241n66698q05185l79394k39110o81064
32679c62336p48663K15373J326184J250152O9625p98000m94797K22674J46611
32670H26823o84176j080944m01979N59278P37609K79764J53840N57506O58605
32661A606326L8386n74402m88297j30917k22798n35524l80122J23180K74347M5731
32651b44090O0789L94279M58869J80762J95434N75386M50326n43560j391263j060882
32641i23950l0051M27599J9940l92874j83197L24171N35161L41565M6227n7379
32631A07212J00085L42463L97232J77586j51829m31777o19843o00227k25434L29135
$$ plain form
32621 -575397 66008 693165 1290940 1865656 2030056 1465449 662301 479842 908979 1020173
32611 1020173 369027 -306032 -242945 150087 -46664 -790185 -1032709 -143702 1218396
32602 1218396 1866454 1411938 582872 264396 442124 361257 -260725 -667494 -133536 807293
32592 807293 960585 142960 -643837 -767995 -680987 -759358 -528509 256777 712022 13992
32582 13992 -1156318 -1466036 -821003 -270794 -245642 -106056 455918 730241 149374 -719006
32572 -719006 -913858 -305917 395619 546983 142711 -300879 -240477 341476 839010 697543
32562 697543 111216 -269823 -179537 179498 739154 1597418 2438083 2640308 2170176 1714565
32552 1714565 1641409 1446992 652161 -271730 -408348 448963 1588871 2180105 1985228
$$ packed form
32621e75397O41405O27157N97775N74716J64400n64607q03148j82459M29137J11194
32611A020173o51146o75059O3087L93032j96751p43521k42524Q89007J362098
32602A218396O48058m54516q29066l18476J77728q0867o21982m06769N33958R40829
32592H07293J53292q17625p86797j24158Q7008p8371K30849P85286M55245o98030
32582A3992j170310l09718O45033N50209K5152J39586N61974K74323n80867q68380
32572g19006j94852O07941P01536J51364m04272m43590O0402N81953M97534j41467
32562F97543n86327l81039R0286L59035N59656Q58264Q40665K02225m70132m55611
32552A714565p3156j94417p94831r23891j36618Q57311J139908N91234j94877
$$ plain form
32543 1985228 1417996 1096889 1226949 1368493 1026349 423860 287886 826587 1411192
32534 1411192 1425157 953011 431145 87380 -51481 -70673 -317348 -1132980 -2175578 -2549714
32524 -2549714 -1930511 -1026098 -606709 -664871 -865313 -1081371 -991895 16386 1774824
32515 1774824 2897364 2356312 896524 -106446 -563150 -1200989 -1722434 -1072768 506853
32506 506853 1373439 823025 48497 131274 456767 57038 -626487 -519780 292571 758995
32496 758995 435688 -182474 -637506 -853060 -678957 -15993 642833 614653 -5537 -493373
32486 -493373 -599929 -759523 -1153520 -1373649 -1226627 -1125372 -1334443 -1462520 -1132568 -635192
32476 -635192 -428009 -382917 -66657 464126 671403 282493 -374909 -810203 -858813 -689771
$$ packed form
32543A985228n67232l21107J30060J41544l42144o02489j35974N38701N84605
32534A411192J3965m72146n21866l43765j38861j9192k46675q15632j042598l74136
32524b549714O19203R04413M19389n8162k00442k16058Q9476J008281J758438
32515A774824J122540n41052j459788j002970m56704o37839n21445O49666J579621
32506E06853Q66586n50414p74528Q2777L25493l99729o83525J06707Q12351M66424
32496G58995l23307o18162m55032k15554J74103O62964O58826k8180o20190m87836
32486d93373j06556j59594l93997k20129J47022J01255k09071j28077L29952M97376
32476f35192K07183M5092L16260N30783K07277l88910o57402m35294m8610J69042
$$ plain form
32466 -689771 -539878 -536609 -691941 -959690 -1211394 -1148863 -452390 734393 1593726 1308537
32456 1308537 21101 -1220420 -1581422 -1182613 -630239 -245784 -19969 82690 184814
32447 184814 585900 1356574 2011776 1992976 1364430 682091 321882 322934 710602 1428219
32437 1428219 1977439 1716789 708281 -172790 -222828 298153 585999 267741 -278898
32428 -278898 -465259 -184636 26173 -457932 -1562734 -2422024 -2257253 -1168611 214366
32419 214366 1571042 2848883 3617487 3292517 2138218 1260369 1238732 1423518 1028622
32410 1028622 278382 -155738 -338490 -901784 -1938933 -2805686 -2965963 -2456251 -1573802
32401 -1573802 -655448 -113760 -120238 -221126 216060 1120368 1754964 1670211 1121928 491101
$$ packed form
32466f89771J49893L269j55332k67749k51704O2531O96473J186783Q59333k85189
32456A308537j287436j241521l61002L98809N52374L84455K25815J02659J02124
32447A84814M01086P70674O55202j8800o28546o82339l60209J052L87668P17617
32437A428219N49220k60650j008508q81071n0038N20981K87846l18258n46639
32428b78898j86361K80623K10809m84105j104802q59290J64771J088642J382977
32419B14366J356676J277841P68604l24970j154299q77849k1637J84786l94896
32410A028622p50240m34120j82752n63294j037149q66753j60277N09712Q82449
32401a573802R18354N41688o478j00888M37186R04308O34596q4753n48283o30827
$$ plain form
32391 491101 -138163 -637933 -632791 2761 803347 1211744 1186260 1058198 1023635 1058497
32381 1058497 1173469 1467245 1951770 2470282 2775455 2666407 2140250 1424471 775576
32372 775576 288925 -2325 784 276139 528341 526000 450101 556829 664787 458412
32362 458412 181475 418969 1166223 1752877 1824646 1746551 1795840 1651313 1122771 776051
32352 776051 1204631 2052906 2397633 1927536 1218259 925802 1140876 1497701 1571647 1180488
32342 1180488 527646 13331 -201108 -272189 -248655 84893 735203 1249103 1248849 893372
32332 893372 490695 20273 -561762 -914705 -724697 -258676 -6562 -11724 -51786 -191809
32322 -191809 -544524 -732898 -335191 244771 143597 -676408 -1271595 -1018088 -350713 69724
$$ packed form
32391D91101o29264m99770N142O35552Q00586M08397k5484j28062l4563L4862
32381A058497J14972K93776M84525N18512L05173j09048n26157p15779o48895
32372G75576m86651k91250L109K75355K52202k341p5899J06728J07958k06375
32362D58412k76937K37494P47254N86654P1769p8095M9289j44527n28542l46720
32352G76051M28580Q48275L44727m70097p09277k92457K15074L56825P3946l91159
32342A180488o52842n14315k14439p1081K3534L33548O50310N13900k54l55477
32332H93372m02677m70422n82035l52943J90008M66021K52114n162m0062j40023
32322a91809l52715j88374L97707N79962j01174q20005n95187K53507O67375M20437
$$ plain form
32312 69724 243152 470631 686910 687776 631762 769541 924912 776124 506280 621285
32302 621285 1102776 1267673 695751 -95397 -291892 89502 218298 -327443 -893597 -722296
32292 -722296 -176753 -251095 -968311 -1208803 -454251 216203 -392625 -1774356 -2347875 -1566426
32282 -1566426 -405859 150512 126778 -50633 -239148 -348149 -178123 131442 91111 -376124
32272 -376124 -712338 -537984 -97032 390188 1131048 2087590 2572394 2126424 1304740 972370
32262 972370 1207720 1476878 1506553 1360449 983188 332704 -271125 -543067 -722650 -1034601
32252 -1034601 -978255 3455 1312141 1628592 683010 -305860 -259911 491251 1000165 1020894
32242 1020894 900575 696265 215819 -250523 -28702 949740 1797601 1631640 636752
$$ packed form
32312F9724J73428K27479K16279Q66n6014J37779J55371j48788k69844J15005
32302F21285M81491J64897n71922p91148j96495L81394J28796n45741n66154J71301
32292g22296N45543p4342p17216k40492P54552O70454o08828j381731n73519P81449
32282a566426J160567N56371k3734j77411j88515j09001J70026L09565m0331m67235
32272c76124l36214J74354M40952M87220P40860R56542M84804m45970q21684l32370
32262I72370K35350K69158K9675j46104l77261o50484o03829k71942j79583l11951
32252a034601N6346R81710J308686L16451r45582r88870M5949P51162N08914K0729
32242A020894j20319k04310m80446m66342K21821R78442Q47861j65961r94888
$$ plain form
32233 636752 -112584 173002 1208788 2044997 2085098 1533703 917396 479373 226796 305408
32223 305408 893931 1713320 2051016 1506264 498426 -190877 -257255 -64716 -103696 -469148
32213 -469148 -827690 -697060 222806 1748847 3148833 3587549 2854379 1591322 642708
32204 642708 241117 23729 -242178 -343752 -161408 -105932 -618404 -1463239 -1992264 -2004550
32194 -2004550 -1818414 -1522605 -830586 119754 531604 10499 -684134 -588115 152481 628802
32184 628802 546974 406841 392153 37298 -763680 -1260653 -820392 214753 1097350 1569424
32174 1569424 1721135 1506051 1008773 756724 1079234 1478530 1330358 895087 815730 867581
32164 867581 244818 -905351 -1367793 -616977 347968 495591 164593 199155 475163 303603
$$ packed form
32233F36752p49336K85586J035786Q36209M0101n51395o16307m38023k52577P8612
32223C05408N88523Q19389L37696n44752j007838o89303o6378J92539l8980l65452
32213d69148l58542J30630R19866J526041J399986M38716p33170j263057r48614
32204F42708m01591k17388k65907j01574J82344N5476n12472q44835n29025j2286
32194b004550J86136K95809O92019R50340M11850n21105o94633R6019P40596M76321
32184F28802q1828j40133j4688l54855q00978m96973M40261J035145Q82597M72074
32174A569424J51711k15084m97278k52049L22510L99296j48172m35271p9357N1851
32164H67581o22763j150169m62442P50816R64945J47623l30998L4562K76008j71560
$$ plain form
32154 303603 -208520 -310361 102380 408163 416324 569475 900393 828611 291722 101220
32144 101220 682772 1305023 1178028 618817 408381 511424 198871 -838293 -2110787
32135 -2110787 -2853647 -2513308 -1110454 402598 660724 -548610 -1678108 -1188107 436316
32126 436316 1362359 853013 -44285 -238499 106779 320534 295354 296526 391067 562544
32116 562544 891568 1243813 1238081 820526 406929 240316 163634 232479 834733 1826826
32106 1826826 2286559 1681117 659906 85164 -128918 -506202 -895065 -759521 -262691
32097 -262691 -129396 -490384 -669036 -196909 609802 1206011 1407117 1272552 837843 171910
32087 171910 -507320 -867215 -590460 304338 1151562 1064640 4077 -1001081 -1125398
$$ packed form
32154C03603n12123j01841M12741L05783Q161J53151L30918p1782n36889j90502
32144A01220N81552O22251j26995n59211k10436J03043l12553j037164j272494
32135b110787p42860L40339J402854J513052K58126j209334j129498M90001J624423
32126D36316R26043n09346q97298j94214L45278K13755k5180J172R4541J71477
32116E62544L29024L52245n732m17555m13597j66613p6682O8845O02254R92093
32106A826826M59733o05442j021211n74742k14082l77284l88863J35544M96830
32097b62691J33295l60988j78652M72127Q06711N96209K01106j34565m34709o65933
32087A71910o79230l59895K76755Q94798Q47224q6922j060563j005158j24317
$$ plain form
32078 -1125398 -760644 -685361 -771109 -395392 249104 357644 -86941 -254993 85454 216567
32068 216567 -112030 -54881 935505 2075993 2412763 2214081 2285107 2529770 2268265 1602812
32058 1602812 1308424 1441219 1189210 318193 -281513 7174 443599 3811 -1002190
32049 -1002190 -1281027 -359488 808663 1186983 911500 830334 1275157 1791729 1851947 1344421
32039 1344421 441797 -569394 -1302018 -1504522 -1380760 -1382435 -1642849 -1922935 -2097025 -2245521
32029 -2245521 -2220654 -1693709 -846225 -408175 -623709 -759778 -186966 584692 678198 250614
32019 250614 216703 730081 902438 175747 -865379 -1359884 -1166082 -617782 122880 967995
32009 967995 1545926 1468025 831374 129357 -255552 -274411 -48551 332083 873551 1551070
$$ packed form
32078a125398L64754P5283q5748L75717O44496J08540m44585j68052L40447J31113
32068B16567l28597N7149R90386J140488L36770j98682P1026K44663k61505o65453
32058A602812k94388J32795k52009q71017n99706K88687M36425m39788j006001
32049a002190k78837R21539J168151L78320k75483q1166M44823N16572O0218n07526
32039A344421r02624j011191p32624k02504J23762j675k60414k80086j74090j48496
32029b245521K4867N26945Q47484M38050k15534j36069N72812P71658R3506m27584
32019B50614l3911N13378J72357p26691j041126m94505J93802N48300P40662Q45115
32009I67995N77931p7901o36651p02017l84909j8859K25860L80634N41468O77519
$$ plain form
31999 1551070 2048362 1809417 691267 -529193 -781255 78335 1095286 1384035 1007661
31990 1007661 506654 64093 -450679 -960329 -1215801 -1243237 -1310631 -1396633 -1033436 104951
31980 104951 1572545 2363510 1906142 739973 -49990 -61883 116434 -76468 -351931
31971 -351931 -117395 608064 1359194 1952014 2410025 2442150 1747676 715707 68724 -134457
31961 -134457 -395446 -754804 -748969 -416855 -386914 -761957 -866941 -415934 14172 85216
31951 85216 320247 1059607 1674125 1509815 872727 369973 -35936 -576617 -949939 -871225
31941 -871225 -794841 -1239319 -1860270 -2020749 -1838177 -1800764 -1742610 -1130400 -108788 618263
31931 618263 764584 550020 68832 -611222 -964431 -508960 343058 757490 650891 581059
$$ packed form
31999A551070M97292k38945j118150j220460k52062Q59590J016951K88749l76374
31990A007661n01007m42561n14772n09650k55472k7436o7394q6002L63197J138387
31980A04951J467594P90965m57368j166169p89963j1893J78317j92902k75463
31971c51931K34536P25459P51130N92820M58011L2125o94474j031969o46983k03181
31961a34457k60989l59358N835L32114K9941l75043j04984M51007M30106P1044
31951H5216K35031P39360O14518j64310o37088n02754m05909n40681l73322P8714
31941h71225P6384m44478o20951j60479J82572L7413N8154O12210J021612P27051
31931F18263J46321k14564m81188o80054l53209M55471Q52018M14432j06599o9832
$$ plain form
31921 581059 678091 631215 616691 1187542 2153113 2547750 1942502 979522 401849 285556
31911 285556 384004 497019 344571 -214731 -712538 -525614 125648 407334 162371 87350
31901 87350 483657 804072 729584 717233 1036740 1183059 808900 422951 530434 799141
31891 799141 752930 657674 975569 1417614 1271597 373468 -816026 -1796423 -2204476 -1789415
31881 -1789415 -775924 32417 38368 -461769 -757353 -588413 -138480 464964 1117010 1456797
31871 1456797 1163782 450439 -104606 -127271 348551 993585 1258033 653108 -704293
31862 -704293 -2042705 -2674694 -2562740 -2040826 -1387367 -868843 -722689 -792260 -615298 -158595
31852 -158595 17771 -369023 -829709 -840178 -513542 -137659 338899 865404 978869 552165
$$ packed form
31921E81059R7032m6876j4524N70851R65571L94637o05248r62980n77673j16293
31911B85556R8448J13015j52448n59302m97807J86924O51262K81686k44963p5021
31901H7350L96307L20415p4488j2351L19507J46319l74159l85949J07483K68707
31891G99141m6211r5256L17895M42045j46017q98129j189494r80397m08053M15061
31881a789415J013491Q08341N951n00137k95584J68940M49933O03444O52046L39787
31871A456797k93015p13343n55045k2665M75822O45034K64448o04925j357401
31862g04293j338412o31989J11954N21914O53459N18524J46154o9571J76962M56703
31852a58595J76366l86794m60686j0469L26636L75883M76558N26505J13465m26704
$$ plain form
31842 552165 249064 544785 888993 647525 309722 763561 1732705 1983715 980121
31833 980121 -543530 -1566164 -1566206 -516819 1012783 1839872 1169205 -315482 -1121222
31824 -1121222 -732591 -7680 154556 -295885 -1031332 -1817602 -2311146 -2150378 -1515711
31815 -1515711 -1025883 -952087 -1080440 -1310039 -1674734 -1798842 -1177810 -103424 518787
31806 518787 414985 188420 207833 165498 -74283 -172150 -138629 -432615 -864420 -518521
31796 -518521 658313 1324639 629855 -365660 -178409 972967 1637074 1155914 113376
31787 113376 -831063 -1433716 -1403502 -522858 739805 1557697 1711172 1594160 1395534 973371
31777 973371 418703 25354 -224819 -493926 -560848 -176220 229789 16074 -594359 -778114
$$ packed form
31842E52165l03101K95721L44208k41468l37803M53839R69144K51010j003594
31833I80121j523651j022634m2J049387J529602Q27089o70667j484687q05740
31824a121222L88631P24911J62236m50441p35447p86270m93544J60768O34667
31815a515711M89828P3796j28353k29599l64695j24108O21032J074386O22211
31806E18787j03802k26565J9413m2335k39781r7867L3521k93986m31805L45899
31796e18521J176834O66326o94784r95515J87251J151376O64107m81160j042538
31787A13376r44439o02653L0214Q80644J262663Q17892J53475j17012j98626m22163
31777I73371n54668l93349k50173k69107o6922L84628M06009k13715o10433j83755
$$ plain form
31767 -778114 -400752 -89675 22316 544896 1535676 2025476 1396848 367922 -56276
31758 -56276 109272 287332 463541 972711 1548373 1513632 848075 294994 313409 518156
31748 518156 332857 -240785 -723287 -768129 -493949 -309414 -466083 -754985 -731053 -287330
31738 -287330 195615 407418 550333 955758 1495409 1767026 1745424 1810947 2119009 2352186
31728 2352186 2214630 1830764 1483237 1239865 1053271 993015 1097490 1134400 823360 282540
31718 282540 -33919 74639 278760 211604 50858 307695 1050844 1643639 1395204 275329
31708 275329 -1170219 -2393754 -3066308 -2925188 -1901694 -522045 243924 -97837 -934327
31699 -934327 -1151302 -375760 619953 828527 155196 -492728 -226021 866489 1871911
$$ packed form
31767g78114L77362L11077J11991N22580R90780M89800o28628j028926m24198
31758e6276J65548J78060J76209N09170N75662l4741o65557n53081J8415K04747
31748E18156j85299n73642m82502m4842K74180J84535j56669k88902K3932M43723
31738b87330M82945K11803J42915M05425N39651K71617k1602O5523L08062K33177
31728B352186j37556l83866l47527k43372j86594o0256J04475L6910l11040n40820
31718B82540l16459J08558K04121o7156j60746K56837P43149N92795k48435j119875
31708B75329j445548j223535o72554J41120J023494J379649P65969l41761q36490
31699i34327k16975P75542R95713K08574o73331o47924K66707J092510J005422
$$ plain form
31690 1871911 2076030 1611424 1033422 553246 11762 -546706 -758444 -508991 -214181
31681 -214181 -285015 -600415 -794154 -817859 -848781 -781932 -254988 748967 1633321 1685038
31671 1685038 742180 -655573 -1685114 -1866606 -1439772 -1087110 -1144871 -1189143 -624683
31662 -624683 422176 1138754 965695 153382 -722018 -1447390 -2133519 -2722323 -2859734
31653 -2859734 -2264753 -1092378 64636 540862 136158 -619423 -898633 -402598 362122
31644 362122 703790 448417 -102019 -661307 -1120916 -1352462 -1198599 -729919 -303315 -248639
31634 -248639 -542489 -814720 -691269 -218066 63220 -341822 -1196468 -1651461 -1209374 -293087
31624 -293087 385144 688293 888440 964329 709687 408016 608693 1083917 814785 -532117
$$ packed form
31690A871911K04119m64606n78002m80176n41484n58468k11738K49453K94810
31681b14181p0834l15400j93739k3705l0922O6849N26944J003955Q84354N1717
31671A685038r42858j397753j029541j81492M26834L52662n7761m4272N64460
31662f24683J046859P16578j73059q12313q75400p25372o86129n88804j37411
31653b859734N94981J172375J157014M76226m04704p55581k79210M96035P64720
31644C62122L41668k55373n50436n59288m59609k31546J53863M68680M26604N4676
31634b48639k93850k72231J23451M73203K81286m05042q54646m54993M42087R16287
31624b93087O78231L03149K00147P5889k54642l01671K00677M75224k69132j346902
$$ plain form
31614 -532117 -1788795 -1642361 -384813 497808 308207 -146048 87170 859086 1432812
31605 1432812 1582982 1552867 1295615 500918 -665337 -1503493 -1637505 -1432613 -1321647
31596 -1321647 -1188431 -800130 -419806 -378488 -281644 558628 1812466 2080259 623282
31587 623282 -1456882 -2422185 -1906609 -1013432 -656152 -657971 -529869 -282864 -145383 -134625
31577 -134625 -285514 -728854 -1145016 -767055 480279 1393128 836145 -650922 -1466843
31568 -1466843 -1041702 -388522 -443364 -789679 -522887 295744 747942 333709 -485146 -986231
31558 -986231 -963821 -690587 -419311 -177654 -9181 -170915 -847938 -1689924 -1968874 -1410684
31548 -1410684 -573138 -58481 334644 1106862 1924523 1830692 738228 -119159 297212
$$ packed form
31614e32117j256678J46434J257548Q82621j89601m54255K33218P71916N73726
31605A432812J50170l0115k57252p94697j166255q38156j34012K04892J10966
31596a321647J33216L88301L80324M1318R6844Q40272J253838K67793j456977
31587F23282k080164r65303N15576Q93177L57280j819J28102K47005J37481J0758
31577a34625j50889m43340m16162L77961J247334R12849n56983j487067q15921
31568a466843M25141O53180n4842l46315K66792Q18631M52198m14233q18855n01085
31558i86231K2410K73234K71276K41657J68473j61734o77023q41986k78950N58190
31548a410684Q37546N14657L93125P72218Q17661r3831j092464q57387M16371
$$ plain form
31539 297212 1488538 2190767 2025516 1687658 1767908 2127749 2381012 2326948 1837613 916025
31529 916025 53773 30531 1055700 2395659 3078951 2776910 1880703 978715 428179
31520 428179 220051 67256 -263654 -626292 -651567 -270074 157146 316263 277462 200077
31510 200077 -2649 -414225 -748932 -646450 -306025 -411456 -1232808 -2083937 -2009094 -944535
31500 -944535 156258 478437 289980 384517 816850 814468 50671 -684035 -571201 7715
31490 7715 94912 -288597 -196811 550659 782168 -359648 -1958193 -2369594 -1307619 -17673
31480 -17673 459443 327264 258076 393648 492791 514243 568724 571014 346758 -43711 -376043
31469 -376043 -557342 -624602 -551141 -297414 -21760 -23673 -415866 -944800 -1188873 -950888
$$ packed form
31539B97212J191326P02229j65251l37858Q0250L59841K53263n4064m89335r21588
31529I16025q62252k3242J025169J339959O83292l02041q96207r01988n50536
31520D28179k08128j52795l30910l62638k5275L81493M27220J59117l8801p7385
31510B00077k02726m11576l34707J02482L40425j05431q21352q51129P4843J064559
31500i44535J100793L22179j88457R4537M32333k382p63797p34706J12834N78916
31490G715Q7197l83509R1786P47470K31509j141816j598545m11401J061975J289946
31480a7673M77116j32179o9188J35572R9143K1452N4481K290k24256l90469l32332
31469c76043j81299o7260P3461K53727K75654j913l92193n28934k44073K37985
$$ plain form
31459 -950888 -490110 -320622 -656544 -1083401 -986203 -357119 67654 -342501 -1306180 -1940486
31449 -1940486 -1825657 -1471491 -1601578 -2165293 -2337733 -1572711 -435756 -92445 -957434
31440 -957434 -2176813 -2641160 -2221198 -1669366 -1539733 -1703270 -1846071 -1867091 -1672253 -1114359
31430 -1114359 -373828 54138 13444 -96386 -17095 -56355 -453898 -834666 -811498 -693779
31420 -693779 -965259 -1380760 -1267211 -527287 293881 755987 710907 14882 -1149326 -1876992
31410 -1876992 -1440994 -547832 -643660 -1839314 -2649398 -2133545 -1133076 -769107 -828001
31401 -828001 -561327 -180837 -396440 -1024212 -1228901 -874637 -559740 -441709 -52028 692411
31391 692411 1208641 1115410 641392 86360 -403088 -467197 239785 1251193 1494319 648961
$$ packed form
31459i50888M60778J69488l35922m26857R7198O29084M24773m10155r63679o34306
31449a940486J14829L54166j30087n63715j72440P65022J136955L43311q64989
31440i57434j219379m64347M19962N51832J29633j63537j42801k1020J94838N57894
31430a114359P40531M27966m0694j09830P9291l9260l97543l80768K3168J17719
31420f93779k71480m15501J13549P39924Q21168M62106m5080o96025j164208p27666
31410a876992M35998Q93162r5828j195654q10084N15853J000469L63969n8894
31401h28001K66674L80490k15603o27772k04689L54264L14897J18031L89681P44439
31391F92411N16230r3231m74018n55032m89448o4109P06982J011408K43126q45358
$$ plain form
31381 648961 -319014 -345330 525308 1442909 1766644 1427059 736501 248442 464320 1296906
31371 1296906 2061017 2252067 2039998 1765231 1360615 677210 45595 -48809 226840 79977
31361 79977 -911155 -2122091 -2460556 -1582487 -322982 235544 4761 -121724 446354
31352 446354 1202622 1364053 1034803 942844 1248898 1336513 805433 23230 -474078 -613071
31342 -613071 -627397 -675257 -759619 -734342 -401822 79093 79688 -698833 -1557502 -1635825 -1191778
31331 -1191778 -1138064 -1458819 -1268623 -538806 -409015 -1316351 -2130076 -1909858 -1337626 -1419098
31321 -1419098 -1803129 -1591930 -1034101 -1105137 -1885843 -2569818 -2750463 -2604171 -2128438 -1318479
31311 -1318479 -812385 -1179655 -1746049 -1323313 -35232 786269 554560 65923 35295
$$ packed form
31381F48961r67975k6316Q70638R17601L23735l39585o90558m88059K15878Q32586
31371A296906P64111J91050k12069k74767m04616o83405o31615r4404K75649j46863
31361G9977r91132j210936l38465Q78069J259505N58526k30783j26485N68078
31352D46354P56268J61431l29250r1959L06054Q7615n31080p82203m97308j38993
31342f13071j4326m7860q4362K5277L32520M80915N95p78521q58669p8323M44047
31331a191778N3714l20755J90196P29817J29791r07336q13725K20218N72232q1472
31321a419098l84031K11199N57829p1036p80706o83975j80645J46292M75733Q09959
31311a318479N06094l67270n66394M22736J288081Q21501k31709m88637l0628
$$ plain form
31302 35295 212750 292456 555769 1088010 1311385 890346 347176 234251 353138 309654
31292 309654 245826 478688 860234 968750 633115 1804 -578009 -653671 -121981 350132
31282 350132 -11763 -900132 -1134323 -263045 826721 1202024 963562 618191 222986
31273 222986 -225411 -282964 289299 864494 676531 -127578 -768609 -852703 -557861 -116505
31263 -116505 337246 641860 796525 1046768 1414670 1455868 863092 -20178 -653951 -912344
31253 -912344 -913179 -689630 -403506 -372758 -459714 -17957 1017173 1626445 1015534 -143282
31243 -143282 -626016 -338497 -129320 -290217 -336357 -150935 -232760 -658733 -764069 -156759
31233 -156759 705098 1248931 1455261 1497411 1308932 876605 517070 495058 650647 678332
$$ packed form
31302C5295J77455P9706K63313N32241K23375m21039n43170j12925J18887m3484
31292C09654o3828K32862L81546J08516l35635o31311n79813p5662N31690M72113
31282C50132l61895q88369k34191Q71278J089766L75303k38462l45371l95205
31273B22986m48397n7553N72263N75195j87963q04109o41031q4094K94842M41356
31263a16505M53751L04614J54665K50243L67902M1198n92776q83270o33773k58393
31253i12344q35K23549K86124L0748q6956M41757J035130O09272o10911j158816
31243a43282m82734K87519K09177j60897m6140J85422q1825m25973j05336O07310
31233a56759Q61857N43833K06330M2150j88479m32327l59535k2012J55589K7685
$$ plain form
31223 678332 577003 631494 1047464 1640721 1826433 1101166 -267079 -1303974 -1411172
31214 -1411172 -1070702 -1031375 -1183551 -932582 -396947 -318757 -800302 -1058810 -644994 -59323
31204 -59323 190883 375305 877816 1359366 1184264 324928 -655758 -1263981 -1318143 -799828
31194 -799828 108690 973860 1418937 1400059 1035401 413246 -222888 -409471 60213 753418
31184 753418 995837 558658 -245681 -965742 -1254151 -919370 -136852 434197 153822 -833423
31174 -833423 -1613927 -1501039 -831304 -471817 -620756 -547863 274753 1235034 1309135 502975
31164 502975 -149036 -63063 218478 144102 120832 699385 1429271 1417991 685275 52870
31154 52870 -142976 -316830 -638848 -688836 -275020 185458 348364 351270 330164 148750
$$ packed form
31223F78332j01329N4491M15970N93257J85712p25267j368245j036895j07198
31214a411172L40470L9327j52176K50969N35635P8190m81545k58508M13816N85671
31204e9323K50206J84422N02511M81550j75102q59336r80686o08223n4162N18315
31194g99828R08518Q65170M45077j8878l64658o22155o36134j86583M69684O93205
31184G53418K42419m37179q04339p20061k88409L34781P82518N71049k80375r87245
31174h33423p80504J12888O69735L59487j48939P2893Q22616R60281P4101q06160
31164E02975o52011Q5973K81541p4376k3270N78553P29886j1280p32716o32405
31154E2870j95846j73854l22018m9988M13816M60478J62906K906k1106j81414
$$ plain form
31144 148750 -187620 -450746 -698482 -1233024 -1877212 -1989720 -1439761 -849228 -581765 -255074
31134 -255074 377468 869875 905189 885262 1091992 1031785 375949 -149801 253025 1116389
31124 1116389 1363737 960410 855826 1427901 2017619 2067304 1790282 1502360 1074005 350388
31114 350388 -468941 -1124688 -1506180 -1438606 -789654 68835 470798 339334 307863 700248
31104 700248 979825 624482 6158 -195313 -76173 -294523 -928862 -1313702 -1126583 -922932
31094 -922932 -1212458 -1583997 -1360943 -776240 -727722 -1429310 -2116047 -2283867 -2399622 -2892266
31084 -2892266 -3189956 -2562061 -1407036 -737415 -651684 -358966 337585 696255 377475
31075 377475 55291 245994 454297 55370 -751532 -1450008 -1931827 -2111922 -1586459 -435149
$$ packed form
31144A48750l36370k63126k47736n34542o44188j12508N49959N90533K67463L26691
31134b55074O32542M92407L5314j9927K06730o0207o55836n25750M02826Q63364
31124A116389K47348m03327j04584N72075N89718M9685k77022k87922m28355p23617
31114C50388q19329o55747l81492O7574O48952Q58489M01963j31464l1471L92385
31104G00248K79577l55343o18324k01471J19140k18350o34339l84840J87119K03651
31094i22932k89526l71539K23054N84703M8518p01588o86737j67820j15755m92644
31084b892266k97690O27895J155025O69621Q5731K92718O96551L58670l18780
31075C77475l22184J90703K08303l98927q06902o98476m81819j80095N25463J151310
$$ plain form
31065 -435149 315543 -97108 -1032762 -1381351 -1127814 -1045859 -1277417 -1277767 -908008 -526936
$$ packed form
31065d35149P50692m12651r35654l48589K53537Q1955k31558l50L69759L81072
$$ [...]
##END NTUPLES=NMR SPECTRUM
##END=
