##TITLE=31Pdec_LY-TMF-4.70.R
 D2O, 24 sc
 27.2.2020
##JCAMPDX= 6.0         $$ Bruker NMR JCAMP-DX V2.0
##DATA TYPE= NMR SPECTRUM
##DATA CLASS= NTUPLES
##ORIGIN= UXNMR, Bruker Analytische Messtechnik GmbH
##OWNER= root
$$ XWIN-NMR		Version 3.5
$$ Thu Feb 27 16:06:42 2020 Russian Standard Time (UT+4h)  she@DPX200
##.OBSERVE FREQUENCY= 81.013821
##.OBSERVE NUCLEUS= ^31P
##.ACQUISITION MODE= SIMULTANEOUS
##.ACQUISITION SCHEME= undefined
##.AVERAGES= 24
##.DIGITISER RES= 17
##SPECTROMETER/DATA SYSTEM= spect
##.PULSE SEQUENCE= zgpg30
##.SOLVENT NAME= CDCl3
##.SHIFT REFERENCE= (INTERNAL, CDCl3, 0, 182.463)
##AUDIT TRAIL= $$ (NUMBER, WHEN, WHO, WHERE, WHAT)
$$ ##TITLE= Audit trail, XWIN-NMR		Version 3.5
$$ ##JCAMPDX= 5.01
$$ ##ORIGIN= Bruker BioSpin GmbH
$$ ##OWNER= she
$$ F:/spectra/data/she/nmr/P31/1/pdata/1/auditp.txt
$$ ##AUDIT TRAIL=  $$ (NUMBER, WHEN, WHO, WHERE, WHAT)
(   1,<2020-02-27 16:05:22.68 +0400>,<she>,<DPX200>,
      <created by zg, POWCHK disabled, PULCHK disabled
       configuration hash MD5:
       00 E9 B6 7A A2 85 ED C7 34 08 36 98 17 FE 4E 26
       data hash MD5: 32K
       7D D5 9E 37 FA 71 61 48 BF F0 96 2D 97 11 DA FF>)
(   2,<2020-02-27 16:05:25.34 +0400>,<she>,<DPX200>,
      <Start of raw data processing
       efp BC_mod = 2 LB = 1 FT_mod = 6 PKNL = 1 PHC0 = -1535.892 PHC1 = 509.6013 SI = 64K 
       data hash MD5: 64K
       4E B9 94 7E 91 A8 C2 8A 36 1B 7E CE CC 37 5A CA>)
(   3,<2020-02-27 16:05:39.81 +0400>,<she>,<DPX200>,
      <pk PHC0 = 4.516588 PHC1 = 0 
       data hash MD5: 64K
       A1 20 A4 B6 93 6E 3C 51 15 EA F9 8B 15 70 C5 EA>)
(   4,<2020-02-27 16:05:43.34 +0400>,<she>,<DPX200>,
      <abs ABSG = 5 
       data hash MD5: 64K
       B8 3E 2E 25 80 5E 95 D6 5A B4 2F C8 DA A3 4A EB>)
(   5,<2020-02-27 16:06:01.57 +0400>,<she>,<DPX200>,
      <pk PHC0 = 0.2007057 PHC1 = 0 
       data hash MD5: 64K
       5D 64 FE 52 35 1E 84 F9 C2 8A DD 92 25 C0 DA 77>)
(   6,<2020-02-27 16:06:05.92 +0400>,<she>,<DPX200>,
      <abs ABSG = 5 
       data hash MD5: 64K
       5F FC BD 40 4E 89 37 F8 32 FB CF 9C 5B 78 63 89>)
$$ ##END=
$$ 
$$ hash MD5
$$ 92 0E B4 78 53 B4 DC 1D D2 7A BC 30 A5 73 64 6A
##$RELAX= 
##$RELAX= 
##$RELAX= 
##$RELAX= 
##$RELAX= 
##$RELAX= 
##$RELAX= 
##$RELAX= 
$$ Bruker specific parameters
$$ --------------------------
##$DU= <F:/spectra>
##$EXPNO= 1
##$NAME= <P31>
##$PROCNO= 1
##$TYPE= <nmr>
##$USER= <she>
##$AMP= (0..31)
100 100 100 100 100 100 100 100 100 100 100 100 100 100 100 100 100 100 
100 100 100 100 100 100 100 100 100 100 100 100 100 100 
##$AQSEQ= 0
##$AQ_mod= 1
##$AUNM= <au_zg>
##$AUTOPOS= <>
##$BF1= 81.014009
##$BF2= 200.13
##$BF3= 200.13
##$BF4= 200.13
##$BF5= 200.13
##$BF6= 200.13
##$BF7= 200.13
##$BF8= 200.13
##$BYTORDA= 1
##$CFDGTYP= 0
##$CFRGTYP= 5
##$CHEMSTR= <none>
##$CNST= (0..31)
1 1 145 1 1 1 1 1 1 1 1 1 1 1 1 1 1 1 1 1 1 1 1 1 1 1 1 1 1 1 1 1 
##$CPDPRG= <waltz16>
##$CPDPRG1= <>
##$CPDPRG2= <waltz16>
##$CPDPRG3= <>
##$CPDPRG4= <mlev>
##$CPDPRG5= <mlev>
##$CPDPRG6= <mlev>
$$ [...]
##$SUBNAM3= <"">
##$SUBNAM4= <"">
##$SUBNAM5= <"">
##$SUBNAM6= <"">
##$SUBNAM7= <"">
##$SUBNAM8= <"">
##$SUBNAM9= <"">
##$SW= 369.568048894756
##$SWIBOX= (0..15)
0 1 3 0 0 0 0 0 0 0 0 0 0 0 0 0 
##$SW_h= 29940.119760479
##$TD= 32768
##$TD0= 1
##$TE= 0
##$TE2= 300
##$TE3= 300
##$TEG= 300
##$TL= (0..7)
0 120 53 12 22 120 120 120 
##$TP= (0..7)
150 150 150 150 150 150 150 150 
##$TP07= 0
##$TPNAME0= <>
##$TPNAME1= <>
##$TPNAME2= <>
##$TPNAME3= <>
##$TPNAME4= <>
##$TPNAME5= <>
##$TPNAME6= <>
##$TPNAME7= <>
##$TPOAL= (0..7)
0.5 0.5 0.5 0.5 0.5 0.5 0.5 0.5 
##$TPOFFS= (0..7)
0 0 0 0 0 0 0 0 
##$TUNHIN= 0
##$TUNHOUT= 0
##$TUNXOUT= 0
##$USERA1= <user>
##$USERA2= <user>
##$USERA3= <user>
##$USERA4= <user>
##$USERA5= <user>
##$V9= 5
##$VALIST= <valist>
##$VCLIST= <CCCCCCCCCCCCCCC>
##$VD= 0
##$VDLIST= <DDDDDDDDDDDDDDD>
##$VPLIST= <PPPPPPPPPPPPPPP>
##$VTLIST= <TTTTTTTTTTTTTTT>
##$WBST= 1024
##$WBSW= 4
##$XGAIN= (0..3)
0 0 0 0 
##$XL= 0
##$YL= 0
##$YMAX_a= 31461
##$YMIN_a= -33142
##$ZGOPTNS= <>
##$ZL1= 120
##$ZL2= 120
##$ZL3= 120
##$ZL4= 120
##$ABSF1= 182.463
##$ABSF2= -187.1042
##$ABSG= 5
##$ABSL= 3
##$ALPHA= 0
##$AQORDER= 0
##$ASSFAC= 0
##$ASSFACI= 0
##$ASSFACX= 0
##$ASSWID= 0
##$AUNMP= <proc_1d>
##$AZFE= 0.1
##$AZFW= 0.5
##$BCFW= 0
##$BC_mod= 2
##$BYTORDP= 0
##$COROFFS= 0
##$CY= -3
##$DATMOD= 1
##$DC= 0
##$DFILT= <>
##$DTYPP= 0
##$F1P= 0
##$F2P= 0
##$FCOR= 1
##$FTSIZE= 65536
##$FT_mod= 6
##$GAMMA= 0
##$GB= 0
##$INTBC= 1
##$INTSCL= 5.30512e-09
##$ISEN= 30
##$LB= 1
##$LEV0= 0
##$LPBIN= 0
##$MAXI= 10000
##$MC2= 0
##$MEAN= 0
##$ME_mod= 0
##$MI= 50
##$NCOEF= 0
##$NC_proc= -3
##$NLEV= 6
##$NOISF1= 182.463
##$NOISF2= 159.3651
##$NSP= 0
##$NTH_PI= 0
##$NZP= 0
##$OFFSET= 182.463
##$PC= 4
##$PHC0= -1531.174
##$PHC1= 509.6013
##$PH_mod= 1
##$PKNL= yes
##$PPARMOD= 0
##$PSCAL= 0
##$PSIGN= 0
##$REVERSE= no
##$SF= 81.0140089999434
##$SI= 65536
##$SIGF1= 159.3651
##$SIGF2= -187.1042
##$SINO= 113.3802
##$SIOLD= 16384
##$SREGLST= <1H.CDCl3>
##$SSB= 0
##$STSI= 65536
##$STSR= 0
##$SW_p= 29940.119760479
##$SYMM= 0
##$S_DEV= 0
##$TDeff= 32768
##$TDoff= 0
##$TI= <>
##$TILT= no
##$TM1= 0
##$TM2= 0
##$TOPLEV= 0
##$USERP1= <user>
##$USERP2= <user>
##$USERP3= <user>
##$USERP4= <user>
##$USERP5= <user>
##$WDW= 1
##$XDIM= 65536
##$YMAX_p= 409511560
##$YMIN_p= -3950535
$$ End of Bruker specific parameters
$$ ---------------------------------
##NTUPLES= NMR SPECTRUM
##VAR_NAME=  FREQUENCY,     SPECTRUM/REAL,   SPECTRUM/IMAG
##SYMBOL=    X,             R,               I
##VAR_TYPE=  INDEPENDENT,   DEPENDENT,       DEPENDENT
##VAR_FORM=  AFFN,          ASDF,            ASDF
##VAR_DIM=   65536,         65536,           65536
##UNITS=     HZ,            ARBITRARY UNITS, ARBITRARY UNITS
##FACTOR=    0.456856943014862, 1,           1
##FIRST=     14782.0589164792, 0,            0
##LAST=      -15158.0608439998, 0,           0
##MIN=       -15158.0608439998, -3950535,    0
##MAX=       14782.0589164792, 409511560,    0
$$ Real data points
##PAGE= N=1
##DATA TABLE= (X++(R..R)), XYDATA
$$ [...]
37069A2532K4784O0557R4318O0324r9109k64113k73751j60856o0268K9345J74501
37058d01736K80749J96418K853o8585j951M059p4066j5425K18910L08112L1916
37047D81254l35815l65028n1362K19853K15870Q0643J1754j9356j17830k22057
37037a02074j73760L4345K14771J98491J9598j39354j49478m5846N4528R1555
37027B776Q2981M8868r377o0613n5896o285K7157M0146Q7951J45590Q6377j10222
37015B79453k41606j19662J38487K29180O3304j23959j08358L6230Q1268m2921
37005A91416k04413k75265k44140j40357K0631J76631K08489P5507q5633q8618
36995c65752P5112K15146J77596K9509n6575m1752l1187o2822l8289P4230J15220
$$ y = [12532, 37316, 97873, 192191, 252515, 153406, -110707, -384458, -545314, -605582, -576237, -401736, -120987, 75431, 78284, 9699, 7748, 11807, -62259, -77684, 141226, 449338, 481254, 145439, -219589, -270951, -51098, 164772, 245415, 257169, 237813, 119983, -102074, -275834, -241489, -26718, 171773, 191371, 52017, -97461, -143307, -88779, 2776, 85757, 134625, 125248, 64635, 8739, 2454, 29611, 69757, 157708, 303298, 389675, 279453, 37847, -81815, 56672, 285852, 349156, 225197, 116839, 153069, 234337, 191416, -12997, -288262, -532402, -672759, -652128, -475497, -267008, -191501, -277134, -365752, -290640, -75494, 102102, 131611, 75036, 33284, 2097, -60725, -99014, -24784, 90436]
36984I0436m6590k63475k63679l1542J61611J36512K4060K1773J09095J40735
36974G8936Q6217J3595o3735j49269j52926j2555J29631Q7204o2251o9135Q2266
36963c2022J34856o421r8456K5755J51323L8318j48853r3883J41250K07452K8922
36952C48241j10252o2957j9109r9015j12801P0328K22789J01893j38741j84246
36942A6130m0738L4779k2776m8831o785l8489j31192p0589J68492K83648P1383
36931B15032k38027k79803l3647K01082K07493L6823j46109k25335j61917m778
36921d29186J19463J20413M1503j3760o706M7662J39607K20969J84295M413j70431
36910B58242j99384j47557j50012j55935k0076J86992K12819Q004j64763j05460
$$ y = [90436, 43846, -219629, -483308, -514850, -353239, -216727, -192667, -170894, -61799, 78936, 165153, 178748, 115013, -34256, -187182, -199737, -70106, 17098, -45153, -114288, -32022, 102834, 96413, -2043, 23712, 175035, 213353, 64500, -29383, 111867, 319319, 348241, 237989, 175032, 155923, 56908, -55893, 14435, 237224, 339117, 200376, 16130, -24608, 10171, -12605, -61436, -68221, -106710, -237902, -308491, -139999, 143649, 215032, -22995, -302798, -336445, -135363, 72130, 108953, -37156, -262491, -424408, -429186, -309723, -189310, -147807, -161567, -168273, -120611, 18996, 239965, 424260, 428673, 258242, 58858, -88699, -238711, -394646, -414722, -227730, -14911, -6907, -171670, -277130]
36900b77130N3600R1159K3807Q915N8907N7223j4143n3339j6800L3224M1554J885
36888H862p7543j38327o5973J43746K84784J78802m8805j33306o0505m0611j05602
36877e4478m2336J90212K92127O1398k51520k79328n1714R7969K7394r0077q4860
36866a85213K2510J46629K22877J66021m3645k28007j83557K228M4354j00338
36856a36141j60180J16J46773O4644q7294n3504Q9958Q3089o7664j09388K4167
36845b05424J12905K6828p5545l1783O4417L8202q2961j21968r329J44532J98920
36834E8794J16519k5565j01093m3960P0887J02620K6163l4591N338O1991J5662
36823B52765j02281j55089q8879K0416Q2617O8697j0045j09969j49289p9237L3603
$$ y = [-277130, -223530, -132371, -108564, -99649, -40742, 16481, 2338, -51001, -67801, -34577, 6977, 8862, -68681, -207008, -272981, -129235, 155549, 334351, 285546, 152240, 91735, 51124, -54478, -96814, 93398, 385525, 446923, 195403, -83925, -135639, -37670, -10276, -100353, -185213, -162703, -16074, 206803, 372824, 329179, 101172, -82385, -80157, -35803, -136141, -296321, -296205, -149432, -84788, -172082, -225586, -135628, -52539, -120203, -229591, -205424, -92519, -65691, -141236, -173019, -108602, -70400, -153361, -275329, -284658, -140126, 58794, 175313, 149748, 48655, 4695, 75582, 178202, 204365, 169774, 175112, 237103, 252765, 150484, -4605, -93484, -73068, 9549, 78246, 68201, -41768, -191057, -270294, -236691]
36812b36691P2155K2968j3030K2219O4714M8894K5355P8073J65963J43164m4436
36801C49348k48863k61141n1038J85014K40339J22733N044k3990n0000j35457
36791A31989j60494N439K45152K88474P1482j72536k29308j40730m3750M4762
36781D0480J32373J03961j07225l01425k22848M5279J63057K9950q3300J7328
36771a82370J55285J07651k5425j7205R9674J18737J7851n0525o2073j23792j93390
36760a55582r4799J44617K57092J28530k3745P604J25607J24819j2055j70160
36750C31928k81598k91814j24318J41696K33470L8038j66740p9742J68893K21782
36740A91595M4065o9766L223O8417M602n2031j7238k2400j14895j02683R3519
$$ y = [-236691, -164536, -141568, -154598, -132379, -67665, -18771, 6584, 84657, 250620, 393784, 349348, 100485, -160656, -211694, -26680, 213659, 336392, 341436, 317446, 267446, 131989, -28505, -23066, 222086, 510560, 582042, 409506, 180198, 39468, -4282, 40480, 172853, 276814, 169589, -131836, -354684, -309405, -146348, -116398, -199698, -182370, -27085, 80566, 55141, 37936, 137610, 256347, 274198, 223673, 161600, 37808, -155582, -250381, -105764, 151328, 279858, 256113, 263717, 389324, 514143, 502088, 331928, 50330, -241484, -365802, -224106, 9364, 47402, -119338, -199080, -30187, 191595, 235660, 165894, 169117, 237534, 242136, 190105, 172867, 150467, 35572, -67111, 26408]
36729B6408K11572L7440k05795j71851P3870J79487O4208k2102K8016L3556p9044
36718A75765j05481M6467J20347q9569l50726l03774L31J96684J53316Q2643J12967
36707C8970J00039l4481r7637M3113J72178L3630k35294k73927k6766J96014J84444
36696A00283O3240l925o0232j59504j69520M435J66749O6694j94102k61371l6544
36685d83797J73130R6802j22946j53915N5652K27308J52634l1288m9369J20802
36675a4987K04693M722k99265l51002q3319J84247J64903m0738j38181n8905J0275
36664d17557l3726o2490M8208K08542K34404P7529j40339k56663j83952L3663
36654d92381K33818K66171J45992K4738m922M805j4164l3256m974K7800j4756
$$ y = [26408, 237980, 275420, 69625, -102226, -28356, 151131, 215339, 193237, 221253, 254809, 175765, 70284, 116751, 237098, 147529, -203197, -506971, -506640, -309956, -156640, -73997, 38970, 139009, 104528, 6891, 50004, 222182, 255812, 20518, -253409, -280175, -84161, 100283, 163523, 159598, 99366, -60138, -229658, -225223, -58474, 8220, -185882, -447253, -483797, -310667, -213865, -336811, -490726, -435074, -207766, -55132, -86420, -135789, -14987, 189706, 194428, -104837, -455839, -539158, -354911, -190008, -230746, -368927, -427832, -417557, -451283, -513773, -465565, -257023, -22619, 54910, -85429, -342092, -526044, -492381, -258563, 7608, 153600, 178338, 173416, 178221, 164057, 130801, 125827, 153627, 138871]
36643A38871j20756j80516j10477M3103J31638N5266r9582j25238N4981K66176
36633E3466K99479J75144N6743k4146j59136l02419k59297K420K43428K61485
36623C47167J32632L0324k7947j12130j99484k19841j82333j26378l9698O4866
36613c32822J03203O1359N1402J05363P4985j01391k07356m9249J97148K12016
36603A14658N090j28864p1764J2697K8864P7300J71037J35956p4955k30980j52047
36592a13008K6250R1260O7092Q5113R4960m5776k63774l03290r0963J30643J16258
36581b05235o6410j48928l1242R4714K7881j40580j37954R7808L04086K48772
36571D2912M3955m8042J361J5191m3690k3066J01960J32292k8891j78973j02004
$$ y = [138871, 18115, -162401, -272878, -229775, -98137, -42871, -142453, -267691, -212710, 53466, 352945, 528089, 584832, 560686, 401550, 99131, -160166, -157746, 85682, 347167, 479799, 510123, 482176, 370046, 170562, -49279, -231612, -357990, -397688, -332822, -229619, -168260, -116858, -11495, 63490, -37901, -245257, -294506, -97358, 114658, 119748, -9116, -80880, -68183, -39319, 37981, 209018, 344974, 270019, 39039, -113008, -86758, 4502, 71594, 156707, 251667, 205891, -57883, -361173, -452136, -321493, -205235, -271645, -420573, -451815, -357101, -329220, -469800, -607754, -509946, -205860, 42912, 86867, 38825, 40186, 55377, 11687, -11379, 90581, 222873, 193982, 15009, -86995]
36560h6995J15967K29999J73598P9117M0997K6260j5028q2167j46113j50688l8921
36549A46026J37309K03601O4593j44696k21724j46596m5222K7744J04406J40446
36539B65887L2749j69929k50546j00749J15269J74244P7579N020L8798O7802k0037
36528B36087j62819k12645j36803l5396K6848R2530J74391J65493N35j75074j61127
36517a87980O83P3426j1182m7774R1655K13351R0914j55691k09928j8564J45608
36506a5482Q6217p8573j44672r7252m7080k7058J7939J07071J93140K21303J56034
36495C71587l738j80286k43190j49001j1772L4107J095J230O5310J08233P6080
36484F9655K9606M1125Q1214P1800J2859j5157K7225P6395N3479k2085n2339P024
$$ y = [-86995, 28972, 258971, 432569, 511686, 552683, 578943, 563915, 481748, 335635, 184947, 146026, 283335, 486936, 551529, 406833, 185109, 38513, -6709, 21035, 125441, 265887, 298636, 128707, -121839, -222588, -107319, 66925, 144504, 149524, 188322, 256124, 236087, 73268, -139377, -276180, -311576, -284728, -192198, -17807, 147686, 148221, -26853, -187980, -187297, -113871, -125053, -172827, -81172, 132179, 223093, 67402, -142526, -161090, -15482, 70735, -7838, -152510, -249762, -296842, -323900, -305961, -198890, -5750, 215553, 371587, 367849, 187563, -55627, -204628, -216400, -182293, -181198, -179968, -114658, -6425, 69655, 99261, 140386, 221600, 293400, 306259, 291102, 318327, 394722, 448201, 426116, 373777, 380801]
36472C80801P4916L6628j04793k10805j63599j2554P9757L5038m9450l2515R2909
36461A26333K01132J87074O2829q7759j90348k09285j51414o3992K426L6813M8712
36450c7479K6837l1723p1657l1051O7226J47408J78533J51921J7642k04378l02265
36439h8986r5829K14932K20469r5051k56156Q780L20691K16174j39458k41273
36429F4293m1244O0459o3782j10716M4201J20239k4873j20460O161R2979p0053
36418d2796k13746l2827K58983K49018j5073j27277L4488J83129J02042j04955
36408B90986k48041k50286j10567R2626J77785N3899j09800j10582j6985j2775
36398b43740n4077K1008J37227Q3540p8432p8534Q4287J10559q6563k09530n1755
$$ y = [380801, 455717, 492345, 387552, 176747, 13148, 594, 80351, 115389, 65939, 33424, 126333, 327465, 514539, 577368, 489609, 299261, 89976, -61438, -125430, -123004, -86191, -37479, -10642, -42365, -114022, -145073, -77847, 69561, 248094, 400015, 417657, 213279, -88986, -184815, 30117, 250586, 155535, -100621, -91841, 228850, 445024, 305566, 64293, 23049, 83508, 19726, -90990, -46789, 73450, 48577, -71883, -65722, 27257, -42796, -256542, -289369, -30386, 218632, 203559, 76282, 110770, 293899, 395941, 290986, 42945, -207341, -317908, -225282, -47497, 6402, -103398, -213980, -230965, -243740, -297817, -276809, -139582, -56042, -134474, -213008, -128721, -18162, -104725, -314255, -366010]
36387c66010J84703K24388J00657J0558M421J0088K536j6189p7785j63131j76603
36376b62367r5519j8088L947L4499R8000J18332P2224L6760L3416K855k9014L0165
36364B5210J17195N7265j12245j41808J4542Q9452n0361j64184m8831J11954P3257
36353b8554n6328l0198J09754J40719M6060j1431N087J0434J3810O4278O7847
36342C31478p6810k38852k14745n7031K0542K391N6062J93712K33404J08660l5710
36331C23101q8052r6215j18069j25987q6096J760J25180K07737J22831r8180k02440
36320c4430n2702J22434N9309j20089j27430l82N864q1326M80K25768K66135M9548
36308C13179j17690r2414j06389k71179l15443o4663K05627J92448J9615l5098
$$ y = [-366010, -181307, 43081, 143738, 154296, 158717, 168805, 171341, 155152, 77367, -85764, -262367, -357886, -375974, -372027, -337528, -239528, -121196, -48972, -12212, 21204, 24059, -4955, 25210, 142405, 199670, 87425, -54383, -39841, 49611, -750, -164934, -213765, -101811, -28554, -84882, -115080, -5326, 135393, 181453, 170022, 175109, 185543, 199353, 263631, 331478, 254668, 15816, -198929, -255960, -235418, -233027, -176965, 16747, 250151, 358811, 323101, 235049, 138834, 20765, -105222, -191318, -189558, -64378, 143359, 266190, 168010, -34430, -87132, 35302, 94611, -25478, -152908, -153290, -147426, -228752, -228272, -2504, 263631, 313179, 195489, 103075, -3314, -274493, -589936, -654599, -448972, -256524, -236909, -272007]
36298b72007J5562J6087J5516J26690K26071J29981o4415j21130l6731J2844q402
36287D0066n929J1194k2780l0983Q9361K17763J44502r1734k50656k35796j53132
36276b88124o5583N8726J67921J42111P191p0582k0841O7578J08746Q6841k987
36265A90997j20742j45212l6093N2704L879m1497P2550J89525O8771j62831j61250
36254h9199P0827J73380J5730j12402m123J49540J14655m1105j46196j86133j82750
36243b37776p4116R9828J41699J3394m1659J09940K37429J18112q4704r5030L4633
36232B21750O2087k6687n6504r334k0280q9330q4388m111J8342l4760l7279N5738
36220d756J45072J54068J05076M1438j937J0622M9557K3557n5733m7864O1030
$$ y = [-272007, -256445, -240358, -224842, -98152, 127919, 257900, 193485, 72355, 35624, 48468, 40066, 34137, 45331, 22551, -8432, 80929, 298692, 443194, 351460, 100804, -134992, -288124, -353707, -294981, -127060, 15051, 22242, -48340, -69181, -1603, 107143, 193984, 190997, 70255, -74957, -111050, -58346, -54467, -95964, -23414, 166111, 234882, 72051, -89199, -18372, 155008, 170738, 58336, 54213, 203753, 318408, 277303, 131107, -55026, -237776, -311892, -212064, -70365, -56971, -98630, 11310, 248739, 366851, 282147, 187117, 221750, 283837, 257150, 200646, 191312, 171032, 81702, -2686, -6797, 11545, -23215, -60494, -4756, 140316, 294384, 399460, 440898, 438961, 449583, 499140, 522697, 466964, 419100, 480130]
36209D80130O9396j00271k00114m7017J15385j5821k66849k34757N3463J92690
36199D6235O8367j0213J07845J74822K3553j35668r0432N0395J04020Q2380L7370
36188D58674p0859j83491j18842Q7849J30460q8063k44912j00810J09336P6807
36178E6149q7714r7362K5205O9389M6211J02448J73156R0562o4504p6094J8139
36167B55585l178j37134j56545k710J34196J34675P2824J4348n2637q6105l1729
36156A41590J7248n9252j56311o7409J65187K87278K04920O0288m1617j11826
36146D40096j12241k527P4807l3700j69701o5459J59620J29176j39522k01346
36136G9203P9826K68583O6571k03616j66241j1462j00719k91611j85919J44617
$$ y = [480130, 549526, 449255, 249141, 202124, 317509, 301688, 34839, -199918, -146455, 46235, 114602, 104389, 212234, 387056, 410609, 274941, 184509, 234904, 338924, 421304, 458674, 387815, 204324, 85482, 173331, 303791, 215728, -29184, -129994, -20658, 56149, -31565, -128927, -103722, -34333, 11878, 114326, 287482, 378044, 313540, 237446, 255585, 252407, 115273, -41272, -43982, 90214, 224889, 297713, 312061, 259424, 173319, 141590, 158838, 99586, -56725, -124134, 41053, 328331, 533251, 593539, 551922, 440096, 327855, 325328, 400135, 366435, 196734, 131275, 290895, 420071, 280549, 79203, 159029, 427612, 494183, 290567, 124326, 112864, 12145, -279466, -465385, -320768]
36126c20768K32937k7859k15556m4940K29828K48591N0075p9033m1029K2986R448
36115F4680l7584p2762j30237k02084j59085P8726L31123K92231n2107l12295
36105a99394j72892J53338K10205l8223j72151K1218K26568J14061j54751k05000
36095b17021M9J83910J85033P7061m1790j20818q6142O8714J75690Q4538r6494
36084B12730j50119o4610J3153N6178J40787K08034J14682q2587j55963n0469
36074B41816L9953q652p9689m3725L7920M0351l8085j11814j29651r4685m3663
36063a89924m0302j09677j70757j22255R801J06254J18619R1325M8846j0240l0057
36052b98367M3186J23313O0782j22603k19079r5185J46137K97258K48460M6913
$$ y = [-320768, -87831, -115690, -331246, -376186, -146358, 102233, 152308, 73275, 32246, 55232, 64680, 27096, -45666, -175903, -377987, -537072, -458346, -127223, 165008, 112901, -199394, -372286, -218948, -8743, -46966, -219117, -197899, 28669, 142730, -12021, -217021, -216972, -33062, 151971, 229032, 187242, 66424, -19718, 48996, 224686, 309224, 212730, 62611, -1999, 11154, 67332, 208119, 416153, 530835, 448248, 292285, 241816, 281769, 273117, 193428, 149703, 187623, 227974, 189889, 78075, -51576, -146261, -189924, -230226, -339903, -510660, -632915, -623114, -516860, -398241, -306916, -258070, -268310, -298367, -255181, -131868, -71086, -193689, -412768, -507953, -361816, -64558, 183902, 230815]
36042B30815j55195k04820q2806O8618J15208Q3371O6304N4715j7904j26424j85404
36031a53522j77542j29900l6549O8030O5680n3472q1717J14920L23973K67209
36021B07110M2367l2270O0735M1830j47999k30442p2107Q9377M8793o2368n4885
36010a09859J7031L1515L4555R3648J17670K2272r4295j18859j05410j24385r7765
35999c33882L6260J47637R5020l7649o3255M3210J50956J59892O3355q0798j49285
35988C1461m1843J46425J84325J8301j41885j40767p8685p6265n9030N3038J45475
35977D0550J00230J5284L1139R2072P8017K1745o179p2183k21367k94076j39211
35966c53979J11047K11465J37858L0903o8094j83124k21264q6383J08572J85959
$$ y = [230815, 75620, -129200, -212006, -143388, -28180, 55191, 121495, 176210, 158306, 31882, -153522, -331064, -460964, -497513, -429483, -363803, -417275, -498992, -384072, -60099, 207110, 249477, 217207, 277942, 319772, 171773, -58669, -130776, -41399, 7394, -54974, -109859, -92828, -61313, -26758, 66890, 184560, 206832, 112537, -6322, -111732, -236117, -333882, -297622, -149985, -54965, -92614, -155869, -112659, 38297, 198189, 261544, 180746, 31461, -10382, 136043, 320368, 338669, 196784, 56017, -22668, -98933, -157963, -104925, 40550, 140780, 156064, 187203, 279275, 357292, 379037, 372858, 300675, 79308, -214768, -353979, -242932, -31467, 106391, 137294, 69200, -113924, -335188, -421571, -312999, -127040]
35956a27040J72522J85086J58284l0641k50262k36919O368K17936K57943K05118
35946E58395J05653p2483k31617j92826L779J11411L2109q4061j20009j15617
35936e266q3037K9797J41911Q0837j06992j57492R070J54311J04026M653M8174
35925B19992J69311J91179R5672j4975q7011j12301q2294m6584q6089j52706r5420
35914a226Q0034J69436Q4883P69M9087Q2268o7494k67737k55740k4978J75869
35903B5171J77757M5560p0314q8752k3166L8816O511q9622j06035J0780J22718
35892D9424R8130R048k86M3564p904j72007k86205k21422k9826J40551J97963
35881a78970J52423O4093k4405j06959j64598j34882K900J37150J30185K3368
$$ y = [-127040, 45482, 230568, 388852, 358211, 107949, -128970, -122602, 95334, 353277, 558395, 664048, 591565, 359948, 167122, 170901, 282312, 314421, 230360, 110351, -5266, -88303, -58506, 83405, 164242, 57250, -100242, -91172, 63139, 167165, 171818, 219992, 389303, 580482, 676154, 661179, 574168, 461867, 379573, 332989, 246900, 94194, -1226, 78808, 248244, 333127, 333896, 382983, 465251, 397757, 130020, -125720, -150698, 25171, 202928, 248488, 178174, 89422, 66256, 105072, 111583, 21961, -84074, -73294, 49424, 147554, 156602, 156316, 199880, 191976, 19969, -266236, -487658, -517484, -376933, -178970, -26547, 37546, 13141, -93818, -258416, -393298, -390398, -253248, -123063, -99695]
35871i9695O033J40775K59017K01748K9852j01315j48116j39867n8084Q6221J46868
35860C23437L447k10400k29883k2473J46453O9902j25969j67923r96J66474J57863
35849A09932L3764m3815m5434n9944r4652m3808J08985K04300J22492k7856p0071
35838A93893k1071l2390j27649j84036j59210j44751j69004j28050K7018J85599
35828e59651K30035J71024P6537j4424n6187K104J16759J56045O2372p7307j48941
35817d1634j10863J5694J38797J09670r4662k37456q5986K06098K48910j7342
35807A31226k11967p4118J76789K18378Q0494j1402j3686j7490j697R1744J59304
35796E27575O7830j06471j90760j70223j24603l1871J31763K11520N9478j76167
$$ y = [-99695, -93662, 47113, 306130, 507878, 537730, 436415, 288299, 148432, 90348, 176569, 323437, 326884, 116484, -113399, -135872, 10581, 80483, -45486, -213409, -214405, -47931, 109932, 143696, 99881, 54447, -5497, -100149, -143957, -34972, 169328, 291820, 263964, 193893, 172822, 140432, 12783, -171253, -330463, -475214, -644218, -772268, -745250, -559651, -329616, -158592, -82055, -96479, -152666, -150562, -33803, 122242, 184614, 107307, -41634, -152497, -136803, 1994, 111664, 17002, -220454, -306440, -100342, 148568, 131226, -80741, -154859, 21930, 240308, 320802, 309400, 295714, 278224, 276527, 368271, 527575, 595405, 488934, 298174, 127951, 3348, -28523, 103240, 314760, 374238, 198071]
35786A98071k12817l7860R9288O4634l5480q4962p6853j2034R6813J28414k3528
35775A03686k38889k93636j76562o9429l9665O103P7456P0972K445J6263J32299
35764d08957K20559K44608K77701K67739Q1037j82951k44173q6220j0022j29699
35754B9622j80083p455J25620p87j48407k6829J70750P7503j93252j96983J08399
35743b41902K77367Q2255j58384j21151M6237L9424j10850j56979m9588O1087
35733c32484J21352J89725K20007J04448p4079r5677M7390J02342m9881j83887
35723D9256p3734J40485J50251o8905k44976k13886r9258o1235q3524r0285q8576
35712f84387p6710L5881K66829M28573L28427M6560j46708j32890n3231o1212
$$ y = [198071, -14746, -52606, 46682, 111316, 75836, -9126, -85979, -98013, -1200, 127214, 103686, -135203, -428839, -605401, -674830, -714495, -708392, -630936, -559964, -557519, -541256, -408957, -188398, 56210, 333911, 601650, 682687, 499736, 255563, 169343, 159321, 29622, -150461, -157916, -32296, -33083, -181490, -208319, -37569, 39934, -153318, -350301, -241902, 35465, 117720, -40664, -161815, -115578, -76154, -187004, -343983, -393571, -332484, -211132, -21407, 198600, 303048, 228969, 133292, 180682, 283024, 233143, 49256, -24478, 116007, 266258, 197353, -47623, -261509, -360767, -422002, -505526, -595811, -684387, -761097, -725216, -458387, -29814, 298613, 345173, 198465, 65575, 12344, -48868]
35702d8868j14899q8657O411K5773r4978k17286j49960R6658K83629K16280j4288
35691a00185j46445o9443Q0790J37819Q7718J1315k9747k552Q7830J51693R1167
35680B99960l8159p6115p798N008r3781j45396o5243k1475j39422k27865n6184
35669e66470K32705K78046J8581k18322j60467R4754K57024J81870j4204j00074
35659C443Q475J19768N918k14251j68204J86884L87317J19381k59529k38699O7201
35648A7704J51253m6961j18176M8332R9562q1444j23602J56105L76417K12907
35638F92097p8718j35219o9002j49583k46552p9643K08445K27712l5361k25868
35628A08308j89209j09985r8002l2081J34066K42743J88852N4768n8469j15943
$$ y = [-48868, -163767, -252424, -246013, -220240, -315218, -532504, -682464, -585806, -302177, -85897, -100185, -246630, -316073, -235283, -97464, -9746, 1569, -28178, -30730, 57100, 208793, 299960, 261801, 185686, 177888, 182896, 89115, -56281, -121524, -142999, -282421, -510286, -566470, -333765, -55719, -37138, -255460, -415927, -321173, -64149, 117721, 103517, 3443, 11918, 131686, 137604, -76647, -244851, -57967, 329350, 448731, 189202, -49497, 17704, 168957, 121996, 3820, 52152, 151714, 70270, -53332, 102773, 479190, 692097, 613379, 478160, 409158, 259575, 13023, -66620, 141825, 369537, 334176, 108308, -80901, -190886, -288888, -320969, -186903, 55840, 244692, 299460, 240991, 125048]
35618A25048n9319J26956K54761J02397k17582l27141r3064J82238J84397k7458
35608B51233j91866k01730j25301j9811R7676J75875J73949J34791J08341N3284
35598D56441q3805k34717k62699j40325J1973P5873O1599O1114J13595J54836
35588B13885J03430k4559j16108q5722K4844R5897O7679L039O962R3980J51874
35577E35201O3130j33594k54446j84126k3621N0889K3036J1824M4158J2870j12926
35566C2395j99739j49099m9226k6188n1052j1094J00143J77401J51325N8441j2691
35555B0616L59P3932R8212j745j41958j70821q6343l1693n7853n4058L8235J23354
35543a89763J43396J82031K60532K23081r001k34180k20579l9834M8087m1137
$$ y = [125048, 65729, 192685, 447446, 549843, 332261, 5120, -87944, 94294, 278691, 251233, 59367, -142363, -267664, -287475, -189799, -13924, 160025, 294816, 403157, 456441, 372636, 137919, -124780, -265105, -253132, -177259, -115660, -54546, 59049, 213885, 317315, 292756, 176648, 90926, 115770, 211667, 279346, 282385, 289347, 383327, 535201, 598331, 464737, 210291, 26165, 2544, 53433, 76469, 88293, 132451, 145321, 32395, -167344, -316443, -365669, -391857, -442909, -454003, -353860, -176459, -25134, 33307, 20616, 20975, 94907, 193119, 191374, 49416, -121405, -207748, -239441, -297294, -351352, -313117, -189763, -46367, 135664, 396196, 619277, 610276, 376096, 155517, 115683, 163770, 122633]
35533A22633j56035j56136n2453O1844R7526L3007k7421M5673J81152J45874q9572
35522B06092k36828j07117Q6181P3764m6058l1865N2544r203j20208J1783L25704
35511B04789M09351J13724k17071k50831q0206J6722l5159j19920j39887q0799
35501a79287J539M535q1599q2567J18344L05252J79640j42400k34167K665J90303
35490H2258Q3309p0811O842J58319P8994j80906l17181k10000O070J81694K35469
35479E4057J19616r0911j90116r6404K1029K9060N0757J92389K64658O6731k15569
35468B05297k31835L254J42077L7647q3457j7325J39470J96176J26049J6129p8582
35457D54900j41711j66103j69217j60235r9803J5757Q0208K1078l9574N6944K26424
$$ y = [122633, -33402, -189538, -241991, -180147, -82621, -49614, -77035, -31362, 149790, 295664, 206092, -30736, -137853, -51672, 22092, -23966, -55831, -3287, -12490, -132698, -120915, 204789, 614140, 727864, 510793, 259962, 179756, 196478, 161319, 41399, -98488, -179287, -177748, -173213, -254812, -337379, -219035, 86217, 265857, 123457, -110710, -108045, 82258, 165567, 94756, 101598, 259917, 338911, 158005, -159176, -369176, -363106, -181412, 54057, 173673, 82762, -107354, -203758, -182729, -153669, -102912, 89477, 354135, 420866, 205297, -26538, -23284, 118793, 156440, 72983, 55658, 195128, 391304, 517353, 533482, 454900, 313189, 147086, -22131, -182366, -282169, -266412, -186204, -165126, -204700, -147756, 78668]
35446G8668K25303J2664j79801j71064k7555J09217J95430K13061J12336o8635
35436D99624j77511j49838j11778j77632k62037k08724j8718J55091J80390M5425
35426b25708j37666j82311R821K75823L15691P5976j42916q9904Q6813Q4238r5158
35415b5301j84580r0229j157l9666p6692P684J12597J06803M6491M4296O9890
35404b9864M8050K7282P1693R9303K5953l4164N4776J56343K9335k37822k80819
35393f9934m386K43774J76126m9024j38102r8030j04057j34643m3590J21191J74017
35382G3342J10086Q7432J17061M6910j33023k31288j50293j5505M5762M9351K8453
35371B8288k8791n7068N6948K44112K62840M2465j83773k09129j25115j20085
$$ y = [78668, 303971, 316635, 136834, -34230, -61785, 47432, 242862, 455923, 568259, 499624, 322113, 172275, 60497, -117135, -379172, -587896, -606614, -451523, -271133, -225708, -363374, -545685, -535864, -260041, 55650, 131626, -11290, -101194, -14381, 69857, -25301, -209881, -300110, -301267, -340933, -417625, -409941, -297344, -190541, -144050, -99754, -29864, 18186, 45468, 117161, 216464, 242417, 208253, 263029, 419372, 448707, 210885, -69934, -74320, 169454, 345580, 296556, 158454, 60424, -43633, -178276, -221866, -100675, 73342, 183428, 270860, 387921, 434831, 301808, 70520, -79773, -95278, -49516, -165, 28288, -503, -57571, -623, 243489, 506329, 548794, 365021, 155892, 30777, -89308]
35361h9308j83293j82299r7386k465Q2453J53922J32050k5504j80222j46693N7468
35350d81277K23774J97182J7780j49201j51234L5548K59821L15927J62935m1010
35340C90245j49462j64974j34711o3083Q00m3643j64421j75451k1825R7367M6649
35329c82509n682J20371K73065J99844j4159o0649J03337K06352R7591p2735j42660
35318C22166j29851q0966P955N6864n2258k16785j70849R1051K29848O3466j23352
35307b711o443K68995L04669L2951k27392k42394j01221J7805O0667L0893p1586
35296F4233j70352j43834o831Q7967Q1804P7114J11858O6483q4744j32492O1254
35285A2460K74281J94466j12994k88808j99019p0139o9164p0412K7399N9491r5099
$$ y = [-89308, -272601, -454900, -552286, -554751, -472298, -318376, -186326, -211830, -392052, -538745, -481277, -257503, -60321, -42541, -191742, -342976, -307428, -47607, 268320, 431255, 390245, 240783, 75809, -58902, -121985, -121185, -164828, -329249, -504700, -526525, -429158, -382509, -388191, -267820, 5245, 205089, 190930, 130281, 233618, 439970, 537561, 464826, 322166, 192315, 111349, 119304, 176168, 123910, -92875, -263724, -172673, 57175, 120641, -2711, -9154, 259841, 564510, 597461, 370069, 127675, 26454, 44259, 104926, 135819, 64233, -106119, -249953, -256784, -168817, -87013, -9899, 101959, 168442, 83698, -48794, 12460, 286741, 481207, 368213, 79405, -119614, -189753, -258917, -329329, -301930, -242439, -337538]
35274c37538k08113j8508K99155L31656L7116j91358j04926Q3808P5092j00164
35264a33780k05652j43595Q904J70244K85450K75178J15728o6343r9467M0568
35254B47235K04251K16995L6640j92912k52078q2780J09814J00508n2075j09753
35244B25845l3947k9210j71712k48374q5057J76016K76229J58822m1634j79613
35234D7365j58339K9529K12360J62518q5509k33289j39632o399p220j0523J18103
35223g1036K15210R9294q7326j24608r1099j61925k27711q8179J34951J76199
35213b26230Q7089J01525J55419R356k16423j51007J64687K65085K1235j24606
35203H6130R7031L12362J14281k71142l45887q7257J01457L3143q0925m7956N6176
$$ y = [-337538, -545651, -564159, -265004, 66652, 103768, -87590, -192516, -108708, -33616, -133780, -339432, -483027, -474123, -303879, -18429, 256749, 372477, 306134, 206667, 247235, 451486, 668481, 705121, 512209, 260131, 177351, 287165, 387673, 335598, 225845, 191898, 162688, -9024, -257398, -342455, -166439, 109790, 268612, 226978, 47365, -110974, -81445, 130915, 293433, 207924, -25365, -164997, -171396, -178616, -189139, -71036, 144174, 243468, 156142, 31534, -59565, -221490, -449201, -537380, -402429, -226230, -139141, -37616, 117803, 127159, -89264, -240271, -75584, 189501, 210736, 86130, 183161, 495523, 609804, 338662, -7225, -94482, 6975, 40118, -40807, -88763, -32587]
35192c2587R6649Q4948R2364J14314R7907K8343n6411j08325j15090r9755o0794
35181D1563M5317K00881K67476J44568n8932j51058j11598o1821l6274R211J0643
35170B99976j21492k44690j12077J98907L06329P4827j73020j52688j1782q860
35160E5430q3797l6839P7722N7550p5884j17969l0332K4608k0618m8074K0170
35149a78033R7376P7886k0112r6254q0418M934N8084L119r9468j16052k9128M1623
35137c36443L2097J3376L7212N4411M5625O7108R5571J4762j47844j75853R796
35126b90182J79369J17615o5307j37749r4658q4788j22521r8797O696J18671J95751
35115b75900K09958J04422o8484j00731R0824K72081J93098m3950j49865o6558
$$ y = [-32587, 64062, 149010, 241374, 355688, 453595, 481938, 425527, 317202, 202112, 102357, 41563, 86880, 287761, 555237, 699805, 640873, 489815, 378217, 316396, 280122, 289333, 299976, 178484, -66206, -178283, 20624, 326953, 401780, 228760, 76072, 64290, 55430, -28367, -65206, 12516, 70066, -5818, -123787, -154119, -129511, -150129, -198203, -178033, -80657, -2771, -22883, -119137, -199555, -194621, -136537, -133418, -232886, -348938, -378066, -336443, -304346, -290970, -253758, -199347, -153722, -86614, 8957, 23719, -124125, -299978, -290182, -110813, 6802, -58505, -196254, -290912, -375700, -498221, -597018, -590322, -471651, -275900, -65942, 38480, -30004, -130735, -39911, 232170, 425268, 381318, 231453, 164895]
35105A64895L1024N2572M2362j6171j66376k89640k22518m0528L5485n924K2099
35094c92720J51263K09971J50271J21981J60759J02479q7741j88762p6350N4210
35084B05361P318r1462k3678J35988J27602p3796k05920j06305O1757O2634p3453
35073B6046j09704M1319J76673Q7900j22203j61612L6448K09735J41315m5747
35063B80170j07085l9027k3214j01953j34456n3038M6508Q8688J12329J45538
35053B14460J41808Q2633J0564p1742k00169l10988k46850K7806L21908M01446
35043C70876K18565p0176k45768j80825N5906K31437J71852l5507j53263j03001
35033B60096l7678q3444j56358j19501r047K0252p0727j42489o2635J20579K34319
$$ y = [164895, 195919, 248491, 290853, 274682, 108306, -181334, -403852, -444380, -408895, -414819, -392720, -241457, -31486, 118785, 240766, 401525, 504004, 416263, 227501, 151151, 205361, 212679, 121217, 97539, 233527, 361129, 287333, 81413, -24892, 36865, 99499, 26046, -83658, -42339, 134334, 222234, 100031, -61581, -25133, 184602, 325917, 280170, 173085, 134058, 110844, 8891, -125565, -178603, -132095, -43407, 68922, 214460, 356268, 438901, 449465, 377723, 177554, -133434, -380284, -352478, -30570, 370876, 589441, 519265, 273497, 92672, 148578, 380015, 551867, 516360, 363097, 260096, 222418, 138974, -17384, -136885, -145932, -125680, -196407, -338896, -401531, -280952, -46633]
35022d6633J82005L8099o2909p7485n0902j3706L8170Q0731P1422K0289k9165
35011A49916p2245j04033n7916P4886J25265m0974k29705j25120J93975K91065
35001B05114K3510k24109j53383n715r1224k25268o5969K49583L00885O5136r3127
34990a4567m0378O325l6133j569J03987M2900j70865j79001J41300M03798K61682
34979E17479r9213k79943k15561j23010r6874m1346Q7148J90905J61020q753j93811
34968a01959k01177K7446K71524K55648K3493j19260n2464K2900m4837j32096
34958e0782j06047n5263q7211j10606k68J84453K98948K90785J70301l2197j85435
34947C16678j26281Q2538J66732K5362j21310r9512m8652j35764k40036j63443
$$ y = [-46633, 135372, 173471, 110562, 33077, -17825, -31531, 6639, 87370, 158792, 179081, 149916, 77671, -26362, -84278, -9392, 115873, 74899, -154806, -279926, -85951, 205114, 228624, 4515, -148868, -154583, -245807, -471075, -537044, -287461, 13424, 78560, -14567, -54945, -48620, -84753, -86322, 17665, 60565, -110300, -289301, -148001, 255797, 517479, 418266, 138323, -77238, -200248, -297122, -338468, -251320, -60415, 100605, 91852, -101959, -303136, -275690, -4166, 251482, 274975, 155715, 103251, 126151, 81314, -50782, -156829, -212092, -299303, -409909, -410177, -225724, 73224, 364009, 534310, 502113, 316678, 190397, 272935, 439667, 465029, 343719, 244207, 195555, 59791, -180245, -343688]
34937c43688K0778Q2120j8453j13261q2747M3868J65123J63088o600j82541j17045
34926c89358J60366L02557J21098j19743r5146J04623J57055N332j19523q1888
34916D5373K7749J00518J14395N9568m8529j11661o1052K4941M8406M3118N6318
34905B99144J0856j31246k04963p1188J03626N8208j44650j86545L3571K54533
34895B1346K19754j8468k18917k25055p0746Q4721J05270K2421k752Q6130J41592
34884A45296L9705j10308j17605K8824J85861K45777J72912k8014k38295k55894
34874F8259o1523Q9323J5534j14792p1704N2354K0529j32865j79055q7726k0027
34863d21693M879J04704K28783J93131K5424m6284K5972N4521k1562m0994M2478
$$ y = [-343688, -322910, -240790, -259243, -372504, -455251, -411383, -246260, -83172, -89772, -272313, -389358, -228992, 73565, 194663, 74920, -20226, 84397, 241452, 246784, 127261, 45373, 73122, 173640, 288035, 347603, 299074, 187413, 126361, 151302, 199708, 242826, 299144, 310000, 178754, -26209, -97397, 6229, 64437, -80213, -266758, -233187, 21346, 241100, 222632, 3715, -221340, -292086, -207365, -102095, -79674, -82426, 3704, 145296, 185001, 74693, -42912, -14088, 171773, 417550, 590462, 562448, 324153, 68259, 6736, 96059, 111593, -3199, -74903, -22549, -2020, -134885, -313940, -401666, -421693, -416814, -312110, -83327, 109804, 135228, 88944, 114916, 169437, 147875, 106881, 149359]
34852A49359M9394q4078j53447k6415J26001J11567O239k2578N206k4260q5856
34841E1132o7368K8288Q8004M8298n2943j39673j46790o0688M6303Q1847M9200
34830g4390K1893J3898j5089l9759J247N4744j802j37377j62976o613J68816J96549
34818A9141J09848L3698O066M61J6096M6782L7422m3879j38207j52650n3805J00820
34806a8207J84532R3796j05728j87624l6831J55068J26503q3351k03278j31228
34796b06348k4699J3124O7518J65548J58068k3800k10339k34614j47473n2651
34786d95666Q0900K63812L17602R7726k09950k59087J264K43622J80133q5713
34776A34643k13123n4554J74512J78459l6641j68367k0474K29893K73466P2680
$$ y = [149359, 198753, 114675, -38772, -65187, 60814, 172381, 178620, 156042, 161248, 136988, 51132, -16236, 12052, 100056, 148354, 95411, -44262, -191052, -251740, -205437, -123590, -74390, -52497, -38599, -53688, -93447, -92200, -37456, -39258, -176635, -339611, -346224, -177408, 19141, 128989, 162687, 168753, 169214, 185310, 232092, 269514, 225635, 87428, -65222, -119027, -18207, 166325, 260121, 154393, -33231, -70062, 85006, 211509, 128158, -75120, -206348, -231047, -217923, -150405, 15143, 173211, 149411, -60928, -295542, -443015, -495666, -414766, -150954, 166648, 264374, 54424, -204663, -203399, 40223, 220356, 134643, -78480, -133034, 41478, 219937, 183296, 14929, -5545, 224348, 497814, 570494]
34766E70494j42039k15631j99675j50376k7255J41250J96177O8285q8726j02362
34756E0142l581O0820L4014m1746j33377k15364k13617o6173J62904L01094K24921
34745A60037n51j47487m4336J97255K62015K2537k52682k31550L4254K03373J29299
34734C32164p288n4134q9106j79275k03559p3782P1192P1804l507L844P4178O6116
34722H647l0989q2478k6110M2469J8649p4290j26305p1497M3611J16756J10184
34711g1353Q3141P8104L3931j09126k65163k73606j01102J22626K55385K44168
34701b995J15448l4679q2570j3612L6303k4833j02781r4189p2928j16438r5931
34690d89205J00336K62563J07972k35412l54259j46914P4243J05415R2340J64624
$$ y = [570494, 428455, 212824, 13149, -137227, -164482, -23232, 172945, 241230, 152504, 50142, 46561, 107381, 141395, 99649, -33728, -249092, -462709, -528882, -365978, -64884, 160037, 159486, 11999, -32337, 164918, 426933, 449470, 196788, -34762, -508, 202865, 332164, 324876, 270742, 181636, 2361, -201198, -274980, -203788, -131984, -135491, -131647, -57469, 8647, -22342, -104820, -130930, -88461, -69812, -144102, -270407, -341904, -298293, -181537, -71353, 11788, 89892, 123823, 14697, -250466, -524072, -625174, -502548, -247163, -2995, 112453, 77774, -4796, -18408, 17895, -6938, -109719, -203908, -276836, -393274, -489205, -388869, -126306, -18334, -253746, -608005, -754919, -680676, -575261, -482921, -318297]
34680c18297K06681J34742O7871O9595K8154o1707j7532J71031K30649M1287j40789
34669D11685j11336m5605j45976k69379j97778j6749P5944J10559J99695K60863
34659B71923J73335K4373o5367j60885k99315k92418m1167J83550J10918q7436
34649a82489q2047P8377J03235k0549n1070O4071J49740J40567J06108J7945j63025
34638A60863k59727j05102R7454L3625j83490j68356Q8867K00113K7696j22869
34628b30926n6638J6514r0093k10609j37590M5418J43138J18067L0813o1347m3437
34617d76690J64519L66508K41837j49068l41230j15010J67151J08772j46242j93580
34607c73033J5940J86053J59302O2127K5488L5090M2738J8105q4874k38359k67640
$$ y = [-318297, -111616, 23126, 90997, 160592, 188746, 127039, 109507, 280538, 511187, 552474, 411685, 300349, 254744, 108768, -160611, -358389, -375138, -299194, -188635, 11060, 271923, 445258, 469631, 404264, 243379, -55936, -348354, -389521, -205971, -95053, -182489, -264536, -186159, -82924, -103473, -154543, -90472, 59268, 199835, 305943, 323888, 160863, -98864, -203966, -106512, -72887, -256377, -424733, -335866, -135753, -108057, -230926, -287564, -271050, -361143, -571752, -709342, -663924, -520786, -402719, -371906, -433253, -476690, -312171, 54337, 296174, 147106, -194124, -309134, -141983, -33211, -179453, -373033, -357093, -171040, -11738, 50389, 75877, 110967, 153705, 171810, 86936, -151423, -419063]
34596d19063n1853K45287L34787J68996l1037r6260o7994l1043J2204M8409R322
34585A21755r4421j35068n5563K5636N10n0887K77J07790J29149O8671N0238O5066
34573B33153k9642k10912k25639L7014L11771K96447P3425m4830J5707M8694n2593
34562D52595j55797j45519o1765N5650K15601L18596K02849p3036k31201j50857
34552D27116j9188j9100j00956j60946k02031k07316r9553O1187R4932J8446N0184
34541a57225J90048J50876j25270k77275r4310J21094O6911p1287j9213P7210
34531a38441j4429j14590K4395J76211J2029k31045q5942L01448L44571k0056
34521B54151k29111j7680K06889Q9331j53829j85325m7385M9153O3449K9020o5542
$$ y = [-419063, -470916, -225629, 109158, 278154, 247117, 150857, 82863, 51820, 64024, 112433, 121755, 27334, -107734, -163297, -137661, -137151, -188038, -187761, -79971, 49178, 117849, 168087, 233153, 203511, -7401, -233040, -196026, 115745, 412192, 485617, 440787, 456494, 505188, 452595, 296798, 151279, 89514, 145164, 360765, 679361, 882210, 809174, 577973, 427116, 407928, 388828, 287872, 126926, -75105, -282421, -381974, -320787, -225855, -207409, -157225, 32823, 183699, 58429, -218846, -313156, -192062, -125151, -196438, -215651, -138441, -152870, -267460, -243065, -66854, -54825, -285870, -371812, -70364, 274207, 254151, 25040, 7360, 214249, 303580, 149751, -35574, -82959, -33806, 29643, 58663, -6879]
34510f879j32048k1963J67250J48668q5811k06868p0276Q2094Q2465R6563K30155
34499B83350K68127O0768j64200j49700M800O3273J8593m948k974j9768p887N2968
34487D02402P0494J9376J1627O3510K2019j43717k30512j35561m3669j00372j52507
34476b16910k5414J67430K18275J42440Q4977O3882O806p5108j13541q9470j4612
34465A48755Q3497J12212L611j25866j02401J3381P314j11429j14447L7585J28555
34454H0767Q4823P5677J35339P6579j04431j51578k4502j3673j92963k22605M8082
34443b08485K52420J09200r3183q118J80585J30700m6240l4244R9044O3704j02781
34432C42602j30310j9275J555q3229r0035j1096L891l0084K4122J33176J61288
$$ y = [-6879, -138927, -160890, 6360, 155028, 69217, -137651, -207927, -125833, -43368, 53195, 283350, 551477, 612245, 448045, 298345, 303145, 366418, 385011, 380063, 377089, 357321, 349434, 402402, 472896, 492272, 503899, 567409, 589428, 445711, 215199, 79638, 35969, -64403, -216910, -242324, -74894, 143381, 285821, 370798, 434680, 441486, 366378, 252837, 163367, 148755, 232252, 344464, 348075, 222209, 119808, 133189, 140503, 29074, -85373, -47788, 80767, 165590, 241267, 376606, 453185, 348754, 197176, 172674, 159001, -33962, -256567, -208485, 43935, 153135, 59952, 51834, 232419, 363119, 316879, 282635, 381679, 445383, 342602, 212292, 193017, 194572, 111343, 21308, 10212, 14103, -15981, 8141, 141317, 302605]
34421C02605J44723J93443K22275Q9978r9516j45033q7801r4315j22034k9905
34411C74420R5670P3049j7874L1104J49188Q1645j56763k84938j95223n6274J4746
34400A08750O4893R1043J7953r3211q9165P524K1937p9944j53289j20781m0580
34389b64870M7717J40063J72236J02753K9629M0701N0050k0089m0777R7166K17221
34378E71800J13193p1033n1210J20215J45883k1156j43911j33194j46487k37311
34368A46789k45652r9896N2697Q4085L4740j0436j2001N2410J42606J36968K1322
34357C03632j7275J18166K04355J5252k82550l52231j71689K2032J40870K43374
34347B23936K40026J755k91936l09479o2601J16247Q3103J2532K0330J9776j5413
$$ y = [302605, 447328, 640771, 863046, 953024, 853508, 708475, 620674, 526359, 404325, 374420, 470090, 543139, 525265, 556369, 705557, 787202, 630439, 345501, 150278, 94004, 108750, 173643, 264686, 282639, 189428, 100263, 107787, 129724, 49780, -103509, -224290, -264870, -217153, -77090, 95146, 197899, 227528, 268229, 318279, 298190, 257413, 354579, 571800, 684993, 613960, 562750, 682965, 828848, 807692, 663781, 530587, 384100, 146789, -98863, -198759, -146062, -61977, -27237, -37673, -49674, 2736, 145342, 282310, 303632, 286357, 404523, 608878, 624130, 341580, -10651, -182340, -160308, -19438, 223936, 463962, 465717, 173781, -135698, -198299, -82052, 1051, 13583, 33913, 53689, 38276]
34336C8276J3649Q4042M5098r7841j69407j11909k5432O0772J77434K14950M8516
34325B78148j61504j26426J13893K19137N1419j63800k08884j14941k157N8996
34315e6119J4430j13021j58637l1954R1457L9670l6604Q0339K59734K28279M5510
34304C63084l0884k0148j17063k35850j38665O6530O2498r8156p0302J56520K42135
34293A79699J07699K5164P0670K9389j10315j12410Q70m7790k14340j37884J79025
34282c0223K86963L1590j98712j35000K5168J01799J90167K54801O0891k79887
34272C07557l04143K5304J65997j02285k82448k3409K79119J94286l8554k9476
34262A91948P9930Q963o4928J13694L00948J46756j61347k16147p2565n9514j52921
$$ y = [38276, 51925, 135967, 181065, 83224, -86183, -198092, -223524, -162752, 14682, 229632, 278148, 116644, -9782, 104111, 323248, 374667, 210867, 1983, -112958, -115115, -56119, -41689, -154710, -313347, -345301, -253844, -214174, -250778, -170439, 89295, 317574, 363084, 332200, 312052, 194989, -40861, -179526, -112996, -50498, -148654, -218956, -62436, 179699, 287398, 312562, 383232, 412621, 302306, 189896, 190766, 142976, -71364, -209248, -30223, 256740, 288330, 89618, -45382, -20214, 81585, 271752, 526553, 587444, 307557, 3414, 28718, 194715, 92430, -190018, -213427, 65692, 259978, 221424, 191948, 271878, 280841, 215913, 329607, 630555, 777311, 615964, 399817, 327252, 267738, 114817]
34251A14817q4027J13059J80391J18294J14678J24093k9816k40596k38050m2281
34241A30562Q4995O5466K9275K904q4584j59425r4213K0122o923j29826j27316
34230b68963M4618K05795K25751J43699N1518J3066N0284J02184P5743m669l1776
34219F07250k8364j22909k75583k83371j17887K3842P0629J59010K85375K40752
34209E58744J3464j19209m7374P252o0815m1124J52488K62979J41311R673L1782
34198I09171K5574j38429k53698j60974k8004N165N8583J53252O6484j93223k43601
34187B00300M4744K69868J64892K5757J13967J74069k3502j88262m9009J04067
34177H36891n8051k89651k21577r863J5057m3928N2961J48105Q140j61034p0199
$$ y = [114817, 30790, 143849, 324240, 442534, 557212, 681305, 651489, 410893, 172843, 130562, 215557, 281023, 310298, 313202, 228618, 69193, -25020, -4898, -11821, -141647, -268963, -224345, -18550, 207201, 350900, 402418, 415484, 465768, 567952, 643695, 639026, 607250, 578886, 455977, 180394, -102977, -220864, -197022, -126393, 32617, 317992, 558744, 572208, 452999, 405625, 412877, 352062, 310938, 463426, 726405, 867716, 877389, 909171, 934745, 796316, 542618, 381644, 353640, 358805, 417388, 570640, 637124, 443901, 200300, 245044, 514912, 679804, 705561, 819528, 993597, 970095, 781833, 732824, 836891, 778840, 489189, 267612, 257749, 272806, 228878, 281839, 429944, 438084, 277050, 206851]
34166B06851J04331N6795q6373n7809L0657k9811q9309K5208Q9878p9263j68084
34155C071J02997L97267K98953K0557l8499j3077j90682l33076j03094K10984
34145C55401J46929j00940o1164J35295M1454k36309k56986p5286o0064j26030
34135b37700N6218L11861K26649n0277o1623J14846P7117p6983K9871K31831Q6777
34124G08587k29387j84656J24391J52844q3866j05281P0569J2251j90823o3729
34114B10900K58996J82933k26266k91568P9403K61991N0160q0051M5614M1756
34104E33868j61876j50254J01068J12548j64970k21650L9925J31378n5445n7842
34094A06750J91730J80583j65906k53564J03432L24424J08290q3476N3706J55318
$$ y = [206851, 311182, 367977, 281604, 223795, 254452, 224641, 135332, 160540, 250418, 171155, 3071, 106068, 503335, 802288, 822845, 784346, 771269, 580587, 247511, 144417, 355401, 502330, 401390, 340226, 475521, 516975, 280666, 23680, -51606, -111670, -237700, -181482, 130379, 357028, 306751, 245128, 359974, 437091, 360108, 389979, 621810, 708587, 479200, 294544, 418935, 571779, 487913, 382632, 453201, 465452, 274629, 210900, 469896, 652829, 426563, 134995, 214398, 476389, 526549, 446498, 492112, 533868, 371992, 221738, 322806, 435354, 270384, 48734, 88659, 220037, 164592, 106750, 298480, 479063, 313157, 59593, 163025, 487449, 595739, 512263, 565969, 721287]
34084G21287j8104j16196P1303J98893N7944m7452M9172O5795r7548j30644L3639
34073G88089N7461j06606j04029P9105N7322j44460q7648J60848O1990l05993
34063D56079k40943K90650M64996J2557l10386o3636J81167k1367k28789n0371
34053D89957J42963K8631o1409J05724J76973j8488q3499J12133J15147j67290
34043H40842j73629K21126L43044o2658l04262J4699K84095L3774k38644n4972
34033I03415J97786Q7269j01108n8222m1105j98365j80025P8098R9978j61741
34023F25980j10362L25101M14767m1735l04156p4796j0277l38334l34204K20993
34013C72977M74583O8579j70205J75123L21055j29724l56569O4962K97244q8360
$$ y = [721287, 703183, 586987, 658290, 857183, 915127, 867675, 916847, 982642, 885094, 754450, 788089, 845550, 738944, 634915, 714020, 771342, 626882, 539234, 700082, 762072, 456079, 215136, 505786, 970782, 983339, 672953, 609317, 790484, 769117, 540328, 489957, 632920, 661551, 600142, 705866, 882839, 864351, 780852, 892985, 1008132, 840842, 667213, 888339, 1231383, 1168725, 864463, 879162, 1163257, 1197031, 958387, 903415, 1101201, 1188470, 1087362, 1029140, 988035, 789670, 609645, 687743, 787721, 625980, 515618, 840719, 1255486, 1213751, 909595, 834799, 824522, 486188, 151984, 372977, 847560, 916139, 745934, 921057, 1242112, 1112388, 755819, 820781, 1118025, 1029665]
34003A029665k08435L60874O04513j8978m16820J35960N73464L559o17321k80597
33993A165884K59399N7331k38716J66658N27668K1086n64291k86478K29144J43022
33983A480707j5124L03794L44606l19895n70034J86907O11430j42118o58681J39933
33973A361525Q39583J57481n60722J04054Q94792L32474l88119J99479Q59459
33964C800006J15925o66961J04212R69780J81204p45915P7494J076299K45098
33955E157142p06360M13598J737351P84431n05678O02589K104625J115694n7291
33946A0646101J802957M011580K855556J519227M576350Q581031Q281201P892000
33938E0166003J3771590K0661400K1936516K9685148O0388777R6637367R1046758
$$ y = [1029665, 821230, 1182104, 1786617, 1767639, 1350819, 1486779, 2060243, 2063802, 1446481, 1165884, 1425283, 1482614, 1243898, 1410556, 1938224, 1959310, 1395019, 1108541, 1337685, 1480707, 1465583, 1769377, 2113983, 1794088, 1224054, 1410961, 2022391, 1880273, 1221592, 1361525, 2201108, 2358589, 1797867, 1901921, 2796713, 3129187, 2741068, 2940547, 3800006, 3915931, 3248970, 3353182, 4322962, 4504166, 3758251, 3835745, 4912044, 5157142, 4450782, 4864380, 6601731, 7386162, 6880484, 7483073, 9587698, 10703392, 10646101, 12449058, 16460638, 19316194, 20835421, 25411771, 33992802, 42274003, 50166003, 63937593, 84598993, 106535509, 136220657, 196609434, 293246801, 384293559]
33931C84293559K5218001n6161309r2382922p4304493m2202140k7331369k3985851
33924I3143476j7454574j0005859r060561j0514620p492232l155869l333078n368882
33916B6757801m012092j229640j509934l213453k406328m92757r25715k362535
33908A0605347j601739J18455k50620j651204j199075K47785J7527j172543q53776
33899D260157L45184J19270r65218p06507M33187L61140o02349n53250K68953
33890B960567J88970n13058l25111L53401M1312p62428m77405M41980L25178n45784
33880A687622n42228K11160K22956m41299m11785K53974K61645l46310l44797
33871E50938K28150J95823m11569m31623J84780L63520j6948p5978K21266J10783
$$ y = [384293559, 409511560, 353350251, 260967329, 186662836, 144460696, 117129327, 93143476, 75688902, 65683043, 56622482, 46107862, 38615630, 35459761, 32126683, 26757801, 22745709, 21516069, 20006135, 16792682, 14386354, 13893597, 12967882, 10605347, 9003608, 9122063, 8871443, 7220239, 6021164, 6268949, 6286476, 5113933, 4260157, 4605341, 4724611, 3759393, 3052886, 3486073, 3847213, 3244864, 2691614, 2960567, 3149537, 2636479, 2311368, 2664769, 2706081, 1943653, 1466248, 1908228, 2233406, 1687622, 1145394, 1356554, 1579510, 1138211, 726426, 980400, 1242045, 895735, 550938, 779088, 974911, 563342, 131719, 316499, 680019, 663071, 587093, 808359, 919142]
33861I19142k77095j42580K99878J79665k72219j33268L59099K06917l98260l92585
33851C48694J46810J83014k80657k57408K81643L65518j15218k76938K9690O9090
33841D94238j98245o2995L79136K76979l10415m16838P2501K51624j02180k19328
33831A64477J07192J84869j48634k18936J20172J97805j54422l04941o5303K9143
33821h8578j32931m8177K81645K64556r6888j43622J87129K49416o0527j50541
33811B61482O9152N3297k15475j62749J81718J69857j86510j90843J84730K22197
33801C86856j48248k11478J27778J68346j79595k10337J35138R1787l81673l77618
33791e99044K50991M79165p9805m59712p2333L11666O9460j81605J23863L98221
$$ y = [919142, 642047, 499467, 799345, 979010, 706791, 573523, 932622, 1139539, 741279, 348694, 495504, 678518, 397861, 140453, 422096, 787614, 672396, 395458, 425148, 494238, 295993, 232998, 612134, 889113, 578698, 161860, 234361, 485985, 383805, 164477, 271669, 456538, 307904, 88968, 209140, 406945, 252523, -52418, -117721, -88578, -221509, -269686, 11959, 276515, 179627, 36005, 223134, 472550, 412023, 261482, 330634, 383931, 168456, 5707, 187425, 357282, 170772, -20071, 164659, 386856, 238608, 27130, 154908, 323254, 143659, -66678, 68460, 160247, -221426, -599044, -348053, 131112, 51307, -408405, -480738, -169072, -99612, -281217, -157354, 240867]
33781B40867O4640l11618p0373L43083K28604j62268k26775p0220o7164n0114
33771h1338K11371L54284N1708k87559j95861N1016J5907r5478P3943K85192J62391
33760E45576q4339o6471R0271O4813p1992j23829j79355k77334j54393K10261
33750d6792L38720J7086k58300r2276J53229N4476j31783k2195J67066Q4135q3387
33739A79979l0960M3869j26784k82810r7880J78986J59845K614N4098J82539P5185
33728C38681j27514q7274J17655J67652M1914p5952j67041k50742j89056K4415
33718b07262J21793K1584J3610J84020J77998j12446k23135P9123K98150M7916
33708D01351k39072p5118K07825P3023k51348k07153J03647J65107l1719q6676
$$ y = [240867, 305507, -6111, -76484, 266599, 495203, 332935, 106160, 35940, -31224, -81338, 130033, 484317, 536025, 248466, 52605, 103621, 119528, 24050, 97993, 383185, 545576, 461237, 394766, 485037, 549850, 477858, 354029, 174674, -102660, -257053, -46792, 291928, 309014, 50714, -41562, 111667, 166143, 34360, 12165, 179231, 263366, 179979, 149019, 192888, 66104, -216706, -314586, -135600, 24245, 26859, 80957, 263496, 338681, 211167, 123893, 241548, 409200, 451114, 375162, 208121, -42621, -231677, -207262, -85469, -63885, -50275, 133745, 311743, 199297, -23838, 55285, 353435, 401351, 162279, 87161, 294986, 368009, 116661, -90492, 13155, 178262, 146543, 59867]
33698E9867L1979L3832o1356n521J28221Q0682p8063j10433p8655j39626j41957
33687b81030N0152J49887p1968k50390L176L44299K10789k14190l08696l7407
33677d05378J07810J5945K1011J61955J37978l8938n1233Q9155P0957q7379q0037
33666e8154O3080M0586q6795Q941K36889J85130j06589j78433J7504L8903k08597
33655d7535k80140j512K16834J01260p2469m2799K6579k8893m8100P6875J40567
33644D0667R909j19945q5494p672N663M3982J07480J4472k20477k87510n8247
33633e57172J87291K05152J18901J07606R8976K921n2482K9982Q1921o3828k60915
33622a01647k38930J5687K47882K30678k3497k79813k85078m2394J56132R4273
$$ y = [59867, 91846, 125678, 64322, 58801, 187022, 267704, 189641, 79208, 553, -139073, -281030, -230878, -80991, -152959, -403349, -400173, -55874, 154915, -59275, -367971, -405378, -297568, -281623, -260612, -98657, 39321, 383, -50850, 38305, 109262, 21883, -58154, 4926, 45512, -41283, -32342, 204547, 389677, 283088, 104655, 122159, 161062, -47535, -327675, -329187, -112353, -11093, -83562, -126361, -99782, -128675, -176775, -99900, 40667, 50576, -69369, -154863, -162535, -156872, -112890, -5410, 9062, -211415, -498925, -557172, -369881, -164729, -45828, 61778, 160754, 163675, 111193, 141175, 223096, 159268, -101647, -340577, -324890, -77008, 153670, 130173, -149640, -434718, -477112, -320980, -226707]
33612b26707o6132l9519J42865K17227J23243L5421M456q6602k02744j41354J04624
33601a35222K77276K26664Q8243K2604K2522L2492L3276k6375j67090k47336j21702
33590E352Q8171J27464j2014j06529o5103l505J6655L3617k07j47570k59959j41645
33578d65273Q5917J23037k5831p6101L4591P2283k2192j0499J83318K90129J40091
33567C29470n9976q5555k7989o2767j38936j15520j6700M6761P5640J40188K29233
33556C13849K53971J53634l9348j95793j88236n9243k00p4518j14949k4564L5063
33545E9666m4579p1686R6415K16600M4769j83418j07306J25643R9101j47926k07477
33534a20198l4363J3649j34787j51099M2765J14281m9556j27592L4116J51547
$$ y = [-226707, -292839, -332358, -189493, 27734, 150977, 186398, 190854, 104252, -98492, -239846, -135222, 142054, 368718, 456961, 479565, 502087, 534579, 567855, 541480, 374390, 127054, 5352, 93523, 220987, 208973, 102444, 37341, 33836, 50491, 84108, 83901, -63669, -323628, -465273, -379356, -256319, -282150, -358251, -323660, -251377, -273569, -284068, -100750, 189379, 329470, 269494, 183939, 155950, 93183, -45753, -161273, -177973, -131212, -55572, 84616, 313849, 567820, 721454, 682106, 486313, 298077, 238834, 238634, 164116, 49167, 24603, 59666, 15087, -56599, 39816, 256416, 301185, 117767, 10461, 136104, 235205, 87279, -120198, -154561, -140912, -275699, -426798, -384033, -269752, -319308, -446900, -412784, -261237]
33524b61237N2474k3303P6449J13600n8856j76455l9217J11529K3161j33311q8425
33513d03591R2355K07636K46874K37022P5624j99860k90053p4545J32037O3020
33503H6519p7577q858J21338K4800j78347j40852J15057J99071p3220m31711n07058
33492h70838k27529J58238L38689K33433O6439P2754J68713J01879j06873j65774
33482b30869J3340J77212J57009Q9751Q7488L6011j06872j52334k1025P2420j8118
33471A04013j23613p7414J9881M7019O1803O6642p7058k90655k22100J82177M40480
33460A31175K06039j88055k36511O875J28114K1215q6175r2679q7599p2241J8958
33449b50884J05385O6313l3334o4075m8000m3016R361J09975R7352n6395j00723
$$ y = [-261237, -208763, -232066, -155617, -42017, -100873, -277328, -316545, -205016, -181855, -315166, -403591, -311236, -103600, 143274, 380296, 455920, 256060, -33993, -108538, 23499, 86519, 8942, 84, 121422, 146222, -32125, -172977, -57920, 141151, 67931, -363780, -870838, -1098367, -940129, -601440, -368007, -301568, -228814, -60101, 41778, -65095, -230869, -217529, -40317, 116692, 206443, 293931, 329942, 223070, 70736, 49711, 122131, 104013, -19600, -97014, -77133, -30114, 31689, 98331, 21273, -269382, -491482, -309305, 131175, 337214, 149159, -87352, -80477, 47637, 68852, -17323, -110002, -197601, -269842, -250884, -145499, -79186, -112520, -176595, -224595, -267611, -258250, -148275, -50923, -107318, -208041]
33438b08041Q5236K19216N4134j87817j66383M3139J35428O9033K583n3122j46186
33427a52780j49643J0027R8174o7592k21242l9140K77537K82942o841j76428p7280
33416b22266N3644Q4983J30469K02950J56610L77r2376r3106j16162j44642q0548
33405a20067q199p2817j65246p3708J20142J49896N50j14068j30246j34836q3978
33394f32577R8021K37843J33417m6104n581J43813P5552j29525r9401J31465J36635
33383D3558j40801k46716J5348K44458J05679j65888k08326o5218K4085L3425
33373c60396O3452J05659J30140J88808K50765J58501r6056k75891k19912m8132
33363a03062O1134P7725K1122r8217j60035j9553K07389K20441j7996j99687j31347
$$ y = [-208041, -122805, 96411, 150545, -37272, -203655, -160516, -25088, 43945, 46528, -6594, -152780, -302423, -292396, -194222, -261814, -483056, -522196, -244659, 38283, 31442, -144986, -222266, -168622, -83639, 46830, 249780, 406390, 406767, 314391, 221285, 105123, -39519, -120067, -128266, -201083, -366329, -440037, -319895, -169999, -169449, -283517, -413763, -548599, -632577, -534556, -296713, -163296, -209400, -214981, -71168, 4384, -125141, -224542, -93077, 43558, -97243, -343959, -328611, -84153, 21526, -144362, -352688, -417906, -393821, -360396, -296944, -191285, -61145, 127663, 378428, 536929, 440873, 164982, -54930, -103062, -41928, 35797, 56919, -41298, -201333, -220886, -13497, 206944, 188948, -10739, -142086]
33352a42086J8013M3338j8492o3919r0454o3716R4918K63689J72265j53652l18006
33341b58102j11268J66779J65097k1901p9949L5670J23099Q8576J2790m0901o9285
33330A0605m6564L6066J00130O5268m3848j42274j74799j34740o9106n4045p7928
33319e31235j7723J40724J85844q380k00803j08095J22642J40660j3862L14J81783
33308a08131J58502j33184k83391q8095J20456O2560m5481O0218K17056J57232
33298A17742l3409j18104r3201o2820J3345J62062K30803J39550N2261O7579K4532
33287E00340j44797j97418k744J50355J0529j88032j17863Q8075R7030n0521p4402
33276G0552K4914K8116n6010l9683M5528J4149q3008l4912J14438J16102m3680
$$ y = [-142086, -124073, -80735, -99227, -163146, -253600, -317316, -222398, 41291, 213556, 59904, -258102, -369370, -202591, -37494, -59395, -139344, -103674, 19425, 108001, 120791, 79890, 10605, -35959, 107, 100237, 165505, 121657, -20617, -195416, -330156, -399262, -453307, -531235, -548958, -408234, -222390, -230770, -431573, -539668, -417026, -276366, -290228, -289914, -108131, 50371, -82813, -366204, -454299, -333843, -271283, -316764, -256546, -39490, 117742, 84333, -33771, -126972, -189792, -176447, -14385, 216418, 355968, 408229, 475808, 500340, 355543, 158125, 155381, 305736, 316265, 128233, 10370, 98445, 195475, 144954, 70552, 95466, 123582, 67572, 27889, 73417, 87566, 4558, -30354, 84084, 200186, 156506]
33265A56506j26091o1426l5273j28706j94771j37442l5938M4804J21229J54435
33255b42673Q2986o183K8025J24615R4935n5755j25011l8168N8801N3411r10l2711
33243e8638m1305j6273O1080J25450Q9133j1090o5650n5472k7437K7084J12875
33232A39757J29369O965j32213j37516p1368q1674j15395p46K28097L32313J99432
33221D97021k5090j47694j12840R321R0790L7087q3720q6129N8124J34730J2831
33210C84431j26363p6486P0964J24888J22283J78279J92583L0277j60044j58245
33200E82567o6053j17214k22496j20811J10363J52316O901k2047Q5946J7051k56356
33189A50167l30894m2210K01794M1210k80040l11760m5631J83304K26928K10264
$$ y = [156506, 30415, -31011, -66284, -194990, -389761, -527203, -563141, -518337, -397108, -242673, -159687, -165870, -137845, -13230, 81705, 25950, -99061, -137229, -78428, -25017, -25927, -58638, -99943, -116216, -55136, 70314, 159447, 148357, 82707, 27235, -202, 26882, 139757, 269126, 276091, 143878, 6362, -65006, -146680, -262075, -262821, -34724, 297589, 497021, 471931, 324237, 211397, 220718, 311508, 348595, 264875, 178746, 236870, 371600, 384431, 258068, 181582, 252546, 377434, 499717, 677996, 870579, 900856, 740812, 582567, 516514, 399300, 176804, 55993, 166356, 318672, 325573, 303526, 389472, 406523, 150167, -180727, -222937, -21143, 20067, -259973, -571733, -617364, -434060, -207132, 3132]
33179C132K11630J66480N4167m4221p1563m4388l111L090o0186j38357j15870
33168c9197K0444J29895Q5078q4355k44735k75105j28678J18098K80014K37460
33158I8919Q4658m535q866j7988l2486K708K8553l8721r8028L985J65823J38576
33146C22598p0031k00313j59504j09570r8760L1370K67724L21714Q2510j48926
33136B38812r8524Q3601J03788l0375j02802n0203J8837M5282M6648J1991o1498
33125B05557j06526q2068l7069O750R9137K03338J63158n7695k63835k74350j33956
33114b77559J7414J18789J41553N9724l3290J7481J54471J29125q5686j86650
33104E5372j8124J39071J0026k14381j80950O9760K04239J17000l940n5263j15371
$$ y = [3132, 214762, 381242, 435409, 391188, 319625, 275237, 272126, 275216, 215030, 76673, -39197, -18753, 111142, 196220, 111865, -132870, -407975, -536653, -418555, -138541, 98919, 183577, 179042, 170176, 152188, 119702, 122410, 150963, 112242, 14214, 18199, 184022, 322598, 252567, 52254, -107250, -216820, -315580, -284210, -16486, 305228, 387738, 238812, 140288, 223889, 327677, 297302, 194500, 144297, 163134, 208416, 255064, 267055, 205557, 99031, 16963, -20106, -13356, 85781, 289119, 452277, 394582, 130747, -143603, -277559, -260145, -141356, 197, 59921, 26631, 44112, 198583, 327708, 242022, 55372, 37248, 176319, 186345, -28036, -208986, -139226, 65013, 182013, 178073, 122810, 7439]
33093G439j79105j15502O6152J68138Q9749l7052n7858J5505P8180P3612K2026
33082A31284j3824J4131O5918M3437n2610q6895P197J01429O6503k1097j1534
33071B43939P6144J03818L2512o2134j28338j50268r0145M0208J20362P6010J7575
33060B79683P3396J60128R1402j31079l00176k59103m9051J70062K42954J15064
33050C93280r2666j67421n5164N8073J0398j05902j05106J4409J03322Q3494k588
33039A34129q5557r8223n306J03698Q2888k4704j976J68018J91384q4388l65554
33028A4409l19147n0931J23919J64752K10174K03445K6254j42986n1494J42506
33018C20901P0624k12741k89391p3477O4301n1208j33922J5284J72671J31516
$$ y = [7439, -171666, -287168, -221016, -52878, 36871, -181, -58039, -42534, 35646, 109258, 131284, 117460, 131591, 197509, 240946, 188336, 101441, 108638, 210067, 276570, 255473, 243939, 320083, 423901, 456413, 394279, 265941, 115673, 25528, 65736, 186098, 262108, 279683, 353079, 513207, 604609, 473530, 173354, -85749, -134800, 35262, 278216, 393280, 300614, 133193, 78029, 136102, 146500, 40598, -64508, -50099, 53223, 136717, 134129, 48572, -49651, -54957, 48741, 131629, 106925, 104949, 272967, 464351, 379963, 14409, -304738, -355669, -231750, -66998, 143176, 346621, 372875, 229889, 178395, 320901, 391525, 178784, -110607, -184084, -119783, -170991, -304913, -289629, -116958, 14558]
33008A4558N1513J00826J28122r182j20934j1965J44168Q9828q9324j47368q7611
32997F2631o0841l0746J12570K37113J22624j41171k42476j04162M6368N2352
32987E4262q933m5030o3259l7887Q6163K07735J26098j40623l09476k07033k276
32976c40259N6982j7041k7805R4050K14463J98711O6473o3855j09051p9703m3583
32965e0618m7660o9553m9857K5925R3972P3774l9995j55512j65099n8728N5782
32954c87569P0956P792j5464N6458J40284J24107J1823p9490n1549O6784J40891
32943H5023O9123q6682j42181l718J98716K62764J64003N2615J5056k5779j35863
32932D53077k27635j83365l8562N9319M1184j6365r973N5568O9454m6536k07338
$$ y = [14558, 66071, 166897, 295019, 285837, 164903, 152938, 297106, 386934, 297610, 150242, 62631, 1790, -28956, 83614, 320727, 443351, 302180, 59704, -44458, 1910, 54262, 45329, 299, -62960, -100847, -14684, 193051, 319149, 178526, -130950, -337983, -340259, -283277, -300318, -328123, -234073, -19610, 179101, 245574, 181719, 72668, -7035, -50618, -98278, -167831, -217688, -191763, -97791, -24017, -64012, -219524, -384623, -443351, -387569, -316613, -308821, -324285, -267827, -127543, -3436, 8387, -71103, -122652, -55868, 85023, 154146, 67464, -74717, -78435, 120281, 383045, 547048, 599663, 614719, 588940, 453077, 225442, 42077, 3515, 62834, 104018, 87653, 77680, 133248, 202702, 156166, -51172]
32921e1172k25645m7903J41298J49136M2182L0431J24857J21979m4655j68307
32911G2201q5013P8897J20512M6459k4980q9609j78503j84400j2423J77174J41824
32900F2139n9448j29113N697Q0096p0147k32396j52580O8476J42504K5175o3941
32889c23538R4R7820Q7398j0712r7986j23512p5093L3389J16526P5507m5919q3506
32877c49532Q882Q0856L6925J0184J28224K42803J19411j74333l23019k01894
32867d21493j0889O6780Q4739J26831J36613R4628J27244K51694K34650n5533
32857F35264l45701k96497o617J38401L3886o7137j4542N2815J9269m0259q5774
32846B3108j95566l16121k33085N8066K40140J20704p3564o7252M9949M8304k0886
$$ y = [-51172, -276817, -324720, -183422, -34286, 7896, 38327, 163184, 285163, 240508, 72201, -12812, 66085, 186597, 233056, 208076, 118467, -60036, -244436, -256859, -79685, 62139, 2691, -126422, -120725, -40629, -110776, -343172, -495752, -427276, -284772, -259597, -323538, -323444, -225624, -138226, -148938, -246924, -370436, -445529, -412140, -295614, -220107, -266026, -349532, -340650, -259794, -222869, -212685, -84461, 158342, 277753, 103420, -219599, -421493, -432382, -365602, -280863, -154032, -17419, 77209, 204453, 456147, 690797, 635264, 289563, -6934, -13551, 124850, 158736, 91599, 77057, 129872, 149141, 108882, 23108, -172458, -488579, -721664, -663598, -423458, -302754, -376318, -443570, -393621, -345317, -366203]
32835c66203M2303J75962J36005o3908j35800K9045J90909J33004m5930j33559
32825c8172j05598p5734p2301k4575P8271J44792J06914J4471k6491J5747O5776
32814H3100N3681K1499N2003J08685N6557j22129k48321j65863M6287J79358J48737
32803B13594M8264L473N8679J61704J85539K9697k20770l21146j55583Q3729J30999
32792B18179j4756j29272q0080N4707J47061J38338J6759j67982k70486j76812
32782b64344K6440J37843R1470o507p0283j06555r9730l039J21234J16848m8380
32771a05003k06823j90973j1823J88401K63184J44881p7344j79740n2006J09659
32761a17587N4954j07430l0942K96784M37371J15099l54848m93464k72820k0164
$$ y = [-366203, -323900, -147938, -11933, -75841, -211641, -182596, 8313, 141317, 95387, -38172, -143770, -219504, -291805, -316380, -238109, -93317, 13597, 28068, 1577, 17324, 83100, 136781, 158280, 210283, 318968, 375525, 253396, 5075, -160788, -114501, 64857, 213594, 261858, 265331, 324010, 485714, 671253, 700950, 480180, 159034, 3451, 87180, 218179, 203423, 74151, -5929, 48778, 195839, 334177, 350936, 182954, -87532, -264344, -237904, -100061, -8591, -15098, -85381, -191936, -291666, -294705, -173471, -56623, -105003, -311826, -502799, -514622, -326221, -63037, 81844, 4500, -175240, -227246, -117587, -62633, -170063, -201005, 95779, 533150, 648249, 293401, -200063, -472883, -493047]
32751d93047R9503J70295K10568J30274j2646l1014Q1896J30325M0662n1656q2408
32740A92752j45854k21571j11307J98401L83428K11865q9562j53639N577P3455
32730C43545o2242j93063j60830o7243n3841r1542p9981n492P7390J15844P3883
32719a03572j9265l7092R3965K27266J61517k5549m5915J39966K06798m5162l42608
32708B10349l20648n5042Q2211j5909r4141K3043J91394K07488P7297n8672r8624
32697A48746j4542J38113K02291N8920j80031k72180j67068n1885l7866j3741
32687a89243R8580J58961L7901j36732j51064j7334O9553K6559l6778j2176P3467
32676g8306J28747J07189K9120n1982r3330q6643l4367O5423J63325J49096M529
$$ y = [-493047, -393544, -223249, -12681, 117593, 104947, 73933, 155829, 286154, 326816, 275160, 192752, 46898, -174673, -285980, -87579, 295849, 507714, 418152, 264513, 270090, 343545, 281303, 88240, -72590, -139833, -193674, -285216, -365197, -370689, -293299, -177455, -103572, -122837, -159929, -65964, 161302, 322819, 297270, 251355, 391321, 598119, 552957, 210349, -110299, -165341, -83130, -99039, -193180, -170137, 21257, 228745, 306042, 247370, 148746, 134204, 272317, 474608, 533528, 353497, 81317, -85751, -137636, -175502, -189243, -90663, 68298, 106199, -30533, -181597, -198931, -129378, -102819, -139597, -151773, -78306, 50441, 157630, 186750, 134768, 41438, -45205, -79572, -14149, 149176, 298272, 302801]
32665C02801r7911j3764J10673K4221k01564k29751M176J51483k037j84174p8462
32654b14309J75255K38922J04466Q276j1967r3771j90696j26447L6743N9543m8609
32643f2594k9672J64066K67323J35175m8234r8243p0883o4348n8448o6837j72273
32632a04968k85441j58550J98590M04118K17941q9573j36147K6926O7641q2379
32622E8158j64329k4096J80378K32223J11878m4728j10892o4398j662m6936j86713
32611f1117k51965j40862K5687P9380M6789O9194J43205J21016l2493j51369r2555
32600b45090P1340J62713J31756Q5994J01720R9702k7176k07780k32488l6994
32590i6303J69549J60707j2842j21061p7808J891K7646K5731R662m7364r1826
$$ y = [302801, 204890, 191126, 301799, 326020, 124456, -105295, -101119, 50364, 48327, -135847, -214309, -39054, 199868, 304334, 312610, 300643, 206872, 16176, -110271, -73528, -13985, -62594, -92266, 71800, 339123, 474298, 426064, 327821, 256938, 192590, 134142, 67305, -104968, -390409, -548959, -350369, 53749, 271690, 182117, 45970, 72896, 140537, 58158, -106171, -130267, 50111, 282334, 394212, 349484, 238592, 174194, 172532, 125596, -61117, -313082, -453944, -428257, -348877, -302088, -232894, -89689, 31327, -1166, -152535, -245090, -173750, -11037, 120719, 206713, 308433, 408135, 380959, 173179, -59309, -96303, 73246, 233953, 221111, 100050, 22242, 24133, 51779, 77510, 87172, 39808, -52018]
32579e2018l4861N4430J0192j25104q6695K15919M95515M28023N2124l01028l67989
32568B88508j55565J04856J48092o1854k47428j49345R3396J38026k4282p5318
32558E9086N9266Q0640j08732j73490N7429K24187K8989k27598j55070N7740J9329
32547g8224j31722J088K78478K00893j93939l19926K704K58618Q7497j93578j95738
32536b83849m8777l6875q3327J2520J54703J46563O1357P4623J26045O2474m9548
32525A35909m6235L8173O2871L9988N5935N4512n4536j68317j11989P5245J81365
32514B62921J04073o8283k02177k14024r4773M8223O5698l0482p0557o594Q962
32503a97013o9267m8443J45285K48294O2982j65106j07495J10254J26459l8159
$$ y = [-52018, -86879, -32449, -22257, -147361, -234056, -18137, 477378, 905401, 957525, 656497, 288508, 132943, 237799, 385891, 324037, 76609, -72736, 20660, 158686, 134404, 59086, 118352, 198992, 90260, -83230, -25801, 198386, 227375, -223, -155293, -97553, -78224, -209946, -208858, 69620, 270513, 76574, -243352, -240648, 17970, 105467, -88111, -283849, -332626, -369501, -452828, -440308, -285605, -139042, -77685, -3062, 122983, 185457, 135909, 89674, 127847, 190718, 230706, 286641, 341153, 286617, 118300, 6311, 81556, 262921, 366994, 298711, 96534, -117490, -212263, -164040, -98342, -128824, -199381, -205975, -197013, -266280, -314723, -169438, 78856, 141838, -23268, -130763, -20509, 105950, 67791]
32493F7791l1331J89776K33796j01077m71984m54543q1143K83789M00702K93966
32483C29742Q5451j13996k11953j74819n0885R0615J98382K13859J03202o0460
32473D09138j41210r7840j8529J2333n239m2966q3863r6354n8843j2992r879k0227
32461a66471R409M4870K1607k3648j0696K9830J0203l4664R076J20389J49843
32450A59748M9595o9113j16436r7840j6187J12542J57249P192j88212j69866J6338
32439a54990N0301j47116k60187q6535J32852J20440k076J6890J03594K8803j43113
32428c41137j58247k6277J4328n7920k2203J46239J94944L8420p3824K1085J33854
32417a30738P5886j0853O8792J87501J00460j22955j93926o4160K4085m4561r0168
$$ y = [67791, 36460, 226236, 460032, 358955, -113029, -567572, -648715, -364926, 35776, 329742, 415193, 301197, 89244, -85575, -136460, -45845, 152537, 366396, 469598, 409138, 267928, 170088, 151559, 163892, 158653, 115687, 31824, -64530, -123373, -136365, -146244, -166471, -157062, -112192, -90585, -114233, -124929, -95099, -84896, -119560, -110484, 9905, 159748, 209343, 140230, 23794, -74046, -90233, 22309, 179558, 186750, -1462, -171328, -154990, -104689, -251805, -511992, -598527, -465675, -345235, -347311, -330421, -226827, -198024, -341137, -499384, -525661, -511333, -569253, -591456, -445217, -250273, -211853, -285677, -264592, -130738, -54852, -65705, 3087, 190588, 291048, 168093, -25833, -89993, -65908, -110469, -200637]
32406b00637K6040J52061Q9409q9720j55833n4977N1927M4343k4440n4815k5851
32395b42493M4083J52268K64990K90487J71066l2239j98775k63182k29900j14557
32385a58252N8538K11215K37923J10813o9508j55164q5363N8162J31618P8602
32375D18584j0119k0668J7121l0226j76631k49720j27039O8523J39670R6554R1602
32364B17651J22584K9593j81874k56846n5773J90798J78726m3742j57170k1712
32354B2235J65016J74055K6848r7599j08717o0996k8453j6996k697L1m7054j20063
32342i4390j13669K6858J80057J62875j3263j29925o3829L9545M591r9549r1550
32331a92249J8301O9147L8407M9359R1306p161k47818l48668j15736K47045L83068
$$ y = [-200637, -174597, -22536, 66873, -22847, -178680, -233657, -181730, -137387, -161827, -216642, -242493, -198410, -46142, 218848, 509335, 680401, 648162, 449387, 186205, -43695, -158252, -99714, 111501, 349424, 460237, 390729, 235565, 150202, 208364, 339982, 418584, 408465, 387797, 404918, 374692, 198061, -51659, -178698, -110175, 29495, 126049, 217651, 340235, 369828, 187954, -68892, -124665, 66133, 244859, 201117, 43947, 22235, 187251, 361306, 388154, 290555, 181838, 120842, 92389, 75393, 72696, 72727, 25673, -94390, -208059, -181201, -1144, 161731, 148468, 18543, -45286, -5741, -1150, -100699, -192249, -173948, -104801, -66394, -17035, 74271, 67110, -180708, -529376, -645112, -398067, -14999]
32320a4999K24827J0269o5717k9172J4626K1280j8774j06880j89003j80144q1255
32309d14942M840J6034J7628Q9967J84530J73001L2273r3824n8352R8824J86190
32298B36169R1130q6275j69539j20555m6193k7066l8239l4216n814O3627J83644
32287D6673K60914J48570j27479l13512k21523J4849J21385M8668j6249L0255
32277g449P6580J9423o2201m8219L7873R3134R2986P8509N2220m128m7627j6675
32265B64426N6347O6836j8839j11956j11936k3112N5167L5073o1606j09656k3054
32254A7690R9989N7624j75076l46991k32592M6600J77310R4512M0553J48930K25175
32243A53724Q7115j03134q5318P4823J00679k9588n9740Q3821J46366j5704j56483
$$ y = [-14999, 209828, 220097, 154380, 125208, 139834, 161114, 142340, 35460, -153543, -333687, -414942, -410102, -394068, -376440, -286473, -101943, 71058, 103331, 9507, -48845, 49979, 236169, 327299, 241024, 71485, -49070, -95263, -122329, -160568, -194784, -200598, -136971, 46673, 307587, 456157, 328678, 15166, -206357, -191508, -70123, -21455, -37704, -7449, 69131, 88554, 26353, -21866, 16007, 109141, 202127, 280636, 332856, 328728, 281101, 264426, 320773, 387609, 368770, 256814, 144878, 121766, 176933, 212006, 150400, 40744, 17690, 117679, 175303, 227, -346764, -579356, -532756, -355446, -260934, -220381, -71451, 153724, 240839, 137705, 52387, 127210, 227889, 198301, 138561, 222382, 368748, 353044, 196561]
32232A96561k2580K20682K28463J00j42372n0594P0343J6357j27521j51852j0553
32221B27034J57265J94685N2758j74363l07599k46396p9835L4248O6408R1187
32211A5392J19894J05652P5469Q3394O1086q6375k54557k41029p6018O708m5721
32200b36105m5859M9653M0189j03681r4605J78395L66914J82838j15075j31025
32190I1639M2261N0108q3806n0910J28659J26774p5238j26035O8631J72393J3500
32179C57976j33035o3525Q370j10505k19167j04224O0266M3952j6855R3699K23368
32168A40320J04779j42429j90268m7008M643p4209n8044P4387Q8647m5750o3618
32157b08550J15855K01153J241k36503j95916L6538J24375l6756k24188k14488
$$ y = [196561, 173981, 394663, 623126, 623226, 480854, 430260, 500603, 516960, 389439, 237587, 227034, 384299, 578984, 631742, 457379, 149780, -96616, -176451, -142203, -75795, 15392, 135286, 240938, 316407, 399801, 460887, 374512, 119955, -121074, -197092, -190384, -236105, -281964, -232311, -192122, -295803, -390408, -212013, 154901, 337739, 222664, 91639, 133900, 184008, 100202, 49292, 177951, 304725, 229487, 103452, 172083, 344476, 357976, 224941, 161416, 169786, 59281, -159886, -264110, -203844, -159892, -176747, -83048, 140320, 245099, 102670, -87598, -134606, -129963, -204172, -262216, -187829, -99182, -144932, -208550, -92695, 108458, 109699, -126804, -322720, -286182, -161807, -198563, -422751, -637239]
32147f37239k2588J75200K40297J79944J00230N9967O421r4074j36345k0120J40232
32136h075J38096l346m9813O4669J11768p1575l08930l28527j23310J02381K23339
32125b53323K53486K05316P5546o4337j18231r4984p2528n7821J683Q5241R7370
32114E7418R888q7325r8846k7842M2773L7188l6825p6110J4304J76779K25099
32103B36501P1055j37178j85928n8181O6885M7643p7527j70081j34630J2545J54590
32092a74306J67217N9668q256P4059J89674J29993r9030k45468j37470Q0328J39132
32081A75541J812j05155j1738J66589J83593k2846k58096k99301j23456J00862
32071a92195J83444N6478j77405l00555j59023J48305L26914K13200k6810j29123
$$ y = [-637239, -659827, -484627, -244330, -64386, 35844, 95811, 102232, 8158, -128187, -148307, -8075, 130021, 126675, 76862, 141531, 253299, 181724, -127206, -455733, -579043, -476662, -253323, 163, 205479, 281025, 216688, 98457, 3473, -69055, -126876, -125193, -39952, 57418, 67306, -20019, -118865, -146707, -103934, -66746, -103571, -179681, -165377, 11402, 236501, 307556, 170378, -15550, -73731, -6846, 40797, -36730, -206811, -341441, -328896, -174306, -7089, 52579, 44323, 118382, 308056, 438049, 339019, 93551, -43919, 36409, 175541, 177353, 72198, 60460, 227049, 410642, 387796, 129700, -169601, -293057, -192195, -8751, 47727, -129678, -430233, -589256, -440951, -114037, 99163, 72353, -56770]
32061e6770p9514o5527j34269j22607M0821J87574J62846M1768l1287n2888o4825
32050a74678j1137J20178J53082m0442k51253j54385K00011L96928K11254j06479
32040C43079k11386j03413j3665k7039l9340l07K6579L2174Q6474J58008R0372
32029C41536j47199l29899k43287M346J09202q825j08645p791J37050R0360o6311
32018b29463m6892J74470K93382J37197p0485o8773M1870K364j57499j74357k88
32007i8474J13055K0177j08939r5451k7253n9823j25475n3636J22360J94582Q6723
31996c2154n3993q4871l5117q12Q685M8394J27727J86478J55999J6980j73576
31985A63740k92757k30223j547K28223K77685J25327o2016r7072L3563J65435
$$ y = [-56770, -136284, -201811, -336080, -458687, -417866, -230292, -67446, -25678, -56965, -109853, -174678, -185815, -65637, 87445, 47003, -204250, -358635, -158624, 238304, 449558, 343079, 131693, 28280, 14615, -12424, -51764, -52071, -25492, 6682, 93156, 251164, 341536, 194337, -135562, -378849, -374503, -265301, -274126, -382771, -390562, -253512, -163152, -229463, -276355, -101885, 191497, 328694, 258209, 189436, 231306, 233670, 76171, -98186, -98474, 14581, 34758, -74181, -169632, -196885, -256708, -382183, -435819, -313459, -118877, -32154, -86147, -171018, -206135, -206947, -198262, -149868, -22141, 164337, 320336, 337316, 163740, -129017, -359240, -360787, -132564, 145121, 270448, 208432, 111360, 144923, 310358]
31975C10358J51588K6195n9025l0741L3852K6666o5225j71016k12958j43238K9344
31964a04200J96911J98816j887k18372k17920n588J70488J32216j2759m8190M5257
31953A34772R7648L1277l2128Q601O2766J1014p6510m6456P8458J31429P4071
31942D74942L4338M4990l0875k14521k74647n8412K14813K28471K3721q9081j6638
31931C37101K0378r8800j88023q2879P3821N8400r1968j55489l9926J43757K48664
31920B25036K03890L7030j05090o2476R5342P6719k14645m33899k29676J92159
31910b15610K85487o5360l66313k18063J45504K49214M0918j38745r7352K3189
31900c57131O1946M7046M4293L0530K284L2936J22265J28868l1542k16795k08292
$$ y = [310358, 461946, 488141, 429116, 398375, 432227, 458893, 393668, 222652, 9694, -133544, -104200, 92711, 291527, 289640, 71268, -146652, -152240, 18248, 150464, 137705, 89515, 134772, 232420, 263697, 231569, 240170, 302936, 313950, 237440, 190984, 269442, 400871, 474942, 509280, 554270, 523395, 308874, 34227, -24185, 190628, 419099, 442820, 353739, 337101, 357479, 258679, 70656, -12223, 61598, 119998, 28030, -127459, -167385, -23628, 225036, 428926, 465956, 360866, 298390, 393732, 470451, 255806, -178093, -407769, -215610, 69877, 4517, -361796, -579859, -434355, -185141, -144223, -282968, -380320, -357131, -295185, -248139, -203846, -173316, -171032, -138096, -15831, 113037, 81495, -135300, -343592]
31889c43592J5675K54850L15513J89034J1051r2513j03215q9045j11810j62758
31879a16810j86564j43743l1645J21933K47791K58406J44658J4891l8310o8916
31869B01691j68822k69559k09954l167J44456J28270P1742P3937L4216j20511
31859a17701k22098r4694J29728J81218N8837m65P0896Q3859m6833j35299l4990
31848a27542J12720J02910k2474o2767M1767J55854J47817K7525q9814r3944J1175
31837B03227Q2752o781j77680k14623o1263R0844O8796o1834j29910q6897k114
31826b95483O2191P1594J2426m9735r126J05196J22840j0760j23547q0294Q452
31815a86246m009m7341P321P7795M002j41494j35361M1341J75016J48444P7241
$$ y = [-343592, -327917, -73067, 242446, 431480, 442531, 350018, 246803, 157758, 45948, -116810, -303374, -447117, -478762, -356829, -109038, 149368, 294026, 308917, 270607, 201691, 32869, -236690, -446644, -449811, -305355, -177085, -105343, -31406, 2810, -117701, -339799, -434493, -304765, -123547, -64710, -65175, 5721, 89580, 42747, -92552, -127542, -14822, 88088, 65614, 2847, 44614, 200468, 348285, 375810, 285996, 192052, 203227, 285979, 279198, 101518, -113105, -174368, -83524, -14728, -76562, -206472, -293369, -295483, -233292, -161698, -149272, -199007, -208133, -102937, 19903, 9143, -114404, -194698, -186246, -190255, -237596, -230275, -152480, -148478, -289972, -425333, -383992, -208976, -60532, 16709]
31804A6709Q7697J47031J64796J22104N6529J1303L544k2899j54390l35729l53253
31793b56558j21841J36528J73014M0304o3844j31565k50110l03451j15049J72044
31783g20528K24531K8097r2778L288J01542N5761J3482Q2626J19670K8832l2310
31772a87787N7965J59341J30326P0507J03568J43773P6520l4626j04580j83239
31762B31768k79587k49376m8092J21037J07092M0478O4305P6822k4746q0792P1633
31751C0542K70249K43508P159k03910k53898j44968P3591K24501P1017k87536
31741C0255l71556J8340M03416K84853j02791j95576j649R703k23084k66141J9787
31730c94443K46680J78794O1073Q4828O5400j04984j73229J0560J67720M8360
$$ y = [16709, 104406, 251437, 416233, 538337, 594866, 606169, 609713, 586814, 432424, 96695, -256558, -378399, -241871, -68857, -28553, -92397, -223962, -474072, -777523, -892572, -720528, -495997, -467900, -560678, -557390, -455848, -400087, -386605, -303979, -184309, -155477, -187787, -129822, 29519, 159845, 230352, 333920, 477693, 554213, 519587, 415007, 231768, -47819, -297195, -345287, -224250, -117158, -76680, -12375, 64447, 39701, -41091, 30542, 300791, 544299, 551458, 347548, 93650, -51318, 22273, 246774, 317791, 30255, -341301, -322961, 80455, 365308, 262517, 66941, 65292, 74995, -148089, -414230, -394443, -147763, 31031, 92104, 176932, 242332, 137348, -35881, -25321, 142399, 190759]
31720A90759j48932j40651k0677j9815q1184k9133O2847K6666n2771J5029J66291
31709c1571J94112J11827R0891J15244J3223j94821k75612j32973O2529J37210
31699I0059J12240Q5660P1502K5239n8808j25569j10141j7903M9715J8564j8413
31688A22145P8430K20992J43829j86411m38272l52078r9000R985j7806L1448J50276
31677c36462J31279k8943q4267N8186J83274J14134l0991o0326P990L7933O441
31666a752k1845n5632j44512k25076j55007P9036K95523L03857R7921j63292l11891
31655c02670k72210o8334J85952L22779K42586L5385q8830l3392P9476P8478m7797
31644A31423j66011j55321O214K30069L28734J50922j96318l84171k50410j5139
$$ y = [190759, 41827, -98824, -119501, -139316, -220500, -249633, -186786, -160120, -212891, -197862, -31571, 162541, 274368, 365259, 480503, 493726, 298905, 23293, -109680, -47151, 90059, 202299, 287959, 359461, 384700, 325892, 200323, 90182, 72279, 121994, 140558, 122145, 200575, 421567, 565396, 378985, -59287, -411365, -510365, -500380, -518186, -486738, -336462, -205183, -234126, -318393, -260207, -76933, 37201, 6210, -54116, -46126, -8193, -1752, -23597, -79229, -223741, -448817, -603824, -524788, -229265, 74592, 172513, 9221, -302670, -574880, -643214, -457262, -134483, 108103, 143488, 54658, 21266, 100742, 179220, 131423, -34588, -189909, -183695, 46374, 375108, 526030, 329712, -54459, -304869, -320008]
31634c20008N4232K4628R7554J91220P7492j46582j39297J14111K34055N3716
31624B41121j23438n4871N0833n7364k18788j51461O2238J39246O8101O6337J75500
31613A97454K23753J39528K8600l3096o5093p6637p1254r6474j43335j02959L0143
31602C0630O6865q3009k05857r9474Q7342R7898k0000n0081l451l3947p5918N7135
31590b31867K76280K96940R5341p1922r7609j15409j56291q8656N3240N3451r2785
31579g9287j29210J6957R7729j4463j03019o113R2150n0j36920r0516P0079J23475
31567a59188N6288K1773N0647L7027n1682j38214j64068j18139N208J58468K16169
31556h5711J11637n1308j13922m4691N7550R0351L0184n8664p1029L0095J55704
$$ y = [-320008, -265776, -241148, -143594, 47626, 125118, -21464, -160761, -46650, 187405, 241121, 117683, 62812, 113645, 56281, -162507, -313968, -251730, -112484, -44383, 21954, 197454, 421207, 560735, 589335, 556239, 491146, 414509, 343255, 246781, 103446, 487, 30630, 97495, 14486, -191371, -290845, -203503, -105605, -125605, -175686, -179137, -213084, -289002, -231867, 44413, 341353, 436694, 364772, 267163, 151754, -4537, -93193, -39953, 13498, -79287, -208497, -191540, -93811, -108274, -211293, -217406, -125256, -125306, -262226, -352742, -282663, -159188, -102900, -81127, -30480, 6547, -45135, -183349, -347417, -465556, -460348, -301880, -85711, 25926, -25382, -139304, -183995, -126445, -36094, -5910, -64574, -135603, -105508, 50196]
31545E0196K04093J86674J46202L1064j90214l65172l16974j19014J4740O0969
31535b97436J41097J91178J8089k92119l85279j54396R4606J15289K5699m342
31525e47614k5134p0802J2308K52260L67386J75265p6957q6132L9714O823j68090
31514a20973k24732q9930P1736J48616J56561J05284J8385p274M2944K1473j15351
31503F739j50803M3953K12800O8292k35465l19935j30264Q0905J94333K75464
31493D6019K73914P0377j97550k31776j8180J51653J19508J1647n5983j04390
31483F5239j00492M2312K27177K34514O8922l3835J6629O2589K600q8544j69825
31472C27286k64150k60853k3574K68282K54699n1318k27199p3993J08884N1388
$$ y = [50196, 254289, 440963, 587165, 618229, 428015, 62843, -254131, -373145, -358405, -297436, -156339, 34839, 52928, -239191, -624470, -778866, -684260, -568971, -543272, -547614, -572748, -643550, -631242, -378982, -11596, 163669, 86712, 580, 40294, 47117, -120973, -345705, -435635, -363899, -215283, -58722, 46562, 64947, 57673, 100617, 122090, 6739, -144064, -100111, 112689, 180981, -54484, -374419, -504683, -423778, -229445, 46019, 319933, 390310, 192760, -39016, -57196, 94457, 213965, 225612, 169629, 65239, -35253, 7059, 234236, 468750, 537672, 503837, 520466, 583055, 585655, 497111, 327286, 63136, -197717, -221291, 46991, 301690, 250372, 23173, -50820, 58064, 109452]
31462A09452q0414m5924N7295L5152m1803k5513K744q2405j63924q2207N4087
31451b63460N1120l0682r303Q6238J06189P8098J17392J46470J2892j87276k16764
31440a09086q4101j4751n4541j8565J38483K14434J06722j0479J5674P0407j8040
31429B36157j89200k40837j12652O0569J29263O6168m3433q8257l7140J8111k3158
31418b24409j08506p6783J02236K40674J68370k6142j09401k1006O3032J1944
31408B0009n6301L5823K24936K69225J01558p2900r6683p8797j46917j67857L5086
31397F7182K98044K64174q7690l69681l12197q0433N4611Q5745J26134J33708
31387A79597K2120j10289j07038j2984N863p2742j34779j35235j14142o8890J4963
$$ y = [109452, 29038, -16886, 40409, 75561, 33758, 8245, 10989, -71416, -235340, -317547, -263460, -212340, -243022, -252325, -166087, -59898, 18200, 135592, 282062, 294954, 107678, -109086, -193187, -207938, -262479, -281044, -142561, 71873, 178595, 168116, 183790, 254197, 236157, 46957, -193880, -306532, -245963, -116700, -50532, -93965, -182222, -219362, -201251, -224409, -332915, -409698, -307462, -66788, 101582, 75440, -33961, -54967, 8065, 20009, -36292, -469, 224467, 493692, 595250, 522350, 425667, 346870, 199953, 32096, 67182, 365226, 629400, 541710, 172029, -140168, -220601, -165990, -80245, 45889, 179597, 201717, 91428, -15610, -28594, -22731, -95473, -230252, -365487, -479629, -548519, -533556]
31376e33556O3516J4547m0609J7037J28065J48333Q7227O8202J04447J03008M8157
31365B08374n377p1067j66235j71341J4369K21968J81561o5622j98532q6753N3079
31354h5576L8507k6020j185L8897k1557j22055j52443j32662j05031o293J76437
31343c98981K67259J24988r6567j26385L9965J43803M4472j00420r2809J8985
31333a75690K6436j22206k15192m5306K73632L90284J65954j00747n5355K07802
31323C49612K66633j9146l07968k79060o1515K5901n5429j07141o7277n6615r6514
31312d08519n0245J13046K09168Q6900j47220k47953j12197J22551K36003J53374
31302d5092J4991J483J02818J39344K7827r6749r6664l6164m0965o6698J2096
$$ y = [-533556, -470040, -455493, -496102, -479065, -351000, -202667, -115440, -47238, 57209, 160217, 208374, 202997, 131930, -34305, -205646, -191277, 30691, 212252, 146630, -51902, -138655, -85576, -47069, -73089, -74274, -35377, -56934, -178989, -331432, -464094, -569125, -575418, -398981, -131722, -6734, -103301, -229686, -189721, -45918, -1446, -101866, -194675, -175690, -149254, -271460, -486652, -531958, -258326, 131958, 297912, 197165, 141810, 349612, 616245, 597099, 289131, 10071, -51444, -25543, -80972, -188113, -255390, -312005, -408519, -458764, -345718, -136550, -49650, -196870, -444823, -557020, -434469, -198466, -45092, -30101, -28618, 74200, 213544, 241371, 144622, 47958, 11794, -29171, -95869, -83773]
31291h3773J47623J57914J2816j11222r3933j5780J7422L3430Q1268Q8123l6865
31280A97023k13084k33742j8984K52636L20269J37437o5995o6646N7696L6384
31270D02994j90673l52938k24985M7881J69481J04994M9890P2727N3733l7035
31260I6069p0916j3962j085q1918j24846o9209m1223r3661o3282J38578L03468
31249b1987K12149j8836j10543j9829P1839P2711L8023k4897j55332k59586j71901
31238c88189Q1120K73620K62253J06075q9552k55986k87281j04785J58630K44779
31228F84J05003m0503l9484K244m1849j02317p4377j9524m2515r9141q7534k7943
31216d67256l75J2845Q2109J95118K81014K99456K17180M683k39065k94769j03382
$$ y = [-83773, 63850, 221764, 234580, 123358, 29425, 13645, 31067, 64497, 145765, 233888, 197023, -16061, -249803, -268787, -16151, 304118, 441555, 375560, 308914, 366610, 402994, 212321, -140617, -365602, -317721, -148240, -43246, 6644, 79371, 133104, 96069, 25153, 11191, 10106, -71812, -196658, -265867, -307090, -400751, -464033, -325455, -21987, 190162, 171326, 60783, 40954, 112793, 185504, 223527, 198630, 43298, -216288, -388189, -307069, -33449, 228804, 334879, 245327, -10659, -297940, -402725, -244095, 684, 105687, 65184, 25700, 27944, -13905, -116222, -190599, -210123, -252638, -351779, -439313, -467256, -467631, -454786, -372677, -177559, 103455, 402911, 620091, 624774, 385709, 90940, -12442]
31205a2442Q9967M9544j13698j29654P737O3974l2920q9799J6359J43898J13863
31194A06829m8104j87480k07641j13703K2323R6726O8682K9272P6375J50391J32800
31183A26470O0639M9654M3001j06189k95481k27050J05652L00541R9827k16755
31173e9691k39132l683J33422M5202o6858n1324K5900Q9029J51736J72430N2405
31162B49436j52132k20338n9436J51494J98408Q2904m6934r9866q0600j1266Q2629
31151I4299J40056R3779n6700k13549k31584m8792K00813K73955R5153j19197
31141B28233j22864L4307R0589m8891j95196j60960M655J32915J53748J11437
31131B27973N7819J5766n399j5870l3206n0936o4776j07333j76397j70127k5347
$$ y = [-12442, 77525, 127069, 13371, -116283, -108546, -44572, -77492, -167291, -150932, -7034, 106829, 58725, -128755, -336396, -450099, -427776, -331050, -262368, -233096, -156721, -6330, 126470, 187109, 236763, 279764, 173575, -121906, -348956, -243304, 57237, 157064, -59691, -298823, -302506, -169084, -123882, -190740, -242064, -216164, -127135, 24601, 197031, 249436, 97304, -123034, -182470, -30976, 167432, 250336, 203402, 103536, 22936, 11670, 94299, 234355, 328134, 271434, 57885, -173699, -222491, -21678, 252277, 347430, 228233, 105369, 139676, 230265, 181374, -13822, -174782, -170127, -37212, 116536, 227973, 285792, 301558, 296159, 280289, 247083, 196147, 131371, 24038, -152359, -322486, -347833]
31120c47833J12429M4098j49117j52924J21199L55056K53450m3369j81782p8467
31110f7260N6914Q3566N0810m659j12642j92510p8376J88822L16047J42442j10135
31099B73019j42522K679L8666j21138k52189j70738J7914J16669J15208J23829
31089A397J36530M7859j17817j81073o6154O1103J3424j55766k25012q7404J45831
31078d27082K94168K63722P9650j35043k22679j31381R172M0767j3696q638P2448
31067a78592Q3827k8874j09304j7783J54764K17488J25167k4150j48008k05032
31057a30497j40252L3888J42770J3706k51496l32492q2648K61381L54715J47116
31047A6191r3784j26164Q176R5601M0954l7576j026J10373J42833N3635l7677
$$ y = [-347833, -235404, -191306, -340423, -493347, -372148, -17092, 236358, 192989, 11207, -67260, -10346, 73220, 124030, 119371, 6729, -185781, -264157, -75335, 240712, 383154, 273019, 130497, 133176, 171842, 50704, -201485, -372223, -354309, -237640, -122432, 1397, 137927, 185786, 67969, -113104, -179258, -118155, -104731, -260497, -485509, -572913, -427082, -132914, 130808, 210458, 75415, -147264, -278645, -269473, -228706, -242402, -251040, -178592, -94765, -123639, -232943, -250726, -95962, 121526, 246693, 222543, 74535, -130497, -270749, -236861, -94091, -80385, -331881, -664373, -747021, -485640, -130925, 16191, -77593, -203757, -195581, -99980, -59026, -96602, -97628, 12745, 155578, 209213, 171536]
31036A71536l6214K634m864k3574K2215Q9408O3153n6038j35905j00824l1576
31025d0049l3777q4863p2309N0672J93132K08080M5393j64105k06516j5834K14672
31014I4496K24074j3243k52687k63735p0039J28704J92683J32782K7540n5260
31004A45315p0866k0003K5844j1081j02125j25945k8501R4499J32508J15755J39037
30993B94437J67159N7343j95610l78498l14899r4637O6105J03562J01893Q6739
30983a06406J6633m5965K3403J61341J32923j03499k59314j07282J61409J88536
30973F1779m7341k18041j06687J44129K74427K05454K9411j44015k35579j97227
30963b33690o8586K1852o584p8462n4100Q4993J99271J56250K753p0887L9634
$$ y = [171536, 135322, 137956, 133092, 109518, 131733, 221141, 284294, 228256, 92351, -8473, -40049, -73826, -158689, -230998, -180326, 12806, 220886, 266279, 102174, -104342, -120176, 94496, 318570, 305327, 52640, -211095, -281134, -152430, 40253, 173035, 200575, 145315, 74449, 54446, 80290, 69209, -32916, -158861, -187362, -92863, 39645, 155400, 294437, 461596, 518939, 323329, -55169, -370068, -464705, -398600, -295038, -193145, -106406, -89773, -135738, -112335, 49006, 181929, 78430, -180884, -288166, -126757, 61779, 14438, -203603, -310290, -166161, 108266, 313720, 343131, 199116, -36463, -233690, -302276, -280424, -287008, -365470, -419570, -334577, -135306, 20944, 23697, -47190, -7556]
30952g556J96960J67408p9695l11255l07437j07586Q5917J59631J46503J00825
30942D3715L9810j1504j8545J9201P9383J42792J66422J01153m379j8988O2826
30931F01886N6425j27818k73628j49737R2293R2331j76438l47206j95721N8521
30921c69092J17961K0826j837R9542J78614J53447Q6754M6552L2557K3277l868
30910C84733p7228j84035k50965k24615j31091k5532N2449N2418n5362j79072
30900f38300j51936M9614K41340K65764J87716J61563K00932J97631J04547j5332
30890F03539r1823j14077j10670j11336j11185p0689J854L541j21051k30298j46897
30879d99092M4478P9741p3225j39566L4760K42516K51295J28320L6384n3641k04088
$$ y = [-7556, 189404, 356812, 277117, -34138, -341575, -449161, -363244, -203613, -57110, 43715, 83525, 72021, 53476, 72677, 152060, 294852, 461274, 562427, 558048, 539060, 601886, 658311, 530493, 256865, 107128, 199421, 291752, 115314, -231892, -427613, -369092, -251131, -230305, -232142, -132600, 46014, 199461, 286215, 332767, 365324, 388601, 384733, 307505, 123470, -127495, -352110, -483201, -508733, -456284, -403866, -459228, -638300, -790236, -740622, -499282, -233518, -45802, 115761, 316693, 514324, 618871, 603539, 511716, 397639, 286969, 175633, 64448, -6241, -4387, -846, -121897, -352195, -499092, -454614, -374873, -448098, -587664, -552904, -310388, -59093, 69227, 105611, 51970, -152118]
30868a52118k77745j46404L4581M7555m0380m5094k2044j10715j62307O3127L95072
30857d16472L97016L4807k38187j53375L9180N9551J0469O6662J09464j9102j59283
30846b69270o6019J64230K18018L3459j36046j02854L8952R6943J5250j08669
30836a16006j45799n1280R9836J94427J90726J03074o7068k62583k94630m6121
30826c95424K62390K74867J0976j26728L6464J68326k4732k98414k48674N1277
30816b89672J91348P0128j8986P5741J42356L585j90751k17018r1959J7561M1028
30805b66639K9643M0473Q9863J47505J30612j0187j72828j77772J012J78764J80380
30794A70826L5212r1242r0700K616P1511L5440o3706j06811n3231K028k1254n7737
$$ y = [-152118, -429863, -576267, -541686, -494131, -534511, -579605, -601649, -712364, -874671, -811544, -416472, -19456, 15351, -222836, -376211, -337031, -277480, -267011, -200349, -90885, -109987, -269270, -335289, -171059, 46959, 80418, -55628, -158482, -119530, -22587, -7337, -116006, -261805, -313085, -213249, -18822, 171904, 274978, 207910, -54673, -349303, -395424, -133034, 141833, 152809, 26081, 62545, 230871, 206139, -92275, -340949, -289672, -98324, -28196, -47182, 28559, 170915, 174500, -16251, -233269, -325228, -307667, -266639, -236996, -196523, -106660, 40845, 171457, 161270, -11558, -189330, -188318, -9554, 170826, 206038, 114796, 24096, 26712, 98223, 133663, 69957, -36854, -90085, -88057, -109311, -167048]
30782a67048j1784O4944L9471r3046j89337j34983N1608K58838L40603K04048
$$ y = [-167048, -178832, -113888, -74417, -167463, -356800, -491783, -440175, -181337, 159266, 363314]
$$ [...]
##END NTUPLES=NMR SPECTRUM
##END=
