##TITLE=31Pdec_LY-TMF-4.70.3
 D2O, 24 sc
 27.2.2020
##JCAMPDX= 6.0         $$ Bruker NMR JCAMP-DX V2.0
##DATA TYPE= NMR SPECTRUM
##DATA CLASS= NTUPLES
##ORIGIN= UXNMR, Bruker Analytische Messtechnik GmbH
##OWNER= root
$$ XWIN-NMR		Version 3.5
$$ Thu Feb 27 16:01:31 2020 Russian Standard Time (UT+4h)  she@DPX200
##.OBSERVE FREQUENCY= 81.013821
##.OBSERVE NUCLEUS= ^31P
##.ACQUISITION MODE= SIMULTANEOUS
##.ACQUISITION SCHEME= undefined
##.AVERAGES= 24
##.DIGITISER RES= 17
##SPECTROMETER/DATA SYSTEM= spect
##.PULSE SEQUENCE= zgpg30
##.SOLVENT NAME= CDCl3
##.SHIFT REFERENCE= (INTERNAL, CDCl3, 0, 182.463)
##AUDIT TRAIL= $$ (NUMBER, WHEN, WHO, WHERE, WHAT)
$$ ##TITLE= Audit trail, XWIN-NMR		Version 3.5
$$ ##JCAMPDX= 5.01
$$ ##ORIGIN= Bruker BioSpin GmbH
$$ ##OWNER= she
$$ F:/spectra/data/she/nmr/P31/1/pdata/1/auditp.txt
$$ ##AUDIT TRAIL=  $$ (NUMBER, WHEN, WHO, WHERE, WHAT)
(   1,<2020-02-27 16:00:17.89 +0400>,<she>,<DPX200>,
      <created by zg, POWCHK disabled, PULCHK disabled
       configuration hash MD5:
       00 E9 B6 7A A2 85 ED C7 34 08 36 98 17 FE 4E 26
       data hash MD5: 32K
       9A 8E EC 6C 34 76 20 68 3E 4D 2D D7 DC AA 6B 9A>)
(   2,<2020-02-27 16:00:21.29 +0400>,<she>,<DPX200>,
      <Start of raw data processing
       efp BC_mod = 2 LB = 1 FT_mod = 6 PKNL = 1 PHC0 = -1540.608 PHC1 = 513.0013 SI = 64K 
       data hash MD5: 64K
       DB D2 E4 DE E7 E5 D9 FB EC E2 14 D1 18 4E 51 D3>)
(   3,<2020-02-27 16:00:43.43 +0400>,<she>,<DPX200>,
      <pk PHC0 = 4.716121 PHC1 = -3.4 
       data hash MD5: 64K
       D4 01 6F 5A 5D 9E FE 72 6B 99 FB FE 38 73 A2 45>)
(   4,<2020-02-27 16:00:46.65 +0400>,<she>,<DPX200>,
      <abs ABSG = 5 
       data hash MD5: 64K
       98 28 44 0D 19 B8 A6 BB 68 3D 9B 2B 89 2C 89 16>)
$$ ##END=
$$ 
$$ hash MD5
$$ EF 73 4A 23 ED 2F 3D 30 CF 8E 08 FC C4 62 5B 8B
##$RELAX= 
##$RELAX= 
##$RELAX= 
##$RELAX= 
##$RELAX= 
##$RELAX= 
##$RELAX= 
##$RELAX= 
$$ Bruker specific parameters
$$ --------------------------
##$DU= <F:/spectra>
##$EXPNO= 1
##$NAME= <P31>
##$PROCNO= 1
##$TYPE= <nmr>
##$USER= <she>
##$AMP= (0..31)
100 100 100 100 100 100 100 100 100 100 100 100 100 100 100 100 100 100 
100 100 100 100 100 100 100 100 100 100 100 100 100 100 
##$AQSEQ= 0
##$AQ_mod= 1
##$AUNM= <au_zg>
##$AUTOPOS= <>
##$BF1= 81.014009
##$BF2= 200.13
##$BF3= 200.13
##$BF4= 200.13
##$BF5= 200.13
##$BF6= 200.13
##$BF7= 200.13
##$BF8= 200.13
##$BYTORDA= 1
##$CFDGTYP= 0
##$CFRGTYP= 5
##$CHEMSTR= <none>
##$CNST= (0..31)
1 1 145 1 1 1 1 1 1 1 1 1 1 1 1 1 1 1 1 1 1 1 1 1 1 1 1 1 1 1 1 1 
##$CPDPRG= <waltz16>
##$CPDPRG1= <>
##$CPDPRG2= <waltz16>
##$CPDPRG3= <>
##$CPDPRG4= <mlev>
##$CPDPRG5= <mlev>
##$CPDPRG6= <mlev>
##$CPDPRG7= <mlev>
##$CPDPRG8= <mlev>
##$CPDPRGB= <>
##$CPDPRGT= <>
##$D= (0..31)
0 1 0 0 0 0 0 0 0 0 0 0.03 2e-05 3e-06 0 0 0 0 0 0 0 0 0 0 0 0 0 0 0 0 
0 0 
##$DATE= 1582804817
##$DBL= (0..7)
120 120 120 11 120 120 24 19 
##$DBP= (0..7)
150 150 150 150 150 150 150 150 
##$DBP07= 0
##$DBPNAM0= <>
##$DBPNAM1= <>
##$DBPNAM2= <>
$$ [...]
##$SUBNAM3= <"">
##$SUBNAM4= <"">
##$SUBNAM5= <"">
##$SUBNAM6= <"">
##$SUBNAM7= <"">
##$SUBNAM8= <"">
##$SUBNAM9= <"">
##$SW= 369.568048894756
##$SWIBOX= (0..15)
0 1 3 0 0 0 0 0 0 0 0 0 0 0 0 0 
##$SW_h= 29940.119760479
##$TD= 32768
##$TD0= 1
##$TE= 0
##$TE2= 300
##$TE3= 300
##$TEG= 300
##$TL= (0..7)
0 120 53 12 22 120 120 120 
##$TP= (0..7)
150 150 150 150 150 150 150 150 
##$TP07= 0
##$TPNAME0= <>
##$TPNAME1= <>
##$TPNAME2= <>
##$TPNAME3= <>
##$TPNAME4= <>
##$TPNAME5= <>
##$TPNAME6= <>
##$TPNAME7= <>
##$TPOAL= (0..7)
0.5 0.5 0.5 0.5 0.5 0.5 0.5 0.5 
##$TPOFFS= (0..7)
0 0 0 0 0 0 0 0 
##$TUNHIN= 0
##$TUNHOUT= 0
##$TUNXOUT= 0
##$USERA1= <user>
##$USERA2= <user>
##$USERA3= <user>
##$USERA4= <user>
##$USERA5= <user>
##$V9= 5
##$VALIST= <valist>
##$VCLIST= <CCCCCCCCCCCCCCC>
##$VD= 0
##$VDLIST= <DDDDDDDDDDDDDDD>
##$VPLIST= <PPPPPPPPPPPPPPP>
##$VTLIST= <TTTTTTTTTTTTTTT>
##$WBST= 1024
##$WBSW= 4
##$XGAIN= (0..3)
0 0 0 0 
##$XL= 0
##$YL= 0
##$YMAX_a= 10694
##$YMIN_a= -11906
##$ZGOPTNS= <>
##$ZL1= 120
##$ZL2= 120
##$ZL3= 120
##$ZL4= 120
##$ABSF1= 182.463
##$ABSF2= -187.1042
##$ABSG= 5
##$ABSL= 3
##$ALPHA= 0
##$AQORDER= 0
##$ASSFAC= 0
##$ASSFACI= 0
##$ASSFACX= 0
##$ASSWID= 0
##$AUNMP= <proc_1d>
##$AZFE= 0.1
##$AZFW= 0.5
##$BCFW= 0
##$BC_mod= 2
##$BYTORDP= 0
##$COROFFS= 0
##$CY= -3
##$DATMOD= 1
##$DC= 0
##$DFILT= <>
##$DTYPP= 0
##$F1P= 0
##$F2P= 0
##$FCOR= 1
##$FTSIZE= 65536
##$FT_mod= 6
##$GAMMA= 0
##$GB= 0
##$INTBC= 1
##$INTSCL= 5.30512e-09
##$ISEN= 30
##$LB= 1
##$LEV0= 0
##$LPBIN= 0
##$MAXI= 10000
##$MC2= 0
##$MEAN= 0
##$ME_mod= 0
##$MI= 50
##$NCOEF= 0
##$NC_proc= -5
##$NLEV= 6
##$NOISF1= 182.463
##$NOISF2= 159.3651
##$NSP= 0
##$NTH_PI= 0
##$NZP= 0
##$OFFSET= 182.463
##$PC= 4
##$PHC0= -1535.892
##$PHC1= 509.6013
##$PH_mod= 1
##$PKNL= yes
##$PPARMOD= 0
##$PSCAL= 0
##$PSIGN= 0
##$REVERSE= no
##$SF= 81.0140089999434
##$SI= 65536
##$SIGF1= 159.3651
##$SIGF2= -187.1042
##$SINO= 113.3802
##$SIOLD= 16384
##$SREGLST= <1H.CDCl3>
##$SSB= 0
##$STSI= 65536
##$STSR= 0
##$SW_p= 29940.119760479
##$SYMM= 0
##$S_DEV= 0
##$TDeff= 32768
##$TDoff= 0
##$TI= <>
##$TILT= no
##$TM1= 0
##$TM2= 0
##$TOPLEV= 0
##$USERP1= <user>
##$USERP2= <user>
##$USERP3= <user>
##$USERP4= <user>
##$USERP5= <user>
##$WDW= 1
##$XDIM= 65536
##$YMAX_p= 512618030
##$YMIN_p= -20423434
$$ End of Bruker specific parameters
$$ ---------------------------------
##NTUPLES= NMR SPECTRUM
##VAR_NAME=  FREQUENCY,     SPECTRUM/REAL,   SPECTRUM/IMAG
##SYMBOL=    X,             R,               I
##VAR_TYPE=  INDEPENDENT,   DEPENDENT,       DEPENDENT
##VAR_FORM=  AFFN,          ASDF,            ASDF
##VAR_DIM=   65536,         65536,           65536
##UNITS=     HZ,            ARBITRARY UNITS, ARBITRARY UNITS
##FACTOR=    0.456856943014862, 1,           1
##FIRST=     14782.0589164792, 0,            0
##LAST=      -15158.0608439998, 0,           0
##MIN=       -15158.0608439998, -20423434,   0
##MAX=       14782.0589164792, 512618030,    0
$$ Real data points
##PAGE= N=1
##DATA TABLE= (X++(R..R)), XYDATA
$$ [...]
36793E03573O27821J36213n51179p20230l09097O9103N4029R404L09695N68126
$$ 503573 1131394 1267607 716428 -3802 -312899 -243796 -189767 -180363 129332 697458
36783F97458J40082p40633j044409l66508M22475M16205l2416L8459O69152R63106
$$ 697458 837540 96907 -947502 -1314010 -891535 -475330 -507746 -469287 199865 1162971
36773A162971M48151l86101r04749r03843l54253N90738J209224P19250n28217
$$ 1162971 1611122 1225021 320272 -583571 -937824 -347086 862138 1581388 1053171
36764A053171j186400o35850K08511K94260j39561k03393K13530M96185M17506
$$ 1053171 -133229 -769079 -560568 -266308 -405869 -609262 -395732 100453 517959
36755E17959L50313M67230M55540J23125k41950l01638j31575o0250k00430l28333
$$ 517959 868272 1335502 1791042 1914167 1672217 1370579 1239004 1178754 978324 649991
36745F49991k51936j44270k67942m04070k7967P21738Q58329q2887j053948p93087
$$ 649991 398055 253785 -14157 -418227 -446194 275544 1133873 1050986 -2962 -796049
36735g96049K76626O21046q6688n98991k13917K25016J3294j75707L04571O75311
$$ -796049 -519423 101623 14935 -584056 -797973 -572957 -559663 -735370 -430799 244512
36725B44512K6307q88487o12459P26561J509418Q86232k91101q83763p67552m72367
$$ 244512 270819 -617668 -1230127 -503566 1005852 1892084 1600983 717220 -50332 -522699
36715e22699l16239k25628K8789N63238J087596J041768L67272j91546o9820K10178
$$ -522699 -838938 -1064566 -1035777 -472539 615057 1656825 2024097 1832551 1762731 1972909
36705A972909j97934j100190j477177r14310l094O37450R43852R77847O85744
$$ 1972909 1774975 674785 -802392 -1716702 -1719796 -1082346 -138494 839353 1525097
36696A525097K40567j1826q6530k91992n81243n59051j79824J79978L95985O73669
$$ 1525097 1765664 1753838 1667308 1375316 794073 235022 55198 235176 631161 1304830
36686A304830Q66219M66519m77968j153739j048423o18170m71776m44573k7683
$$ 1304830 2171049 2637568 2159600 1005861 -42562 -660732 -1132508 -1577081 -1604764
36677a604764O62475R46225N07048j84611m14621J2721N73825N51324j57723q15863
$$ -1604764 -942289 3936 510984 326373 -88248 -75527 498298 1049622 891899 76036
36667G6036o47488J83621P32053M34317k63462n70888k88009J55498L38771K51858
$$ 76036 -571452 -387831 344222 778539 515077 -55811 -343820 -188322 150449 402307
36657D02307J45074J54789J19564j71874n17331l47021M71556J118157O57239
$$ 402307 547381 702170 821734 649860 132529 -214492 257064 1375221 2032460
36648B032460o32661j383867q04608L26959P10369J33473m87377m45923k0487
$$ 2032460 1399799 15932 -788676 -461717 248652 382125 -105252 -551175 -571662
36639e71662J55287m890q3159J26610L27616J95796j25293k20153J2340K26425
$$ -571662 -416375 -421265 -504424 -377814 -50198 145598 20305 -199848 -187508 38917
36629C8917J30819q9225l763M85361R23467P03027k57002j221848j244910k55707
$$ 38917 169736 80511 76748 562109 1485576 2188603 1931601 709753 -535157 -790864
36619g90864O94341O34620j07205m49425j50867l7079n32627r24317n60763P2000
$$ -790864 -96523 538097 430892 -18533 -169400 -206479 -739106 -1663423 -2224186 -2152186
36609b152186K07264M3152K20182N38258K51158n41309q41542j96868O84589J001048
$$ -2152186 -1944922 -1901770 -1681588 -1143330 -892172 -1433481 -2275023 -2471891 -1787302 -786254
36599g86254Q13421N99981M26885L124p13442j303504j243910m34636N69470R92658
$$ -786254 27167 627148 1054033 1057157 343715 -959789 -2203699 -2638335 -2068865 -1076207
36589a076207O63391J96304J56461L80710M48788M03646M78820M74665P2456m57468
$$ -1076207 -412816 -216512 -60051 320659 769447 1173093 1651913 2126578 2199034 1741566
36579A741566n46800k03566L2245j07014m34389p42148q10883k76701P50972J248704
$$ 1741566 1194766 991200 1023445 916431 482042 -260106 -1070989 -1347690 -596718 651986
36569F51986M19657r26895j243098m22941J29718k55991n86649k464Q12365Q50903
$$ 651986 1071643 144748 -1098350 -1521291 -1391573 -1647564 -2234213 -2236677 -1424312 -573409
36559e73409L48006J06296O5071l17440p55905m01887P02914J459880J147301
$$ -573409 -225403 -119107 -54036 -371476 -1127381 -1529268 -826354 633526 1780827
36550A780827K65696k86392l09503k43974l73444m97971l49569j2680K43133L80263
$$ 1780827 2046523 1760131 1450628 1206654 833210 335239 -14330 -27010 216123 596386
36540E96386N37560O05917L00328k37695m61148l17619m68177j104160j291629
$$ 596386 1133946 1739863 2040191 1802496 1341348 1023729 555552 -548608 -1840237
36531a840237l35383Q69592R77481J95507j63641J90756L58301J12075K48125
$$ -1840237 -2175620 -1306028 -328547 -133040 -296681 -105925 252376 364451 612576
36522F12576Q18619P22347l42017j090443o42451J21395J37198k12849j23109
$$ 612576 1431195 2153542 1811525 721082 78631 200026 337224 124375 1266
36513A266J60243P0533p7067J85193M26579J61927j07940J24190K35601l92081
$$ 1266 161509 232042 154975 340168 766747 928674 820734 944924 1180525 788444
36503G88444r58733m24239O10440P49074j6426n26833m24864l16553k82255J63255
$$ 788444 -170289 -594528 15912 764986 748560 221727 -203137 -519690 -801945 -638690
36493f38690P89171Q63292N20179M27410K99848n88962j564372j127713M78906
$$ -638690 150481 1013773 1533952 1961362 2261210 1672248 107876 -1019837 -540931
36484e40931J243950L65319o34967m41848K34632K89716j1838m3011j31253o03475
$$ -540931 703019 1068338 433371 -8477 226155 515871 504033 461022 329769 -273706
36474b73706p34115M6304R02307Q21580J89715j03887k35073p45506j074592l63083
$$ -273706 -1007821 -961517 -59210 762370 952085 848198 613125 -132381 -1206973 -1570056
36464a570056P77158Q98497p4522p63689m58502P9813J21154j0904J72385M50027
$$ -1570056 -792898 105599 31077 -732612 -1191114 -1111301 -990147 -1001051 -828666 -378639
36454c78639M20693J76173O853l5368N684J10321J13765j07138k35938J20511
$$ -378639 42054 218227 225080 189712 195396 305717 419482 312344 76406 196917
36444A96917O38590N36744k40401q24769o55496j78094M6023J99045O19087R56710
$$ 196917 835507 1372251 1131850 307081 -348415 -526509 -480486 -281441 337646 1294356
36434A294356O46352j16803n76492m38296p3085K15111M86424O68972L88197m18906
$$ 1294356 1940708 1823905 1247413 809117 736032 951143 1437567 2106539 2494736 2075830
36424B075830j149651j170423n80208j6327J44177M6150r3341k69979m08051j81664
$$ 2075830 926179 -244244 -824452 -840779 -696602 -650452 -743793 -1013772 -1421823 -1603487
36414a603487N24255J150662R15980j66732j086133r35307l1118M38978j05446
$$ -1603487 -1079232 71430 987410 820678 -265455 -1200762 -1231880 -792902 -898348
36405h98348q93518p72926L18614J247970J055749L8133p50562p61968l28930
$$ -898348 -1791866 -2564792 -2246178 -998208 57541 95674 -654888 -1416856 -1745786
36396a745786N8992L13039M65491L50466o5784l67939j69158K59063L13565l5503
$$ -1745786 -1686794 -1373755 -908264 -557798 -623582 -991521 -1160679 -901616 -588051 -623554
36386f23554j75418K14407O49237N36450K2006k40160J9624L98282L86644o4802
$$ -623554 -798972 -584565 64672 601122 623128 382968 402592 800874 1187518 1122716
36376A122716n72578p06421l27751K76613N74951K84227k78284n23784l19753
$$ 1122716 550138 -156283 -484034 -207421 367530 651757 373473 -150311 -470064
36367d70064j33751l10614n25901l15216R9254Q9871k99506k69162M73680J075968
$$ -470064 -603815 -914429 -1440330 -1755546 -1656292 -1566421 -1865927 -2135089 -1661409 -585441
36357e85441P27349j07940m36642k41909k19958l13935J76614R66018P49464o57765
$$ -585441 141908 33968 -402674 -644583 -864541 -1178476 -1001862 -35844 713620 55855
36347E5855j572832p96503N35760P39080J51658K61714R94308Q77099k52732p99590
$$ 55855 -1516977 -2313480 -1777720 -1038640 -886982 -625268 369040 1246139 993407 193817
36337A93817p0695N68211O4692n23890J03101J191100J098543j13395r40364q20483
$$ 193817 123122 691333 756025 232135 335236 1526336 2624879 2511484 1571120 750637
36327G50637n84066o27102l05390N22063Q48687J30727o40468l97064L58270M28481
$$ 750637 166571 -460531 -765921 -243858 604829 735556 95088 -301976 56294 484775
36317D84775j57090l06713K81140O74857K90260k13755j14502K35341J69670j35299
$$ 484775 327685 20972 302112 976969 1267229 1053474 938972 1174313 1343983 1208684
36307A208684j78812k42969q47028j394764p11205R47382J776953Q46498n66287
$$ 1208684 1029872 786903 -60125 -1454889 -2166094 -1218712 558241 1404739 838452
36298H38452q49446k06745J05271j82006l45923j49030J6191J54030N33838P06055
$$ 838452 -10994 -217739 -112468 -294474 -640397 -789427 -773236 -619206 -85368 620687
36288F20687r014j067950j122814p0620O79476L32251k44485j20880L41848M63564
$$ 620687 611673 -456277 -1579091 -1649711 -970235 -637984 -882469 -1003349 -661501 -197937
36278a97937M01843M72090L24874k58776o23930k60572K06009K1497m23618l58055
$$ -197937 203906 675996 1000870 742094 118164 -142408 63601 85098 -338520 -696575
36268f96575N348K638j45677K37182Q95237R15712K04873m51809o80215p74088
$$ -696575 -691227 -688589 -834266 -597084 298153 1213865 1418738 966929 286714 -487374
36258d87374p53897k96781L58167N12070J38949p0989Q6800R9642j31849j3357
$$ -487374 -1241271 -1538052 -1179885 -667815 -528866 -599855 -513055 -413413 -545262 -558619
36248e58619N62208P96638K54030l63139l06599J18672K03047n7547j97772j44432
$$ -558619 3589 800227 1054257 691118 384519 503191 706238 648691 450919 306487
36238C06487j36464j04078K03790O22566O64997J97435l54714m90877j16767M08476
$$ 306487 170023 65945 269735 892301 1557298 1754733 1400019 909142 792375 1200851
36228A200851N88538K61324j94777k97091q2256L326j76405k73780j08284O76
$$ 1200851 1789389 2050713 1855936 1558845 1476589 1479915 1303510 1029730 921446 922122
36218I22122j87516l60227j33442L03282M38781J62125j48618j89570o9060p4088
$$ 922122 734606 374379 240937 544219 983000 1145125 996507 806937 737877 663789
36208F63789l14844o40745p88493n83910o9657N07356Q17477O32298M8091m62116
$$ 663789 348945 -291800 -1080293 -1664203 -1733860 -1226504 -409027 223271 271362 -190754
36198a90754m41850J8928L92497M34564M23725N12315L57458k06893o51517n00082
$$ -190754 -632604 -613676 -221179 213385 637110 1149425 1506883 1299990 648473 148391
36188A48391j53449k40375n16684k78903L75508O64513L82282M9124j53114n12548
$$ 148391 -5058 -245433 -762117 -1041020 -665512 -999 381283 430407 277293 -235255
36178b35255q00779l65920N27411P01072j21138p25548k79433M26593M55165K47927
$$ -235255 -1036034 -1401954 -874543 -173471 -294609 -1020157 -1299590 -872997 -417832 -169905
36168a69905N37793P71992L7519j139710j414884o51644R0641L46531N85373Q50846
$$ -169905 367888 1139880 1177399 37689 -1377195 -2028839 -1938198 -1591667 -1006294 -155448
36158a55448N52312j92078m12176R5651K73839m88782j278880j036825j03494
$$ -155448 396864 204786 -207390 -111739 162100 -326682 -1605562 -2642387 -2745881
36149b745881M44080L27434J12135J92572M73105P29396O96967J46200o12444
$$ -2745881 -2301801 -1974367 -1862232 -1669660 -1196555 -467159 229808 376008 -236436
36140b36436p34964N7502Q54168P37341J37839J13975O10025N45928l78190j131715
$$ -236436 -971400 -913898 -59730 677611 815450 929425 1539450 2085378 1707188 575473
36130E75473r29776l13405q5387p3353K45261N97856M09273J1376K34693R11163
$$ 575473 -354303 -667708 -753095 -826448 -581187 16669 425942 437318 672011 1583174
36120A583174R38389J8388p85696o86827l21140n18582q54288m87107K27174K71736
$$ 1583174 2521563 2539951 1754255 1067428 746288 227706 -626582 -1113689 -886515 -614779
36110f14779j99203r985R67786J349410L50181r16773j072744l64887P2703K0779
$$ -614779 -813982 -823967 143819 1493229 1843410 926637 -146107 -510994 -438291 -417512
36100d17512O8138K63658J46523j21790J08931P06676P48177m1986q35255r36231
$$ -417512 -349374 -85716 60807 -60983 47948 754624 1502801 1460815 625560 -310671
36090c10671n80501k13692J46182M54640L82463l0777k09013J6613M6235m05446
$$ -310671 -891172 -1104864 -958682 -504042 -121579 -152356 -361369 -344756 -298521 -703967
36080g03967o70343k28283L33405K83811k8762J08178M35385K52915j46751R4697
$$ -703967 -1374310 -1602593 -1269188 -985377 -1014139 -905961 -470576 -217661 -364412 -269715
36070b69715P06246M59123p68894j502347p94377L77551O51488K08649J29178
$$ -269715 436531 895654 126760 -1375587 -2169964 -1792413 -1140925 -932276 -803098
36061h03098N44905O41679J92213r3602J84450M96416L00368j56042l54314l01926
$$ -803098 -258193 383486 575699 482097 666547 1162963 1463331 1307289 952975 651049
36051F51049l40843m51995k30278M58714J116626J071391K46114o61834q78089
$$ 651049 310206 -141789 -372067 86647 1203273 2274664 2520778 1858944 980855
36042I80855l77880J66524K53319O7129J8742J29040J53161K7496j62927m32578
$$ 980855 602975 769499 1022818 1089947 1108689 1237729 1390890 1418386 1255459 822881
36032H22881p33269p72373m32077j51514l60986p11654n00688K22865O82905N28602
$$ 822881 89612 -682761 -1114838 -1266352 -1627338 -2338992 -2839680 -2616815 -1933910 -1405308
36022a405308K11213Q6141m3321k06504M3878P07687R02749R1879q72353p90536
$$ -1405308 -1194095 -1107954 -1151275 -1357779 -1313901 -606214 296535 388414 -483939 -1274475
36012a274475K07492R21620P70096L10874J45652J87946J59256P9223K1266q9881
$$ -1274475 -1066983 -145363 624733 935607 1081259 1269205 1428461 1507684 1528950 1439069
36002A439069k56096l91589n60282p85481p19247j16409M47399J51217o94915
$$ 1439069 1182973 791384 231102 -554379 -1273626 -1390035 -942636 -791419 -1486334
35993a486334p91592K83091J275147R45761k10655p56972k79089L55915M24848
$$ -1486334 -2277926 -1994835 -719688 226073 15418 -741554 -1020643 -664728 -239880
35984b39880J13158j28200j96584j38921O7095L02217K83541m4461l68053l70690
$$ -239880 -126722 -254922 -451506 -590427 -523332 -221115 62426 17965 -350088 -720778
35974g20778l5560M27461P22691N78422J4129n15756n50872j95270M7309j2221
$$ -720778 -756338 -328877 393814 972236 986365 470609 -80263 -275533 -228224 -240445
35964b40445o7060J22159L88708N04953M82585L44149m1492o20758r35847n79746
$$ -240445 -307505 -185346 203362 708315 1190900 1535049 1493557 872799 -63048 -642794
35954f42794K64627R93761J177699P90139L5653p45799j109028p97790o7543N12778
$$ -642794 -378167 615594 1793293 2583432 2619085 1873286 764258 -33532 -101075 411703
35944D11703O30965M45148K52359J61816J06803m2380m00736q73876j043735n76362
$$ 411703 1042668 1487816 1740175 1901991 2008794 1966414 1565678 691802 -351933 -928295
35934i28295J92095M88547J17185k09845Q6689N41585L68522k50989m22606J0379
$$ -928295 -736200 -247653 -130468 -340313 -253624 287961 656483 405494 -17112 -6733
35924f733K01730l05088q26010o54084j30750Q0923J31679N26406R92325Q06357
$$ -6733 194997 -110091 -936101 -1590185 -1720935 -1640012 -1508333 -981927 10398 816755
35914H16755N4630m23490l28091j72391j69208J41142Q26601J098236M82151l24323
$$ 816755 871385 447895 119804 -52587 -221795 -80653 745948 1844184 2326335 2002012
35904B002012m49040p5272P1009m4039Q6157M06263K77164m18820r36529o58012
$$ 2002012 1552972 1477700 1548709 1504670 1590827 1997090 2274254 1855434 918905 260893
35894B60893J23175O55060N79425J18407k94525l75501j81936o5498k68488n35796
$$ 260893 384068 1039128 1618553 1736960 1442435 1066934 884998 819500 551012 15216
35884A5216l76852K15419O05049K70999m93818r12234o46915j03427J91587K03092
$$ 15216 -361636 -146217 458832 729831 236013 -676221 -1323136 -1426563 -1234976 -1031884
35874a031884K19458L27753L64764K75980J68124K4964k35152l83846o7118M67593
$$ -1031884 -812426 -484673 -119909 156071 324195 349159 114007 -269839 -336957 130636
35864A30636M26968l64400r64787n79632K40998M85865K71555M55055R29523O33683
$$ 130636 557604 193204 -771583 -1351215 -1110217 -624352 -352797 102258 1031781 1665464
35854A665464o01816j515727j188887k57192K28580J81218O6930J5320N6295M30761
$$ 1665464 1063648 -452079 -1640966 -1898158 -1669578 -1488360 -1421430 -1406110 -1349815 -919054
35844i19054R35520P69815j86514p88156k14652P00947P70746K39339L6068K0381
$$ -919054 16466 786281 599767 -188389 -403041 297906 1068652 1307991 1344059 1364440
35834A364440n21099j178909r06983L3423L14957k64648n15116J4550L35687n9268
$$ 1364440 843341 -335568 -1242551 -1209128 -894171 -1158819 -1673935 -1659385 -1323698 -1382966
35824a382966k03694O08313J472773J244448J83551p23034j167195j293726r04665
$$ -1382966 -1586660 -978347 494426 1738874 1922425 1199391 32196 -1261530 -2166195
35815b166195N7926Q44273P27108P7707k50063j83510k19790l53567j57781K90836
$$ -2166195 -2108269 -1263996 -536888 -459181 -709244 -892754 -1112544 -1466111 -1623892 -1333056
35805a333056M65609K91704K09302L47595L44726N6640j71070p9121J35140J75835
$$ -1333056 -867447 -575743 -366441 -18846 325880 382520 211450 132329 267469 443304
35795D43304K1171k03511m64940p69470r64000p20243J38120J198336J587756
$$ 443304 464475 260964 -203976 -973446 -1937446 -2657689 -2519569 -1321233 266523
35786B66523R08919j16934m61105j23819L6802k36590k69530J86766L35969l31949
$$ 266523 1175442 1058508 597403 473584 510386 273796 4266 191032 527001 195052
35776A95052j042644q97798k55367K902n2713K59752Q51121R68107N00423J07886
$$ 195052 -847592 -1745390 -2000757 -1997855 -2050568 -1790816 -939695 28412 528835 636721
35766F36721P2412M746k39182k60650R3043M13574L90806J45627j88410n64893
$$ 636721 709133 713879 474697 214047 307090 720664 1111470 1257097 1068687 503794
35756E03794o53756r7522P33628R67630M13207j57055j24283K41638M16657L19356
$$ 503794 -149962 -247484 486144 1453774 1866981 1709926 1585643 1827281 2243938 2563294
35746B563294M1270m77243j074449j219315p11474r5549P0605l8049L8184K33346
$$ 2563294 2604564 2127321 1052872 -166443 -877917 -973466 -902861 -940910 -902726 -669380
35736f69380J67161p1078J6735M88083P12305J89611p02691j085880o23795Q7956
$$ -669380 -502219 -573297 -556562 -68479 643826 833437 130746 -955134 -1578929 -1490973
35726a490973K95724K7620o9495K48688M79381K31628j19577p7150J47196O4905
$$ -1490973 -1195249 -1167629 -1237124 -988436 -509055 -277427 -397004 -474154 -326958 -262053
35716b62053j75329n3884L43620M37676J78752J03119L01630K20213k87946n75102
$$ -262053 -437382 -491266 -147646 290030 468782 571901 873531 1093744 805798 230696
35706B30696k45538J64004R824n73541j034717j066133n38886N43872J580363
$$ 230696 -14842 149162 158986 -414555 -1449272 -2515405 -3054291 -2510419 -930056
35697i30056J579345M32597o61972o77426k2183L46275L52523M46611M61999k9932
$$ -930056 649289 1081886 419914 -257512 -279695 66580 419103 865714 1327713 1297781
35687A297781o19283n15249P6699K22164j57264k09194K19180J80405p16991j452522
$$ 1297781 678498 163249 239948 462112 304848 95654 314834 495239 -221752 -1674274
35677a674274j091292j74372K12166J9182m647L76098P01460O69061M02563L2018
$$ -1674274 -2765566 -2939938 -2727772 -2708590 -2713237 -2337139 -1635679 -966618 -564055 -532037
35667e32037l47463m36736m0486M99052O97739O01391N23975L30762l07242j024558
$$ -532037 -879500 -1316236 -1356722 -857670 -159931 441460 965435 1296197 988955 -35603
35657c5603r47978L4077R02556P73300j4240n00791l64582n0505R6472K23652
$$ -35603 -983581 -949504 -46948 726352 712112 211321 -153261 -203766 -107294 116358
35647A16358M61932N24198J13188m80293n65579N9702O89414N02541l25910p75273
$$ 116358 578290 1102488 1215676 735383 169804 229506 918920 1421461 1095551 320278
35637C20278l54945K14138P9504m89668n96086j31352J63532j2088j03258K21905
$$ 320278 -34667 179471 258975 -230693 -826779 -958131 -794599 -806687 -909945 -688040
35627f88040M80092K97647J29078M28820P52212M30516l18384p32773o41921m86041
$$ -688040 -207948 89699 218777 647597 1399809 1830325 1511941 779168 137247 -348794
35617c48794m23175j96172K12204N10263O09297N38969K8635r93367j627390q22238
$$ -348794 -771969 -968141 -755937 -245674 363623 902592 931227 -62140 -1689530 -2511768
35607b511768Q89359J643375P00557m60304k67094P28386Q78597r415n61539j00406
$$ -2511768 -1622409 20966 721523 261219 -5875 722511 1601108 1591693 1030154 929748
35597I29748M13272P4743n27616l66153L19409M04387l12817p33421r0243Q93850
$$ 929748 1343020 1417763 890147 523994 843403 1247790 934973 201552 111309 1005159
35587A005159J020275K27533n27148o90660n62494l67367J29551P54341O54833
$$ 1005159 2025434 2252967 1725819 1035159 472665 105298 234849 989190 1644023
35578A644023l83788j154833n55487O63872Q51171j58221r14908n92877K4216
$$ 1644023 1260235 105402 -450085 213787 1064958 906737 -8171 -601048 -576832
35569e76832R2150q1014M1235K33589J80232J60559K94122L2304p40949j024857
$$ -576832 -484682 -565696 -524461 -290872 -110640 49919 344041 376345 -364604 -1389461
35559a389461j58598Q53042O76421l29630p38050k37207K02898J02983j5850R8478
$$ -1389461 -1548059 -695017 -18596 -348226 -1086276 -1323483 -1120585 -1017602 -1033452 -934974
35549i34974J6303k88675j62125N49280J065148Q18299J65651l66885o95045p35268
$$ -934974 -918671 -1207346 -1369471 -820191 244957 1063256 1228907 862022 166977 -568291
35539e68291k55285M49489N91344M3582l49112p1377K66783j0144n44535n68487
$$ -568291 -823576 -374087 217257 260839 -88273 -159650 107133 96989 -447546 -1016033
35529a016033l2777N17090P05169M29588k85089j004200r72853o9063P98034P97697
$$ -1016033 -1048810 -531720 173449 603037 317948 -686252 -1659105 -1728168 -930134 -132437
35519a32437K12451j91464k93805m35965n77021m23231r9022M8231P9990K31208
$$ -132437 80014 -111450 -405255 -841220 -1418241 -1841472 -1940494 -1892263 -1812273 -1581065
35509a581065L07730L2997k50095j1403M99232N46902R9897j45032K5715K933
$$ -1581065 -1273335 -1240338 -1490433 -1501836 -1002604 -455702 -355805 -500837 -475122 -472189
35499d72189n33676r91488p67309j11294L86051O24332P77438O90119J32663n57482
$$ -472189 -1005865 -1997353 -2764662 -2875956 -2489905 -1865573 -1088135 -398016 -265353 -822835
35489h22835p14728k27737L04136L83694J94171K14069N58216R07324R00931M23524
$$ -822835 -1537563 -1765300 -1461164 -1077470 -883299 -669230 -111014 796310 1697241 2120765
35479B120765l23691q43396o33662K35506R60267P89513o6045p09916p16398m71432
$$ 2120765 1797074 953678 320016 555522 1515789 2305302 2239257 1529341 812943 341511
35469C41511k87290Q5669O88782Q61012K27749m19707j58532N71905N87434j71957
$$ 341511 54221 139890 828672 1689684 1917433 1497726 1339194 1911099 2498533 2326576
35459B326576o25560m05584l64254q79398j013731j07387R35399R39684J86400
$$ 2326576 1701016 1295432 931178 51780 -961951 -1069338 -133939 805745 992145
35450I92145k20228q3271r2856m54769o28947l23739J36866M18255M73095L18385
$$ 992145 771917 688646 595790 141021 -487926 -811665 -674799 -256544 216551 534936
35440E34936P4728M0286K20770J34988l55566n55649m3816L37920l11696j254794
$$ 534936 609664 649950 870720 1005708 650142 94493 50677 388597 76901 -1177893
35430a177893r92993L78017J218345Q35317L24120M76876M56244n23736j518120
$$ -1177893 -2170886 -1792869 -574524 260793 584913 1061789 1518033 994297 -523823
35421e23823j127085L67695J415584J295683O61614K32634k384k78653n94716
$$ -523823 -1650908 -1283213 132371 1428054 2089668 2322302 2319918 2041265 1446549
35412A446549q55987r08694m82830L51828Q36218L17099o90902r99968l48981
$$ 1446549 590562 -318132 -800962 -449134 387084 704183 13281 -986687 -1335668
35403a335668K91458K10125q5461J36133O04494N51190K230k76001m324K42241
$$ -1335668 -1044210 -834085 -919546 -783413 -178919 372271 374501 98500 94176 336417
35393C36417K8138l01570l17340k40351m41378o31962k54446N05315Q49092N45571
$$ 336417 364555 62985 -254355 -494706 -936084 -1568046 -1822492 -1317177 -468085 77486
35383G7486K18844K35641J02332n13145q78375j60652J127862J629385R67241
$$ 77486 296330 531971 634303 121158 -757217 -917869 209993 1839378 2806619
35374B806619R3984k70409n03964r85258j135579l70297O68735Q33397J23210
$$ 2806619 2900603 2630194 2126230 1140972 5393 -364904 303831 1137228 1260438
35365A260438l64044r5169K42742k4297n27881n46723r4095K78185L37056K17335
$$ 1260438 896394 801225 1043967 1019670 491789 -54934 -149029 129156 466212 683547
35355F83547p7419n59284q24920m56710J84984L13778n6692n7467N79612Q80779
$$ 683547 606128 46844 -778076 -1234786 -1049802 -736024 -792716 -850183 -270571 610208
35345F10208O2859j108347j259715k77387O93240Q78053N45020J07805m27208
$$ 610208 673067 -435280 -1694995 -1972382 -1279142 -401089 143931 251736 -175472
35336a75472r09534q44260j51322N34747O92168M87597K61062M6878j11192j7635
$$ -175472 -1085006 -1929266 -2080588 -1545841 -853673 -366076 -105014 -58136 -169328 -186963
35326a86963J82727M9729k79842n3508Q01785J207343M35529p06235j017929n35650
$$ -186963 -4236 45493 -234349 -287857 513928 1721271 2156800 1450565 432636 -103014
35316a03014j05931K0298J18499N7172l94618p10178k74193L68474K26509l51225
$$ -103014 -208945 -188647 -70148 -12976 -407594 -1117772 -1391965 -1023491 -796982 -1148207
35306a148207n9242J115355J577398N21410p84264q94722j80424Q8044k43378
$$ -1148207 -1207449 -92094 1485304 2006714 1222450 327728 147304 235348 -8030
35297h030k94090K06663N11383J00722n10635m93776J96507P50523M84083k76367
$$ -8030 -302120 -95457 415926 516648 6013 -487763 -291256 459267 943350 666983
35287F66983n30081R1627P65319O22056N974j62894M0582l09526j262067j610098
$$ 666983 136902 228529 993848 1615904 1621878 1458984 1499566 1190040 -72027 -1682125
35277a682125o74424N81100Q93883L45403r6392l3245J74108K23846J06617j87329
$$ -1682125 -2356549 -1775449 -881566 -536163 -632555 -665800 -491692 -267846 -161229 -348558
35267c48558n34206n01470R2579O78016N75168n2578m37974k42224J78739M12451
$$ -348558 -882764 -1384234 -1291655 -613639 -38471 -91049 -529023 -771247 -592508 -180057
35257a80057L75890J22826k61211n52316n33459k68766O606K08741L89718N01174
$$ -180057 195833 318659 57448 -494868 -1028327 -1297093 -1290487 -1081746 -692028 -190854
35247a90854M26777K02872J1712k9593J4603m1316k94823n08737k50677M60077
$$ -190854 235923 438795 450507 420914 435517 394201 99378 -409359 -660036 -199959
35237a99959R05246N56566l0189O7835O66792O63757k16238r31670p48234k79937
$$ -199959 705287 1261853 1231664 1299499 1966291 2630048 2413810 1482140 733906 453969
35227D53969k89561m49778j58052K44297Q2846m16743n23676j87674J30394L92238
$$ 453969 164408 -285370 -443422 -199125 -116279 -533022 -1056698 -1244372 -1113978 -721740
35217g21740P43762P41091m1513q76078n90189O07486J228978O02257l09672n26022
$$ -721740 22022 763113 721600 -154478 -744667 -137181 1091797 1694054 1384382 858360
35207H58360l43335m18670n50987k36630K18951R4244n35197q28091l91635K30966
$$ 858360 515025 96355 -454632 -691262 -472311 -378067 -913264 -1741355 -2132990 -1902024
35197a902024M25243L02082L28368N32991N21082J77361r4017K6228K83157K49824
$$ -1902024 -1476781 -1174699 -846331 -313340 207742 385103 291086 317314 600471 850295
35187H50295m2948k59537l42910m63799n11722k15994K41882L62484J35782M9902
$$ 850295 807347 547810 204900 -258899 -770621 -986615 -744733 -382249 -246467 -196565
35177a96565J94686J27746j65456n8869N89912J009780P46491M10180N03819M37408
$$ -196565 -1879 125867 -39589 -98458 491454 1501234 2247725 2657905 3161724 3599132
35167C599132l63368j205597j123117m74134l13203o47435o18928j16451J32893
$$ 3599132 3235764 2030167 907050 432916 119713 -527722 -1146650 -1263101 -1130208
35158a130208m5418r6450N3033j11317m79189k80906M72445P52463J46792l97360
$$ -1130208 -1175626 -1272076 -1219043 -1330360 -1809549 -2090455 -1618010 -865547 -718755 -1116115
35148a116115l1465P41481R04238K84331m83642p66041k97507O60729J223868
$$ -1116115 -1147580 -406099 498139 782470 298828 -467213 -764720 -103991 1119877
35139A119877O29753o16101j112168m31105K53349p4250p94920p34000K6495M36466
$$ 1119877 1749630 1133529 21361 -409744 -156395 -230645 -1025565 -1759565 -1733070 -1296604
35129a296604J81749L7642N17317J046484Q04255j27634q61213p82864j99267
$$ -1296604 -1114855 -1077213 -559896 486588 1290843 1163209 301996 -480868 -680135
35120f80135J83041J63260P8400K6683l23076r09743r73443j54492P28538Q06403
$$ -680135 -497094 -333834 -255434 -228751 -551827 -1461570 -2435013 -2589505 -1860967 -1054564
35110a054564M91251O36019Q72989J95378j013118j172207K9228R77577N56060
$$ -1054564 -563313 72706 945695 1141073 127955 -1044252 -1015024 -37447 518613
35101E18613k60855j43542N43531N98782n0504m92360l57842o6518R4858J80809
$$ 518613 257758 114216 657747 1256529 1206025 713665 355823 289305 384163 564972
35091E64972J48740K648P3953M57747N56737o9200q09636p95653k36517m8594
$$ 564972 713712 716360 790313 1248060 1804797 1735597 925961 130308 -106209 -154803
35081a54803l74474m50507N5612M99235K81788k78988m42251N982N79440O72408
$$ -154803 -529277 -979784 -924172 -424937 -143149 -422137 -864388 -858406 -278966 393442
35071C93442J78100l88193m04767J49948O26545M21019l74944j067043r56975
$$ 393442 571542 183349 -221418 -71470 555075 976094 601150 -465893 -1422868
35062a422868J9529R80301P21316p88087j866702r80094J058086J934322R23033
$$ -1422868 -1403339 -423038 298278 -489809 -2356511 -3336605 -2278519 -344197 578836
35053E78836l02302l20747J72409L4964k96583J69577J031205J133944M78724
$$ 578836 276534 -44213 128196 163160 -133423 36154 1067359 2201303 2680027
35044B680027j5951j87270n96822j120660j009907k84127K23672K33189K77642
$$ 2680027 2664076 2476806 1879984 759324 -250583 -534710 -311038 -77849 199793
35035A99793N58448O18077K64283j09553k11423q3119K71579P22160P11676j3719
$$ 199793 758241 1376318 1640601 1531048 1319625 1236506 1508085 2230245 2941921 2928202
35025B928202o98731n79870j82156m40078r63730o62542J80096J86225p38171
$$ 2928202 2229471 1649601 1467445 1027367 63637 -598905 -418809 -232584 -970755
35016i70755j128971m10262K08880n8300k23134O04410J473947J007896m79670
$$ -970755 -2099726 -2509988 -2301108 -2359408 -2582542 -1978132 -504185 503711 24041
35007B4041j501630j323597l75974O21455J083216P12435j1334r5411O08133J051606
$$ 24041 -1477589 -2801186 -3177160 -2555705 -1472489 -760054 -771388 -866799 -258666 792940
34997G92940N82371n8283o6083J37982q3209l07373L0008L65277P658l99419N1569
$$ 792940 1375311 1317028 1250945 1388927 1305718 998345 1028353 1393630 1401288 1001869 1053438
34986A053438O71672J41344j066182j165227M0542P09264j35804j084096n94564
$$ 1053438 1725110 1866454 800272 -364955 -324413 384851 249047 -835049 -1429613
34977a429613P18225J197186M84986m29213q08885p05131l10689K42063O32506
$$ -1429613 -711388 485798 970784 541571 -267314 -972445 -1283134 -1041071 -408565
34968d08565O31005M45818K55765k29143j091793j523472p18266P56284J463798
$$ -408565 222440 668258 924023 694880 -396913 -1920385 -2638651 -1882367 -418569
34959d18569R99567M08366M70329N76481q4059j029383j107704k36024M54509
$$ -418569 580998 989364 1459693 2036174 1952115 922732 -184972 -420996 33513
34950C3513K25554l45123l26186K97190P51223N25411j22481n61188l80957L09655
$$ 33513 259067 -86056 -412242 -115052 636171 1161582 1039101 477913 96956 406611
34940D06611R48703R52893K56482o32237j166588j195390q43155k86552J94431
$$ 406611 1355314 2308207 2564689 1932452 765864 -429526 -1272681 -1559233 -1364802
34931a364802L03960J35734J56179M83158N74617N7838n40329m83428P8084M01713
$$ -1364802 -1060842 -925108 -768929 -285771 288846 346684 -193645 -677073 -598989 -197276
34921a97276L14717K80674M13627L10659o3203k02272K4239J18898j12681k20050
$$ -197276 117441 398115 811742 1122401 1059198 856926 881165 1000063 887382 667332
34911F67332m2637r4756n25058o03134N9390O27933K84914l68987k30753N09237
$$ 667332 624695 529939 4881 -598253 -538863 89070 373984 4997 -225756 283481
34901B83481O91920M4531n25391m78191k88527l29399k16057L00527P06823N51374
$$ 283481 975401 1019932 494541 16350 -272177 -601576 -817633 -517106 189717 741091
34891G41091J83965J08409J89866Q3868n3680P7977K27996q6826p51849j124307
$$ 741091 925056 1033465 1223331 1307199 1253519 1331496 1559492 1472666 720817 -403490
34881d03490q69590k75717K21661M42454M19255K81751J82261J22472m6452k61255
$$ -403490 -1273080 -1548797 -1327136 -884682 -465427 -183676 -1415 121057 74605 -186650
34871a86650j40020M05767P14304R4758j065833j541759p64439M55087R63788
$$ -186650 -326670 79097 793401 888159 -177674 -1719433 -2483872 -2028785 -1064997
34862a064997N78638N429j96936r9869o636l1421j34128k80044m33459m96833
$$ -1064997 -486359 -480930 -677866 -777735 -784371 -815792 -949920 -1229964 -1663423 -2160256
34852b160256l33332J12251O43413Q36118M67877q4768k13947Q8848K11024r4662
$$ -2160256 -2493588 -2381337 -1737924 -901806 -433929 -518697 -732644 -643796 -432772 -527434
34842e27434k61225J53201O47204N41071Q1293n2295K8859k67684o75936k98147
$$ -527434 -788659 -635458 11746 552817 634110 581815 610674 342990 -332946 -631093
34832f31093P09285J017065J53451o54329m32285O52m36079j093742o30786O31912
$$ -631093 78192 1095257 1248708 594379 162094 162746 -273333 -1367075 -1997861 -1365949
34822a365949J056322J88450o63928m89746J93843N08418L88945J27653k12950
$$ -1365949 -309627 -121177 -785105 -1274851 -1081008 -572590 -183645 -55992 -268942
34813b68942m26405r8462O07934R24342O31258L62462L73354O1330p06562r38667
$$ -268942 -695347 -793809 -185875 738467 1369725 1732187 2105541 2166871 1460309 521642
34803E21642j06182O49721J08508j008499j002653K71300J298695J185767N87774
$$ 521642 415460 1065181 1173689 165190 -837463 -566163 732532 1918299 2506073
34794B506073J87937l25924j185004j620321r40097J94741N47444K4925k82071
$$ 2506073 2694010 2368086 1183082 -437239 -1377336 -1182595 -635151 -610226 -892297
34785h92297K58366R48160Q21946O929n11328k58030K00961K18519q355O8133
$$ -892297 -633931 314229 1136175 1143104 631776 373746 574707 793226 784871 853004
34775H53004L10013Q6333n48144o99515K7880P74232N76755k65538o93111l98131
$$ 853004 1163017 1249350 701206 1691 29571 803803 1380558 1115020 421909 23778
34765B3778l6852p1269k14287j26956L7631L2916q0669j98515l82605n46712l66723
$$ 23778 -13074 -84343 -298630 -425586 -387955 -355039 -435708 -634223 -1016828 -1563540 -1930263
34754a930263J65854M94596K26015j96775o6043N11990P20544K68714j15137K09852
$$ -1930263 -1764409 -1269813 -1043798 -1240573 -1306616 -794626 -74082 194632 79495 289347
34744B89347P07033L43251q24094j528447r62096J43550N90416L10577J74790
$$ 289347 996380 1339631 515537 -1012910 -1975006 -1831456 -1241040 -930463 -755673
34735g55673N32308Q11376N69907J19669j17750j89564k40686j57918O5656J30907
$$ -755673 -223365 588011 1157918 1277587 1159837 970273 729587 571669 637325 768232
34725G68232n0757j35228J8374K8455k95280n01429k63454Q67q4355l9103O53385
$$ 768232 717475 582247 600621 629076 333796 -167633 -431087 -430220 -514575 -553678 99707
34714I9707J381316J096750l7575p77189n94569k77212m81532p28052l81843K12074
$$ 99707 1481023 2577773 2540198 1763009 1168440 891228 409696 -318356 -700199 -488125
34704d88125L37177R9110J66614N78065O56087J49188l18682k58509j42271o08581
$$ -488125 -150948 -51838 114776 692841 1348928 1498116 1179434 920925 778654 170073
34694A70073j208389q10894O37910J645474J039991l46276p55262Q7732P43560
$$ 170073 -1038316 -1849210 -1211300 434174 1474165 1127889 372627 460359 1203919
34685A203919K48112o44188q13844l12946J50999M10864O49185O45915J59826
$$ 1203919 1452031 807843 -6001 -318947 -167948 242916 892101 1538016 1697842
34676A697842l53905l07339L3696l5069n09381p63464n55239j37006L94487R94712
$$ 1697842 1343937 1036598 1070294 1035225 525844 -237620 -792859 -929865 -535378 459334
34666D59334J147653M09442o38606r40862m14729Q8218J63406J38309M7758m30580
$$ 459334 1606987 2016429 1377823 436961 22232 110450 273856 412165 459923 29343
34656B9343q94152m14620P90022J193818J06836j195201j260344l26719M75632
$$ 29343 -864809 -1279429 -489407 704411 811247 -383954 -1644298 -1971017 -1495385
34647a495385Q09683R61910P87292L5311p46944p85628k91736r8916l01795k34606
$$ -1495385 -685702 276208 1063500 1098811 351867 -433761 -725497 -824413 -1126208 -1360814
34637a360814L04562P63785P91601O17006L78956j17050p59460r39941l27334
$$ -1360814 -1056252 -292467 499134 1116140 1495096 1378046 618586 -321355 -648689
34628f48689O24122J187748J055847M03857l75802q73322q97416o35183l91571
$$ -648689 -24567 1163181 2219028 2622885 2247083 1373761 476345 -158838 -550409
34619e50409j98407Q6733L99495N14214M01915K22037M4129r5980j3141L34978
$$ -550409 -748816 -662083 -262588 251626 653541 875578 919707 823727 810586 1145564
34609A145564N22990J52012m18869m53935K7747J97939l08617p72052m61108K49036
$$ 1145564 1668554 1820566 1401697 947762 975509 1173448 864831 92779 -368329 -119293
34599a19293M37238k9489l88807j34967L15822K77864k62582o29630k87128M91760
$$ -119293 317945 288456 -100351 -235318 80504 358368 95786 -533844 -820972 -329212
34589c29212Q77097M35056k90067l77154L03270Q77297N88412k39145p01994m91686
$$ -329212 547885 982941 692874 315720 618990 1496287 2084699 1845554 1143560 651874
34579F51874q3219R5054J04060P3098q7762l36576l43732q293K49681P4914k62243
$$ 651874 568655 663709 767769 840867 753105 416529 72797 64504 314185 389099 126856
34568A26856k94934q5266n7720k85332m28594k98195j9963K97292N95103O27778
$$ 126856 -168078 -253344 -311064 -596396 -1024990 -1323185 -1343148 -1045856 -450753 177025
34558A77025K17395k53379j73624L80650O42915K45655k52380k00567K81490N96011
$$ 177025 394420 141041 -32583 348067 990982 1236637 984257 783690 1065180 1661191
34548A661191M16963j28143o59480p39753k86604R8822k21289q46449o97487L05338
$$ 1661191 2078154 1950011 1290531 550778 264174 362996 141707 -704742 -1402229 -1096891
34538a096891Q98408L27521m86333m49090L5202K5970j77553L20926J123341R24156
$$ -1096891 -198483 129038 -357295 -806385 -771183 -745213 -922766 -601840 521501 1445657
34528A445657l12730j131455p35471O1468L97065N25185Q43425R52119M58325
$$ 1445657 1132927 1472 -733999 -672531 -275466 249719 1093144 2045263 2503588
34519B503588j90855m44055m86075o48699o67858k64878J28452J9366k28869M8982
$$ 2503588 2312733 1868678 1382603 733904 66046 -198832 -70380 -51014 -279883 -230901
34509b30901O35970O31763k05144j023055r71055k62768J61368j39666n66836
$$ -230901 405069 1036832 831688 -191367 -1162422 -1425190 -1263822 -1403488 -1970324
34500a970324l40421L46350N63631P9094k12248K59249O97918K50158l92055k1563
$$ -1970324 -2310745 -1964395 -1400764 -1321670 -1533918 -1274669 -576751 -326593 -718648 -740211
34490g40211R05099P68390n47127j249510l64779P89543O84732k86550q03439
$$ -740211 164888 933278 386151 -863359 -1228138 -438595 246137 -40413 -843852
34481h43852n76929j71627K02209N60823N49763O7674j59781L40577P91925L18418
$$ -843852 -1420781 -1592408 -1390199 -829376 -279613 -211939 -371720 -31143 760782 1079200
34471A079200n51975p09824k27876k6813k00114l7076M75397N26223q6559n80087
$$ 1079200 527225 -182599 -410475 -437288 -637402 -674478 -199081 327142 240583 -339504
34461c39504m33291k3441J84539K31883K52302J97743J40614K29571K80965P483
$$ -339504 -772795 -796236 -611697 -379814 -127512 70231 210845 440416 721381 728864
34451G28864l68183l54459k357J59393n0838l18686l98924k10468M13730J317069
$$ 728864 360681 6222 3865 163258 112420 -206266 -605190 -815658 -401928 915141
34441I15141J599199N62312r93703j442222m18745P13651P11358j35746p64339
$$ 915141 2514340 3076652 2082949 640727 221982 935633 1646991 1511245 746906
34432G46906o97715k09511K41758L13273m1832m14755l53267l8546n1781m08971
$$ 746906 49191 -160320 81438 394711 352879 -61876 -415143 -453689 -505470 -914441
34422i14441m65889O2275O46144P44299M45643N8385l17702n00212j38745O39876
$$ -914441 -1380330 -1318055 -671911 72388 518031 576416 258714 -241498 -380243 259633
34412B59633J020084M39768n93346j069178o29828J77895O00999L63063j76809
$$ 259633 1279717 1719485 1126139 56961 -572867 -394972 206027 569090 392281
34403C92281l62688Q7661O74714O46854o443m69170j53778N50719Q36704M65571
$$ 392281 29593 117254 791968 1438822 1432379 963209 809431 1360150 2196854 2662425
34393B662425j04084l66327k51710m9459n5120k85998m82440m30141k42962j93083
$$ 2662425 2558341 2192014 1940304 1890845 1835725 1549727 1067287 637146 394184 201101
34383B01101l06924l38979j64140K2369L573j00398M9189M86441O79124P8324
$$ 201101 -105823 -444802 -608942 -586573 -583000 -683398 -634209 -147768 531356 609680
34373F09680r81982j353372m68420O92703P57590j14963m56458K86865R25291
$$ 609680 -372302 -1725674 -2194094 -1501391 -743801 -858764 -1315222 -1028357 -103066
34364a03066M13770n66252p77713k61295Q8816J25335M22260R93887J176799O93580
$$ -103066 310704 -255548 -1033261 -1294556 -1205740 -1080405 -658145 335742 1512541 2206121
34354B206121o2828o89089r44212n15552N25251J257765Q20632l45878j016086
$$ 2206121 2143293 1454204 509992 -5560 519691 1777456 2598088 2252210 1236124
34345A236124p86878l14527j13842n1585J7252k1666j57113k72299m20086m86581
$$ 1236124 449246 134719 20877 -30708 -13456 -35122 -192235 -464534 -884620 -1371201
34335a371201J1724J038276J514992P15249l91780m38945K26603K26526m58953
$$ -1371201 -1359477 -321201 1193791 1909040 1517260 1078315 1304918 1531444 1072491
34326A072491n49010J92648N40028k7019n24193k99370p567j51017k01648J18940
$$ 1072491 523481 716129 1256157 1229138 704945 405575 398008 246991 45343 164283
34316A64283J48606l45814m91358J42727O19867J87776m54269m31665j19187k17467
$$ 164283 312889 -32925 -524283 -381556 238311 426087 -28182 -459847 -579034 -796501
34306g96501l92137J3265O61974P21748J40305m75926p77963p48314l74615J32817
$$ -796501 -1188638 -1175373 -513399 208349 348654 -127272 -905235 -1653549 -2028164 -1895347
34296a895347L30137K20989L07709N99572M37195k56083n68022m6244M80549K53580
$$ -1895347 -1565210 -1344221 -1036512 -436940 255 -255828 -823850 -870094 -389545 -135965
34286a35965k47461k86579m9883K2969J55392N59199P04844K09185l28030k64186
$$ -135965 -383426 -670005 -719888 -696919 -541527 17672 722516 931701 603671 339485
34276C39485Q6305K21821L54142O56855N44589k86953r80396p40478j10129M2030
$$ 339485 425790 647611 1001753 1658608 2203197 1916244 935848 195370 85241 127271
34266A27271m8032K31075N55443L48689K4914K38354N54445K08639l89091k76010
$$ 127271 79239 310314 865757 1214446 1239360 1477714 2032159 2240798 1851707 1575697
34256A575697L90512N95489M6435o85463j208112j388843q96382J84579Q23070
$$ 1575697 1966209 2561698 2608133 1922670 714558 -674285 -1570667 -1386088 -563018
34247e63018L24964m27743k61801M25557M88335L5363r560K16531j09296o07316
$$ -563018 -238054 -665797 -927598 -502041 -13706 21657 12097 228628 119332 -487984
34237d87984j14090J088725J381702L29203o85346o70075k07944j2140J09814
$$ -487984 -602074 486651 1868353 2197556 1512210 842135 634191 622051 731865
34228G31865K87805M3634o04071p45258k461P08756N15040k19561o22378m49512
$$ 731865 1019670 1063304 459233 -286025 -288486 420270 935310 715749 93371 -356141
34218c56141j1435L29531K39274l19129p01716k42653O06466P29609N5234k76624
$$ -356141 -367576 -38045 201229 -117900 -819616 -1062269 -455803 273806 329040 52416
34208E2416K82786Q64485O10186j30959n91940o36348m41234m353M30170K72416
$$ 52416 335202 1199687 1809873 1678914 1086974 450626 9392 5039 435209 707625
34198G07625m50478p92343k18884M80942L71358j82991j42577N57677R46526M98254
$$ 707625 257147 -535196 -754080 -273138 98220 -84771 -227348 330329 1276855 1775109
34188A775109j79126l14674j6351J8121m65567r33387p79691j18931L64231K59199
$$ 1775109 1595983 1281309 1264958 1283079 817512 -115875 -895566 -1014497 -650266 -391067
34178c91067j65093m08895k76161J11692M93181N55284K07424j55590j00143J07836
$$ -391067 -556160 -965055 -1241216 -1129524 -636343 -81059 126365 -29225 -129368 -21532
34168b1532j66987p68642p37387K36435J192194J205172N38237p779j17152J58407
$$ -21532 -188519 -957161 -1694548 -1458113 -265919 939253 1477490 1469711 1352559 1510966
34158A510966O94840R68435L82774n55002n27033M90064P96747m13742j520724
$$ 1510966 2205806 3174241 3557015 3002013 2474980 2965044 3761791 3348049 1827325
34149A827325r17638M21146N34985n09549j116802q14918m32110k30328J81429
$$ 1827325 909687 1330833 1865818 1356269 239467 -575451 -1007561 -1237889 -1056460
34140a056460M85615P9092m59052j07120O91216O24274k59205o87389k95295J25468
$$ -1056460 -570845 -491753 -950805 -1057925 -366709 257565 -1640 -689029 -984324 -858856
34130h58856K68747M65979M61794j86221p70903l30330M44373J40254q64735r22009
$$ -858856 -590109 -124130 337664 151443 -619460 -949790 -505417 -365163 -1229898 -2151907
34120b151907J01087P73599O81568P20141Q56518Q9788j172963j217584R5784
$$ -2151907 -2050820 -1277221 -595653 124488 981006 1070794 -102169 -1319753 -1223969
34111a223969R73419O81560M63961Q89790P87291l24191j096447o64839P617O0360
$$ -1223969 -250550 431010 894971 1784761 2572052 2247861 1151414 486575 494192 554552
34101E54552J0298K14550N9123m41735k29492P45013J041472J58647n65439l19266
$$ 554552 564850 779400 838523 396788 167296 912309 1953781 2112428 1546989 1227723
34091A227723j8260k90251l97597o6760j93837p82715m81282P81453J109818j63137
$$ 1227723 1209463 919212 521615 454855 261018 -521697 -1002979 -221526 888292 725155
34081G25155j031565o2654J225887R14307m60955j279508j209113o74047K42578
$$ 725155 -306410 -369064 856823 1771130 1310175 30667 -1178446 -1852493 -1609915
34072a609915R87830M88522q41955j040199L24570J265463P36619K68063Q34667
$$ -1609915 -622085 -133563 -975518 -2015717 -1691147 -425684 310935 578998 1413665
34063A413665R65582j80628p74165L79829J279774R1292j481875j060824M35264
$$ 1413665 2379247 2198619 1424454 1804283 3084057 3175349 1693474 632650 1067914
34054A067914O83417j35062l49738k3112j77679k98502N17108J280118P00355
$$ 1067914 1751331 1616269 1266531 1243419 1065740 767238 1284346 2564464 3264819
34045C264819l17253l80990k91133j267687k064603q58023J295625J914223R11964
$$ 3264819 2947566 2566576 2275443 1007756 -1056847 -1914870 -619245 1294978 2206942
34036B206942Q8354j20582m96329o60594K37151J265548Q87247l44430p43624
$$ 2206942 2295296 2174714 1678385 1017791 1254942 2520490 3407737 3063307 2319683
34027B319683k60961N6639K54783P26498N74774p67876j674656o93384P10691
$$ 2319683 2058722 2115361 2370144 3096642 3671416 2903540 1228884 535500 1246191
34018A246191N09901m25650j95840N08781k1305q89967j42753J336773J150500
$$ 1246191 1756092 1330442 1134602 1643383 1622078 732111 589358 1926131 3076631
34009C076631l97770r84569k87138J28540O1282M37475P41174Q03o91744M9516
$$ 3076631 2678861 1694292 1407154 1535694 1596976 2034451 2775625 2776428 2084684 2134200
33999B134200Q82576n1024j354878o18537J039875Q14710p16401p49418N88257
$$ 2134200 3016776 2965752 1610874 992337 2032212 2846922 2130521 1381103 1969360
33990A969360P29172m94270r18621k78432j12286k01537P10576J572024O13725
$$ 1969360 2698532 2204262 1285641 1007209 894923 693386 1403962 2975986 3589711
33981C589711q41515m53258O83414J76693q29863P8590J443163N17279j036017
$$ 3589711 2748196 2294938 2978352 3155045 2325182 2403772 3846935 4364214 3328197
33972C328197k2275J796078O99138j534478m77115K422042K096854p59207j028799
$$ 3328197 3305922 5102000 5801138 4266660 3789545 6211587 8308441 7549234 6520435
33963F520435J143681R30568j517222j316109J402982J579578q23665p94907J610502
$$ 6520435 7664116 8594684 7077462 5761353 7164335 8743913 7920248 7125341 8735843
33954H735843J419949q17941K68635L585191K917166k78693J338578O148959N478171
$$ 8735843 10155792 9337851 9606486 13191677 16108843 15830150 17168728 23317687 28795858
33945B8795858J005015L139266J0627786J1647538P793427J3343583K6053247
$$ 28795858 29800873 32940139 43567925 55215463 63008890 76352473 102405720
33938A02405720K8250772K7038530N6086235J12724233J30219909N5892631o4937153
$$ 102405720 130656492 157695022 213781257 326505490 456725399 512618030 447680877
33931D47680877j31826959j08473361n2208025k4784170k4320797k0525178j0696836
$$ 447680877 315853918 207380557 155172532 130388362 106067565 85542387 74845551
33924G4845551r693387j4229776j0619242k272814k060001p517575o628554m90874
$$ 74845551 65152164 50922388 40303146 38030332 35970331 28452756 21824202 21333328
33916B1333328K75118m084297m267447o096N42628l169459l838781m81754P06523
$$ 21333328 21608446 17524149 13256702 13250606 13793234 10623775 6784994 6303240 7009763
33907G009763j346429j583273O02392Q00200r98766n63578J587569Q99867k072784
$$ 7009763 5663334 4080061 4682453 5482653 4483887 3920309 5507878 6407745 4334961
33898D334961k331207K29379Q72136r79566j282005L38569J80288j640177j090988
$$ 4334961 2003754 2233133 3105269 2125703 843698 1182267 1362555 -277622 -1368610
33889a368610J604351J707904j306999k470722k3103J855140O58196q33466m73981
$$ -1368610 235741 1943645 636646 -1834076 -1857179 -2039 656157 -177309 -651290
33880f51290j10113r07664q66332Q21719J778296P52992l57587k97356j93408
$$ -651290 -761403 -1669067 -2535399 -1713680 64616 817608 460021 162665 -30743
33871c0743m35228J05264R14430R4525j538008j003257J479104K260499L12500
$$ -30743 -465971 -360707 553723 648248 -889760 -1893017 -413913 1846586 2159086
33862B159086j162873l59739N53792l119m16779L11530L86496j052590j860704
$$ 2159086 996213 636474 1190266 1187147 770368 1081898 1468394 415804 -1444900
33853a444900p01842N37146K25937l67712N9921M40860j61719n13027L04090R75558
$$ -1444900 -2146742 -1609596 -1383659 -1751371 -1691450 -1250590 -1412309 -1925336 -1621246 -645688
33843f45688M35260j85171J55439N21725O3919l03970J37385M58443L8481j76016
$$ -645688 -210428 -395599 -240160 281565 345484 41514 178899 637342 675823 499807
33833D99807K86818L16375n34036r08617q5022O38528L04972j30346J13914J98318
$$ 499807 786625 1103000 568964 -339653 -424675 213853 518825 388479 502393 700711
33823G00711l52797m37123M20713Q12736r1876r01792l85068M64993L44484k06066
$$ 700711 347914 -89209 331504 1144240 1052364 150572 -234496 230497 574981 368915
33813C68915j59991J41520J1277k21045j99906m01497q49640n80843N25472J101044
$$ 368915 208924 350444 361721 140676 -59230 -460727 -1310367 -1891210 -1365738 -264694
33803b64694N27680k8063J20391n5361j020242j348061k22950Q38386N19874m9857
$$ -264694 262986 234923 355314 299953 -720289 -2068350 -2291300 -1452914 -933040 -982897
33793i82897M67624J050635K14962j115528j030933K33134Q93125N01217Q0118
$$ -982897 -515273 535362 750324 -365204 -1396137 -1163003 -269878 231339 311457
33784C11457o172l05554p56916o60250q393M92037N36777L53036P9729j63056
$$ 311457 305285 -269 -757185 -1417435 -1425828 -933791 -397014 -43978 35751 -127305
33774a27305j15504N7945j97925o87586m44024N18003Q00381j32344p98881r752
$$ -127305 -242809 -184864 -382789 -1070375 -1514399 -996396 -196015 -328359 -1127240 -1136992
33764a136992J099024Q40150m11033j005916n26571Q6421K61053K19678J36921
$$ -1136992 -37968 802182 391149 -614767 -1141338 -1054917 -793864 -574186 -437265
33755d37265J5410j1619k3455l14448n35626Q4946J102731R42383n09839j150033
$$ -437265 -421855 -433474 -456929 -771377 -1307003 -1222057 -119326 823057 313218 -836815
33745h36815K03557J685253J132147o36006j349019p66104l18220k71002K72745
$$ -836815 -633258 1051995 2184142 1548136 199117 -566987 -885207 -1156209 -883464
33736h83464J073393Q96680j56803o52662k43651q7839o00238o76144K97898J233542
$$ -883464 189929 1086609 929806 277144 33493 -54346 -654584 -1330728 -1032830 200712
33726B00712Q94211m15263j377711j207790k41246N85739O54965K72446K02819
$$ 200712 1094923 679660 -698051 -1905841 -2147087 -1561348 -906383 -633937 -431118
33717d31118N11878M96948R932j31905L90003O54475P6114m58510j53003J81612
$$ -431118 80760 577708 587640 455735 845738 1500213 1576327 1117817 964814 1146426
33707A146426m10230j129597o84997M02165O22343R972j07229M40127M63400l30442
$$ 1146426 736196 -393401 -1078398 -676233 -53890 -43918 -151147 288980 752380 421938
33697D21938p80962k71464L53851L13908l2999j06061L2127J49815K66337K95800
$$ 421938 -359024 -630488 -276637 37271 4272 -101789 -69662 80153 346490 642290
33687F42290N5460k20402j03453K81666M47584L58179K99708J61784l21634q56094
$$ 642290 697750 477348 373895 655561 1103145 1461324 1761032 1922816 1601182 745088
33677G45088r57490p53356n87283k52556M48101Q96949N06197j39678j58756J62940
$$ 745088 -212402 -965758 -1553041 -1805597 -1357496 -460547 45650 -94028 -252784 -89844
33667h9844P6187q6079L77045Q41142K17011q49162o80822N80868R88475o5683
$$ -89844 -13657 -99736 277309 1118451 1335462 486300 -194522 386346 1374821 1309138
33657A309138q86265l35769L93154m8254r39827q08179K49913R21068N95431j80481
$$ 1309138 422873 87104 480258 432004 -507823 -1316002 -1066089 -145021 450410 269929
33647B69929o61096m92671K13395Q22243O55609q1394m18593M5335O21019O35925
$$ 269929 -391167 -883838 -670443 151800 807409 726015 307422 352757 973776 1609701
33637A609701K90571M4989r1538k50723l54979m19793n91550o86661l78611O7401
$$ 1609701 1900272 1945261 1853723 1603000 1248021 828228 236678 -449983 -828594 -761193
33627g61193Q9507p5161L72267J283809J468308M87317o09340q67304o41681o08089
$$ -761193 -671686 -746847 -374580 909229 2377537 2864854 2255514 1388210 746529 138440
33617A38440o24835l32779L3481K02348M14208P01489M62874m66409j126562o82142
$$ 138440 -486395 -819174 -785693 -583345 -169137 532352 995226 528817 -597745 -1279887
33607a279887L16031P62912M90814J10261p1904j39144n4324J41884N6160m02518
$$ -1279887 -963856 -200944 289870 400131 328227 189083 134759 276643 332803 -69715
33597f9715n58866Q3228Q93889R29710K96733j42538j07926o9746k55301l38493
$$ -69715 -628581 -545353 348536 1278246 1574979 1432441 1324515 1254769 999468 660975
33587F60975j27138J25436J80586J06322N7859P5414O0813j98855p51215j123556
$$ 660975 533837 659273 839859 946181 1004040 1079454 1140267 941412 190197 -933359
33577i33359p27814J78935N92781J93769q8608M49107J038085N87676n46468j079941
$$ -933359 -1661173 -1482238 -889457 -695688 -784296 -335189 702896 1290572 744104 -335837
33567c35837p15709l23781l28487j78788L87558P26297L94876o8161n2771J82424
$$ -335837 -1051546 -1375327 -1703814 -1882602 -1495044 -768747 -373871 -442032 -494803 -312379
33557c12379J10977j26766q6315J28011J02342q5142m3793J12828p6229m32918
$$ -312379 -201402 -328168 -414483 -286472 -184130 -269272 -313065 -200237 -276466 -709384
33547g09384j56432Q76890J589083J041748k31526r17345o07334m3097J38405
$$ -709384 -865816 11074 1600157 2641905 2410379 1493034 885700 842603 981008
33538I81008O9083K0265o7151j84267j04832O1423j50532o84994q04306k62322
$$ 981008 1050091 1070356 1003205 818938 714106 775529 624997 -59997 -864303 -1126625
33528a126625J35643k11576o36130k47982N75422P70347K45832j21733M6939K26060
$$ -1126625 -990982 -1202558 -1838688 -2086670 -1511248 -740901 -495069 -616802 -569863 -343803
33518c43803K3801k95011l99146k64037M8895L55449K58448k41835l84176K79587
$$ -343803 -320002 -615013 -1014159 -1278196 -1229301 -873852 -615404 -857239 -1241415 -961828
33508i61828Q80273L78702o85392r22954l03749p6148n21891n25938L10797Q75655
$$ -961828 -81555 297147 -388245 -1311199 -1614948 -1691096 -2212987 -2738925 -2428128 -1552473
33498a552473M81147k9249O5416J32722l71957o45310M7676Q89738P96763K16541
$$ -1552473 -1071326 -1100575 -1035159 -902437 -1274394 -1919704 -1872028 -982290 -185527 31014
33488C1014K36888O77966N42228j69377n38144l26426j65498k80071k25529J07164
$$ 31014 267902 945868 1488096 1318719 780575 454149 288651 8580 -216949 -109785
33478a09785K64559P8303j09643j15159r6331r5023k3388K043q9053M7153O16790
$$ -109785 154774 233077 123434 8275 -88056 -183079 -206467 -204424 -293477 -246324 370466
33467C70466J014680M93160o23858j198125p58262j2764K04422j00373l26027
$$ 370466 1385146 1878306 1254448 56323 -701939 -714703 -510281 -610654 -936681
33458i36681p8928M10632N26626J3411m93013j20837Q99900J247283K81007r45767
$$ -936681 -1015609 -604977 -78351 -64940 -557953 -678790 221110 1468393 1749400 803633
33448H03633j128581m55630p091j5498J42044N54009N90559R1237l37928l65201
$$ 803633 -324948 -780578 -787669 -803167 -661123 -107114 483445 574682 236754 -128447
33438a28447l64058n87014o89726l64269J51538M53583M23176J69619r2067q0845
$$ -128447 -492505 -1079519 -1769245 -2133514 -1981976 -1528393 -1105217 -935598 -1027665 -1108510
33428a108510K45468M76914K54229j34382j47064J44596J64916k12631m23479
$$ -1108510 -863042 -386128 -131899 -266281 -413345 -268749 -103833 -316464 -739943
33419g39943o2713M91428N40098p3241p26500o47486J75541Q34721N66974j62485
$$ -739943 -802656 -311228 228870 155629 -570871 -1218357 -1042816 -208095 358879 196394
33409A96394k43736M53891R12360N81355R7902l8373l13666r59918j074229j03086
$$ 196394 -47342 406549 1318909 1900264 1998166 1959793 1646127 686209 -388020 -491106
33399d91106Q49911N76325k49599j98581M89829L85934o07985j075843m08408
$$ -491106 358805 935130 685531 486950 976779 1362713 754728 -321115 -729523
33390g29523M45211P41541Q24925R01817M76373m56650r86381o44877q9241N0861
$$ -729523 -284312 457229 1282154 2183971 2660344 2203694 1217313 572436 483195 534056
33380E34056m1486j30612l87661o75562m38334K80794P29605O72338O20323N80491
$$ 534056 492570 361958 -25703 -701265 -1139599 -858805 -129200 543138 1163461 1743952
33370A743952r5619j193783j422753l95831N68363M53365j255J70020M99420J72378
$$ 1743952 1648333 454550 -968203 -1364034 -795671 -342306 -343561 -173541 325879 498257
33360D98257l65397k50605K32963K93314J11452L33380O75871M00326k59531m67863
$$ 498257 132860 -117745 115218 408532 519984 853364 1529235 1929561 1670030 1202167
33350A202167k72368m37504r76496j071978m27291L67099Q15249R30549P14596
$$ 1202167 929799 492295 -484201 -1556179 -1983470 -1616371 -801122 129427 844023
33341H44023J25911m49474n25276k79914k49197l97179k89884o372K6474l5594
$$ 844023 969934 520460 -4816 -284730 -533927 -931106 -1220990 -1227362 -1200888 -1236482
33331a236482L25593Q83651Q05333n056o64897n95032j51156K03714M50918N10777
$$ -1236482 -910889 -27238 778095 773039 108142 -486890 -638046 -434332 16586 527363
33321E27363J20220m41116m11593K19708M27263l17511j058923o88221L90480
$$ 527363 647583 206467 -205126 14582 441845 124334 -934589 -1622810 -1232330
33312a232330Q55209L37791k69941k69354J7703N6252m2995R1612L41061K82323
$$ -1232330 -377121 -39330 -309271 -578625 -560922 -504670 -547665 -456053 -114992 167331
33302A67331m7576j05526L31219O95412L17186n89765j047398n07205M17882O65028
$$ 167331 119755 14229 345448 1040860 1358046 768281 -279117 -786322 -368440 296588
33292B96588l8517r43379j191050o50654J63801P06816P69161M15794j62634o47987
$$ 296588 258071 -685308 -1876358 -2527012 -2363211 -1656395 -887234 -471440 -634074 -1282061
33282a282061o23124R7716J067996J417898P70653j98796m98646m2901L12974
$$ -1282061 -1905185 -1807469 -739473 678425 1449078 1250282 751636 708735 1021709
33273A021709j8267o37665q38476n03447q325L58013M96370L39829q381k02189
$$ 1021709 1003442 365777 -472699 -976146 -984471 -626458 -130088 209741 201360 -829
33263h29n8741J62021J65866O4036J06301K47178L17043L57518M13228K51804
$$ -829 -59570 102451 268317 332353 438654 685832 1002875 1360393 1773621 2025425
33253B025425k72539p70255o85933k9224O22419P66997L52447l20401p73117o22657
$$ 2025425 1752886 982631 296698 267474 889893 1656890 2009337 1688936 915819 293162
33243B93162J016M82234M28309J12132m4182p1349j84820k99670k71572k77126
$$ 293162 294178 776412 1204721 1316853 1272671 1201322 1016502 716832 445260 168134
33233A68134m58734n26545k44158M0880n3459k23952N68L57344K57599j64859
$$ 168134 -290600 -817145 -1061303 -1020423 -1073882 -1297834 -1297266 -939922 -682323 -847182
33223h47182k78730n1463J727j26923P8562N77216O78309K15288j38749N517K30774
$$ -847182 -1125912 -1177375 -1175648 -1302571 -1224009 -646793 31516 246804 108055 113572 344346
33212C44346K31307L18263N69331L94139m41166j142659r36397j58806L70853
$$ 344346 575653 893916 1463247 1857386 1416220 273561 -662836 -821642 -450789
33203d50789M90836N08632L98758k1453m79613n78636m93545o38023q36255n26782
$$ -450789 40047 548679 947437 925984 446371 -132265 -625810 -1263833 -2100088 -2626870
33193b626870K99700R96268J084693O90363J94302j13285j06205M5035p8877n83745
$$ -2626870 -2327170 -1330902 -246209 444154 638456 525171 418966 464001 385124 -198621
33183a98621r27050n83562J52428N39470L90041J34928L1430m2529n0220K45356
$$ -198621 -1125671 -1709233 -1556805 -1017335 -627294 -492366 -460936 -503465 -553685 -308329
33173c08329O79245O92553J47907m24050o04167n55870m73990j65804M22004Q01280
$$ -308329 370916 1063469 1211376 787326 183159 -372711 -846701 -1012505 -590501 210779
33163B10779N96626J82222P0977J6071n24309j183340q65298O10274J845884J479097
$$ 210779 807405 989627 1060604 1076675 552366 -630974 -1496272 -885998 959886 2438983
33153B438983r835q92494m51468K39321M5645n86031m82220L05643N37111k11747
$$ 2438983 2429148 1536654 1085186 1324507 1370152 784121 301901 607544 1144655 932908
33143I32908p68451j68469P40871N16461o51408j180081m29747M85716M84944
$$ 932908 164457 -4012 736859 1253320 601912 -578169 -1007916 -522200 -37256
33134c7256p9229l89875m81005o94941o50187J20219R90735R10906O0313l46446
$$ -37256 -116485 -506360 -987365 -1682306 -2332493 -2212274 -1221539 -310633 -250320 -596766
33124e96766P4720L88874m9289o56312p49539n39574l53600J15950R26392J165107
$$ -596766 -522046 -133172 -182461 -838773 -1588312 -2127886 -2481486 -2365536 -1439144 -274037
33114b74037K34008q36108o44456M49251Q60279K43805j32824L48534O34621j04493
$$ -274037 -40029 -876137 -1520593 -1071342 -211063 32742 -100082 248452 883073 778580
33104G78580r72910p92936q520J03805n23364p88731k15707N00756P21748N83412
$$ 778580 -194330 -987266 -995786 -891981 -1415345 -2204076 -2419783 -1919027 -1197279 -613867
33094f13867L53445J0485k64562j0840O92423J007655M27154m51070p62687n63268
$$ -613867 -260422 -249937 -514499 -525339 167084 1174739 1601893 1150823 388136 -175132
33084a75132n49265q54113q59275k63976L31447K83990r3187M0637P65944J190812
$$ -175132 -724397 -1578510 -2437785 -2701761 -2370314 -2086324 -2179511 -2138874 -1372930 -182118
33074a82118P26404o435n5571M58701N38651j88840r50728r91212n37668k28388
$$ -182118 544286 537851 482280 940981 1479632 1290792 340064 -651148 -1188816 -1417204
33064a417204j84296j47728o1650L3421K84348O55574O48348k202o81393o19580
$$ -1417204 -1601500 -1749228 -1810878 -1777457 -1493109 -837535 -189187 -191389 -872782 -1492362
33054a492362q34L57155K09344K479m9273j52925k28340J10184P35201R69805
$$ -1492362 -1493196 -1136041 -926697 -924218 -973491 -1126416 -1354756 -1244572 -509371 460434
33044D60434N66309J0762k98853m27487l17867K83150J030576J048578K54231
$$ 460434 1026743 1037505 738652 311165 -6702 276448 1307024 2355602 2609833
33035B609833k83699R0243N62628J39904p83724j120572p77433n60613p07251
$$ 2609833 2326134 2416377 2979005 3118909 2335185 1214613 437180 -123433 -830684
33026h30684o04595O4331Q32002J192085J082276N67463k41306q75379q11131
$$ -830684 -1435279 -1370948 -538946 653139 1735415 2302878 2061572 1186193 375062
33017C75062k13233K28127K54945J81696O8191m04937j050543j088535l78730
$$ 375062 161829 389956 644901 826597 894788 489851 -560692 -1649227 -2027957
33008b027957J22303k27333o54171j33066R31200J233973N10523j54753j0543
$$ -2027957 -1905654 -2132987 -2787158 -2920224 -1989024 -755051 -244528 -399281 -409824
32999d09824L99459K93383j84546l90530j59016K28356O04630Q53913O37284j52333
$$ -409824 -10365 283018 98472 -292058 -451074 -222718 381912 1235825 1873109 1720776
32989A720776q58751o74538K48983R40728Q93740N44209L21561l3881p64009j315201
$$ 1720776 862025 187487 436470 1377198 2270938 2815147 3136708 3102827 2338818 1023617
32979A023617r57803Q3127P73743N22886k11664o09386l70040J77079N12829L41642
$$ 1023617 65814 148941 922684 1445570 1233906 624520 254480 431559 944388 1286030
32969A286030k14430p09008p59288l72914J56840N66332P09864N11478P2142k86120
$$ 1286030 1071600 362592 -396696 -769610 -612770 -46438 663426 1174904 1247046 960926
32959I60926l31188j92674j12051o8866P0467J87190N1502k49089l72742j80376
$$ 960926 629738 437064 325013 256147 326614 513804 565306 316217 -56525 -236901
32949b36901J68879M99315O70976M59354k04739r01179j030039n03429J69005
$$ -236901 -68022 431293 1102269 1561623 1356884 455705 -574334 -1077763 -908758
32940i08758M70428K91927j21244l21995N8915P99093J076721M49044m32213o82036
$$ -908758 -438330 -146403 -267647 -589642 -530727 268366 1345087 1794131 1361918 679882
32930F79882m53318n31679q76075o10245M52481J320865J175355L25941m99916
$$ 679882 226564 -305115 -1181190 -1791435 -1338954 -18089 1157266 1483207 983291
32921I83291r72406r31671k57221N86766P44919J90290j23949J93915L17321k50807
$$ 983291 10885 -920786 -1178007 -591241 153678 343968 220019 413934 731255 480448
32911D80448o07772O7302R61613Q19981o3272m24939r1152o822m62031p20898
$$ 480448 -127324 -60022 901591 1721572 1658300 1233361 1142209 1135387 673356 -47542
32901d7542m21092l7195J96061O24642J182150J145226K63212p49065j193615
$$ -47542 -468634 -505829 -309768 314874 1497024 2642250 2905462 2156397 962782
32892I62782j102615p24292j07150M90738N47979K5514m50994m59504k51965j38075
$$ 962782 -139833 -864125 -971275 -480537 67442 92956 -358038 -817542 -1069507 -1207582
32882a207582m4560O7378O114j53426k4690L64035M69991J57960l236K53074L46526
$$ -1207582 -1252142 -1184764 -1178650 -1332076 -1356766 -992731 -522740 -364780 -368016 -114942 231584
32871B31584j46571o30619l35707M60620Q04096L95626j24245j49882J60997K11684
$$ 231584 85013 -545606 -881313 -420693 383403 779029 654784 504902 665899 877583
32861H77583k56961q16370q02570j82364K71734K3808l23699J22387R98747J019264
$$ 877583 620622 -195748 -998318 -1180682 -908948 -885140 -1208839 -1086452 -87705 931559
32851I31559l9862q82287o82368l06206o81979j079860l33642R73698J142705
$$ 931559 891697 9410 -672958 -979164 -1661143 -2741003 -3074645 -2100947 -958242
32842i58242k6036q16114q4753J162395J316499K93553o98618q88844n56226j81529
$$ -958242 -984278 -1800392 -1885145 -722750 593749 887302 188684 -700160 -1256386 -1437915
32832a437915J81447N72978P42337M21782k30975p20749p04327k53711L24847
$$ -1437915 -1256468 -683490 58847 480629 249654 -471095 -1175422 -1429133 -1104286
32823a104286P60522Q84426O39180J78397j76483k50977j80241j14292K7347K57262
$$ -1104286 -343764 540662 1179842 1358239 1181756 930779 750538 636246 663593 920855
32813I20855K45221k25926p28905o67355j69533J25269J17559L07485P09141O12272
$$ 920855 1166076 940150 211245 -456110 -625643 -500374 -382815 -75330 633811 1246083
32803A246083j87464p74479l58722N34329Q44199M24930o1658k91613m55479n16171
$$ 1246083 1058619 284140 -74582 459747 1303946 1728876 1667218 1375605 920126 403955
32793D03955j83882L45050L95173k43178r20601q96264j46212P16573J049541
$$ 403955 220073 565123 960296 717118 -203483 -1099747 -1245959 -529386 520155
32784E20155O61381n0682m11777j22259M09423N27348K8714p11397j128940q59069
$$ 520155 1181536 1130854 719077 596818 1006241 1533589 1562303 850906 -278034 -1137103
32774a137103j6072P25079O42399j97465r21792q76891k93629K66983O03467O87827
$$ -1137103 -1153175 -428096 214303 16838 -904954 -1781845 -2075474 -1808491 -1205024 -517197
32764e17197L87090j43265l25592M7987M08724L16693J47154K49633J53759n33897
$$ -517197 -130107 -273372 -598964 -550977 -142253 174440 321594 571227 724986 191089
32754A91089j134858q44352r2287J76986O3847L02821P63523P65688N23872P40195
$$ 191089 -943769 -1788121 -1880408 -1703422 -1639575 -1336754 -573231 192457 716329 1456524
32744A456524J029063M60805m65720l38860N70865L86932j205531k118109j144449
$$ 1456524 2485587 2946392 2480672 2141812 2712677 3099609 1894078 -224031 -1368480
32735a368480J06232k1568n53240J22683J241033R32254n46936j207101m32546
$$ -1368480 -1262248 -1283816 -1837056 -1714373 -473340 458914 -88022 -1295123 -1727669
32726a727669M78379O65381N78973M90706K2040o00349n04648K55829N77604J03315
$$ -1727669 -1249290 -583909 -4936 485770 507810 -92539 -597187 -341358 236246 339561
32716C39561k65595j9256K04989p214q0550L36932O19915K85018k28990n02980
$$ 339561 73966 54710 259699 252485 171935 508867 1128782 1413800 1184810 681830
32706F81830p60130r55438m50057O59755J122786L86773l13434J38635Q69177
$$ 681830 -78300 -1033738 -1483795 -824040 298746 685519 372085 510720 1379897
32697A379897M60306o55988r19625j88727K15305j71319l54844J82083N67066
$$ 1379897 1840203 1184215 264590 75863 291168 119849 -234995 -52912 514154
32688E14154J23310m60507l12977K63935M35064J07821k02979k63772j83884R359
$$ 514154 637464 176957 -136020 127915 562979 670800 467821 204049 20165 29524
32678B9524K37414J52672l55049p23600l94573K81943M40624q4177n45744l55264
$$ 29524 266938 419610 64561 -659039 -1053612 -771669 -331045 -415222 -960966 -1316230
32668a316230J68266L29406l9231m77594n00820n2899N66543J027154J171178
$$ -1316230 -1147964 -818558 -857789 -1335383 -1836203 -1889102 -1322559 -295405 875773
32659H75773R82129M77019k58641r36317j140023o95369Q0687O31594O70016L66169
$$ 875773 1857902 2334921 2076280 1139963 -60 -695429 -614742 16852 686868 1053037
32649A053037O6995n8712q6028j50762k74603l62506l31682j93448J5350L04965
$$ 1053037 1120032 1061320 975292 824530 549927 187421 -144261 -337709 -322359 -17394
32639a7394O24581P39058M33921r9002l31077m8259K64282l587p15089j057715
$$ -17394 607187 1346245 1780166 1681164 1350087 1301828 1566110 1562523 847434 -210281
32629b10281n48567L73055R23090Q38007M07250q0469n09030o80554l95981J00679
$$ -210281 -758848 -385793 537297 1375304 1782554 1702085 1193055 512501 116520 217199
32619B17199J91604l39778r07863q17217j42661M43778N89310N72538O89429P67867
$$ 217199 408803 69025 -838838 -1656055 -1798716 -1354938 -765628 -193090 496339 1264206
32609A264206M97638n3766n18257o61369n18968k21135R2185K45873J55117o880
$$ 1264206 1761844 1708078 1189821 528452 9484 -211651 -119466 126407 281524 274644
32599B74644M6145L38228N35446L14548k48171p42877q41758n66235j70217J03050
$$ 274644 320789 659017 1194463 1509011 1260840 517963 -323795 -890030 -1060247 -957197
32589i57197R9615k24424o45552o46872R0129J099514J427178P48108j65014m30414
$$ -957197 -857582 -1082006 -1727558 -2374430 -2284301 -1184787 242391 990499 825485 395071
32579C95071j58718o0122k65088k76615M686O7691k40235l74246p3397J19490
$$ 395071 236353 176231 -88857 -365472 -360786 -293095 -533330 -907576 -980973 -861483
32569h61483j60805l53206Q9108O56183N55997M5553q521M03820M89858Q6382
$$ -861483 -1022288 -1375494 -1286386 -630203 -74206 -28653 -37174 366646 856504 942886
32559I42886o9381L37158O22192K06605n40643r62639r14400n42149L9056M57551
$$ 942886 873505 1210663 1832855 2039460 1498817 536178 -378222 -920371 -881315 -423764
32549d23764J79022o32078r82263l01552P36775J145365P98374J75617m18890
$$ -423764 -244742 -876820 -1859083 -2160635 -1423860 -278495 519879 695496 276606
32540B76606p46672l84477O06197J246027P19846m63444j158808j030523n07667
$$ 276606 -470066 -854543 -248346 997681 1717527 1254083 95275 -935248 -1442915
32531a442915K03892J020359J287564M43942p63315r97411k80394Q5328l31391
$$ -1442915 -1239023 -218664 1068900 1512842 749527 -247884 -528278 -442950 -774341
32522g74341m81875J99442P44577L77592r9153K14099O34883J52936n27987L1701
$$ -774341 -1256216 -1056774 -312197 65395 -33758 180341 815224 968160 440173 471874
32512D71874J370220J355081o77791k655334k391103l09960J352211J276212M8228
$$ 471874 1842094 3197175 2519384 -135950 -2527053 -2837013 -1484802 -208590 -160362
32503a60362j061518j311097o23706N92291J551679J580706P79927o5304l59898
$$ -160362 -1221880 -2532977 -3156683 -2564392 -1012713 567993 1347920 1282616 922718
32494I22718k30961j01650o3414P5899L17641L70857L1862n37634r53274r10200
$$ 922718 691757 590107 526693 602592 920233 1291090 1322952 785318 -167956 -1078156
32484a078156l66834L84054Q03404N06642k69298p73795n19079J66173N71682
$$ -1078156 -1444990 -1060936 -257532 249110 -20188 -793983 -1313062 -1146889 -575207
32475e75207M82213L20162M29729N74285L25722k69833o70302m49908K18760P24461
$$ -575207 -92994 227168 656897 1231182 1556904 1287071 616769 166861 385621 1110082
32465A110082O14291K5602m77040n01426k17338j00540l46890o36151m81588K14371
$$ 1110082 1724373 1749975 1272935 771509 554171 453631 106741 -529410 -1010998 -796627
32455g96627R37508R56158R3142r26653j155379m81569L05907N67656M57940L27879
$$ -796627 140881 1097039 1190181 263528 -891851 -1373420 -1067513 -499857 -41917 285962
32445B85962R8431k84439l35861K74163Q87455N90989m02392j010074q44563n56126
$$ 285962 384393 99954 -235907 38256 925711 1516700 1114308 104234 -740329 -1296455
32435a296455n47691l91740J68064O10266N08739J95740O3721l4229k01698j07545
$$ -1296455 -1844146 -2235886 -2067822 -1457556 -948817 -753077 -689356 -723585 -925283 -1032828
32425a032828K75132L51607m3378j35679M67078Q27615Q4688r52243q64412K33702
$$ -1032828 -757696 -406089 -449467 -585146 -118068 709547 794235 -158008 -1022420 -788718
32415g88718R50215P33632L61414L42580J86253m53797j035116r68321l90911
$$ -788718 161497 895129 1256543 1599123 1785376 1331579 296463 -671858 -1062769
32406a062769K35399O20030N37899o8050p00399p08004k04104J10502Q9591K69014
$$ -1062769 -827370 -207340 330559 262509 -437890 -1145894 -1349998 -1239496 -1149905 -880891
32396h80891P39645Q39323K67867l66484m87789k56190L796K71063L74127o8939
$$ -880891 -141246 698077 965944 599460 111671 -144519 -140723 130340 504467 435528
32386D35528q15751r53621k00612N56929N58264J72572L1969L0523j16049j63472
$$ 435528 -380223 -1333844 -1534456 -977527 -419263 -246691 -214722 -184199 -300248 -463720
32376d63720J4085r8453o40259o76621L91954J466507J091217l46942j120625
$$ -463720 -449635 -548088 -1188347 -1864968 -1473014 -6507 1084710 737768 -382857
32367c82857n83652K60340N07487L30269R3901k48834n62335l72513L03319P76763
$$ -382857 -966509 -706169 -198682 131587 225488 -23346 -585681 -958194 -654875 121888
32357A21888O25464J21558l77510p00160n22620K87627R32351L95865q93510j313823
$$ 121888 747352 868910 491400 -208760 -731380 -443753 488598 884463 -9047 -1322870
32347a322870l46111O43079N21979j3162R0344L83549j40461j085539j147162
$$ -1322870 -1668981 -1025902 -503923 -517085 -426741 -43192 -183653 -1269192 -2416354
32338b416354j85504O12234N56548J89854J15533K14384K57041L47975M62727
$$ -2416354 -2601858 -1989624 -1433076 -1243222 -1127689 -913305 -656264 -308289 154438
32329A54438L13646p0922l09237l55755n05884o10510j64338N98585O82520j45434
$$ 154438 468084 397162 87925 -267830 -773714 -1384224 -1548562 -949977 -267457 -412891
32319d12891p69006l23698M88548N35254m4673l08383j13621o4842j70256J54057
$$ -412891 -1181897 -1505595 -1017047 -481793 -526466 -834849 -948470 -1013312 -1183568 -1029511
32309a029511P40076O17811l62626j004707m39331N96128Q58181K66357k91752
$$ -1029511 -289435 328376 -34250 -1038957 -1478288 -882160 -23979 242378 -49374
32300d9374l01619J1885L17303M52671K93505k8916L985O11215J136731Q18739
$$ -49374 -350993 -339108 -21805 430866 724371 695455 699440 1310655 2447386 3266125
32290C266125p9308o29819n69997m62307n91844n96474l18072j54869k94803l76709
$$ 3266125 3186817 2556998 1987001 1524694 932850 336376 18304 -136565 -431368 -808077
32280h08077k34948k27129m46840l81839J60979N52420L65951J62975M90370P77166
$$ -808077 -1043025 -1270154 -1716994 -2098833 -1937854 -1385434 -1019483 -856508 -366138 411028
32270D11028K08390p90511j050310m05522J61938R4709r8590P8028L91683N40299
$$ 411028 619418 -171093 -1221403 -1626925 -1464987 -1370278 -1468868 -1390840 -999157 -458858
32260d58858O32791O42050K23029m69125n97265J27230P60706L90688n20572q52465
$$ -458858 173933 815983 1039012 569887 -27378 99852 860558 1251246 730674 -121791
32250a21791l96366J59490M30219N47562M10515j99110p70946m60805M51666O34885
$$ -121791 -518157 -358667 71552 619114 1029629 830519 59573 -401232 50434 685319
32240F85319k89524r36162j73913J025517R54804k50684q54008j68128N54669
$$ 685319 395795 -540367 -714280 311237 1266041 1015357 161349 -6779 547890
32231E47890K22743m85933l91152L65364P78373N60604J78071k50744r31538j444019
$$ 547890 770633 284700 -106452 258912 1037285 1597889 1775960 1525216 593678 -850341
32221h50341j009621J39800P52332L10330j63040L36605J213920J102062j62614
$$ -850341 -1859962 -1720162 -967830 -657500 -820540 -483935 729985 1832047 1669433
32212A669433j292594j222486l04437L48863K23461k08062k60076J18598L95856
$$ 1669433 376839 -845647 -1150084 -801221 -577760 -785822 -1045898 -927300 -531444
32203e31444K58244O6794K94001P47115P94804K89395k58103m67503m90732m77697
$$ -531444 -273200 -206406 87595 834710 1629514 1918909 1660806 1193303 702571 224874
32193B24874k47479K16645N11905M27483K82466K58034j6598o76243j010581l82051
$$ 224874 -22605 194040 705945 1133428 1415894 1673928 1657330 981087 -29494 -411545
32183d11545O78532J102577P18119K31703j1871l46934q77739j118822p39667
$$ -411545 266987 1369564 2087683 2319386 2307515 1960581 1082842 -35980 -775647
32174g75647k9539N45158P33930M15618l09606q94221p88457j76748K62469L01414
$$ -775647 -805186 -260028 473902 889520 579914 -314307 -1102764 -1279512 -1017043 -715629
32164g15629K46544J57650k01881n83186l40105M45943Q14369K89001m22370n48603
$$ -715629 -469085 -311435 -513316 -1096502 -1436607 -990664 -176295 112706 -309664 -858267
32154h58267k79485j21032n279K61053L38404n0138l96592j14650M48402N39941
$$ -858267 -1137752 -1258784 -1264063 -1003010 -664606 -714744 -1111336 -1225986 -777584 -237643
32144b37643J92150J9942J10937M3289j56290m3988K75695J94069k72396l64620
$$ -237643 -45493 -25551 85386 128675 -27615 -71603 204092 398161 125765 -238855
32134b38855J32408M24115j7292n65682m61727o252M4198k58222k76616L9573
$$ -238855 -106447 317668 300376 -265306 -727033 -733285 -689087 -947309 -1223925 -1184352
32124a184352J41531m8679K0210M84281P23093L83361k5088k5080L2419k86991
$$ -1184352 -1042821 -1091500 -1071290 -587009 136084 519445 494357 469277 501696 214705
32114B14705n55482j46839N22065M20212m97467j122323p88273q3888K62705L74540
$$ 214705 -340777 -487616 34449 454661 -42806 -1165129 -1953402 -2037290 -1774585 -1400045
32104a400045N60530N30253M0569l72289j93021R5406j93644o33253k84736O40596
$$ -1400045 -839515 -309262 -268693 -640982 -834003 -738597 -932241 -1565494 -1850230 -1209634
32094a209634R47388K90861l56054k82956N7100J15296J35554L92346M70136K2236
$$ -1209634 -262246 28615 -327439 -610395 -553295 -437999 -302445 89901 560037 582273
32084E82273m69631m15494k5242J66165J50873J65488O2665l22983o08992l94226
$$ 582273 112642 -302852 -328094 -161929 -11056 154432 217097 -105886 -714878 -1109104
32074a109104n32L7073j04865R8257M83642L89997j88821m84348j19103L26046
$$ -1109104 -1109636 -1072563 -1177428 -1079171 -595529 -205532 -394353 -878701 -997804 -671758
32064f71758J86768l63604o07448k11030M30649O97768M40362R7164P6905J82293
$$ -671758 -484990 -848594 -1456042 -1667072 -1236423 -538655 -98293 -1129 75776 258069
32054B58069k7441l94487k52900N14824J156593J093374O32280K18632l00097
$$ 258069 230628 -163859 -416759 98065 1254658 2348032 2980312 3198944 2898847
32045B898847j022021j306507o54220K18126K03073n69989r49541m76889J31469
$$ 2898847 1876826 570319 -83901 134225 337298 -232691 -1182232 -1659121 -1527652
32036a527652K47035J01678J04391K17709K77317K76668J48613j51237k91703
$$ -1527652 -1280617 -1178939 -1074548 -856839 -579522 -302854 -154241 -305478 -597181
32027e97181L8733L92437M9377o85815o58749L72830J167948P44143k17981m76301
$$ -597181 -558448 -166011 -116634 -802449 -1461198 -1088368 79580 823723 605742 129441
32017A29441j1672K23975j00337l74181k37224j55905n27541q67849m24216O28802
$$ 129441 117769 341744 241407 -132774 -369998 -525903 -1053444 -1921293 -2345509 -1716707
32007a716707J151551M00991q82983j215129j86508R98498J080908K84964k57458
$$ -1716707 -565156 -164165 -1047148 -2262277 -2448785 -1450287 -369379 -84415 -341873
31998c41873j48810L6496o3778j21232R7140L04513K78937J77142O1248k14956
$$ -341873 -490683 -454187 -517965 -639197 -542057 -237544 41393 218535 279783 64827
31988F4827m60791k15310L97263O26294K12512k21551k58597l23001p07423q06411
$$ 64827 -395964 -611274 -214011 412283 624795 403244 144647 -178354 -885777 -1692188
31978a692188q1816Q66222J055399N03841K1782o1693j32250m03992n66605l49323
$$ -1692188 -1774004 -907782 147617 651458 673240 611547 479297 75305 -491300 -840623
31968h40623J08317M84385N10981O9588o10586r70453o43681J48999Q91081J204665
$$ -840623 -732306 -247921 263060 332648 -277938 -1248391 -1892072 -1743073 -851992 352673
31958C52673Q95078L8571p51373p17735K6560M64460O1242m78514l61847J14790
$$ 352673 1247751 1286322 534949 -182786 -156226 308234 369476 -109038 -470885 -356095
31948c56095K45157P0618k76r4312m22588n04999O6601O09836L07799k92269j35973
$$ -356095 -110938 -40320 -40596 -134908 -557496 -1062495 -995894 -386058 -78259 -370528 -506501
31937e06501L76165j7540r98408p87549Q78296J855617O58697j244387j552458
$$ -506501 -130336 -147876 -1146284 -1933833 -1055537 800080 1458777 214390 -1338068
31928a338068k95112O76515N28608J17236J61813L04503J27457r3884j9399J55674
$$ -1338068 -1633180 -956665 -428057 -310821 -149008 155495 282952 189068 169669 325343
31918C25343O9564k97693o44052n69918J35550J078918J353299N44348n54066
$$ 325343 394907 97214 -546838 -1116756 -981206 97712 1451011 1995359 1441293
31909A441293q12722k07003K60648R663m49535l98687J51742O20746N16120k01402
$$ 1441293 628571 421568 682216 691879 242344 -156343 -4601 616145 1132265 930863
31899I30863j041053j235498m91669N13115Q58577N57830L91240N72727M13844
$$ 930863 -110190 -1345688 -1837357 -1324242 -465665 92165 483405 1056132 1469976
31890A469976m12571j119087q78026L2O25377P55546P32380O10069K03650k15114
$$ 1469976 1057405 -61682 -939708 -939676 -314299 441247 1173627 1783696 1987346 1772232
31880A772232j70847J03318r6397o77619o53066L27117J203712Q91932k11436
$$ 1772232 1601385 1704703 1608306 930687 277621 604738 1808450 2700382 2488946
31871B488946q57822o40310k22011j09278j01680j5416j14647n08132p45893m34768
$$ 2488946 1631124 990814 768803 659525 557845 542429 427782 -80350 -826243 -1261011
31861a261011J64328N33092N49974L95281J41278j41868j59600K21271N43776
$$ -1261011 -1096683 -563591 -13617 381664 522942 381074 221474 442745 986521
31852I86521K71687l44450n09109n1492K77851o3779n86710n59338j54858j05486
$$ 986521 1258208 913758 404649 353157 631008 567229 -19481 -578819 -733677 -839163
31842h39163m25452l21379M70803J066275O68152j68522k98731K67375L46469
$$ -839163 -1264615 -1585994 -1115191 -48916 619236 450714 151983 419358 765827
31833G65827n50478j299486p22637O39150J232803O41931k8551K5511J90792l36489
$$ 765827 215349 -1084137 -1806774 -1167624 65179 707110 678559 704070 894862 558373
31823E58373j091590j007194p7981O29764N44938K31180K65495L32233o2004n87403
$$ 558373 -533217 -1540411 -1618392 -988628 -443690 -212510 52985 385218 323214 -264189
31813b64189n04360J98140P54863O81232K94255O8270j1688j85852m00228m28186
$$ -264189 -768549 -570409 184454 865686 1159941 1228211 1216523 1030671 630443 202257
31803B02257k97264k16058j77385p442K09881J51111k00882l92271j08183L23022
$$ 202257 -95007 -311065 -488450 -495892 -286011 -134900 -335782 -728053 -836236 -513214
31793e13214L37086j06178m78542l48596J69629O26388O78120L17966j40149k90229
$$ -513214 -176128 -282306 -760848 -1109444 -939815 -313427 364693 682659 542510 252281
31783B52281J50M51858P01231O64705M33996O437n75830r76147q74364m69812
$$ 252281 252431 704289 1405520 2070225 2504221 2510658 1934828 958681 84317 -385495
31773c85495k20924j05164L05478R42078J070615L51873n18674p15422l51836
$$ -385495 -606419 -711583 -406105 535973 1606588 1958461 1439787 724365 372529
31764C72529p7931k3793J38229L39267J55474l17698m46539q0045J61776q5087
$$ 372529 294598 270805 409034 748301 903775 586077 139538 59493 221269 136182
31754A36182l43220k03931j32412o35448j132902o23455O86575J436566R65939
$$ 136182 -207038 -410969 -543381 -1178829 -2311731 -2935186 -2248611 -812045 153894
31745A53894J69995O4586L52445J52653m91239p85925n05750j07422L12071J041749
$$ 153894 323889 388475 740920 893573 402334 -383591 -889341 -996763 -684692 357057
31735C57057J664895J186790k97810j241155o94318L11940L86639j78842k20632
$$ 357057 2021952 3208742 2910932 1669777 975459 1287399 1674038 1495196 1274564
31726A274564K29690K17460k41220k07689L37032L88282j61287j87308O17977
$$ 1274564 1504254 1721714 1480494 1272805 1609837 1998119 1836832 1649524 2267501
31717B267501J011947K50868o74628q00885p15913j128460j279653k96368R51286
$$ 2267501 3279448 3530316 2855688 2054803 1338890 210430 -1069223 -1365591 -414305
31708d14305J038617K68717K8254L96548K19870o62073j090747n83191J8481J72372
$$ -414305 624312 893029 921283 1317831 1537701 875628 -215119 -798310 -779829 -607457
31698f07457L77392Q65158R61930L33456l29771m49825l22814k38528P2224N58704
$$ -607457 -230065 635093 1597023 1930479 1600708 1150883 828069 589541 661765 1220469
31688A220469N31315j15881m60015j05071o1213j025626j799607q33309J224248
$$ 1220469 1751784 1635903 1175888 1070817 1009604 -16022 -1815629 -2648938 -1424690
31679a424690K044220O57736j314757j787540n93271P61781J082402N78284J64130
$$ -1424690 619530 1277266 -37491 -1825031 -2418302 -1656521 -574119 4165 168295
31670A68295K29585L57692P9058m76536q31298p53323l09820L69003R50848Q51743
$$ 168295 397880 755572 834630 358094 -473204 -1226527 -1536347 -1167344 -216496 635247
31660F35247l0024p67675m06667N88679Q16324q6597r59283q35987j05932M46555
$$ 635247 605223 -162452 -569119 19560 835884 749287 -209996 -1045983 -1151915 -705360
31650g05360P11627P55109K37492q28955j504506j015235R4319O95348N01794
$$ -705360 6267 761376 998868 169913 -1334593 -2349828 -2255509 -1560161 -1058367
31641a058367L8865l25275n22904l64728K07042O98345O05055J63733l4078Q0376
$$ -1058367 -1019502 -1344777 -1867681 -2232409 -2025367 -1327022 -721967 -558234 -592312 -511936
31631e11936J27936l2599k27783l28995k58534N0235L70060L19703P0383K37763
$$ -511936 -384000 -416599 -644382 -973377 -1231911 -1181676 -811616 -491913 -421530 -183767
31621a83767P39095O82205r4066n05392o0973M7512j062743k086633j334216M86046
$$ -183767 555328 1237533 1143467 638075 577102 624614 -438129 -2524762 -3858978 -3372932
31611c372932J249564O33130K35627O84352Q57024K42321j09264L26662M84361
$$ -3372932 -2123368 -1490238 -1254611 -570259 286765 529086 419822 746484 1230845
31602A230845k75324p98279l3184J079505J003330r3522p99169n58637n4244J14844
$$ 1230845 955521 157242 124058 1203563 2206893 2113371 1314202 755565 701321 816165
31592H16165L7195n0261q5150o1667r4383l63253o61990m65843J94059N42366
$$ 816165 853360 803099 717949 656282 561899 198646 -463344 -929187 -735128 -192762
31582a92762K04953j49844R6419M96252L67483j3432L4212L36939J60243n17381
$$ -192762 12191 -137653 -41234 455018 822501 809069 843281 1180220 1340463 823082
31572H23082r87788r51319p69666n80179l0887Q85037J436714R92055j23206r29573
$$ 823082 -164706 -1116025 -1885691 -2465870 -2496757 -1611720 -175006 817049 693843 -235730
31562b35730q12757n6364N94013P63605O96663O42450L44165m46330j215386j160599
$$ -235730 -1048487 -1104851 -510838 252767 949430 1591880 1936045 1489715 274329 -886270
31552h86270l90382J44139N1818l0059L30541N95798K82055j13660L0152L64342
$$ -886270 -1276652 -1132513 -1080695 -1110754 -780213 -184415 97640 -16020 14132 378474
31542C78474J73333m33406p59955n71245j53509L16060P48645Q40495M81482J31366
$$ 378474 551807 118401 -641554 -1212799 -1366308 -1050248 -301603 538892 1020374 1151740
31532A151740J55608K01618j12625m10389k33013M1850j25785l63545m1330M41763
$$ 1151740 1307348 1508966 1396341 985952 752939 794789 669004 305459 264129 705892
31522G05892K19861m79986o05944j900L78880P290o25175r91053r89063m10293
$$ 705892 925753 445767 -160177 -162077 216803 224093 -401082 -1392135 -2381198 -2791491
31512b791491Q38108J886337J576974K19541o07629k94592R9974k32015o76305
$$ -2791491 -1953383 -67046 1509928 1729469 1121840 827248 927222 695207 18902
31503A8902n68503l17530l04373K8217R47489J452454P02831n16428r35471n76656
$$ 18902 -549601 -867131 -1171504 -1143287 -195798 1256656 1959487 1443059 507588 -69068
31493f9068k33485N4M02342N67458P1705l94120J493O33792L43820m57966l64090
$$ -69068 -302553 -302499 99843 667301 739006 344886 346379 980171 1323991 866025 501935
31482E01935N12379N21855p37072j509846n20686J081643J462811N75185k54533
$$ 501935 1014314 1536169 799097 -710749 -1231435 -149792 1313019 1888204 1633671
31473A633671l27399o471K72549L48519K0676o96381j182644q21407J12289P46302
$$ 1633671 1306272 1299801 1572350 1920869 1941545 1245164 62520 -758887 -646598 99704
31463I9704O62379J81715k14103l06298j72197j60763n74135j062506p82364L86018
$$ 99704 762083 943798 729695 423397 251200 90437 -483698 -1546204 -2328568 -1942550
31453a942550J306304R58511r6532m82156O2256N15883K70527r3206K6121K85651
$$ -1942550 -636246 322265 225733 -256423 -194167 321716 592243 499037 525158 810809
31443H10809J16648l24817n31502m59138l79864k99713q8815R1188M3304P855
$$ 810809 927457 602640 71138 -388000 -767864 -1067577 -1156392 -1065204 -1021900 -1014045
31433a014045L23131P48700O98003J16619m18018n18431l70771j85642J47233
$$ -1014045 -690914 57786 755789 872408 454390 -64041 -434812 -620454 -473221
31424d73221N64897N47385j49738q44760o62192K12914O85022K28583m48184n11725
$$ -473221 91676 639061 489323 -355437 -1017629 -804715 -119693 108890 -339294 -851019
31414h51019j45861j9521p8483K91397J003413J111375K41369o05058l48534N54725
$$ -851019 -996880 -1016401 -1094884 -803487 199926 1311301 1552670 947612 599078 1153803
31404A153803O55062m48761j485796j194575P6135R66843Q45560K73101q4722
$$ 1153803 1808865 1360104 -125692 -1320267 -1244132 -277289 568271 841372 756650
31395G56650k45917m26496m30511n1736K92934K3695n69630m97728M58154J138368
$$ 756650 510733 84237 -346274 -398010 -105076 -81381 -651011 -1148739 -690585 447783
31385D47783M89085q07786j069094J22234J329375J202467J47612m95729k60757
$$ 447783 936868 129082 -940012 -817778 511597 1714064 1861676 1365947 1105190
31376A105190K31312M29389L54552R0376l99847q61346q20778k45361L56695N87025
$$ 1105190 1336502 1765891 2120443 2210819 1810972 949626 128848 -116513 240182 827207
31366H27207M58832N7679n35667r52804q02623l29034j42858j92475J81076R16323
$$ 827207 1286039 1343718 808051 -144753 -947376 -1276410 -1419268 -1611743 -1430667 -514344
31356e14344R38798k10754j357577j200890j73239K76994j51318l62345K82940
$$ -514344 424454 213700 -1143877 -2344767 -2518006 -2241012 -2392330 -2754675 -2471735
31347b471735J022802R09686P4491o74013q75124n83887M800O18571Q88678O92998
$$ -2471735 -1448933 -539247 -464756 -1138769 -2013893 -2597780 -2592980 -1974409 -1085731 -392733
31337c92733L69237K83970L19281P3924m88932q84532o92478j25793K00416P2995
$$ -392733 -23496 260474 579755 653679 164747 -719785 -1412263 -1538056 -1337640 -1264645
31327a264645k2410L65641Q81611P99274J24261l79570l42771k15606k63170M088
$$ -1264645 -1287055 -921414 -39803 759471 883732 504162 161391 -54215 -317385 -313297
31317c13297Q05528J308823P51265k82993p16130n99495p24468r93884n61086
$$ -313297 492231 1801054 2552319 2269326 1553196 953701 229233 -764651 -1325737
31308a325737M81724R85874N44667P5133K06711L67133L8286k94097j86796j30264
$$ -1325737 -844013 141861 686528 761661 968372 1335505 1373791 1079694 892898 762634
31298G62634n18709p19792j78558M04214J25810n63252n72041L3632K08701l17615
$$ 762634 243925 -475867 -654425 -250211 -124401 -687653 -1259694 -1226062 -1017361 -1334976
31288a334976o85363l32343K72575N07037L68956J61499O3581J85923N23335P55555
$$ -1334976 -2020339 -2352682 -2080107 -1573070 -1204114 -1042615 -979034 -793111 -269776 485779
31278D85779N43693Q555n02390r42970j334152j279091m69479M89494O40558O1029
$$ 485779 1029472 1038027 535637 -407333 -1741485 -3020576 -3490055 -3000561 -2360003 -2298974
31268b298974k10974K47991O91769N17900J84728K76904M78607K28536j96970
$$ -2298974 -2509948 -2261957 -1570188 -1052288 -867560 -590656 -112049 116487 -80483
31259h0483j24387L19823L49073j91762n17600j21495L91829J77398n76941q81414
$$ -80483 -204870 114953 464026 272264 -245336 -366831 24998 202396 -374545 -1255959
31249a255959l29884L93040N56906L52899L91019O63821O30711J29064m55151
$$ -1255959 -1585843 -1192803 -635897 -282998 108021 771842 1402553 1531617 1076466
31240A076466q51795j069840r29582k26850N40561N13342j86758m12446K56443
$$ 1076466 224671 -845169 -1774751 -2001601 -1461040 -947698 -1134456 -1546902 -1290459
31231a290459P38934J52016p07937n96482K73848P49015N54800L29724K58442
$$ -1290459 -551525 -399509 -1107446 -1703928 -1430080 -681065 -126265 203459 461901
31222D61901k504k81294r6361K25461m3562n74417l24822O11200R71987L72344
$$ 461901 459397 178103 81742 307203 263641 -310776 -635598 -24398 947589 1319933
31212A319933j32002N8351J52591m09138q63558n46379r9665k18121l57777J26706
$$ 1319933 1187931 1246282 1398873 989735 126177 -420202 -519867 -737988 -1095765 -969059
31202i69059N83384J44702n83864l53720P05932J292754Q92878K42678o7229k40821
$$ -969059 -385675 -240973 -824837 -1178557 -472625 820129 1713007 1955685 1888456 1647635
31192A647635m59187m69191j93419N5374J29909J73644J58925o7572l07006k29536
$$ 1647635 1188448 719257 525838 581212 711121 884765 1043690 976118 669112 439576
31182D39576l2229k06342o79763q67161n53678n8198M29926R27797J097715M80863
$$ 439576 407347 201005 -478758 -1345919 -1899597 -1957795 -1527869 -600072 497643 978506
31172I78506n42906q73183j16534P84594P50873j39843r47421j038976n91036
$$ 978506 435600 -437583 -554117 230477 981350 841507 -105914 -1144890 -1735926
31163a735926j84512j47477j78421L14266J248371J570069N62926q23810r57108
$$ -1735926 -1920438 -2067915 -2246336 -1932070 -683699 886370 1449296 625486 -331622
31154c31622J84297R05048L00505m66138j59672N43699L47261l74021k57958N46456
$$ -331622 -147325 757723 1058228 592090 432418 976117 1323378 949357 691399 1237855
31144A237855M60089q19491j546260n67441Q45360R33737L60l95486L5342K08202
$$ 1237855 1697944 878453 -667807 -1235248 -389888 543849 544209 148723 184065 392267
31134C92267k64126n50837k60115r2883m00854m46241K05021P27769L72593k31801
$$ 392267 128141 -422696 -682811 -775694 -1176548 -1622789 -1417768 -689999 -317406 -549207
31124e49207j66558K05911r727n25754l10661N38173Q31788K66021n9648M93763
$$ -549207 -715765 -509854 -519581 -1045335 -1355996 -817823 13965 279986 220338 714101
31114G14101R74702L00473j039527j573676o98194O84441J172689K30807j224298
$$ 714101 1688803 1989276 949749 -623927 -1322121 -637680 535009 765816 -458482
31105d58482j592247l45898J156315J295033L60728j5386M98732M42367q36052
$$ -458482 -2050729 -2396627 -1240312 54721 415449 400063 898795 1341162 505110
31096E05110j783805r73601N68297R05187R5304k06087M53062P68720j7418r12676
$$ 505110 -1278695 -2252296 -1683999 -778812 -683508 -889595 -436533 332187 314769 -597907
31086e97907p68605J29400O99651M83316j34251n76004n16492m6872L38647K16794
$$ -597907 -1366512 -1237112 -537461 -54145 -188396 -764400 -1280892 -1327764 -989117 -772323
31076g72323k12477l72703r7363K37548L53631L84406M83535N15909K71181k20253
$$ -772323 -984800 -1357503 -1454866 -1217318 -863687 -479281 4254 520163 791344 571091
31066E71091o16717m74071K50914Q76221O53086j18895l33619K62869N68085j15940
$$ 571091 -45626 -519697 -268783 607438 1260524 1141629 808010 1070879 1638964 1523024
$$ [...]
##END NTUPLES=NMR SPECTRUM
##END=
