##TITLE=31Pdec_LY-TMF-4.5.R.t
 D2O, 24 sc
 27.2.2020
##JCAMPDX= 6.0         $$ Bruker NMR JCAMP-DX V2.0
##DATA TYPE= NMR SPECTRUM
##DATA CLASS= NTUPLES
##ORIGIN= UXNMR, Bruker Analytische Messtechnik GmbH
##OWNER= root
$$ XWIN-NMR		Version 3.5
$$ Thu Feb 27 14:04:14 2020 Russian Standard Time (UT+4h)  she@DPX200
##.OBSERVE FREQUENCY= 81.013821
##.OBSERVE NUCLEUS= ^31P
##.ACQUISITION MODE= SIMULTANEOUS
##.ACQUISITION SCHEME= undefined
##.AVERAGES= 24
##.DIGITISER RES= 17
##SPECTROMETER/DATA SYSTEM= spect
##.PULSE SEQUENCE= zgpg30
##.SOLVENT NAME= CDCl3
##.SHIFT REFERENCE= (INTERNAL, CDCl3, 0, 182.463)
##AUDIT TRAIL= $$ (NUMBER, WHEN, WHO, WHERE, WHAT)
$$ ##TITLE= Audit trail, XWIN-NMR		Version 3.5
$$ ##JCAMPDX= 5.01
$$ ##ORIGIN= Bruker BioSpin GmbH
$$ ##OWNER= she
$$ F:/spectra/data/she/nmr/P31/1/pdata/1/auditp.txt
$$ ##AUDIT TRAIL=  $$ (NUMBER, WHEN, WHO, WHERE, WHAT)
(   1,<2020-02-27 14:03:00.25 +0400>,<she>,<DPX200>,
      <created by zg, POWCHK disabled, PULCHK disabled
       configuration hash MD5:
       00 E9 B6 7A A2 85 ED C7 34 08 36 98 17 FE 4E 26
       data hash MD5: 32K
       D6 62 88 F7 92 FC B2 BA 27 1F 8B 2A E7 8B 83 75>)
(   2,<2020-02-27 14:03:03.39 +0400>,<she>,<DPX200>,
      <Start of raw data processing
       efp BC_mod = 2 LB = 1 FT_mod = 6 PKNL = 1 PHC0 = -1521.103 PHC1 = 112.2013 SI = 64K 
       data hash MD5: 64K
       67 5C 24 C9 45 91 C0 C5 5C B0 5E 07 AB 4A F7 47>)
(   3,<2020-02-27 14:03:26.70 +0400>,<she>,<DPX200>,
      <pk PHC0 = 2.197842 PHC1 = -0.8000001 
       data hash MD5: 64K
       D9 F7 FB 21 27 78 07 32 33 FA AB BF 87 F8 50 57>)
(   4,<2020-02-27 14:03:29.73 +0400>,<she>,<DPX200>,
      <abs ABSG = 5 
       data hash MD5: 64K
       8F D5 62 4F D6 9B 0E 90 45 9A 79 6C F5 2E 63 01>)
$$ ##END=
$$ 
$$ hash MD5
$$ 1B B5 87 CB 78 8B 18 50 87 4E 81 69 DB 92 04 1D
##$RELAX= 
##$RELAX= 
##$RELAX= 
##$RELAX= 
##$RELAX= 
##$RELAX= 
##$RELAX= 
##$RELAX= 
$$ Bruker specific parameters
$$ --------------------------
##$DU= <F:/spectra>
##$EXPNO= 1
##$NAME= <P31>
##$PROCNO= 1
##$TYPE= <nmr>
##$USER= <she>
##$AMP= (0..31)
100 100 100 100 100 100 100 100 100 100 100 100 100 100 100 100 100 100 
100 100 100 100 100 100 100 100 100 100 100 100 100 100 
##$AQSEQ= 0
##$AQ_mod= 1
##$AUNM= <au_zg>
##$AUTOPOS= <>
##$BF1= 81.014009
##$BF2= 200.13
##$BF3= 200.13
##$BF4= 200.13
##$BF5= 200.13
##$BF6= 200.13
##$BF7= 200.13
##$BF8= 200.13
##$BYTORDA= 1
##$CFDGTYP= 0
##$CFRGTYP= 5
##$CHEMSTR= <none>
##$CNST= (0..31)
1 1 145 1 1 1 1 1 1 1 1 1 1 1 1 1 1 1 1 1 1 1 1 1 1 1 1 1 1 1 1 1 
##$CPDPRG= <waltz16>
##$CPDPRG1= <>
##$CPDPRG2= <waltz16>
##$CPDPRG3= <>
##$CPDPRG4= <mlev>
##$CPDPRG5= <mlev>
##$CPDPRG6= <mlev>
##$CPDPRG7= <mlev>
##$CPDPRG8= <mlev>
##$CPDPRGB= <>
##$CPDPRGT= <>
##$D= (0..31)
0 1 0 0 0 0 0 0 0 0 0 0.03 2e-05 3e-06 0 0 0 0 0 0 0 0 0 0 0 0 0 0 0 0 
0 0 
##$DATE= 1582797779
##$DBL= (0..7)
120 120 120 11 120 120 24 19 
##$DBP= (0..7)
150 150 150 150 150 150 150 150 
##$DBP07= 0
##$DBPNAM0= <>
##$DBPNAM1= <>
$$ [...]
##$SUBNAM3= <"">
##$SUBNAM4= <"">
##$SUBNAM5= <"">
##$SUBNAM6= <"">
##$SUBNAM7= <"">
##$SUBNAM8= <"">
##$SUBNAM9= <"">
##$SW= 369.568048894756
##$SWIBOX= (0..15)
0 1 3 0 0 0 0 0 0 0 0 0 0 0 0 0 
##$SW_h= 29940.119760479
##$TD= 32768
##$TD0= 1
##$TE= 0
##$TE2= 300
##$TE3= 300
##$TEG= 300
##$TL= (0..7)
0 120 53 12 22 120 120 120 
##$TP= (0..7)
150 150 150 150 150 150 150 150 
##$TP07= 0
##$TPNAME0= <>
##$TPNAME1= <>
##$TPNAME2= <>
##$TPNAME3= <>
##$TPNAME4= <>
##$TPNAME5= <>
##$TPNAME6= <>
##$TPNAME7= <>
##$TPOAL= (0..7)
0.5 0.5 0.5 0.5 0.5 0.5 0.5 0.5 
##$TPOFFS= (0..7)
0 0 0 0 0 0 0 0 
##$TUNHIN= 0
##$TUNHOUT= 0
##$TUNXOUT= 0
##$USERA1= <user>
##$USERA2= <user>
##$USERA3= <user>
##$USERA4= <user>
##$USERA5= <user>
##$V9= 5
##$VALIST= <valist>
##$VCLIST= <CCCCCCCCCCCCCCC>
##$VD= 0
##$VDLIST= <DDDDDDDDDDDDDDD>
##$VPLIST= <PPPPPPPPPPPPPPP>
##$VTLIST= <TTTTTTTTTTTTTTT>
##$WBST= 1024
##$WBSW= 4
##$XGAIN= (0..3)
0 0 0 0 
##$XL= 0
##$YL= 0
##$YMAX_a= 1492
##$YMIN_a= -577
##$ZGOPTNS= <>
##$ZL1= 120
##$ZL2= 120
##$ZL3= 120
##$ZL4= 120
##$ABSF1= 182.463
##$ABSF2= -187.1042
##$ABSG= 5
##$ABSL= 3
##$ALPHA= 0
##$AQORDER= 0
##$ASSFAC= 0
##$ASSFACI= 0
##$ASSFACX= 0
##$ASSWID= 0
##$AUNMP= <proc_1d>
##$AZFE= 0.1
##$AZFW= 0.5
##$BCFW= 0
##$BC_mod= 2
##$BYTORDP= 0
##$COROFFS= 0
##$CY= -3
##$DATMOD= 1
##$DC= 0
##$DFILT= <>
##$DTYPP= 0
##$F1P= 0
##$F2P= 0
##$FCOR= 1
##$FTSIZE= 65536
##$FT_mod= 6
##$GAMMA= 0
##$GB= 0
##$INTBC= 1
##$INTSCL= 5.30512e-09
##$ISEN= 30
##$LB= 1
##$LEV0= 0
##$LPBIN= 0
##$MAXI= 10000
##$MC2= 0
##$MEAN= 0
##$ME_mod= 0
##$MI= 50
##$NCOEF= 0
##$NC_proc= -9
##$NLEV= 6
##$NOISF1= 182.463
##$NOISF2= 159.3651
##$NSP= 0
##$NTH_PI= 0
##$NZP= 0
##$OFFSET= 182.463
##$PC= 4
##$PHC0= -1518.905
##$PHC1= 111.4013
##$PH_mod= 1
##$PKNL= yes
##$PPARMOD= 0
##$PSCAL= 0
##$PSIGN= 0
##$REVERSE= no
##$SF= 81.0140089999434
##$SI= 65536
##$SIGF1= 159.3651
##$SIGF2= -187.1042
##$SINO= 113.3802
##$SIOLD= 16384
##$SREGLST= <1H.CDCl3>
##$SSB= 0
##$STSI= 65536
##$STSR= 0
##$SW_p= 29940.119760479
##$SYMM= 0
##$S_DEV= 0
##$TDeff= 32768
##$TDoff= 0
##$TI= <>
##$TILT= no
##$TM1= 0
##$TM2= 0
##$TOPLEV= 0
##$USERP1= <user>
##$USERP2= <user>
##$USERP3= <user>
##$USERP4= <user>
##$USERP5= <user>
##$WDW= 1
##$XDIM= 65536
##$YMAX_p= 340327561
##$YMIN_p= -9065073
$$ End of Bruker specific parameters
$$ ---------------------------------
##NTUPLES= NMR SPECTRUM
##VAR_NAME=  FREQUENCY,     SPECTRUM/REAL,   SPECTRUM/IMAG
##SYMBOL=    X,             R,               I
##VAR_TYPE=  INDEPENDENT,   DEPENDENT,       DEPENDENT
##VAR_FORM=  AFFN,          ASDF,            ASDF
##VAR_DIM=   65536,         65536,           65536
##UNITS=     HZ,            ARBITRARY UNITS, ARBITRARY UNITS
##FACTOR=    0.456856943014862, 1,           1
##FIRST=     14782.0589164792, 0,            0
##LAST=      -15158.0608439998, 0,           0
##MIN=       -15158.0608439998, -9065073,    0
##MAX=       14782.0589164792, 340327561,    0
$$ Real data points
##PAGE= N=1
##DATA TABLE= (X++(R..R)), XYDATA
$$ [...]
36699F74819o50960m37134M62639O94558m2688o52431n45915k29948m3383J98086
36689e72357L75393K44381K28351O84446P81736l00533j463207q99039R21220
36680C91J578770K65643j104341r55944j79164j79922o24184n20433j45700k94098
36670b158982n43972P8121J172757J272382P9978q91511l12885J192260J861143
36661A749291R86382l11239n85866J22173M96709j47324r64983r67194m94135
36652a16186m66789p78651n93222N7825L00527O4499L12422J240364J574597M39497
36642B034883j093009j293584L947J368034J572122O50165n98616j426511j499220
36633b81789r96707m64094l20989n05508o70696n64496j37686M65884Q68950O38194
$$ plain form
36699 674819 23859 -413275 49364 743922 701234 48803 -497112 -727060 -770443 -572357
36689 -572357 -196964 47417 275768 960214 1741950 1441417 -21790 -920829 391
36680 391 1579161 1844804 740463 -215481 -394645 -574567 -1198751 -1719184 -1864884 -2158982
36670 -2158982 -2702954 -2624833 -1452076 -179694 -99716 -991227 -1304112 -111852 1749291
36661 1749291 2735673 2424434 1838568 1960741 2457450 2310126 1345143 377949 -116186
36652 -116186 -582975 -1361626 -1954848 -1897023 -1596496 -1531997 -1219575 20789 1595386 2034883
36642 2034883 941874 -351710 -347763 1020271 2592393 3242558 2643942 1217431 -281789
36633 -281789 -1278496 -1742590 -2063579 -2569087 -3239783 -3804279 -3941965 -3476081 -2607131 -1968937
36623a968937k68432j259203j408176j54776J993694L460263K870198O38795j286232
36614B617194j681528j291368j180878r06782L41668J634956J290326k65268p69126
36605b10806L73270J008807l76094k142613j913409m0080J193919R46938M53818
36596g06250O06913P60519K46386l46989q8564Q72746J414635P24943p74963j744196
36586I65180j272023K1288O17995J3025o38325k36875O20226N80059l80547r33205
36576f43202l84287M25614N25179K11521M00780J081702J206913J61398j252056
36567A733562j690292q85311J42500M97660L84876L49051K70703j26656l49514
36558C26579J87621Q60140M97107o72244j135927m22681J77541j82945m77685
$$ plain form
36623 -1968937 -2237369 -3496572 -4904748 -5059524 -3065830 394433 3264631 3903426 2617194
36614 2617194 935666 -355702 -1536580 -2443362 -2101694 -466738 823588 558320 -210806
36605 -210806 162464 1171271 795177 -1347436 -3260845 -3300925 -2107006 -1160068 -706250
36596 -706250 -99337 661182 907568 560579 472015 1344761 2759396 3484339 2709376 965180
36586 965180 -306843 -285555 332440 345465 -292860 -529735 90491 670550 290003 -643202
36576 -643202 -1027489 -601875 -76696 134825 535605 1617307 2824220 2985618 1733562
36567 1733562 43270 -842041 -699541 -201881 182995 532046 802749 676093 326579
36558 326579 514200 1374340 1871447 1199203 63276 -359405 -181864 -364809 -842494
36549h42494L80353J534018J359855j22768j373115j436103p53214j19608J62094
36540a210982K03050L34410Q24401J327193J081480J23769m32798J8708N68369
36531B837600K04900o53420j074216j134144j255278r09454M23137J660079J290780
36522A389984j59052o53388L82416J362600J024616k0887o34785o06574k59887
36513A825043J67389K49761m46075j482398j822452j260742n70536p1401O98776
36504b712635J588430J530310K97559o92713k38767R03317J062070j68975j580277
36495a1681j821487p20444O15796Q46628j15321p92805P5125J708410K177225
36486A961446R21219p54266j576744j400221m65692Q82672J586601O64479r70873
$$ plain form
36549 -842494 -462141 1071877 2431732 2308964 935849 -500254 -1253468 -1373076 -1210982
36540 -1210982 -1007932 -673522 150879 1478072 2559552 2683321 2250523 2269231 2837600
36531 2837600 3042500 2389080 1314864 180720 -1074558 -1984012 -1560875 99204 1389984
36522 1389984 1230932 577544 959960 2322560 3347176 3326289 2691504 2084930 1825043
36513 1825043 1992432 2242193 1796118 313720 -1508732 -2769474 -3340010 -3411411 -2712635
36504 -2712635 -1124205 406105 703664 10951 -227816 675501 1737571 1568596 -11681
36495 -11681 -1833168 -2553612 -1937816 -1091188 -1206509 -1999314 -1924189 -215779 1961446
36486 1961446 2882665 2128399 551655 -848566 -1314258 -431586 1155015 1819494 848621
36477H48621j179487L35046J372594M61543j047800j236862l11771L21055K50286
36468a86775j10989o44039j041777m16731J128036J774186M95362r24399l28215
36459b55341J394746J581893j57898j564284j222197j28978M69697O82982Q11744
36450A612364L99554o48090j299135o74704O98556J549754J224508P3418r93355
36441A942870j213814p05658l79387o55427p29395J33296J169135J087348J793
36432F50761q46909r03337m99164L17296J531696K033806O49759j596269k188119
36423h50480n12264J273450J352656M18872r7549j89921m59934o27266k58046
36414D9518J19271k3894n6931O68335J312358O33351r25542j660686r28264K11895
$$ plain form
36477 848621 -330866 4180 1376774 1838317 790517 -446345 -758116 -437061 -186775
36468 -186775 -297764 -941803 -1983580 -2400311 -1272275 501911 997273 72874 -255341
36459 -255341 1139405 2721298 2563400 999116 -223081 -352059 117638 800620 1612364
36450 1612364 2011918 1363828 64693 -610011 88545 1638299 2862807 2936225 1942870
36441 1942870 729056 23398 -355989 -1011416 -1740811 -1607515 -438380 648968 650761
36432 650761 -196148 -1099485 -1598649 -1281353 250343 2284149 2933908 1337639 -850480
36423 -850480 -1362744 -89294 1263362 1682234 1584685 1394764 934830 307564 49518
36414 49518 168789 144895 87964 756299 2068657 2702008 1776466 115780 -812484 -600589
36404f00589O72898N66662N41563P33309P59142L43042l36141q21410q49852n93965
36394D14659k90019J59055P62053Q84272l7185j259384j294741N867J037752O48137
36384A030466l26390n16236k6373P1140m45988p98588n29459K6621M53424O57186
36374d04197O57318N37240M53301L26989j22655p28914q33924k91447J97006K29123
36364A9840L11488O80426N59632m26586j141097n63788L43436J374j195528j463070
36354b873873m69336L43210K80975K49076O97343O81296k20294q06293k00945
36345b318841N57441J96434p05993p96000k04138j02311n33652l79950N98840
36336c688170J272205R47305L18747J43781J37476j57626l86235r8110K97692
$$ plain form
36404 -600589 72309 638971 1180534 1913843 2672985 3016027 2679886 1858476 1008624 414659
36394 414659 124640 283695 1045748 1930020 1892835 633451 -661290 -655423 382329 1030466
36384 1030466 704076 187840 161467 232607 -213381 -1011969 -1541428 -1514807 -1061383 -404197
36374 -404197 253121 790361 1243662 1570651 1447996 719082 -114842 -406289 -209283 19840
36364 19840 331328 1011754 1571386 1144800 3703 -560085 -216649 -215275 -1410803 -2873873
36354 -2873873 -3343209 -2999999 -2719024 -2469948 -1772605 -1091309 -1311603 -2117896 -2318841
36345 -2318841 -1761400 -1564966 -2270959 -3066959 -3271097 -3373408 -3907060 -4287010 -3688170
36336 -3688170 -2415965 -1468660 -1149913 -1006132 -868656 -1026282 -1412517 -1510627 -1212935
36327a212935K26930M8481M33454J012350Q08918p1655m52792m552J65648n57344
36317C96503j069573l27739P07486M09841q64429j201387n7200J008335Q13291
36308a84872P8389j76238k03339n20332o47744p0162N46642L72335j22695K7508
36298i00508O42183P97944L53951j24837m62128o88671l45423O77467J192313
36289A142291K09481j080848o77558J099752J896863Q50285l37648l37744k606
36280B762268k86095m42668K61728P77968m4578j292018j318835l12523K80912
36271C86159J92826L17569O69569K90873p69660j162577l21239O09129M86583
36262F99232l19717p36040m14693K20098O81500O72086J57687m02013l46710L37506
$$ plain form
36327 -1212935 -986005 -937524 -504070 508280 1317198 1245543 792751 788199 953847 396503
36317 396503 -673070 -1000809 -293323 116518 -747911 -1949298 -2006498 -998163 -184872
36308 -184872 -106483 -282721 -486060 -1006392 -1654136 -1724298 -1177656 -805321 -928016 -900508
36298 -900508 -258325 539619 893570 768733 306605 -382066 -727489 -50022 1142291
36289 1142291 1351772 270924 -406634 693118 2589981 3440266 3102618 2764874 2762268
36280 2762268 2476173 2033505 2295233 3073201 3028623 1736605 417770 105247 386159
36271 386159 578985 896554 1566123 1856996 1087336 -75241 -396480 212649 699232
36262 699232 379515 -356525 -771218 -551120 130380 802466 960153 558140 211430 548936
36252E48936Q84333P37692K64162J74047N60856Q24739L81285p23198j787633
36243A865219k026052j306099k64980M15366O14770N04732J40992k67534k07918
36234e31504L61999N71440j64009r21672l79486J074856J671476P82692k76253
36225B189539l72622j03649m67360j173110j281572o71541J19056Q16427J238997
36216B94165Q92761k40130j115533q98608k58942k69146o20606l24666L15229
36207b225476J56759n26957j97719J211294J694984K26761j343691q69479Q99129
36198i74395J435702P4997j252780q70320N90426J389084Q65981j80430p39460
36189C38805o34562m07334m29749l60648K63875J059522J084433K61196l18043
$$ plain form
36252 548936 1433269 2170961 2435123 2609170 3170026 3994765 4376050 3652852 1865219
36243 1865219 -160833 -1466932 -1731912 -1316546 -701776 -197044 -56052 -323586 -531504
36234 -531504 -169505 401935 237926 -683746 -1063232 11624 1683100 2465792 2189539
36225 2189539 1816917 1713268 1245908 72798 -1208774 -1880315 -1761259 -944832 294165
36216 294165 1186926 946796 -168737 -1067345 -1326287 -1595433 -2216039 -2540705 -2225476
36207 -2225476 -2068717 -2595674 -2793393 -1582099 112885 339646 -1004045 -1873524 -974395
36198 -974395 461307 536304 -716476 -1586796 -996370 392714 1258695 1078265 338805
36189 338805 -295757 -703091 -1132840 -1493488 -1229613 -170091 914342 1175538 857495
36180H57495K3833N11209K00101n06337o16664j61449J00504O9850J77084K92224
36170I47850N7056r7528L11025M92054m88145j584408q90661J119247J860994
36161A727484N91179m81965K1168M64339n91302j571250o22352R62752Q51343
36152A351396m01957n80251K13853J07767p00454k09403J332471J285941q07453
36143A591910j993228n26185J414426J356873J09512l60381k05637m89887o75709
36134B21694J22884Q83967K45183q29523n06265O97918P56872m08268r58226l64748
36124a38512j8610n25939q37140m10616J865J70117Q02535J587683J039685q36488
36114H34580j843563p22282R02109J046373J39329k77117j22803k61838n21500
$$ plain form
36180 857495 881328 1392537 1592638 1086301 469637 308188 408692 478542 655626 947850
36170 947850 1004906 907378 1218403 1710457 1222312 -362096 -1252757 -133510 1727484
36161 1727484 2318663 1836698 1857866 2322205 1730903 159653 -462699 500053 1351396
36152 1351396 949439 369188 583041 690808 -9646 -219049 1113422 2399363 1591910
36143 1591910 -401318 -927503 486923 1843796 1953308 1592927 1387290 897403 221694
36134 221694 344578 1228545 1473728 644205 137940 835858 1592730 1184462 226236 -138512
36124 -138512 -157122 -683061 -1520201 -1930817 -1928952 -1758835 -956300 631383 1671068 834580
36114 834580 -1008983 -1731265 -829156 217217 356546 79429 -43374 -305212 -826712
36105h26712j27421N39790L96630m73042r40085o04242p4326L15951P15476Q21582
36095b56399J36424q09044q46912J6491M83728P473l32192L88569J389141J313936
36085A491215J72042p98921q29007l30000k8671q0024j58414m949L03636M79395
36075B16302L34554L379j79809o0306J40810O8207l34680o64417m36518K58876
36065f53602O57305K44174l41743L985J133287J510243L54772r75954p77179M95384
36055A650672Q91953j38839j118395r77914m82848n35950n68525K01653J050931
36046b7262P79522j81091k46726Q97155J764823J150056l98397j500268j436033
36037H01779m00589R01749J529543R07862l88499j052263o43808j56237n15638
$$ plain form
36105 -826712 -954133 -414343 -17713 -490755 -1430840 -2035082 -2109408 -1793457 -1077981 -256399
36095 -256399 -119975 -929019 -1775931 -1759440 -1275712 -1268239 -1600431 -1211862 177279 1491215
36085 1491215 1663257 864336 35329 -294671 -323342 -403366 -561780 -566729 -263093 216302
36075 216302 550856 554235 374426 314120 454930 523137 188457 -475960 -912478 -653602
36065 -653602 3703 247877 -93866 -89881 1043406 2553649 2908421 1932467 1155288 1650672
36055 1650672 2542625 2403786 1285391 307477 -175371 -711321 -1279846 -1078193 -27262
36046 -27262 752260 571169 324443 1221598 2986421 4136477 3738080 2237812 801779
36037 801779 401190 1302939 2832482 3740344 3351845 2299582 1655774 1499537 983899
36028I83899j179777r69706J36339R31001O46721q3523j80371M85281J040598
36019A810462P46307j94473j011410j255408j032360n06765K89230R88167Q87360
36010G21110K34m45791M98200J831806J644116j55235j524831j132642p5291J08945
36000A470621k23640J28049Q36008N17527q06845j523904q22030K57250N22722
35991C55758Q1300l92674o87798p74501m48216J48445M16990K00462O1163K98868
35981g40203N19458N26008O63917Q51747L95109o14090r28700n4195O90225J71593
35971A480869o59420l52551N62058N14894l40323m08152M66262N80490p46147
35962A097980j865674j249973L39668J195528R46771L96817N8566k5617K38196
$$ plain form
36028 983899 -195878 -1165584 -1029245 -98244 548477 464954 284583 769864 1810462
36019 1810462 2556769 2362296 1350886 95478 -936882 -1443647 -1154417 -166250 721110
36010 721110 721344 275553 773753 2605559 4249675 4094440 2569609 1436967 1361676 1470621
36000 1470621 1246981 1375030 2211038 2728565 1921720 397816 -424214 -166964 355758
35991 355758 437058 44384 -643414 -1417915 -1866131 -1717686 -1300696 -1100234 -1039071 -740203
35981 -740203 -220745 305263 969180 1820927 2216036 1601946 673246 619051 1309276 1480869
35971 1480869 821449 468898 1030956 1545850 1205527 797375 1263637 1844127 1097980
35962 1097980 -767694 -2017667 -1677999 -482471 464300 861117 919683 894066 1132262
35953A132262O12246K59716j047049k004342j271570M59675J179128K85607o72524
35944a066851k66126R36484J380201O15383m22575q41958p04387m93924l16703
35935a180456P229L37157K07831m21341q07233k65001P79225J178610O21427J22455
35925E79903N19630J090086M93054j160543k179268j459079Q0690Q10073N24559
35916g00895L90073R48850J219878K27801j331570j830202q79627J89086K34337
35907a532269j95021P9869R41374J119960J38210r03106p98345K50492J074067
35898A75231R76175K21284n62295r38001q06185m38884k70047l47752j93504M58730
35888a725248J054771Q46464m2718p41098p60665m08725l0538M68056J059082
$$ plain form
35953 1132262 1744508 2004224 957175 -1047167 -2318737 -1859062 -679934 -394327 -1066851
35944 -1066851 -1332977 -396493 983708 1599091 1176516 334558 -369829 -863753 -1180456
35935 -1180456 -1173227 -836070 -628239 -1049580 -1856813 -2121814 -1342589 -163979 457448 579903
35925 579903 1099533 2189619 2682673 1522130 -657138 -2116217 -2035527 -1225454 -700895
35916 -700895 -310822 638028 1857906 2085707 754137 -1076065 -1955692 -1766606 -1532269
35907 -1532269 -1727290 -1647421 -706047 413913 552123 -350983 -1149328 -898836 175231
35898 175231 1151406 1372690 810395 -127606 -933791 -1372675 -1642722 -1990474 -2183978 -1725248
35888 -1725248 -670477 175987 133269 -607829 -1368494 -1777219 -1807757 -1339701 -280619
35879b80619J200679N64520k41699l21257L08832P79350N97050J76906K8875N8332
35869B870969J561j9227J10444k936p08046j526194j643090j056540m80661j59688
35859b613408L23712R16262Q02122k46735j134430q16849K69092R70171J002733
35850e27330Q22136M34093m59939j335847j136346J26735J104476P88199l35752
35841e19575j097544r22076p4328P09306O64330k56814r81376m13198R94486J663852
35831b32937J013435Q8878j95673k30945n76403q59701o42545l36887l02144J7400
35821b257522R74386J624718J028615o3085k40893L43949L22160n73355j132867
35812B6106p11258j04713J9652J74210Q25228J255683O13092o10780j115952m98275
$$ plain form
35879 -280619 920060 1484580 1242881 921624 1230456 2009806 2606856 2783762 2812637 2870969
35869 2870969 2872530 2853303 2963747 2960811 2252765 726571 -916519 -1973059 -2453720 -2613408
35859 -2613408 -2289696 -1373434 -571312 -818047 -1952477 -2769326 -2500234 -1530063 -527330
35850 -527330 294806 728899 268960 -1066887 -2203233 -2076498 -972022 -183823 -519575
35841 -519575 -1617119 -2539195 -2613523 -1904217 -1239887 -1496701 -2478077 -2891275 -1896789 -232937
35831 -232937 780498 869376 673703 442758 -133645 -993346 -1635891 -1972778 -2274922 -2257522
35821 -2257522 -1283136 341582 1370197 1307112 1066219 1410168 1732328 1158973 26106
35812 26106 -685152 -789865 -770213 -596003 229225 1484908 2098000 1487220 371268 -127007
35802a27007L70150N65735Q8135m53698o43093m92033j29363L65547P42375N42473
35792H29221l40614j222378j255568m93679K17280M33957N03929O41361N11339
35783a75152R6831J8637M12068M62409j84344n82511n3048M78829K9433n69910
35773f6758l6690R41376P11973l81591m20065O68411O69037j182671k461958j050060
35763b608996J514190K118048L75368j166349p06350P14918J036011j63214j433343
35754c19717j388115k96925M32838J70823j91820J85717O10354L6971r00019o60688
35744b320581O01440J087377K03084o09099m27589j81993n20569m43360N87724
35735b023566J153009K28926p18332l6805J212594R69241l93813q46055j01729
$$ plain form
35802 -127007 243143 808878 897013 443315 -199778 -691811 -821174 -455627 286748 829221
35792 829221 488607 -733771 -1989339 -2483018 -2265738 -1831781 -1327852 -686491 -175152
35783 -175152 -78321 -59684 352384 814793 630449 47938 -5110 473719 503152 -66758
35773 -66758 -103448 837928 1549901 1168310 748245 1416656 2085693 903022 -1558936 -2608996
35763 -2608996 -1094806 1023242 1398610 232261 -474089 240829 1276840 1113626 -319717
35754 -319717 -1707832 -2004757 -1571919 -1401096 -1592916 -1407199 -796845 -759874 -1659893 -2320581
35744 -2320581 -1719141 -631764 -428680 -1037779 -1465368 -1647361 -2167930 -2611290 -2023566
35735 -2023566 -870557 -641631 -1359963 -1396768 -184174 785067 391254 -454801 -556530
35726e56530L16401n2822k16972o041k43632o51563p4431J032304Q73136n44634
35716a24784j131808k27421K88149n78500j091663N6527J229885N72792p81067
35707a787890o22925P27821J278468P92444P60868J453525J519165N31512l10719
35698D342269l54275m17706j023762j389897q84659j21540J47130J10383J53766
35689E61709J1289n71545j101121j005163m51024J16706O62470J157122J103012
35680D83455K74114n02619k36514P13756R48773k9663j050950q68648J68867P25575
35670F26146L48571j44088j14134M341l22178o67729l50062L18016M75218J99472
35660C73573M19761J211657J366965K13574j171000j436766q69003p22359j123298
$$ plain form
35726 -556530 -240129 -292951 -509923 -515964 -759596 -1411159 -1485590 -453286 419850 -124784
35716 -124784 -1256592 -1484013 -1195864 -1774364 -2866027 -2809500 -1579615 -1006823 -1787890
35707 -1787890 -2410815 -1682994 -404526 387918 1148786 2602311 4121476 4652988 4342269
35698 4342269 3987994 3570288 2546526 1156629 271970 150430 297560 407943 561709
35689 561709 572998 1453 -1099668 -2104831 -2555855 -2439149 -1776679 -619557 483455
35680 483455 757569 254950 18436 732192 1680965 1651302 600352 -268296 -99429 626146
35670 626146 974717 830629 716495 720836 398658 -269071 -619133 -301117 174101 373573
35660 373573 793334 2004991 3371956 3585530 2414530 977764 108761 -613598 -1736896
35651a736896r17720L73236J624844J584565M64983n27728p46236n27606k94037
35642g02595N4348O32141R68401M97891m21897o63029J55592R09260M31997p09879
35632A152230r63056j56404K07463o41931j428786p69005P23886J428670R66568
35623E19635J78373m93668j144808j321734l99044R55961J222340K28294m59775
35614g14426J60073J095652R65890m53n23161k03618N9364n47859j575411j679025
35604b962974j54498J895545K388560P41250j064477q74944O77560J082696l58656
35595A370062j616194j105655J54984N57612L21500M29128N35105k62742j434503
35586a050703j618251p60621l3681J01048K39979O56852J021879J342955J768619
$$ plain form
35651 -1736896 -2654616 -2281380 -656536 928029 1393012 865284 119048 -408558 -702595
35642 -702595 -648247 -16106 952295 1450186 1028289 365260 520852 1430112 1862109 1152230
35632 1152230 189174 32770 240233 -401698 -1830484 -2599489 -1875603 -446933 519635
35623 519635 698008 204340 -940468 -2262202 -2661246 -1705285 -482945 -254651 -714426
35614 -714426 -554353 541299 1507189 1506736 983575 779957 839321 291462 -1283949 -2962974
35604 -2962974 -3117472 -1221927 1166633 1907883 843406 -31538 646022 1728718 1370062
35595 1370062 -246132 -1351787 -1196803 -639191 -317691 111437 646542 383800 -1050703
35586 -1050703 -2668954 -3429575 -3463256 -3362208 -3122229 -2465377 -1443498 -100543 1668076
35577A668076J637158K85132j286054j302216O4537P10898k13521j048861m15501
35568I9648N82589L19935o66587o96642K70726O96605n0193r10654q99904l12684
35558a567161J31523L23592N13327O93252O49761K99997k17161n84416m72166
35549b29452P5790N12564L36697l01857p62482n58815K76312J180738J292620
35540A822115J83963j345846j790433p27325N01296N49428r3703J9659R87950
35531A07104J360361L12817j126892j495212o98545K20187N83091O36734P75428
35522F75073Q39296M29157l44203q09558n68291p7749k934j88968M0110N68966
35512E60899M47671m45430p61688M06542J843118J686072O5808j125860q97144
$$ plain form
35577 1668076 3305234 3590366 2304312 1002096 1066633 1777531 1564010 515149 99648
35568 99648 682237 1002172 335585 -361057 -90331 606274 556081 -354573 -1254477 -1567161
35558 -1567161 -1435638 -1112046 -598719 94533 744294 1044291 827130 242714 -229452
35549 -229452 -153662 358902 695599 393742 -368740 -927555 -651243 529495 1822115
35540 1822115 2006078 660232 -1130201 -1857526 -1356230 -806802 -900505 -880846 107104
35531 107104 1467465 1780282 653390 -841822 -1540367 -1320180 -737089 -100355 675073
35522 675073 1514369 1943526 1599323 789765 221474 143725 140791 -48177 -8067 560899
35512 560899 1008570 563140 -198548 207994 2051112 3737184 3802992 2677132 1779988
35503A779988j55030K5202k98977p18962j226959j598893j194668j21387M02964
35494c106722k87849j096506n63654J099623K322214K154904J107537K33245R2829
35485A955621M99584P39067J69006r93248j708633j308471l31351K31613J65054
35476e81758K3772K02672N06973M77015j65381j146992j582278q07841N20633
35467b553185R26903J07052m94615K12884J272836J161045J16979m23044j77312
35458A49543j44844n23308k81051Q10640J371598M97721o51086n04807N51716
35449A276122P83498l14534j352686j092601q4253K94559k18747n72059q357Q79820
35439d09238J036557L78008k46287l00019p4894L5360L7753m7989l17705m42777
$$ plain form
35503 1779988 1624958 1650160 1351183 632221 -594738 -2193631 -3388299 -3509686 -3106722
35494 -3106722 -3394571 -4491077 -5054731 -3955108 -1632894 522010 1629547 1862792 1955621
35485 1955621 2455205 3194272 3363278 2370030 661397 -647074 -978425 -746812 -581758
35476 -581758 -557986 -355314 151659 628674 463293 -683699 -2265977 -3073818 -2553185
35467 -2553185 -1626282 -1519230 -2013845 -1800961 -528125 632920 749899 326855 149543
35458 149543 4699 -518609 -799660 10980 1382578 1880299 1229213 724406 1276122
35449 1276122 2059620 1745086 392400 -700201 -784454 -489895 -708642 -1280701 -1289058 -409238
35439 -409238 627319 1005327 759040 459021 384127 419487 457240 409251 91546 -351231
35429c51231J45412J077225J011080m60839j796284j458989j24725L81862j82117
35420a758606l39686O63470J802885J902319J068398J29937l95328m75723m60011
35411B137655q58423j522277j347147J81671J606587J158840m95043j033076M795
35402a66418O46202j44426q73846k95227M77654J29321n55692l55691J26739j06715
35392a118099k59321P05193J531312L41126j884657k291594m69669R38867K96803
35383b210039r18655q79491l2346K68223J5094K8313L38669L93151J79976J51357
35373b665748M56991Q62706J035794O67226j27089n21029O2492P89443L80533
35364I41319p87805j058984j64791L00818l29785n53769N62205J341192O4664
$$ plain form
35429 -351231 -205819 871406 1882486 1421647 -374637 -1833626 -1958351 -1576489 -1758606
35420 -1758606 -2098292 -1434822 368063 2270382 3338780 3468717 3073389 2597666 2137655
35411 2137655 1279232 -243045 -1590192 -1408521 198066 1356906 861863 -171213 -166418
35402 -166418 479784 335358 -538488 -833715 -356061 -226740 -782432 -1138123 -1011384 -1118099
35392 -1118099 -1377420 -672227 859085 1200211 -684446 -2976040 -3445709 -2506842 -2210039
35383 -2210039 -3128694 -4008185 -4040531 -3772308 -3757214 -3728901 -3390232 -2997081 -2817105 -2665748
35373 -2665748 -2208757 -1346051 -310257 356969 229880 -291149 -228657 560786 941319
35364 941319 153514 -905470 -1070261 -769443 -1099228 -1652997 -1090792 250400 315064
35355C15064j888775j787113L42815J736500R11310n63745p61198M3374M16335
35346a235433J9953l19636j23298J52298r3317p71760j154235o87777K40169O13594
35336c359442P3844n26130k93656M50550P73339N78409N73208J000679J328258
35327E99059J159354O16749j49453j003552j418307r22662K9121N25598N16188
35318d7905O75121R85780O87489j96791o27007k72725j33451p74389j236508n94889
35308a535275N55415J178096J277690J188003M74173j047036k101680j409995
35300a420609K55837J103024R18953Q73171J083378M53361r63793j564401p39447
35291e26R3975j27742m45950K69195J302212J296709L32430n65482j047869j226045
$$ plain form
35355 315064 -1573711 -3360824 -3018009 -1281509 -370199 -933944 -1695142 -1651768 -1235433
35346 -1235433 -1215480 -1535116 -1658414 -1506116 -1599433 -2371193 -3525428 -4213205 -3973036 -3359442
35336 -3359442 -3285598 -3811728 -4105384 -3654834 -2881495 -2303086 -1729878 -729199 599059
35327 599059 1758413 2375162 2225709 1222157 -196150 -1118812 -1089691 -564093 -47905
35318 -47905 627216 1612996 2300485 2103694 1476687 1203962 1070511 296122 -940386 -1535275
35308 -1535275 -979860 198236 1475926 2663929 3138102 2091066 -10614 -1420609
35300 -1420609 -1164772 -61748 857205 1730376 2813754 3267115 2303322 738921 -526
35291 -526 93449 -34293 -480243 -211048 1091164 2387873 2720303 2154821 1106952 -119093
35281a19093p06967O76519J827381J594611N82006K84948P64999P00470l95229
35272E209645j506370j738367j287862o66556j37556j215l20564l98901K96368
35263e51378Q88391K15981j003567r73366J95027M81228n91316r35038N46883
35254a727155J775560P09976j227177j285697M13515J374573O58614k44430k55464
35245A92315j4059j20232j51572R6695J14044j37504q1950R7566m27976j283130
35235a715803r61645O12555J478675O18449k55466O34819K167849J886856l84280
35226D082009k400289k579407j502319m05576K54961N10110M39158M10931P93371
35217c97051J130437N30456q11884j435425m80737J051608J553211P11581n11899
$$ plain form
35281 -119093 -826060 -149541 1677840 3272451 3854457 4139405 4904404 5604874 5209645
35272 5209645 3703275 1964908 677046 10490 -127066 -128281 -448845 -847746 -551378
35263 -551378 337013 552994 -450573 -1423939 -1228912 -747684 -1339000 -2274038 -1727155
35254 -1727155 48405 758381 -468796 -1754493 -1340978 33595 692209 447779 192315
35245 192315 178256 58024 -93548 3147 117191 -20313 -102263 -4697 -432673 -1715803
35235 -1715803 -2677448 -2064893 -586218 32231 -223235 411584 2579433 4466289 4082009
35226 4082009 1681720 -897687 -2400006 -2805582 -2550621 -2040511 -1601353 -1190422 -397051
35217 -397051 733386 1263842 451958 -983467 -1464204 -412596 1140615 1852196 1340297
35208A340297j280819j431828r53762R9680J126261J276683N33414j85981l04933
35199B19012k58408m76608n33085n2505L26812P15k41195O22564J719997J190393
35189B517692p21497j601895n19835N07524o2466o92447L95821J773191R84715
35180B580803j139653j565089J27590J324767Q30055L52955Q71637Q41132n89519
35171C634678j588238p70293K55910l20743j368106r12174M09127O53321K822
35162c696J51019J112081J295504L38820n22478o89383o72444n34796J18350P56293
35152A349270M39645m46499p62742n66589o17221m85642N74971J355804J4589
35143H55586k398532k692410k75203J774641J265216k93491p02799k34257o9398
$$ plain form
35208 1340297 59478 -1372350 -2326112 -2226432 -1100171 176512 709926 523945 219012
35199 219012 -39396 -516004 -1049089 -1101594 -774782 -774067 -1015262 -392698 1327299 2517692
35189 2517692 1796195 194300 -325535 181989 119523 -572924 -177103 1596088 2580803
35180 2580803 1441150 -123939 3651 1328418 2158473 2511428 3383065 4224197 3634678
35171 3634678 2046440 1276147 1532057 1211314 -156792 -1068966 -659839 -6518 -3696
35162 -3696 147323 1259404 2554908 2893728 2371250 1681867 1009423 474627 592977 1349270
35152 1349270 1788915 1342416 579674 13085 -604136 -1089778 -514807 840997 855586
35143 855586 -1542946 -4235356 -4510559 -2735918 -1470702 -1764193 -2466992 -2701249 -2770647
35134b770647P8282P47723J008569P5982q26619l00939P42729N21813o35656q31196
35124b189959M47122J798484K031338J227028l8077j119651j214968j42460R75572
35115A774429Q80789k32144j182838j384693j045462l96262K64890L56258j51281
35106a116314l21044L46930R04742M52860k71241j38115M31919L23169k45884
35097C67022k41589K31128K35331j88544k40941Q42j21015l17771Q7717N03685
35087C15865o5704q87281m52011O61016L86383j207666j585281K65054K058703
35078e10922J626051r1779r05173m49542J46447K99563K22655J24487K64942Q95102
35068A621831J401294O88565r10022j574887o66861J99928k01118p84505k93832
$$ plain form
35134 -2770647 -2692365 -1944642 -936073 -860091 -1686710 -1987649 -1244920 -723107 -1358763 -2189959
35124 -2189959 -1742837 55647 2086985 3314013 3275936 2156285 941317 798857 1774429
35115 1774429 2655218 2423074 1240236 -144457 -1189919 -1586181 -1321291 -965033 -1116314
35106 -1116314 -1437358 -1090428 -185686 267174 -4067 -142182 289737 612906 367022
35097 367022 125433 356561 591892 403348 162407 163249 42234 -275537 -187820 315865
35087 315865 250161 -637120 -1089131 -428115 -41732 -1249398 -2834679 -2569625 -510922
35078 -510922 1115129 1023350 118177 -331365 -184918 114645 337300 461787 726729 1621831
35068 1621831 3023125 3711690 2801668 1226781 559920 759848 558730 -225775 -519607
35059e19607L72902j74267j249856j240215k63243L72009N34953J036014J640321
35050E09011J387942N12743Q0996J5379n78644j360068j081973O0665N00753p9024
35040c2220k62693N19712R85383L48043k41960K69529R85988O09881l89250o51732
35030B140681j38128O3576k76264k09081O63175J344744P94790n97123j454277
35021B332093j061286q9605L43640l2698n51311n82905j73775K71372M79032L81133
35011A315690J30009R6942L66176L08636n55706j351556p32734Q14786J130172
35002A522415m44266j740483r00253P73926R21791k33637o04865K29616O84009
34993B08253P5684n20875m58026l71825n26830k87390L48661N19977J98879L41259
$$ plain form
35059 -519607 -146705 -320972 -1570828 -2811043 -3074286 -2702277 -2167324 -1131310 509011
35050 509011 1896953 2409696 2490692 2506071 1927427 567359 -514614 -453949 46804 -32220
35040 -32220 -294913 224799 1210182 1558225 1316265 1585794 2571782 3181663 2792413 2140681
35030 2140681 2002553 2066129 1789865 1580784 2243959 3588703 4383493 3786370 2332093
35021 2332093 1270807 1181202 1524842 1492144 940833 357928 184153 455525 934557 1315690
35011 1315690 1445699 1542641 1908817 2217453 1661747 310191 -422543 392243 1522415
35002 1522415 1078149 -662334 -1562587 -788661 133130 -100507 -705372 -475756 208253
34993 208253 283937 -236938 -694964 -1066789 -1593619 -1881009 -1532348 -1012371 -813492 -472233
34983d72233R81643R95875J52563m37928l03319j45390r4067M63005R86343J59445
34973B285937j330472j144518P20886J320061n35805k134037j335694N5l56248
34964b509835r89346K40005J837732J152382o69287m42954J472215J715346l38009
34955A468249j657934p02640M96669K62302k75359R8791N63889K81429l9791O4012
34945E59617k42380j125643j261707j88549O32158K95753q8389L73207P82352
34936b63581M18873J88399O56723P13349k00034n91958M96913J380997L47640
34927C147321j324115j329175M6855P31379K55960j15105N3926M8731j79016m8980
34917A287781J03999m44884j050060n09003O16645O48815l17137m50146O37568
$$ plain form
34983 -472233 509410 1505285 1657848 1219920 916601 771211 677144 1140149 2126492 2285937
34973 2285937 955465 -189053 531833 1851894 1316089 -817948 -2153642 -2153587 -2509835
34964 -2509835 -3499181 -3259176 -1421444 -269062 -938349 -1381303 90912 1806258 1468249
34955 1468249 -189685 -892325 -395656 -133354 -408713 -309922 253967 535396 495605 559617
34945 559617 317237 -808406 -2070113 -2258662 -1626504 -1330751 -1419140 -1045933 -263581
34936 -263581 155292 343691 1000414 1713763 1513729 921771 1418684 2799681 3147321
34927 3147321 1823206 494031 540886 1272265 1528225 1413120 1467046 1515777 1336761 1287781
34917 1287781 1391780 946896 -103164 -612167 4478 653293 336156 -113990 523578
34908E23578J071156j77376j451667r03556P40682J326173K41199j052213j028753
34899g10777K98512J618309J631935K74537j143397j255152j37359Q82814Q58051
34890B317473J15527m61242m17399J06726O32162O22963m3440p97851r18093l25731
34880H31095M25870P41685K70809r33653k037349j788208m8366J547216J444139
34871D53238K66199r5663P78292J366502N54543q68387j484054r82316j10708
34862a22354L52986J28252n10855r13854p13696l12897k00120m3004O83336J418884
34852b33322J080550q8543o08343l5129K77208n86097j399081m87608J696977
34843c83388K953991J982188l29761k133828k349166j197692K72134J008394P12122
$$ plain form
34908 523578 1594734 1417358 -34309 -937865 -197183 1128990 1370189 317976 -710777
34899 -710777 -412265 1206044 2837979 3112516 1969119 713967 576608 1459422 2317473
34890 2317473 2433000 1971758 1554359 1661085 2293247 2916210 2872770 2074919 1156826 831095
34880 831095 1256965 1998650 2269459 1335806 -701543 -2489751 -2538117 -990901 453238
34871 453238 719437 623774 1402066 2768568 3323111 2454724 970670 -11646 -122354
34862 -122354 230632 358884 -151971 -1065825 -1779521 -2092418 -2292538 -2335542 -1652206 -233322
34852 -233322 847228 758685 150342 115213 392421 -193676 -1592757 -2080365 -383388
34843 -383388 2570603 4552791 4223030 2089202 -259964 -1457656 -1185522 -177128 534994
34834E34994j2276l46226p4529L54010M48525J96169j7640Q0663L08939L05785
34824A778414P0061r4568j81905n21015j036666j105474n29399K2167Q0327J53010
34814a365048O98615J091083O14236j72026k44913K33435L67372J55647K23019
34805A601420K99023l90665j369300j288096j38520O40645M70102K75562M97773
34796E97944L33748m35031p02167K5398O36436L08979j93181j00909P3827r1275
34786D53769J04285Q90920J011026k30387j402263j081468j38863n8194l03652
34777g54827M64539J577149J200806m99376j432166p71657P8729n2375n85775
34768g74953n84166q3569M90626R95520J226180R00997K43944k75443p44258j381049
$$ plain form
34834 534994 522718 176492 101963 455973 904498 1100667 1083027 1163690 1472629 1778414
34824 1778414 1848475 1753907 1572002 1050987 14321 -1091153 -1620552 -1598385 -1518058 -1365048
34814 -1365048 -666433 424650 1038886 866860 621947 855382 1222754 1378401 1601420
34805 1601420 1900443 1509778 140478 -1147618 -1286138 -645493 -175391 100171 597944
34796 597944 931692 496661 -205506 -180108 456328 765307 572126 471217 545044 453769
34786 453769 558054 1448974 2460000 2229613 827350 -254118 -392981 -451175 -754827
34777 -754827 -290288 1286861 2487667 1988291 556125 -215532 -136803 -189178 -774953
34768 -774953 -1359119 -1442688 -952062 43458 1269638 2170635 2414579 2139136 1394878 13829
34758A3829j538169m24765J225286J644049M41854p72962n92483N03997J141720
34749A642356P76368r3369p32169p44697l05407j0953j65106l46317j18643K10258
34739A12321J77674K8173J79461L59613K16222J71192N57637O14558k74643j065389
34729A076819m85417O32925M86179o42482p91308K89753P10218k32527r14262
34720A29898l92853N392o32065r27935K92283J673368J438000J83463m14219l04744
34710A050588m24497n35580J15075Q32503L65553p74543r74934j46867L37156
34701a55546J16162J80507P03788O09811l02096p13036L6546P60723L08591p02552
34691H42898j013465n35881m0165J65930K43839Q0396m66941q85380m87814M55550
$$ plain form
34758 13829 -1524340 -1949105 -723819 920230 1362084 589122 -3361 500636 1642356
34749 1642356 2418724 2325355 1593186 848489 543082 532129 367023 20706 -97937 112321
34739 112321 289995 318168 497629 857242 1073464 1244656 1802293 2416851 2142208 1076819
34729 1076819 591402 1224327 1710506 1068024 276716 566469 1276687 1044160 129898
34720 129898 -262955 -257563 -889628 -1817563 -1525280 148088 1586088 1769551 1355332 1050588
34710 1050588 626091 90511 205586 1038089 1403642 629099 -345835 -492702 -155546
34701 -155546 -39384 141123 844911 1454722 1152626 439590 476136 1236859 1545450 842898
34691 842898 -170567 -706448 -746613 -580683 -336844 -256448 -723389 -1608769 -2096583 -1641033
34681a641033Q16435K0263j138795j376306l75967Q94791J281538O41355j52756
34672a030475k61975K78087P52159N90972n3787m48011m3238P77963R84534K45876
34662A792105l96794R1109R96007O07911j208722k500393j853965l24196K45812
34653b551126j55873q4345R42874J844696J714629Q95814R5680n61264j188272
34644I52813j552420j313001n19678L91012R31098Q65451L81388p2593k45804
34635a81734k48487k17166j68413k57363o34044q79497l17709P85581J207801
34626i11031M87811k84419j32140L79801L84059K96077P64807J014996M9192j165063
34616H84090q21680O74311J056015k44346j234924o82451O9847k40589n34159
$$ plain form
34681 -1641033 -824598 -804335 -1943130 -3319436 -3695403 -2800612 -1519074 -877719 -1030475
34672 -1030475 -1292450 -1014363 -262204 328768 274981 -173030 -216268 561695 1546229 1792105
34662 1792105 1395311 1486420 2482427 3090338 1881616 -618777 -2472742 -2796938 -2551126
34653 -2551126 -2706999 -2791344 -1848470 -3774 1710855 2606669 2702349 2141085 952813
34644 952813 -599607 -1912608 -2432286 -2041274 -1110176 -244725 136663 64070 -181734
34635 -181734 -430221 -647387 -815800 -1073163 -1707207 -2586704 -2904413 -2118832 -911031
34626 -911031 -423220 -707639 -839779 -459978 -75919 220158 984965 1999961 2049153 884090
34616 884090 62410 736721 1792736 1548390 313466 -368985 -299138 -539727 -1073886
34607a073886M62105J580018R11637r91572j916439j392375r99042j356782j082405
34598e858741O59346K434169K438927R18028m08980n83894p8169L34303M49062
34589C04051M44480M47025L79985P275p86593j602689j665154o56761P38097J439435
34579i50849J069774K17488l33407l71976k21518j68857j37417P5841M03917N33943
34569A16939L37089N4425r7671k82358o78813r20816m33475N64520R78964J84987
34559a76209r62247j077232k1564R52476Q60544P0391n21024o77060o42747l35820
34549b530492M81364J431574J719770J153268L33143k41047o08493p55612l40942
34540F42533N74677J139749O50867m73793j195987j064299m22863K88456P94643
$$ plain form
34607 -1073886 -611781 968237 1879874 888302 -1028137 -2420512 -3419554 -4776336 -5858741
34598 -5858741 -5199395 -2765226 -326299 591729 182749 -401145 -479314 -145011 304051
34589 304051 748531 1195556 1575541 1582816 796223 -806466 -2471620 -3128381 -2390284 -950849
34579 -950849 118925 336413 3006 -368970 -590488 -759345 -896762 -820921 -417004 116939
34569 116939 454028 508453 410782 128424 -550389 -1471205 -1904680 -1340160 -361196 -176209
34559 -176209 -1138456 -2215688 -2237252 -1284776 -424232 -353841 -874865 -1551925 -2194672 -2530492
34549 -2530492 -2049128 -617554 1102216 2255484 2588627 2347580 1739087 983475 642533
34540 642533 1217210 2356959 3007826 2534033 1338046 273747 -149116 139340 933983
34531I33983P05925k32663j430274j663788m68470J051750J331677J62933j084131
34522f93058j150197l15955K38926J43868J74858Q43996J496838J335869O68274
34513B743419L07515J83419l96444j265702j377104m63665M07044L87271o0796
34504D64957k25001l19026p62055j064618m45448Q56915J752415J539699M06537
34495B204375r12001j473711p32282N79691Q78803k01345r91289n0612J581069
34486H82698J770940L33274q98887p65470O9169O43803Q15855O44140Q5002l94592
34476C185932j92979K09093k34915j199808j162993O5285P58989K4597o64384
34467G88817M4175R71510K56805j502270j987804n71961R39730J012105J59080
$$ plain form
34531 933983 1639908 1407245 -23029 -1686817 -2155287 -1103537 228140 391073 -693058
34522 -693058 -1843255 -2159210 -1920284 -1776416 -1601558 -757562 739276 2075145 2743419
34513 2743419 3050934 3234353 2837909 1572207 195103 -268562 138482 525753 464957
34504 464957 239956 -79070 -841125 -1905743 -2351191 -1494276 258139 1797838 2204375
34495 2204375 1292374 -181337 -913619 -333928 544875 343530 -647759 -698371 882698
34486 882698 2653638 2986912 2088025 1322555 1391724 2035527 2851382 3495522 3580524 3185932
34476 3185932 2992953 3202046 2967131 1767323 604330 669615 1428604 1453201 788817
34467 788817 832992 1804502 2061307 559037 -1428767 -2000728 -1060998 -48893 110187
34458A10187l65209k81934j8130L14352Q26570J185301P97069l22136j294237
34449I51833j233532k63643N76822N49105J8695k58496k38249l19548l20998K46892
34439b91119R52861P27352l50521q41286r0542P08915M56585j18423J40769P72560
34429B067151N61127l16307o48225k68323j43816n49493p18415l51269k0536O1988
34419c26118K92076N25661J26545n67541l59822P25723J047742j45236j270056
34410D8974o29301J089289J867684J071609k52677j182508j596622j387350m38007
34401a408909N90882P08011M7741j71408N52687J205625P30293m65455j080282
34392G09185n37312N14573J075784P66447M0419l24590j6317M77669M67776p5639
$$ plain form
34458 110187 -255022 -536956 -555086 -240734 585836 1771137 2568206 2246070 951833
34449 951833 -281699 -545342 31480 580585 599280 340784 102535 -217013 -538011 -291119
34439 -291119 661742 1389094 1038573 197287 106745 815660 1272245 1153822 1294591 2067151
34429 2067151 2628278 2311971 1663746 1395423 1251607 702114 -16301 -367570 -388106 -326118
34419 -326118 -34042 491619 618164 50623 -309199 416524 1464266 1319030 48974
34410 48974 -580327 508962 2376646 3448255 3195578 2013070 416448 -970902 -1408909
34401 -1408909 -818027 -110016 -62275 -233683 319004 1524629 2254922 1789467 709185
34392 709185 171873 686446 1762230 2528677 2569096 2244506 2228189 2705858 3173634 3097995
34382C097995n67775o55577n55335m84190k87676J18073L83927J67819l37271
34373H79990o10816l57665K87158Q53447P93738O3596n20093j28505P38719O39305
34363B638874o68745j509276n88060R46771J075135j15963o91811Q1109P66241
34354A934275J98220q12131j033541o75939o13938p91492n71617K1451M73343
34345a871369O68484P10901M10132j82811l38088K95883Q03695K41542p83284
34336d4915r42645j36029O34599R36157J080542R18038p719j105827j072690J49010
34326D08521J095060Q12235n9302n87324p18553p04662m80734j16587O4937J69925
34316a16484N63969Q44523K01974r56261j187950k61829L45822j28371m80458
$$ plain form
34382 3097995 2530220 1874643 1319308 835118 547442 665515 1049442 1217261 879990
34373 879990 269174 -88491 198667 1052114 1845852 1909448 1389355 1260850 1999569 2638874
34363 2638874 1970129 460853 -127207 819564 1894699 1778736 1086925 1168034 1934275
34354 1934275 2132495 1320364 286823 -389116 -1003054 -1794546 -2366163 -2344712 -1871369
34345 -1871369 -1202885 -491984 -81852 -264663 -602751 -306868 496827 738369 -44915
34336 -44915 -987560 -1123589 -488990 447167 1527709 2445747 2438028 1332201 259511 408521
34326 408521 1503581 2315816 2256514 1669190 950637 245975 -234759 -351346 -286409 -116484
34316 -116484 447485 1292008 1493982 537721 -650229 -912058 -566236 -694607 -1175065
34307a175065K86558J151763Q02399k15371o24133n24709p08035q64308l09147
34298b180048K88197j31069q47912k32995J424380K067375J014152r3717N950
34289A314313M59713J43632m18486k13336L93767L20211m20696q51846o23462
34280A03810l42190l89386l63957J24879P87446J059372P80853K32827k40825
34271A752829m30178k88248n1960k22923j031417j852482j639111k76088R53695
34262c085883Q65324n879j42964P30336J269821N83405m67957o61259j18864K28558
34252h05362J17621o9785k20635l79493j69877O24027J207258O11767p23764j289059
34242a097302m96140O50042J084613R51147R06452R20152M50153n07269j187144
$$ plain form
34307 -1175065 -888507 263256 1065655 850284 226151 -298558 -1006593 -1870901 -2180048
34298 -2180048 -1891851 -2022920 -2870832 -3103827 -1679447 387928 1402080 1308363 1314313
34289 1314313 1774026 1917658 1499172 1285836 1679603 1999814 1579118 727272 103810
34280 103810 -238380 -627766 -991723 -866844 -79398 979974 1760827 1993654 1752829
34271 1752829 1322651 1034403 982443 759520 -271897 -2124379 -3763490 -4039578 -3085883
34262 -3085883 -2220559 -2226438 -2369402 -1639066 -369245 214160 -253797 -915056 -1033920 -805362
34252 -805362 -687741 -757526 -978161 -1357654 -1527531 -903504 303754 915521 191757 -1097302
34242 -1097302 -1593442 -943400 141213 1092360 1998812 2918964 3369117 2861848 1674704
34233A674704r78869k35202J48166p9707j87293L81031R71144N96979l89805n88947
34223A312201L46193J081861O08388k52225k10217N15287O48622k61599j403047
34214B385464j822223j245191j29423N26750n6403j313576j651953n14409P29991
34205c090973P43515Q6507O0398O35743Q82951P09074O64215N60087j58919r99801
34195I2797r15306o6116L47667l6201l79424j68191J59156J85815J2366k64718
34185a032155o09783o75827k75159N2521j24540k07212M10111R95691N59619k69694
34175a176428r5103Q76008J075658O6588r66588j251898j246791j253582q36537
34166d808673Q6049R39460J446135J659233J212072m6527r93372n24193M07911
$$ plain form
34233 1674704 695835 460633 608799 529092 341799 722830 1693974 2290953 1901148 1312201
34223 1312201 1658394 2740255 3348643 3096418 2886201 3401488 4050110 3788511 2385464
34214 2385464 563241 -681950 -811373 -284623 -341026 -1654602 -3306555 -3820964 -3090973
34205 -3090973 -2347458 -2260951 -2200553 -1564810 -681859 27215 691430 1251517 1092598 92797
34195 92797 -822509 -888625 -540958 -577159 -956583 -1124774 -965618 -779803 -767437 -1032155
34185 -1032155 -1641938 -2317765 -2592924 -2540403 -2664943 -2872155 -2462044 -1466353 -906734 -1176428
34175 -1176428 -1271531 -395523 680135 746723 -219865 -1471763 -2718554 -3972136 -4808673
34166 -4808673 -4722624 -3783164 -2337029 -677796 534276 487749 -505623 -1029816 -621905
34157f21905M1694j137147r36455Q59186J908758R93167k14627m5446P24496N92231
34147B163952l22902r43174q67720l35650K62485K43006o96965j397383m82038
34138b376389J166763J291990j10508o09796N71430J174383j40831j373689o13370
34129a020017P23281M51546p19591p01185L99418Q51604L42135k5995j7068l07031
34119b2903p46097n36141J70499M33800j0380o32362r40699n19504Q56125K204556
34109B56894J690358p96448k733707k061142J02742J362284J315626J109110R26263
34100A171980O5807j125607j387111m14224Q15209J334436Q47641l24655j177310
34091a93834p75945K59807K84521p29192q49637N93949J617115Q12805l23282
$$ plain form
34157 -621905 -580211 -1717358 -2653813 -1794627 114131 1107298 892671 847225 1571721 2163952
34147 2163952 1841050 897876 30156 -305494 -43009 199997 -496968 -1894351 -2376389
34138 -2376389 -1209626 82364 -28144 -637940 -66510 1107873 967042 -406647 -1020017
34129 -1020017 -296736 154810 -564781 -1265966 -866548 -14944 327191 301196 284128 -22903
34119 -22903 -769000 -1305141 -1134642 -700842 -711222 -1343584 -2284283 -2803787 -1947662 256894
34109 256894 1947252 1150804 -1582903 -3644045 -3541303 -2179019 -863393 245717 1171980
34100 1171980 1237787 112180 -1274931 -1689155 -873946 460490 1308131 983476 -193834
34091 -193834 -969779 -709972 -425451 -1154643 -2004280 -1410331 206784 1019589 696307
34082F96307j75941K00064n64426j213594j51964J191177M99136j326539j531854
34073b377634J0536J021287Q24158P90585J144833O47482n17606o74671K48314
34064A117284M48564n02965q60345K40401J389131J312449N46641k6861m54333
34055C209966q47579q67373o36713p84795j194047r62173J21779J154331J293434
34046D86830N29877n06654q48457M1513J139421O48185j257788k101953p04938
34037b573964Q67391O15862l21085j08555N03834R4781l17834P12765J765085
34028A238280Q00074q35406m53848J162848J015968q87747j656952m50295O42027
34019E74949N15294J82512O7367m01486o66795K03225J049804K05471j161863
$$ plain form
34082 696307 520366 720430 156004 -1057590 -1209554 -18377 480759 -845780 -2377634
34073 -2377634 -2367098 -1345811 -521653 268932 1413765 2061247 1543641 868970 1117284
34064 1117284 1565848 1062883 202538 442939 1832070 3144519 3691160 3664299 3209966
34055 3209966 2362387 1495014 858301 73506 -1120541 -2082714 -1960935 -806604 486830
34046 486830 1016707 510053 -338404 -296891 842530 1490715 232927 -1869026 -2573964
34037 -2573964 -1706573 -1090711 -1411796 -1520351 -1016517 -921736 -1239570 -526805 1238280
34028 1238280 2038354 1202948 749100 1911948 2927916 2040169 383217 -67078 574949
34019 574949 1090243 1272755 1340122 938636 271841 475066 1524870 1730341 568478
34010E68478p83726N70652N50091k49024M37491J696414P07983j758160k194929
34001d54730m06770M55920k39511p2414J046538N38017j395484j570300L24495
33992a774239J214670N33968Q60923K084093J118375j646720k072126K84980J057389
33983A661313j003326j767698N72413K346753J366337L75765R66334O57492j262409
33974C912974j604043L32367R22760p26615r55284Q63994O85678j750827j413822
33965B67182K106603K553917j462209k933773J021728L654516J006830j140001
33957E074793R65074J775942j775647l119609J071732L216526p26256k340649
33949D141906L193367O426678J363427j604510M833825R344699L690217J464300
$$ plain form
34010 568478 -215248 355404 905495 656471 1093962 2790376 3498359 1740199 -454730
34001 -454730 -861500 -405580 -645091 -717505 329033 867050 -528434 -2098734 -1774239
33992 -1774239 -559569 -25601 835322 2919415 4037790 2391070 318944 603924 1661313
33983 1661313 657987 -1109711 -537298 1809455 3175792 3551557 4517891 5175383 3912974
33974 3912974 2308931 2641298 3564058 2837443 1882159 2746153 3431831 1681004 267182
33965 267182 2373785 4927702 3465493 531720 1553448 5207964 6214794 5074793
33957 5074793 6039867 7815809 6040162 2920553 3992285 7208811 6482555 4141906
33949 4141906 7335273 13761951 15125378 13520868 18354693 27699392 31389609 32853909
33941C2853909J2537454J9416836J0067809J3680712N8935604J07543495Q5291742
33934C40327561j2050367r7179204r8808463m5458867j0382659j3005622j8697514
33927D4744865r230410k128918p495033j0818405l742551J972252j012734l502851
33919H786215J35322J866765k449492m480976P7416L128584l66163l444610q56223
33910B396838J751523m25299k552930l46026J768471k27198k291195o02386J191010
33901F62808n01167k323838p85427J261248P13372J1941J410778K011215j70944
33892B289986j536352L96018J795500n07383k773500q81418K262934J871078p78228
33883B138635j503063m32155k99141p78144O5449J307792R54271j24098j22935
$$ plain form
33941 32853909 45391363 64808199 74876008 88556720 147492324 255035819 340327561
33934 340327561 328277194 231097990 132289527 86830660 76448001 63442379 44744865
33927 44744865 35514455 33385537 25890504 15072099 11329548 13301800 12289066 8786215
33919 8786215 8921537 10788302 8338810 3857834 3935250 7063834 6697671 3253061 2396838
33910 2396838 4148361 3723062 1170132 824106 2592577 2365379 74184 -528202 662808
33901 662808 161641 -2162197 -2947624 -1686376 -973004 -961063 449715 2460930 2289986
33892 2289986 753634 1149652 2945152 2437769 -335731 -1217149 1045785 2916863 2138635
33883 2138635 635572 203417 -95724 -873868 -808419 499373 1453644 1329546 1206611
33874A206611K45570j78579k26021Q82489J074903q17223k055590m37273J513511
33865A208398P23489j235196j286130j63473k00531n88018N55672J800966Q00162
33856A615339r70684n45648J174195J061269o44080j034083J68334N39128l93985
33847I69785o55605K83899R12568P73340P31448M83486r03750k372139k025271
33838a802239m62857K01261O1680Q16381K013675J548781l05485j033114j37370
33829I00713L11783l06681k02812J102460J571858K49332j054996r51210n46372
33820A074075r54644j273638n90890J80669P9959j22568M99266J190569P88173
33811H70971l32942r41824o95258j17577L80252N76750K61314k82335k96132L38920
$$ plain form
33874 1206611 1452181 1273602 1047581 1930070 3004973 2187750 132160 -305113 1208398
33865 1208398 1931887 696691 -589439 -752912 -953443 -1541461 -985789 815177 1615339
33856 1615339 644655 99007 1273202 2334471 1690391 656308 824642 1363770 969785
33847 969785 314180 598079 1510647 2283987 3015435 3498921 2595171 223032 -1802239
33838 -1802239 -2265096 -2063835 -2002155 -1185774 827901 2376682 2071197 1038083 900713
33829 900713 1212496 905815 703003 1805463 3377321 3626653 2571657 1620447 1074075
33820 1074075 119431 -1154207 -1745097 -1564428 -1484469 -1607037 -1107771 82798 870971
33811 870971 538029 -403795 -1099053 -1216630 -836378 -259628 1686 -280649 -576781 -237861
33801b37861O95279R2440q10127q14355K78579J360170J142702m34811j871130
33792e99114j584257N3455R50747R0659j008576o33365N36920P84563K63289M18702
33782g26977J090204O53870r20537j615035n17631P80613P81984Q6482k22467
33773f09494l54755p23811p00579J14151P26297L41172r1607M63555J029041J04185
33763B98155j495215j491736L08286J525659P17525o22352n61825M32724O49251
33754b39528L104p9548P40271J100173K30162p47844o18547Q3133J50540k72817
33744C49099j15990O51418R20454K53461n29926p50105o63828o03523m65500l80987
33734a335427p22467j037114k66596J358368K019395Q43283n69539l92345P92522
$$ plain form
33801 -237861 457418 549858 -260269 -1074624 -796045 564125 1706827 1272016 -599114
33792 -599114 -2183371 -2129916 -1179169 -1088510 -2097086 -2730451 -2193531 -1408968 -1145679 -726977
33782 -726977 363227 1017097 96560 -1518475 -2036106 -1255493 -473509 -387027 -609494
33773 -609494 -964249 -1688060 -2388639 -2274488 -1548191 -1207019 -1298626 -835071 193970 298155
33763 298155 -1197060 -2688796 -2380510 -854851 -137326 -759678 -1321503 -888779 -239528
33754 -239528 -236424 -315972 424299 1524472 1754634 1006790 388243 471376 621916 349099
33744 349099 233109 884527 1804981 2058442 1528516 778411 114583 -488940 -954440 -1335427
33734 -1335427 -2057894 -3095008 -3361604 -2003236 16159 859442 289903 -102442 690080
33725F90080J139884M49818J28482O47598Q77948O6510j070219j589042j449755
33716a08696j037584n70048l08609m47558n07200K47006J474232J824980Q16754
33707A383277l05154l03457K52767o9889j265146j713353m67452J294600J750978
33698E57171P77347j07890O998L23012r8641p06555m47887K72737P8214j036250
33688c81744j410577k26686J122260J053779L9287l42568J92899N04672l8162
33679E13160p25964o88552K56O36205P50507M35901N7562k29508n98492j016856
33669h65781q61592K83114J551410J490530N6966j094403p65292L28274Q37992
33660I61218N39892O0538k50923l23732j4789M17816K48834n25482q10744j04302
$$ plain form
33725 690080 1829964 2279782 2408264 3055862 3933810 4000320 2930101 1341059 -108696
33716 -108696 -1146280 -1716328 -2024937 -2472495 -2979695 -2732689 -1258457 566523 1383277
33707 1383277 1078123 774666 1027433 957544 -307602 -2020955 -2488407 -1193807 557171
33698 557171 1334518 1226628 1233626 1556638 1457997 751442 303555 576292 654506 -381744
33688 -381744 -1792321 -2019007 -896747 157032 196319 -146249 46650 551322 513160
33679 513160 -212804 -901356 -901100 -264895 485612 921513 979075 749567 151075 -865781
33669 -865781 -1727373 -1444259 107151 1597681 1654647 560244 -205048 123226 961218
33660 961218 1501110 1561648 1310725 986993 972204 1390020 1638854 1113372 302628 198326
33650A98326M43528j91895j040223n32355R14936J382062K69833r48363r36818
33641d40969j52851R9315o10783j494989j510384m57650Q03076J349566J261220
33632a154449J149757R10078O1254p86396m48277N92737M52297r54700j261410
33623a439109N18011J906391P22822j279094j165317N63494J183413L34178N7130
33614A401919Q40957R55230k39540j295122j310488r88398p58036k10333L83983
33605a219828K73886N840O80921J563640J018370l44384m22663N34062K29573
33596B319417j258514j165866R69123J975257K99125j283847m36866Q96123K66964
33587B580916q87253p1872J590346J278606o57475j474979o31985j05201o55125
$$ plain form
33650 198326 641854 449959 -590264 -1122619 -207683 1174379 1444212 495849 -440969
33641 -440969 -593820 -494505 -1105288 -2600277 -4110661 -4568311 -3765235 -2415669 -1154449
33632 -1154449 -4692 905386 966640 180244 -268033 324704 777001 -177699 -1439109
33623 -1439109 -921098 985293 1708115 429021 -736296 -172802 1010611 1344789 1401919
33614 1401919 2242876 3198106 2958566 1663444 352956 -635442 -1393478 -1603811 -1219828
33605 -1219828 -945942 -940102 -259181 1304459 2322829 1978445 1555782 2089844 2319417
33596 2319417 1060903 -104963 864160 2839417 3138542 1854695 1417829 2313952 2580916
33587 2580916 1693663 1621791 3212137 4490743 3833268 2358289 1726304 1621103 965978
33578I65978r73973m42783K7610j2510m2521p5359n91509j028275l22510J069423
33568a426429J545454P20469k67318o54497n98507r0264R13264J478397O20522
33559B241091q75195j311599o32219l12052p76378q52124M0818R90162J233049
33550b54447J076438Q21798K48759n02932q88542j004296j361764j576853p66778
33541d208617O86399J383179J060675Q01252Q75107K63930j149241j822197q65789
33532b975302N25572R41817O08746L57743J22633l55211m95373J58118Q22556
33523b88701N66146j55791k24128L67553N66483j34547j040792j180409l64162
33514a888348O29091P52212j51318r14131l57009J016235J531585O39582m15506
$$ plain form
33578 965978 -7995 -450778 -423168 -435678 -478199 -553558 -1145067 -2173342 -2495852 -1426429
33568 -1426429 119025 839494 572176 -82321 -680828 -771092 142172 1620569 2241091
33559 2241091 1365896 54297 -577922 -889974 -1666352 -2518476 -2477658 -1487496 -254447
33550 -254447 821991 1643789 1892548 1389616 501074 -503222 -1864986 -3441839 -4208617
33541 -4208617 -3522218 -2139039 -1078364 -277112 597995 861925 -287316 -2109513 -2975302
33532 -2975302 -2449730 -1507913 -899167 -541424 -418791 -774002 -1269375 -1111257 -288701
33523 -288701 277445 121654 -102474 265079 831562 697015 -343777 -1524186 -1888348
33514 -1888348 -1259257 -507045 -658363 -1572494 -1929503 -913268 618317 1257899 842393
33505H42393n26475p8740K13086N51257J192040J408381N02456q41792j338090
33496A924516p60527R4752O20146O93870K85901l24240m17362J91406N71711J556
33486B881729p27128m46219M86664P44865J36428k80705n0934J80403R3235J49316
33476C167654L50359j2719q87564j129996l33219L19611q4493o93402l80474L27927
33466F43684K09805n17612n82045J80809O05917J38085m41850m79945l52675m64566
33456a060393m58623j6190M59506N69280N59240O53451M90946j23797n94565l68158
33446A10697J96375M83236N29980N35145J39247q30213j482628r14836K14074
33437a018923L97334n82460j463840j419535q58186j68048R37751K287220K705134
$$ plain form
33505 842393 315918 237178 450264 1001521 2193561 3601942 4104398 3262606 1924516
33496 1924516 1163989 1258741 1878887 2572757 2858658 2534418 2117056 2308462 2880173 2881729
33486 2881729 2154601 1708382 2195046 2939911 3076339 2795634 2744700 2925103 3018338 3167654
33476 3167654 3518013 3505294 2617730 1487734 1154515 1474126 1389633 696231 315757 643684
33466 643684 853489 335877 -246168 -65359 540558 678643 236793 -243152 -595827 -1060393
33456 -1060393 -1519016 -1535206 -1075700 -506420 52820 706271 1197217 1073420 478855 110697
33446 110697 307072 790308 1320288 1855433 1994680 1164467 -318161 -1232997 -1018923
33437 -1018923 -621589 -1204049 -2667889 -4087424 -4945610 -5113658 -4175907 -1888687 816447
33428H16447J482358m07841j407168j177806o10968m27315m55210j85880M20320
33419a953063P99556M69158j67020j44158N98324P99893k39067j168723m34079
33410a439179R98641P98656r49321j556318P1135J568298Q15466q02928q66763
33401a362313K05773K75790p21487q56061L59111J222218O95220k36085n22254
33392i40088m67896n25235k55742O69676J575214J648095R38547K4772o44806
33383B022537q00595m19263O0610J65071K1605r952r5564n44414r84399q50948
33373a435312l83712j26535J57964Q69778J318420N89392o37941q30369k9983
33364e08298K91015j71842j55975O34170P79890k96016j132092p06121j49009
$$ plain form
33428 816447 2298805 1890964 483796 -694010 -1304978 -1732293 -2187503 -2373383 -1953063
33419 -1953063 -1153507 -684349 -851369 -995527 -397203 402690 163623 -1005100 -1439179
33410 -1439179 -440538 358118 -591203 -2147521 -2076386 -508088 307378 -495550 -1362313
33401 -1362313 -1156540 -880750 -1602237 -2458298 -2099187 -876969 -181749 -417834 -940088
33392 -940088 -1407984 -1933219 -2188961 -1519285 55929 1704024 2642571 2667343 2022537
33383 2022537 1221942 802679 863289 1028360 1049965 1040013 944449 400035 -584364 -1435312
33373 -1435312 -1819024 -1945559 -1787595 -917817 400603 989995 352054 -478315 -508298
33364 -508298 -217283 -389125 -545100 89070 868960 572944 -559148 -1265269 -1414278
33355a414278n56392q92890R6295J323221Q54455q62467j428407O5386J879067
33346i36010K109758R18275j51000j64914L33186J28263j102473k094536j392910
33337b352361N20746J500847N33652r35023j209349n82846k04417M6176Q71454
33328a811121J591486Q32317j052923k047598j101938P34949J942398J959837
33320A047407Q99702p43103j797703j209191L70752R78034j17273j357790j034160
33311b963325N46402J800327J904427J205973K63179n59398q97363o43825k64132
33302C92265k44544l86576j76637L36353N94824L54677o9916l34273l49753n4708
33292F1712N89777J238805J228648K90341r91841j652387j218497o9462R18025
$$ plain form
33355 -1414278 -1970670 -2863560 -2767265 -1444044 -589589 -1452056 -2880463 -2815077 -936010
33346 -936010 1173748 2092023 1941023 1776109 2109295 2237558 1135085 -959451 -2352361
33337 -2352361 -1831615 -330768 202884 -732139 -1941488 -2524334 -2728751 -2682575 -1811121
33328 -1811121 -219635 612682 -440241 -2487839 -3589777 -2854828 -912430 1047407
33320 1047407 1947109 1204006 -593697 -1802888 -1432136 -454102 -571375 -1929165 -2963325
33311 -2963325 -2416923 -616596 1287831 2493804 2756983 2197585 1300222 656397 392265
33302 392265 147721 -238855 -415492 -79139 515685 870362 800446 466173 116420 61712
33292 61712 651489 1890294 3118942 3409283 2417442 765055 -453442 -522904 395121
33283C95121J020914J99970q18561j140360o19153o7892k67279q58914o98862
33274b855016N52038J711268J411965j29465j281700r36403K66464Q66040L27881
33265f6928n15860o31842L307N42814M61181K23748N16179J105280J088198L00579
33255C026656k96928k6475M52133J82094n98738r06853n23603l1389L60108Q44830
33245B481835J004142J08137j381976j962590j183798l19259l38290n19721M860
33236b106660N64865J08824q40519q85694M4019O47291K88909k42708j50010L44699
33226b226984O90550P89195O77811J79303o31084j095386o02867O22846J625648
33217B9032J546400L62156j029967j541408r27654M77L90046L13581L79679O75335
$$ plain form
33283 395121 1416035 1616005 797444 -342916 -962069 -1029961 -1297240 -2156154 -2855016
33274 -2855016 -2302978 -591710 820255 690790 -590910 -1527313 -1260849 -394809 -66928
33265 -66928 -582788 -1214630 -1211323 -668509 -207328 16420 532599 1637879 2726077 3026656
33255 3026656 2729728 2703253 3155386 3337480 2738742 1831889 1308286 1276897 1637005 2481835
33245 2481835 3485977 3594114 2212138 249548 -934250 -1253509 -1591799 -2111520 -2106660
33236 -2106660 -1541795 -1432971 -2273490 -3159184 -3115165 -2467874 -2178965 -2421673 -2571683 -2226984
33226 -2226984 -1536434 -747239 -69428 109875 -521209 -1616595 -2219462 -1596616 29032
33217 29032 1575432 1937588 907621 -633787 -1561441 -1560964 -1170918 -857337 -477658 197677
33207A97677O79374J45927n21872q76809r20977q32518n98187j51947L63177O80533
33197a835622O59235L80524J00095J04755M59706Q54029Q13658J50781p81470
33188I05691j281637q62191J98417R29439N92039m24579r53456m12865N30276
33179g78866Q71806M83053K3089j26624k86922p42039j063485o40117K45594M96453
33169a518058l15274j092876n87098P15423J186991N32733K12885Q74168J033274
33160A042168l90854j738619q23193J456607K122979M55995j158934r84570q9709
33151a08130L3631k35602R814L90142K19259o6042J73590N17785L18684k02056
33141A051075o55781j183932j570052r57991N46608J385241P68474n5033P2737
$$ plain form
33207 197677 877051 1022978 501106 -375703 -1296680 -2129198 -2727385 -2879332 -2516155 -1835622
33197 -1835622 -1176387 -795863 -695768 -591013 -131307 722722 1536380 1687161 905691
33188 905691 -375946 -1238137 -1039720 -110281 481758 57179 -896277 -1309142 -778866
33179 -778866 92940 575993 599082 472458 185536 -556503 -1619988 -2260105 -2014511 -1518058
33169 -1518058 -1833332 -2926208 -3513306 -2797883 -1610892 -1078159 -865274 8894 1042168
33160 1042168 651314 -1087305 -1910498 -453891 1669088 2125083 966149 -18421 -108130
33151 -108130 -74499 -310101 -300287 89855 309114 243072 416662 934447 1253131 1051075
33141 1051075 395294 -788638 -2358690 -3316681 -2770073 -1384832 -616358 -671391 -598654
33132e98654M36268J76646L3809O04558O29250q12801j994280r42831J155869
33123a312166J688736P05825L47400R26758P43591m49237r54726l15728m6036
33114A334417p09955j006981l88343o462l43271l65290J95526J87827m75524k15472
33104a793528J226683J729269J76094j433533j021513M38687P78569j8800l71173
33095b89245J83588P38962P21045K82783l69946q58519n82073K20508L07118o70614
33085c16393j213474j01237J574273J825829L96914j264618j943724j459229k31958
33076b733617Q98032J054133L88475O8111N27172P25748p6398r72929q28470O6550
33066h83193P99201J180733J226484M93190q51872j496025q43036k27901q39836
$$ plain form
33132 -598654 -162386 14260 48069 652627 1281877 469076 -1525204 -2468035 -1312166
33123 -1312166 376570 1082395 1429795 2356553 3100144 2650907 1696181 1380453 1334417
33114 1334417 624462 -382519 -770862 -777324 -1120595 -1485885 -1290359 -1102532 -1578056 -1793528
33104 -1793528 -566845 1162424 1338518 -95015 -1116528 -677841 100728 81928 -289245
33095 -289245 -105657 633305 1354350 1637133 1267187 408668 -173405 47103 354221 -316393
33085 -316393 -1529867 -1631104 -56831 1768998 2165912 901294 -1042430 -2501659 -2733617
33076 -2733617 -1835585 -781452 -392977 -324866 202306 928054 851656 -121273 -949743 -883193
33066 -883193 -83992 1096741 2323225 2816415 1964543 468518 -374518 -602419 -1442255
33057a442255j650246j082711L56366R93666O52544M38192N27756J88370m02092
33048a420410k95474M48218Q54437P24105N95987K95127p09351j666414j162491
33039b336266N04651J381605O13194n14742p24939l72685k65342k12666L49820
33030a577370J161753J391437O96727m05607j017294o61375J58784M42815K625
33021A92495k76045Q7758L04579k73220q37492m03380M52482N63028J62827K77761
33011B50793O73011K39528q25832j104840k72001M29357K41921j92118k78029
33002h38210l21017n41878n79853l52476k29531j29210L66624Q98486O53512r0703
32992a164256j69837N46735R13491M22653j50895l08165m62926o53892k48517
$$ plain form
33057 -1442255 -3092501 -4175212 -3818846 -2825180 -2172636 -1734444 -1206688 -1018318 -1420410
33048 -1420410 -1715884 -1267666 -413229 310876 906863 1201990 492639 -1173775 -2336266
33039 -2336266 -1831615 -450010 163184 -351558 -1076497 -1449182 -1714524 -1927190 -1577370
33030 -1577370 -415617 975820 1672547 1266940 249646 -411729 -252945 189870 192495
33021 192495 -83550 4208 308787 35567 -801925 -1205305 -752823 -189795 -26968 250793
33011 250793 923804 1163332 337500 -767340 -1039341 -609984 -368063 -560181 -838210
33002 -838210 -1159227 -1701105 -2280958 -2633434 -2862965 -2992175 -2625551 -1727065 -1073553 -1164256
32992 -1164256 -1334093 -787358 126133 548786 397891 89726 -373200 -1027092 -1275609
32983a275609N78299P12801K9943k31072L01344L31501p15379j327870k82680
32974a878722J184839J190122j4823p18971l50561J98125K57724n5793n70873
32965g58933j099756j066202j76619Q45010J122448Q16215N47272J95750n99526
32956a74341j202006n78267R51785J814540J228564J29514k82355p5871j50532
32947A661031p88746j265846q62454J27389O65820K31941m98591n19284J83406
32938a065334O49469K39874n90708r03279k83112P99877J370330Q32663k51249
32929G98531o58551j56247O3283o67953j070212J73289J884534J754283n6040
32920B064917r54001J59036J336837Q03251m73719p54157k21935p9322l77715
$$ plain form
32983 -1275609 -697310 15491 45434 -185638 115706 447207 -268172 -1596042 -1878722
32974 -1878722 -693883 496239 481416 -237555 -588116 -389991 -132267 -188060 -758933
32965 -758933 -1858689 -2924891 -3101510 -2256500 -1134052 -317837 229435 425185 -174341
32956 -174341 -1376347 -1954614 -1002829 811711 2040275 2169789 1887434 1811563 1661031
32947 1661031 872285 -393561 -1256015 -1128626 -462806 -230865 -729456 -1248740 -1065334
32938 -1065334 -415865 -175991 -766699 -1669978 -1953090 -1153213 217117 1049780 798531
32929 798531 139980 -16267 47016 -620937 -1691149 -1517860 366674 2120957 2064917
32920 2064917 1110916 1269952 2606789 3410040 2936321 2182164 1960229 1880907 1503192
32911A503192m52940m42556p36545p91678m0777P81582P03610J82547K43337O77716
32901A627488O44201L65895N22375N24014o78275k305537k284319k87580J546510
32892c25228J448402Q2829q63265r01804p12085p29087o38001k799J065552J823927
32882B48441J533671L98059m40774k69273K42066O7536o47189r40866n71107j99613
32872e79049k12195l45084m32159n63961m98438J26196R10836R80551L23505p8953
32862c68751K60461O01647J78179n97343p26583j0827P09077N93969k27248p81950
32852c69369l19973P88510J432849J076403K91783j84104l63122n61015o21278
32843A170684k61022J91962J49572l29918o19371m00454L7547K61448Q9500k83205
$$ plain form
32911 1503192 1050252 607696 -128849 -920527 -961304 -179722 523888 706435 949772 1627488
32901 1627488 2271689 2637584 3159959 3683973 3005698 700161 -1584158 -1871738 -325228
32892 -325228 1123174 1206003 342738 -559066 -1271151 -2000238 -2638239 -2641038 -1575486 248441
32882 248441 1782112 2180171 1739397 1470124 1712190 1779726 1132537 191671 -379436 -579049
32872 -579049 -791244 -1136328 -1568487 -2132448 -2630886 -2504690 -1593854 -613303 -289798 -368751
32862 -368751 -108290 493357 671536 74193 -652390 -663217 45860 639829 412581 -369369
32852 -369369 -689342 99168 1532017 2608420 2900203 2716099 2352977 1791962 1170684
32843 1170684 909662 1101624 1251196 921278 301907 -98547 -61000 200448 289948 6743
32833F743l24887K80541R52715P52225j52931n14451K7201K13367o96376j348076
32823h03929k96702J450672J735665M92975l16266J32153M75540l56269j453012
32814A060827j521885p81995k83786k50781n1461O26343J281694J187465K27501
32805A493922q15530r85689l30565J32215m2141l5489O73678J074718J99208r57875
32795D06452p85665K58003L04521p72429j046753K76879J492814J062997j35684
32786A061135l99135L25672Q23683N66212R2219o7110O4751J98852J11207j13718
32776B663768p0155L47585M78267k42129j152787j062475M0398J004950J127356
32767C134778O37001k10553j197456j503303n55024N96444M53675m86492m62352
$$ plain form
32833 6743 -318144 -37603 915112 1667337 1514406 999955 1027156 1240523 544147 -803929
32823 -803929 -1100631 350041 2085706 2578681 2262415 2394568 2870108 2513839 1060827
32814 1060827 -461058 -1243053 -1526839 -1777620 -1829081 -1202738 78956 1266421 1493922
32805 1493922 678392 -307297 -637862 -505647 -547788 -583277 90401 1165119 1364327 406452
32795 406452 -379213 -121210 183311 -589118 -1635871 -1358992 133822 1196819 1061135
32786 1061135 662000 987672 1811355 2377567 2469786 2402676 2467427 2666279 2777486 2663768
32776 2663768 2593613 2941198 3419465 3177336 2024549 962074 1002472 2007422 3134778
32767 3134778 3771779 3561226 2363770 860467 305443 901887 1355562 869070 406718
32758D06718M28825K87053j077668j485505j79588N95209o09194j773012o99672
32749d106834J350236J873156J076392P98933R39430K1240j537808j776286n25212
32740a886753L79762K21117J52196O08227M59657o46253j286207m78174Q26202
32731a650226J325189J035697O09277J99709k35087m54183l60073j68886J30409
32722D31826O90330J076357N97640m87275j096142q21094l18964r7369J6894O1066
32712E3269k42361n84349j67230Q89372J344521N52322n93775r83671o87938m41288
32702h61128m50468l30990K15512J053830J628582J295632J30704p51220m28410
32693A502044M64498N68144j84885o21606l59660k71063o18365l91848P08733
$$ plain form
32758 406718 835543 1122596 44928 -1440577 -1620165 -1024956 -1634150 -3407162 -4106834
32749 -4106834 -2756598 -883442 192950 991883 1931313 1952553 414745 -1361541 -1886753
32740 -1886753 -1506991 -1285874 -1133678 -525451 -65794 -712047 -1998254 -2476428 -1650226
32731 -1650226 -325037 710660 1319937 1519646 1284559 830376 470303 301417 431826
32722 431826 1122156 2198513 2796153 2308878 1212736 391642 72678 -24691 -7797 53269
32712 53269 -189092 -773441 -940671 -51299 1293222 1845544 1251769 268098 -419840 -861128
32702 -861128 -1311596 -1642586 -1427074 -373244 1255338 2550970 2681674 1930454 1502044
32693 1502044 1966542 2534686 2349801 1728195 1368535 1097472 479107 87259 795992
32684G95992J180483j40763j984085k159859n19651J019275J104821K90275k60016
32675f73528k43384n3095O3136J79666L67728N42552N49699K83299k16795p25214
32665G4064r13635n57801K01973Q11069P67523K41934r0243K2388J24071n3543
32655F27800j01114J49954K9354p66399j150765j21656J290697J158136m26830
32646F89177j301669l60660R44582Q65824l15750j078944o82456M31965J402119
32637E94188J456676M51770o39547o41631J24444J85171p49855j275260o52408
32628a146452L5262Q907K34604J320330J746019J73241j867947j930859l82947
32619a809842K81672o20037j258913n16063N98257J162712J602469J942909J070786
$$ plain form
32684 795992 1976475 1835712 -148373 -2308232 -2827883 -1808608 -703787 -413512 -673528
32675 -673528 -916912 -970007 -906871 -727205 -359477 183075 732774 1016073 799278 74064
32665 74064 -839571 -1397372 -1195399 -384330 383193 625127 534884 557272 681343 627800
32655 627800 526686 676640 705994 -60405 -1211170 -1332826 -42129 1116007 689177
32646 689177 -612492 -973152 -28570 837254 521504 -557440 -1239896 -807931 594188
32637 594188 2050864 2502634 1863087 1221456 1345900 1531071 781216 -494044 -1146452
32628 -1146452 -1111190 -1102283 -867679 452651 2198670 2371911 503964 -1426895 -1809842
32619 -1809842 -1528170 -2148207 -3407120 -3923183 -3324926 -2162214 -559745 1383164 2453950
32610B453950j002841k112355q52064R89472Q59984p29721j034532O38971J834406
32601A045270O95266j215239j256139M07888J214297J92592n85706O18840K203303
32592C320372J477235j038454k093496n87883P84291J8084o99264J471414M732966
32583G385265M399040l45057m874034n196461k636664q41836o24526j93838J067446
32574a860665J833611J401297O58985L07491n2021o47281q53244l68706P0293
32565D89760k00259p68647q28445k66523L80580N89900J85072n16338p20398P0302
32555a584996J108391R79826m90286j687755j180140M25027J378357J029719K22233
32546B00376k48805m55601n44316k12264N42959R63007M88381l20584m93176M0099
$$ plain form
32610 2453950 1451109 -661246 -1513310 -523838 336146 -393575 -1428107 -789136 1045270
32601 1045270 1740536 525297 -730842 -322954 891343 1083935 498229 1117069 3320372
32592 3320372 4797607 3759153 1665657 1077774 1862065 1880149 1180885 2652299 7385265
32583 7385265 11784305 11439248 6565214 1368753 -1267911 -2109747 -2734273 -2928111 -1860665
32574 -1860665 -27054 1374243 2033228 2340719 2288698 1641417 788173 419467 489760
32565 489760 289501 -479146 -1307591 -1574114 -1193534 -603634 -418562 -934900 -1655298 -1584996
32555 -1584996 -476605 503221 12935 -1674820 -2854960 -2429933 -1051576 -21857 200376
32546 200376 -48429 -504030 -1048346 -1260610 -717651 245356 733737 413153 -80023 -39924
32536c9924N19856N55770N10387O20303M32811m95501j708760k103794j088701
32527b797553O50189J622400R44557o16384j295738l27908J048689J128029m6049
32518C10232q80757n52737M2175q060k20355J47512N93755K44442m55413l62511
32508a141717L72153M63483l19211o84012M6943Q16681O41818K43946P23964J555321
32498B719369J282014k40632j617042j803645j104230k58062M08941P23272N02963
32489F12948M3296L5780N79410Q52246K14750q10641j138150m37731N28885P61619
32479A242412p298j062623j323067l99768R15690J454652R23870Q387o58855j004929
32469H8471r57039k30822Q79164J257840K88767j015537j024101N05579K105986
$$ plain form
32536 -39924 479932 1035702 1546089 2166392 2599203 2103702 394942 -1708852 -2797553
32527 -2797553 -2147364 -524964 419593 -196791 -1492529 -1820437 -771748 356281 310232
32518 310232 -570525 -1123262 -1081087 -1089147 -1309502 -1161990 -568235 -323793 -779206 -1141717
32508 -1141717 -769564 -306081 -625292 -1309304 -1262361 -445680 196138 440084 1164048 2719369
32498 2719369 4001383 3760751 2143709 340064 -764166 -1022228 -613287 109985 612948
32489 612948 656244 692024 1271434 2123680 2338430 1527789 389639 -48092 480793 1242412
32479 1242412 1235114 172491 -1150576 -1550344 -634654 819998 1743868 1752255 1093400 88471
32469 88471 -868568 -1099390 -220226 1037614 1326381 310844 -713257 -207678 1898308
32460A898308K263770Q85461q57729j685620j253482m19242l49998j084218j389676
32451a992426n20037N14806L50436n86538o71192L54685R86439M10627k58954
32442a412154O1588P18196O80931L46931N64070Q29953J16996j104940j396465
32433e94894o39242j09254k80534k32498N13373J174155J181069R95005Q88037
32424B895217L68410m71125n11362N14828J087091O3691j428216j677739r28743
32415h7948o36134j000692j020350n03415k04623j55768L52429J113970J081749
32406a060782K67316j69211j8473l64287j287734j206840M68752J870021J311307
32397a89931j36683m42979K67320L95242k17259l04803K49105J73210o64657p00318
$$ plain form
32460 1898308 4162078 5047539 4189810 2504190 1250708 831466 481468 -602750 -1992426
32451 -1992426 -2512463 -1997657 -1647221 -2233759 -2904951 -2550266 -1563827 -1153200 -1412154
32442 -1412154 -1350566 -632370 48561 395492 959562 1789515 1906511 801571 -594894
32433 -594894 -1234136 -1343390 -1623924 -1856422 -1343049 -168894 1012175 2007180 2895217
32424 2895217 3263627 2792502 2281140 2795968 3883059 3946750 2518534 840795 -87948
32415 -87948 -724082 -1724774 -2745124 -3248539 -3453162 -3608930 -3256501 -2142531 -1060782
32406 -1060782 -793466 -962677 -981150 -1345437 -2633171 -3840011 -3371259 -1501238 -189931
32397 -189931 -326614 -769593 -502273 -107031 -324290 -629093 -379988 -206778 -871435 -1571753
32387a571753O39884J630209P82335q09736j076067R3305R99492O46888l13061
32378A021496r41950j044208p49445j41467L66768R2869r98030j889038j481319
32369e764324J52815J709456J852934N17974r18577r28404N48739J977650J906592
32360A054855M67812j087521j902715j944348j260091K03980J865969K479521
32352a22538J447937k69499j117437n93090M86072J136170J108460O99920K24038
32343C000033j08227j50318j882n1726m91983q81414o40353l2200m2578q93017
32333b93665j325232k42705J342055J323511m07725j415762o3392J982422J998985
32324B898492k4410j677534j705480j236891j298808j173637p1620J205661J459318
$$ plain form
32387 -1571753 -931869 698340 1480675 670939 -405128 -311823 687669 1334557 1021496
32378 1021496 79546 -964662 -1714107 -1855574 -1488806 -1395937 -2393967 -4283005 -5764324
32369 -5764324 -5611509 -3902053 -2049119 -1531145 -2449722 -3378126 -2829387 -851737 1054855
32360 1054855 1522667 435146 -1467569 -3411917 -4672008 -4468028 -2602059 -122538
32352 -122538 1325399 1055900 -61537 -654627 -168555 967615 2076075 2775995 3000033
32343 3000033 2891806 2741488 2739606 2687880 2195897 1314483 674130 641930 599352 -293665
32333 -293665 -1618897 -1861602 -519547 803964 396239 -1019523 -1082915 899507 2898492
32324 2898492 2874082 1196548 -508932 -1745823 -3044631 -4218268 -4289888 -3084227 -1624909
32315a624909Q47940L50751L20355N10923P35178O23688l60289j715445j742216
32306b054024J76170K078225J715402l71272j696935j243228k54723J27408J54346
32297a368631K32450J27268j30053L9316O17368P46744Q8138o29627p61000m44116
32287a482143M6579N64791O03622k18618j086801q05351K07201L77112l82245
32278b175853m50087O03395J130903L71025k2496J082820K022395J013114p60677
32269B814539j121027m49264n89326j300699p74684Q00453J221008k6020q47677
32260b72697J723J019248N48813p34378j188413n67188J94894N02252L79890k221
32250a18077l39905l28243j82820l74813p18120n91973j20622m3178l04095l733
$$ plain form
32315 -1624909 -776969 -426218 -105863 405060 1140238 1763926 1403637 -311808 -2054024
32306 -2054024 -1877854 200371 1915773 1544501 -152434 -1395662 -1650385 -1522977 -1368631
32297 -1368631 -1136181 -1008913 -1138966 -1099650 -482282 264462 352600 -277027 -1038027 -1482143
32287 -1482143 -1435564 -870773 -267151 -485769 -1572570 -2377921 -2170720 -1793608 -2175853
32278 -2175853 -2625940 -2022545 -891642 -520617 -543113 539707 2562102 3575216 2814539
32269 2814539 1693512 1244248 654922 -645777 -1420461 -620008 601000 574980 -272697
32260 -272697 -270974 748274 1297087 562709 -625704 -1192892 -997998 -495746 -115856 -118077
32250 -118077 -457982 -786225 -969045 -1343858 -2061978 -2653951 -2774573 -2817751 -3121846 -3125579
32240c125579J013335J765747J631137J027123L49823m73052j106573q71095n84
32231B10282N32824O26962Q95023Q58438n73151k473549k325543n671J363443
32222h90942N3350j491988o51008J173258J174223j63936l76822M61446K51528
32213d60891q45809m69121J558979K531922J196169m56562p18215n16963r57842
32204H61667j215409m90715K11223k7780l05694K75633Q48596N54462L49542J127979
32194B189504J619466L55363j489394j574152M8012J130570N83039n16676j088388
32185A257344j212845j061297m84168J07225L0011l11683J22903J050612J004291
32176E02393k13264r12222n3754J111821R30465l09319j021283n27483M18754
$$ plain form
32240 -3125579 -2112244 -346497 1284640 2311763 2661586 2188534 1081961 210866 210282
32231 210282 743106 1370068 2265091 3123529 2550378 76829 -2248714 -2254385 -890942
32222 -890942 -837592 -2329580 -2980588 -1807330 -633107 -797043 -1173865 -712419 -460891
32213 -460891 -1306700 -1775821 -216842 2315080 3511249 3054687 2336472 1819509 861667
32204 861667 -353742 -844457 -633234 -661014 -966708 -691075 157521 711983 1061525 2189504
32194 2189504 3808970 4164333 2674939 1100787 1148799 2279369 2862408 2345732 1257344
32185 1257344 44499 -1016798 -1500966 -1393741 -1363730 -1675413 -1552510 -501898 502393
32176 502393 289129 -623093 -676847 434974 1365439 1056120 34837 -492646 -73892
32167g3892Q79348O98707M25342O60880J244375J110550l76162k039041j987062
32158E43045l11966P08546k46371j624220j337059K31152J067642N24627k37960
32149f82564l87830k89829k63690l5281L19676K39094j35822J51148J291287K104101
32139B310290J640992M86966k43623m58675q29569j475653j735451j141945r0405
32130a537073N26126K13444n27592o27182K49890J117583R59614K50937K31038
32121H56785Q80094R39631P2641n05237r0003L21761j77218q06181n06300K23046
32111A209019L04549q1819j73208k66763r62662j465952o10992Q14258Q77781
32102c55789m12030r93747l1385Q47916L05948p02193p19726J00879Q49500J348558
$$ plain form
32167 -73892 805456 1504163 1929505 2590385 3834760 4945310 4569148 2530107 543045
32158 543045 231079 939625 693254 -930966 -2268025 -2036873 -969231 -444604 -682564
32149 -682564 -1070394 -1360223 -1623913 -1659194 -1339518 -1100424 -1236246 -1085098 206189 2310290
32139 2310290 3951282 4438248 4194625 3735950 2906381 1430728 -304723 -1446668 -1537073
32130 -1537073 -1010947 -797503 -1325095 -1952277 -1702387 -584804 374810 625747 856785
32121 856785 1736879 2676510 2749151 2243914 2153911 2475672 2298454 1492273 985973 1209019
32111 1209019 1513568 1431749 1258541 991778 29116 -1436836 -2047828 -1233570 -355789
32102 -355789 -767819 -1761566 -1792951 -945035 -639087 -1341280 -2061006 -1960127 -1110627 237931
32092B37931J549103P96057q94752j972299j256192K27144P83811N20609O23161
32083F14573R44737K93091j143846j627658l91950J236027J656959P16544p21338
32074A577139j757648j687037m02366R77362R44440m11503j252450m26322R42784
32065a495601J126752J85515m40181k09269k8135m87921q12121j78498P87189
32056a552270Q46366J20913L5722J073363J801915R70387m47508o85099p253k44652
32046A911884j583985j993565n29249R38557O76791j39669M20793J629090J301673
32037B632320m62244j451478r92729p02478j282685j229743L11687J707581J249113
32028b20656l01370j028176m59505M45004Q36187L58176r92271k306474k086678
$$ plain form
32092 237931 1787034 2583091 1688339 -283960 -1540152 -1313008 -529197 -8588 614573
32083 614573 1559310 1852401 708555 -919103 -1311053 -75026 1581933 2298477 1577139
32074 1577139 -180509 -1867546 -2269912 -1292550 -348110 -759613 -2012063 -2438385 -1495601
32065 -1495601 -368849 -183334 -623515 -832784 -860919 -1348840 -2160961 -2339459 -1552270
32056 -1552270 -705904 -584991 -549269 524094 2326009 3296396 2848888 2163789 2156536 1911884
32046 1911884 327899 -1665666 -2194915 -1256358 -579567 -719236 -298443 1330647 2632320
32037 2632320 2170076 718598 -274131 -976609 -2259294 -3489037 -3177350 -1469769 -220656
32028 -220656 -522026 -1550202 -2009707 -1564703 -728516 -370340 -1362611 -3669085 -5755763
32019e755763k13763J444869J486082Q48745R40271J184073K57176j200843j296558
32010b305711P8918J041866O07519j37640j06153K77836K54872m036n3205o166
32000c51900k4519J53904N98194Q60364P21147M97361K50530m04554j251494j246739
31990a97706o3691J028465P47653m03615r09033l33326L97206N51781L46017R6721
31980A260472l45375r34154r81265j3500J281220J608641N97259o62080q33707
31971I77511J13709R00953N02547o35381j225341p45178P9548L91038K16773Q4364
31961F60543J06151k2189l55044o24731p89307j040754j142755m37429J028355
31952b617160J933269J050450r46126j916092p62264J203872J891216Q62841n16082
$$ plain form
32019 -5755763 -5969526 -4524657 -3038575 -2189830 -1249559 -65486 191690 -1009153 -2305711
32010 -2305711 -2226793 -1184927 -577408 -715048 -821201 -543365 -288493 -292529 -345734 -351900
32000 -351900 -376419 -222515 375679 1236043 1957190 2454551 2705081 2300527 1049033 -197706
31990 -197706 -261397 767068 1514721 1111106 202073 -131253 265953 817734 1163751 1260472
31980 1260472 915097 -19057 -1000322 -1013822 267398 1876039 2473298 1811218 977511
31971 977511 1091220 1992173 2494720 1859339 633998 -111180 -31632 359406 576179 660543
31961 660543 766694 744505 389461 -235270 -1024577 -2065331 -3208086 -3645515 -2617160
31952 -2617160 -683891 366559 -579567 -2495659 -3257923 -2054051 -162835 700006 183924
31943A83924r65304m94300J58289M33099J42688n28534r43957n05287N11356J120072
31933h87954Q33680J41851l99070p96584r89734m82173O79598J327936N58112
31924a4338p96455j128574k26530N98837M69507p4583j82844K35852Q51299J397933
31914A130104J424002M42867j093330j754626q15041O11398R31777J23761n02415
31905D98497l09586J4994r5917j59899K54634M51226l52129j417378j173748M66668
31895a822638J705671J237833n6749o12916m08639m47126o77679j00674J126217
31886e6700J450577L05204q49976p38412j21839k64498p56597m08210N28971P70142
31876a41338K15655L2780N92530R60809O24711K11319J42619k0072m40068n54332
$$ plain form
31943 183924 -781380 -1275680 -1117391 -684292 -541604 -1070138 -2014095 -2519382 -2008026 -887954
31933 -887954 -54274 87577 -311493 -1108077 -2097811 -2579984 -1900386 -572450 -14338
31924 -14338 -810793 -1939367 -2165897 -1567060 -1097553 -1172136 -1354980 -1119128 -267829 1130104
31914 1130104 2554106 2996973 1903643 149017 -666024 -54626 877151 1000912 498497
31905 498497 188911 203905 107988 -51911 202723 653949 301820 -1115558 -2289306 -1822638
31895 -1822638 -116967 1120866 1064117 451201 42562 -404564 -1082243 -1182917 -56700
31886 -56700 1393877 1699081 849105 110693 -11146 -275644 -1032241 -1440451 -911480 -141338
31876 -141338 74317 107097 699627 1660436 2285147 2496466 2639085 2619013 2178945 1624613
31866A624613k96461m48151j113330j185883k00429O16264K73336k48529L47309
31857f31261J296744Q67198p15252j383842k93474J047596J136174L70948j47155
31848A547676l48255o68121p77829r5827R35605J281768Q59614N89668Q57020
31839D181319R09164J05322j034749j524735j103241k37429O07586J145190J075426
31830D123853L76240l84131o35859n87962q07129j154656r15484N909Q59524J158814
31820B039119J136109Q73859K5874j123559j433959n45051K57258j69745j059245
31811F60r89316j47450J33499l86865o82877l38010j5395k9623M8375K35477O2748
31800b108777j72354L70060J318590J208573j78097j272004j153904p90816r65775
$$ plain form
31866 1624613 1328152 880001 -233329 -1419212 -1619641 -1003377 -730041 -978570 -631261
31857 -631261 665483 1532681 817429 -566413 -859887 187709 1323883 1694831 1547676
31848 1547676 1199421 531300 -246529 -342356 593249 1875017 2734631 3324299 4181319
31839 4181319 5090483 5195805 4161056 2636321 1533080 1295651 1903237 3048427 4123853
31830 4123853 4500093 4115962 3480103 2892141 2085012 930356 14872 20781 880305 2039119
31820 2039119 3175228 4049087 4074961 2951402 1517443 972392 1229650 1059905 660
31811 660 -988656 -1136106 -1002607 -1389472 -2072349 -2410359 -2425754 -2455377 -2407002 -2171525 -2108777
31800 -2108777 -2281131 -1911071 -592481 616092 437995 -834009 -1987913 -2778729 -3744504
31791c744504p84563M75453J656566J429006L88206j72849l90316r74246j299465
31782c416712l55356J112210J440234O21413J10194L20950K44825m75991r27192
31773a325425n50745J69920P67652J110437P63285l98498j124570j71020J374830
31764F15866J272620l13252r02139K08081O99338p87657k186221j386737L01924
31755b478177N07579k68490O8701J238225J050930n79439j217230J29189J391849
31746a56863P49432p22051j012315m6404Q61519J129823R89667L71038p70328
31737A393518j566604j136171j13485R5803m46613j57502J474498K592457J310282
31728C446183j421640k626241r66159J566245K170534O28364p84443m64610O30692
$$ plain form
31791 -3744504 -4529067 -4053614 -2397048 -968042 -579836 -752685 -1143001 -2117247 -3416712
31782 -3416712 -3772068 -2659858 -1219624 -598211 -488017 -167067 77758 -398233 -1325425
31773 -1325425 -1876170 -1706250 -938598 171839 935124 536626 -587944 -758964 615866
31764 615866 1888486 1575234 673095 881176 1580514 792857 -1393364 -2780101 -2478177
31755 -2478177 -1970598 -2239088 -2170387 -932162 118768 -460671 -1677901 -1548712 -156863
31746 -156863 592569 -129482 -1141797 -1188201 -326682 803141 1792808 2163846 1393518
31737 1393518 -173086 -1309257 -1422742 -1326939 -1773552 -1931054 -456556 2135901 3446183
31728 3446183 2024543 -601698 -1567857 -1612 2168922 2797286 2012843 1548233 2178925
31719B178925O81624l79722r89026l47773N03081L39339n08173q81109o57191
31710f0025p72165j453282j614527n25142Q54800J115398M19933J83230R00151
31701i51629J493226J076675K37208q0274m0663l51794q46949p17937N9035N54332
31691D31230K28081l64095m26187R3712N85848M65876k97465j041139r03918J61029
31681a067028J090571R38644J38350j36565L47946O91885L02784l55306n99167
31672A352114l44302R9071L94766K36227l53055p92498o64158m45755o76203p72245
31662a966038M1857R33401L60026j164086j299508N05691J831200R06664o81718
31653e32511o51436M47482N99487j80273k96812L20243K62480n20826n85903J98941
$$ plain form
31719 2178925 2860549 2480827 1491801 1144028 1647109 1986448 1478275 597166 -60025
31710 -60025 -832190 -2285472 -3899999 -4425141 -3570341 -2454943 -2035010 -1851780 -951629
31701 -951629 541597 1618272 1855480 1775206 1734543 1382749 535800 -182137 -123102 431230
31691 431230 659311 295216 -130971 -37259 548589 1014465 717000 -324139 -1228057 -1067028
31681 -1067028 23543 962187 1100537 963972 1311918 2003803 2306587 1951281 1352114
31672 1352114 1007812 1106883 1501649 1737876 1384821 592323 -71835 -517590 -1193793 -1966038
31662 -1966038 -1924181 -990780 -630754 -1794840 -3094348 -2588657 -757457 149207 -532511
31653 -532511 -1183947 -736465 -136978 -317251 -614063 -293820 -31340 -552166 -1138069 -939128
31643i39128K76169o91873r89924K14877J345834R94226N3180j07503J21653k37177
31633D0334p57574n14314P8652M2502l49820j72098L81829M51275K18848M89806
31623i0560R17443M19688p15969r34424J36648J004760N75201m02505q17596p59073
31613f66387p26484m76205K54879P66119L12508n58155o94683o705N76264N53434
31603f65415K72860N0048j55312j94867J95984O78514N48860j29564m97821k39348
31593a36061k6265k54808l12276K65419Q21708O45023K34705M05720P19502J51464
31583B514131r43652j044374J61913J059527L87932r43667j238568l53784M11438
31574A0896K95709j31715q8656L64137N78053J56234o20623j023914n89356K87574
$$ plain form
31643 -939128 -662959 -1354832 -2344756 -2129879 -784045 210181 263361 155858 277511 40334
31633 40334 -717240 -1231554 -1152902 -1110400 -1460220 -1632318 -1250489 -799214 -580366 -90560
31623 -90560 826883 1246571 530602 -403822 -267174 737586 1312787 910282 92686 -666387
31613 -666387 -1392871 -1869076 -1614197 -848078 -535570 -1093725 -1788408 -1795113 -1218849 -665415
31603 -665415 -392555 -342507 -497819 -692686 -496702 181812 730672 601108 103287 -136061
31593 -136061 -162326 -417134 -729410 -463991 357717 1002740 1237445 1643165 2362667 2514131
31583 2514131 1570479 526105 688018 1747545 2135477 1191810 -46758 -400542 10896
31574 10896 306605 174890 86234 450371 1028424 1184658 564035 -459879 -1049235 -761661
31564g61661P11324L95986M9092L83293J127555J378918O54268o73637j685736
31555A579402j547312l38602O62567L09587o53920l28870J371111J996672k5185
31546C025450k679655k898995q28888O76838L64015j48909L69624Q13947R6749
31537a209824p08396j75349J040865J323052O64045L85968Q14552Q81350Q8r97648
31527B018703j081880l19383L63389K64616m11551q04022m01979K42943K55711
31518A26547j62933O8792J090097J547441N26341r63047j391026p97049l42515
31509b97352l84932k98061P6724J31340k67026l60077L27987J174065J194215
31500A296883J64526j196755j877787j372790r5602J013578J390902J178188P11487
$$ plain form
31564 -761661 -50337 345649 394741 778034 1905589 3284507 3938775 3265138 1579402
31555 1579402 32090 -306512 356055 665642 11722 -317148 1053963 3050635 3025450
31546 3025450 345795 -2553200 -3382088 -2705250 -2341235 -2490144 -2120520 -1306573 -1209824
31537 -1209824 -1918220 -2093569 -1052704 270348 934393 1320361 2134913 3016263 3016351 2018703
31527 2018703 936823 617440 980829 1245445 833894 29872 -372107 -129164 126547
31518 126547 -36386 32406 1122503 2669944 3196285 2233238 842212 45163 -297352
31509 -297352 -682284 -980345 -903621 -772281 -1039307 -1399384 -1071397 102668 1296883
31500 1296883 1461409 264654 -1613133 -2985923 -3081525 -2067947 -677045 501143 1212630
31491A212630K27894J19616O52072J188050O82784o36192j260107o92415l23188
31482A171144r72473j155081M91527K422169K120974k1086j308840q54287l84936
31473A509111q26613r01428R0438P34870P5289n43160J40660R63342K99545j101726
31463D40328j323888l36624K40656j22167l51661J32804N57772K51912l70842
31454h81710o16244l80365J168J36932j79094n99927l79685N46442J153200P62484
31444d36799K43891O67909J325466O05534j290088k169575q33378J159360J531612
31435H03932J39614j177284j075699p5480N06925K48560j35795J1797L68301K15115
31425a70014l50514m69512J45425P21375O42418L51442M09232M32826j27395p94474
$$ plain form
31491 1212630 1440524 1560140 2212212 3400262 4083046 3446854 2186747 1494332 1171144
31482 1171144 198671 -956410 -464883 1957286 4078260 4057174 2748334 1894047 1509111
31473 1509111 682498 -218930 -128492 606378 681667 138507 279167 1242509 1542054 440328
31463 440328 -883560 -1220184 -979528 -1101695 -1453356 -1320552 -762780 -510868 -881710
31454 -881710 -1497954 -1878319 -1877151 -1740219 -1919313 -2519240 -2898925 -2352483 -1199283 -436799
31444 -436799 -192908 475001 1800467 2406001 1115913 -1053662 -1887040 -727680 803932
31435 803932 943546 -233738 -1309437 -1384917 -877992 -629432 -765227 -753430 -385129 -170014
31425 -170014 -520528 -990040 -844615 -123240 519178 870620 1279852 1712678 1585283 790809
31415G90809p45002k28332j20926l86722k76708J21161k4987n99341m69511N48401
31405a391158J170520P06379J73756M46932O77368j31511j080500n86572R21302
31396I06516J307018k10931j883597j846051m83947M44123K38043k14979m3762
31387a787567M87920O96150N77134O11629P96851N88187j15652n99677l44764
31378I10211J05267r9777q34151j216151r31321m70818n2354O75332J525339J422043
31368A033620o3140j571248j373536L75944J755959J407442p8808j219211j313466
31359a046444o97674J08415Q94358J493522J521909P00936n92659j399748j106257
31350a23642k21490J71781j93497m46288P5396P30384M63588n69617j114502n33482
$$ plain form
31415 790809 45807 -182525 -303451 -690173 -966881 -845720 -870707 -1470048 -1939559 -1391158
31405 -1391158 -220638 485741 659497 1106429 1783797 1652286 571786 -14786 906516
31396 906516 2213534 2002603 119006 -1727045 -2210992 -1766869 -1528826 -1743805 -1787567
31387 -1787567 -1299647 -603497 -26363 585266 1382117 1970304 1854652 1254975 910211
31378 910211 1015478 915701 81550 -1134601 -2065922 -2536740 -2589094 -1913762 -388423 1033620
31368 1033620 970480 -600768 -1974304 -1598360 157599 1565041 1486233 267022 -1046444
31359 -1046444 -1744118 -1635703 -741345 752177 2274086 2975022 2382363 982615 -123642
31350 -123642 -345132 -173351 -366848 -813136 -737740 -7356 456232 -113385 -1227887 -1761369
31340a761369M20769P77173N11545Q0609m98908j317909j740127r01228Q97248
31331c532197K155569J871108O19189m33334r27078j129121r68260j97390P24434
31322a817080R21630L51980j20188o4110K1864j60122j11033L59763M46881l34711
31312e05126r92851l75563R32300J317621M38162n01546o66929m25742j45153
31303i24827M43441J225195J302373L28971p14126q27348l18932j14340l97458
31294B949o61716o05481l20578K2348J91747J4326j94460J00068O67140O14798
31284a68859j15014l83497L38082R23859L87450l56724M1585R72594P08774p33620
31274A614630j472351o31196M52885M46445j12194n6930M93337N88153R8580j75218
$$ plain form
31340 -1761369 -1340600 -563427 -51882 28727 -470181 -1788090 -3528217 -4429445 -3532197
31331 -3532197 -1376628 494480 1113669 680335 -246743 -1375864 -2344124 -2541514 -1817080
31322 -1817080 -895450 -543470 -663658 -727768 -705904 -866026 -977059 -617296 -170415 -505126
31312 -505126 -1497977 -1873540 -941240 376381 814543 312997 -353932 -779674 -924827
31303 -924827 -481386 743809 2046182 2375153 1661027 833679 514747 400407 2949
31294 2949 -658767 -1264248 -1584826 -1562478 -1370731 -1356405 -1550865 -1450797 -783657 -168859
31284 -168859 -283873 -667370 -329288 594571 982021 625297 666882 1639476 2348250 1614630
31274 1614630 142279 -488917 -36032 410413 298219 241289 734626 1322779 1421359 1246141
31264A246141K25916Q70913J090798O37430k53801j070054j337648j010406n18892
31255a19603l05552l97991m98961l49512M4448M07942M29038J33055p0931J05404
31245f22663M44131N63638M05617Q4012m27443j018459j188899o55643N7312K82082
31235b076315K03471M46397R01554Q75183L32121O548J68808K27636k08110p27126
31225A50167q39094n29953R2578Q79901J213600M75286p81659j177575m19238
31216i35987K29616q2514n32248j17635O96947Q85645N19398L48775L89316J11101
31206A512414m13745o69018o67741p62302q06712m76515q6363j07864k23735J11616
31196b589965N47054M15189P9642L85949J011311Q47465j5750l01684K53141M14853
$$ plain form
31264 1246141 1472057 2342970 3433768 4071198 3817397 2747343 1409695 399289 -119603
31255 -119603 -425155 -823146 -1322107 -1671619 -1627171 -1219229 -790191 -657136 -728067 -622663
31245 -622663 -178532 385106 790723 874735 447292 -571167 -1760066 -2415709 -2358397 -2076315
31235 -2076315 -1872844 -1426447 -524893 350290 682411 688959 857767 1085403 877293 150167
31225 150167 -688927 -1218880 -1126302 -246401 967199 1442485 660826 -516749 -935987
31216 -935987 -706371 -788885 -1321133 -1438768 -741821 143824 663222 1011997 1401313 1512414
31206 1512414 1098669 429651 -238090 -1000392 -1807104 -2283619 -2369982 -2477846 -2701581 -2589965
31196 -2589965 -2042911 -1627722 -1548080 -1162131 -150820 696645 680895 379211 632352 1047205
31186A047205k95041n96817L15680J118278L69191j014873j047924K31773Q34220
31177I61692j10150j143334q15178K54442N58176m3013l75966J49236P69168N67521
31167G72594l20004j005345r10036k21920M36854N28913m197o07719n63851J52630
31157a742081P10937N02598Q9281M04771J163476J039227l02363j370119p70719
$$ plain form
31186 1047205 752164 155347 471027 1589305 1958496 943623 -104301 127472 961692
31177 961692 851542 -291792 -1106970 -852528 -294352 -337365 -713331 -564095 205073 772594
31167 772594 452590 -552755 -1462791 -1684711 -1247857 -718944 -723141 -1330860 -1894711 -1742081
31157 -1742081 -1031144 -528546 -439265 -34494 1128982 2168209 1865846 495727 -274992
$$ [...]
##END NTUPLES=NMR SPECTRUM
##END=
