##TITLE=31Pdec_LY-TMF-4.40.3
 D2O, 24 sc
 27.2.2020
##JCAMPDX= 6.0         $$ Bruker NMR JCAMP-DX V2.0
##DATA TYPE= NMR SPECTRUM
##DATA CLASS= NTUPLES
##ORIGIN= UXNMR, Bruker Analytische Messtechnik GmbH
##OWNER= root
$$ XWIN-NMR		Version 3.5
$$ Thu Feb 27 14:32:16 2020 Russian Standard Time (UT+4h)  she@DPX200
##.OBSERVE FREQUENCY= 81.013821
##.OBSERVE NUCLEUS= ^31P
##.ACQUISITION MODE= SIMULTANEOUS
##.ACQUISITION SCHEME= undefined
##.AVERAGES= 24
##.DIGITISER RES= 17
##SPECTROMETER/DATA SYSTEM= spect
##.PULSE SEQUENCE= zgpg30
##.SOLVENT NAME= CDCl3
##.SHIFT REFERENCE= (INTERNAL, CDCl3, 0, 182.463)
##AUDIT TRAIL= $$ (NUMBER, WHEN, WHO, WHERE, WHAT)
$$ ##TITLE= Audit trail, XWIN-NMR		Version 3.5
$$ ##JCAMPDX= 5.01
$$ ##ORIGIN= Bruker BioSpin GmbH
$$ ##OWNER= she
$$ F:/spectra/data/she/nmr/P31/1/pdata/1/auditp.txt
$$ ##AUDIT TRAIL=  $$ (NUMBER, WHEN, WHO, WHERE, WHAT)
(   1,<2020-02-27 14:30:58.37 +0400>,<she>,<DPX200>,
      <created by zg, POWCHK disabled, PULCHK disabled
       configuration hash MD5:
       00 E9 B6 7A A2 85 ED C7 34 08 36 98 17 FE 4E 26
       data hash MD5: 32K
       FA 05 A7 D1 42 12 3B 46 70 E0 7F 5C 4F 84 13 C7>)
(   2,<2020-02-27 14:31:00.75 +0400>,<she>,<DPX200>,
      <Start of raw data processing
       efp BC_mod = 2 LB = 1 FT_mod = 6 PKNL = 1 PHC0 = -1596.182 PHC1 = 626.6014 SI = 64K 
       data hash MD5: 64K
       51 66 93 08 24 0F 6A D1 D4 D2 A9 EE B8 24 18 15>)
(   3,<2020-02-27 14:31:35.34 +0400>,<she>,<DPX200>,
      <pk PHC0 = -19.59331 PHC1 = 45.4 
       data hash MD5: 64K
       06 3C EE F4 03 40 B5 4B 4E BA 93 41 9E 49 3B FF>)
(   4,<2020-02-27 14:31:45.92 +0400>,<she>,<DPX200>,
      <abs ABSG = 5 
       data hash MD5: 64K
       CE D6 4B B3 EC 29 54 3A 92 4A 08 52 47 88 E1 63>)
$$ ##END=
$$ 
$$ hash MD5
$$ 07 7B D9 FF D0 F2 2A 84 57 80 8C FF 7B 7D 2F D7
##$RELAX= 
##$RELAX= 
##$RELAX= 
##$RELAX= 
##$RELAX= 
##$RELAX= 
##$RELAX= 
##$RELAX= 
$$ Bruker specific parameters
$$ --------------------------
##$DU= <F:/spectra>
##$EXPNO= 1
##$NAME= <P31>
##$PROCNO= 1
##$TYPE= <nmr>
##$USER= <she>
##$AMP= (0..31)
100 100 100 100 100 100 100 100 100 100 100 100 100 100 100 100 100 100 
100 100 100 100 100 100 100 100 100 100 100 100 100 100 
##$AQSEQ= 0
##$AQ_mod= 1
##$AUNM= <au_zg>
##$AUTOPOS= <>
##$BF1= 81.014009
##$BF2= 200.13
##$BF3= 200.13
##$BF4= 200.13
##$BF5= 200.13
##$BF6= 200.13
##$BF7= 200.13
##$BF8= 200.13
##$BYTORDA= 1
##$CFDGTYP= 0
##$CFRGTYP= 5
##$CHEMSTR= <none>
##$CNST= (0..31)
1 1 145 1 1 1 1 1 1 1 1 1 1 1 1 1 1 1 1 1 1 1 1 1 1 1 1 1 1 1 1 1 
##$CPDPRG= <waltz16>
##$CPDPRG1= <>
##$CPDPRG2= <waltz16>
##$CPDPRG3= <>
##$CPDPRG4= <mlev>
##$CPDPRG5= <mlev>
##$CPDPRG6= <mlev>
##$CPDPRG7= <mlev>
##$CPDPRG8= <mlev>
##$CPDPRGB= <>
##$CPDPRGT= <>
##$D= (0..31)
0 1 0 0 0 0 0 0 0 0 0 0.03 2e-05 3e-06 0 0 0 0 0 0 0 0 0 0 0 0 0 0 0 0 
0 0 
##$DATE= 1582799457
##$DBL= (0..7)
120 120 120 11 120 120 24 19 
##$DBP= (0..7)
150 150 150 150 150 150 150 150 
##$DBP07= 0
##$DBPNAM0= <>
##$DBPNAM1= <>
##$DBPNAM2= <>
$$ [...]
##$SUBNAM3= <"">
##$SUBNAM4= <"">
##$SUBNAM5= <"">
##$SUBNAM6= <"">
##$SUBNAM7= <"">
##$SUBNAM8= <"">
##$SUBNAM9= <"">
##$SW= 369.568048894756
##$SWIBOX= (0..15)
0 1 3 0 0 0 0 0 0 0 0 0 0 0 0 0 
##$SW_h= 29940.119760479
##$TD= 32768
##$TD0= 1
##$TE= 0
##$TE2= 300
##$TE3= 300
##$TEG= 300
##$TL= (0..7)
0 120 53 12 22 120 120 120 
##$TP= (0..7)
150 150 150 150 150 150 150 150 
##$TP07= 0
##$TPNAME0= <>
##$TPNAME1= <>
##$TPNAME2= <>
##$TPNAME3= <>
##$TPNAME4= <>
##$TPNAME5= <>
##$TPNAME6= <>
##$TPNAME7= <>
##$TPOAL= (0..7)
0.5 0.5 0.5 0.5 0.5 0.5 0.5 0.5 
##$TPOFFS= (0..7)
0 0 0 0 0 0 0 0 
##$TUNHIN= 0
##$TUNHOUT= 0
##$TUNXOUT= 0
##$USERA1= <user>
##$USERA2= <user>
##$USERA3= <user>
##$USERA4= <user>
##$USERA5= <user>
##$V9= 5
##$VALIST= <valist>
##$VCLIST= <CCCCCCCCCCCCCCC>
##$VD= 0
##$VDLIST= <DDDDDDDDDDDDDDD>
##$VPLIST= <PPPPPPPPPPPPPPP>
##$VTLIST= <TTTTTTTTTTTTTTT>
##$WBST= 1024
##$WBSW= 4
##$XGAIN= (0..3)
0 0 0 0 
##$XL= 0
##$YL= 0
##$YMAX_a= 2902
##$YMIN_a= -2951
##$ZGOPTNS= <>
##$ZL1= 120
##$ZL2= 120
##$ZL3= 120
##$ZL4= 120
##$ABSF1= 182.463
##$ABSF2= -187.1042
##$ABSG= 5
##$ABSL= 3
##$ALPHA= 0
##$AQORDER= 0
##$ASSFAC= 0
##$ASSFACI= 0
##$ASSFACX= 0
##$ASSWID= 0
##$AUNMP= <proc_1d>
##$AZFE= 0.1
##$AZFW= 0.5
##$BCFW= 0
##$BC_mod= 2
##$BYTORDP= 0
##$COROFFS= 0
##$CY= -3
##$DATMOD= 1
##$DC= 0
##$DFILT= <>
##$DTYPP= 0
##$F1P= 0
##$F2P= 0
##$FCOR= 1
##$FTSIZE= 65536
##$FT_mod= 6
##$GAMMA= 0
##$GB= 0
##$INTBC= 1
##$INTSCL= 5.30512e-09
##$ISEN= 30
##$LB= 1
##$LEV0= 0
##$LPBIN= 0
##$MAXI= 10000
##$MC2= 0
##$MEAN= 0
##$ME_mod= 0
##$MI= 50
##$NCOEF= 0
##$NC_proc= -7
##$NLEV= 6
##$NOISF1= 182.463
##$NOISF2= 159.3651
##$NSP= 0
##$NTH_PI= 0
##$NZP= 0
##$OFFSET= 182.463
##$PC= 4
##$PHC0= -1615.775
##$PHC1= 672.0014
##$PH_mod= 1
##$PKNL= yes
##$PPARMOD= 0
##$PSCAL= 0
##$PSIGN= 0
##$REVERSE= no
##$SF= 81.0140089999434
##$SI= 65536
##$SIGF1= 159.3651
##$SIGF2= -187.1042
##$SINO= 113.3802
##$SIOLD= 16384
##$SREGLST= <1H.CDCl3>
##$SSB= 0
##$STSI= 65536
##$STSR= 0
##$SW_p= 29940.119760479
##$SYMM= 0
##$S_DEV= 0
##$TDeff= 32768
##$TDoff= 0
##$TI= <>
##$TILT= no
##$TM1= 0
##$TM2= 0
##$TOPLEV= 0
##$USERP1= <user>
##$USERP2= <user>
##$USERP3= <user>
##$USERP4= <user>
##$USERP5= <user>
##$WDW= 1
##$XDIM= 65536
##$YMAX_p= 430431839
##$YMIN_p= -45811911
$$ End of Bruker specific parameters
$$ ---------------------------------
##NTUPLES= NMR SPECTRUM
##VAR_NAME=  FREQUENCY,     SPECTRUM/REAL,   SPECTRUM/IMAG
##SYMBOL=    X,             R,               I
##VAR_TYPE=  INDEPENDENT,   DEPENDENT,       DEPENDENT
##VAR_FORM=  AFFN,          ASDF,            ASDF
##VAR_DIM=   65536,         65536,           65536
##UNITS=     HZ,            ARBITRARY UNITS, ARBITRARY UNITS
##FACTOR=    0.456856943014862, 1,           1
##FIRST=     14782.0589164792, 0,            0
##LAST=      -15158.0608439998, 0,           0
##MIN=       -15158.0608439998, -45811911,   0
##MAX=       14782.0589164792, 430431839,    0
$$ Real data points
##PAGE= N=1
##DATA TABLE= (X++(R..R)), XYDATA
$$ [...]
36667B056806J942958k3978j505308j349106m49336p0955j94417j03442L28066
36658F31288O81496P30930M49808k77104j241188j540220m99906J036576J255407
36649A227087l79422k156771k106008m56495Q39728Q11883M61632P88345J161102
36640A91081N95720l54623l68152M60292O98321j52010q76738m35191N81689J004614
36630A345003O38505L2059n27527r50386q30034Q2510J106091J140506K7782j110296
36620I54213j072514Q0347J005800M76730j157431k183435j485210J04067R86446
36611b290987Q72048O79830P01048K91698m95030n68916L11240Q21672J67702
36602D90305n00788J8723R24091P57558j82859n20369k10197l89915j120836j186370
$$ y = [2056806, 3999764, 3975786, 2470478, 1121372, 672036, 601081, 406664, 303222, 631288, 1312784, 2043714, 2493522, 2216418, 975230, -564990, -1064896, -28320, 1227087, 847665, -1309106, -3415114, -3871609, -3031881, -2219998, -1758366, -970021, 191081, 786801, 432178, 64026, 524318, 1222639, 1070629, 193891, -241300, 340389, 1345003, 1983508, 2015567, 1488040, 537654, -292380, -209870, 896221, 2036727, 2064509, 954213, -118301, -37954, 967846, 1444576, 287145, -1896290, -3381500, -3277433, -2290987, -1418939, -739109, -38061, 253637, -241393, -810309, -499069, 322603, 490305, -10483, 8240, 932331, 1689889, 1507030, 986661, 776464, 386549, -734287, -1920657]
36592a920657k50028N22347L58984j10413k04259j72146k73829j27074L78255
36583a798820O12718L07987J14528M17054O08220K53369n2961J56107K28454l82723
36573D63933q47809k44672O29100L39116o77245n27170J044810J850985L91320
36564B422368j760635k072181n17868P42965O66043M04660Q84391J173820K72658
36555B216221r08467q41738J82897N35523k25575r44153r41318q37056r87301
36546b750967p09976K79478J083787J093112R54070J173078J034096Q083r63715
36537A201046q85551l44144l48145n26992r631P99336R58017O84403O10700K13571
36527B352610j046654j870323p71154J007610R18115p76311j244564L18318J441116
$$ y = [-1920657, -2170685, -1648338, -1289354, -1399767, -1604026, -1776172, -2050001, -2177075, -1798820, -1186102, -878115, -763587, -346533, 261687, 515056, 462095, 618202, 846656, 463933, -383876, -628548, 552, 339668, -337577, -864747, 180063, 2031048, 2422368, 661733, -1410448, -1928316, -1185351, -519308, -114648, 769743, 1943563, 2216221, 1307754, 466016, 648913, 1184436, 958861, 14708, -926610, -1763666, -2750967, -3460943, -3181465, -2097678, -1004566, -50496, 1122582, 2156678, 2164761, 1201046, 315495, -28649, -376794, -903786, -913417, -114081, 843936, 1528339, 2139039, 2352610, 1305956, -564367, -1335521, -327911, 590204, -186107, -1430671, -1112353, 328763]
36518C28763N56445o06713k36545P07054P14598M18132Q79882J165029K9484j461051
36508B495078j452021l77338j32635q92806j062649o7407Q93189Q63730K30293
36499D97434k55461k67134K04655P48996O47008p1377l61830J69604L91631m26149
36489A277377j130047o77032j96531r93162j790151n76626J684411K156651N91065
36480C45955l85488L98765J121370M49372l71801j21244K82622j85251o62320
36471H71980j45472N18883J44315o94159p80238l57941m61349j008553j115923
36462c028457o83039k91756l1892L60186O37359M14825K8966N8877L43425L27073
36452a864433L1341r3470M7590K29799L90445N13726M12018R8341l5756K07674
$$ y = [328763, 885208, 278495, 41950, 749004, 1463602, 1881734, 2761616, 3926645, 3956129, 2495078, 1043057, 665719, 533084, -359722, -1422371, -1489778, -596589, 267141, 497434, 241973, -25161, 179494, 928490, 1575498, 1504121, 1142291, 1311895, 1703526, 1277377, 147330, -529702, -726233, -1719395, -3509546, -4086172, -2401761, -245110, 345955, -39533, 359232, 1480602, 1929974, 1558173, 1436929, 1719551, 1534300, 871980, 726508, 1245391, 1389706, 695547, -84691, -442632, -903981, -1912534, -3028457, -3711496, -4003252, -4035144, -3674958, -3037599, -2622774, -2593808, -2534931, -2191506, -1864433, -1833092, -1926562, -1878972, -1649173, -1258728, -745002, -332984, -234643, -270399, -62725]
36442f2725N39790O91679O30896K02340o04346j024357l44503N52762L3596j548883
36432i33751j833053L7117J860356J616124L23333n4478K26924j94771r56257
36423I1544p62375l1442j31887n95833K05633J860989K148832O42414n75728l22478
36413B529669R6284m56172j076240p87567l00171m10962m09361M22470J196934
36404H04884Q49407m2264l72393l67951q01296j263496q28697K12001P90798P17144
36394c01863M90621J9308r38252j491157m94758J396919K239683J498338O08258
36385C027097N01298K67792r07090j970633j462056J70761J096705N47410m97175
36376G74109r79283r76916r82907q92764l05516O25486J223120J065142L91610
$$ y = [-62725, 477065, 1168744, 1799640, 2001980, 1397634, 373277, 28774, 581536, 615132, -933751, -2766804, -2729687, -869331, 746793, 1070126, 1015648, 1242572, 1047801, 91544, -670831, -702273, -834160, -1429993, -1224360, 636629, 2785461, 3427875, 2852147, 2529669, 2625953, 2169781, 1093541, 305974, 5803, -405159, -814520, -392050, 804884, 1654291, 1612027, 1239634, 871683, 70387, -1193109, -2021806, -1809805, -1019007, -301863, 188758, 208066, -730186, -2221343, -2716101, -1319182, 920501, 2418839, 3027097, 3528395, 3796187, 2889097, 918464, -543592, -372831, 723874, 1271284, 774109, -205174, -1182090, -2164997, -3057761, -3363277, -2737791, -1514671, -449529, -57919]
36367e7919k16980l56934q1940J45700r7628o02362n80848L44446J410619J520060
36357A426214P09747R7126K10052K38838n31131j392379j247309l64908Q6633
36348g67117l0587K51311J048416J072014l16305j736959j523435k0940R73135
36339a050467O11554k63529n95158k76602K47945O75444Q40435N86420o1246q66094
36329a51298j570645j860434j322507N5599J433929J771115J016252J46833o4832
36320e45988J92106L47159K09697q8681m01592n13509k18533K38476K50288k54255
36310g84832m83169J09892Q15276N29264n71433j128106n24965J93684j07067
36301a951456q77545o37362P32971J580036P41776o94523p77337O16958J584899
$$ y = [-57919, -274899, -631833, -713773, -568073, -665701, -1268063, -1848911, -1504465, -93846, 1426214, 2135961, 2233087, 2443139, 2681977, 2150846, 758467, -488842, -853750, -767117, -797704, -546393, 502023, 1574037, 1257732, -479227, -2002662, -2023602, -1050467, -438913, -702442, -1297600, -1574202, -1326257, -650813, 189622, 776042, 714796, -151298, -1721943, -3582377, -4904884, -4849285, -3415356, -1644241, -627989, -481156, -545988, -353882, -6723, 202974, 114293, -287299, -800808, -1019341, -780865, -530577, -784832, -1268001, -1158109, -342833, 186431, -385002, -1513108, -2038073, -1844389, -1951456, -2829001, -3466363, -2733392, -1153356, -411580, -1106103, -1883440, -1266482, 318417]
36292C18417Q00069p24259j083287L3480J195801J247796M94433j97144n84319
36283A500987r02316j144259j083297p44674l61956P316M20768P09101O16007
36274i82323K85589K10295N51728Q12698M23182m85081j135425r67625k82072
36265a569034J19029j03388m39987k62884K69958M21434m2573m76450k85832K28583
36255b141144L95734J97134J71073M65474O66480N95848N75788O80941M08815
36246B016143m72238j305089j336976p11726n7070N24606J239918J634260R31811
36237B463639m70024r61117J53105J355980P95033j037350j807890n83279Q10001
36228G18098M04132j023156j040117Q60531K379625J556402n54187j428362m65560
$$ y = [318417, 1118486, 394227, -689060, -655580, 540221, 1788017, 2282450, 2085306, 1500987, 598671, -545588, -1628885, -2373559, -2735515, -2728199, -2307431, -1598330, -982323, -696734, -486439, 65289, 877987, 1301169, 816088, -319337, -1286962, -1569034, -1450005, -1553393, -1993380, -2256264, -1986306, -1564872, -1607445, -2083895, -2369727, -2141144, -1745410, -1548276, -1377203, -911729, -245249, 350599, 926387, 1607328, 2016143, 1543905, 238816, -1098160, -1809886, -1866956, -1342350, -102432, 1531828, 2463639, 1993615, 1032498, 1185603, 2541583, 3336616, 2299266, 491376, -91903, 718098, 1122230, 99074, -941043, -80512, 2299113, 3855515, 3301328, 1872966, 1407406]
36219A407406N87257L73080m27314n91520k09540j59886n71391q31017o83884
36210a106809l94085p3786L13089N12774L73189M01348R79136J305608L63175
36201B673639j148328j366316o9760P24445k05445j273260n35202J137721J309680
36192A247174k42964j217287l61839P44467L15905r52782j182533k18501L42500
36183a525860l15526j108027p15686O25877J542336J247408L42068k2835N22483
36174E92238J189809R55958k47355j417939j552686o37253M81412R70546O34293
36165I69023q0924m63941r8542O77212R70216K70597q54499j305712p26682Q4453
36155e58799K17206j83134j88611N30460J127334P16229k92108o51776o3901K83936
$$ y = [1407406, 1994663, 2367743, 1940429, 1348909, 1139369, 979483, 408092, -422925, -1106809, -1500894, -1574680, -1261591, -748817, -375628, 25720, 1004856, 2310464, 2673639, 1525311, 158995, 89235, 813680, 608235, -665025, -1200227, -62506, 1247174, 1004210, -213077, -574916, 169551, 485456, -467326, -1649859, -1868360, -1525860, -1841386, -2949413, -3665099, -3039222, -1496886, -249478, 92590, 69755, 592238, 1782047, 2738005, 2490650, 1072711, -479975, -1117228, -635816, 334730, 969023, 888099, 424158, 325616, 1002828, 1973044, 2243641, 1389142, 83430, -643252, -558799, -341593, -524727, -713338, -182878, 944456, 1660685, 1368577, 716801, 652900, 936836]
36145I36836n93431j888542j948914n64357P26142Q33435N96800J300448K426741
36136A825158K124062q9174k294098k469267r91367J14209k6453l05951L05659
36127a807222J148733J045451J51804m24112l32128j57065j36203P8512L74912
36118e7318J56564m04471l66771K98118L61802o18116j287825o07289L13770l9423
36108b250959j044728r50484K31272Q38260L47156Q78M24734N86249j98081r02552
36098b918255l89787Q90310J716700J615413Q06112l82840j299208j129121n2365
36089a143041O48155L41628l5157M29317J131474R75209k4443j088966j754241
36080e20065j717932o23514R66441J445815K51058r52236n49414O06701P06625
$$ y = [936836, 343405, -1545137, -3494051, -4058408, -3332266, -2498831, -1902031, -601583, 1825158, 3949220, 3860046, 1565948, -903319, -1894686, -1780477, -1806930, -2112881, -1807222, -658489, 386962, 538766, 114654, -217474, -374539, -510742, -432230, -57318, 99246, -305225, -671996, -373878, -12076, -630192, -1918017, -2525306, -2211536, -2250959, -3295687, -4246171, -4014899, -3176639, -2829483, -2828605, -2403871, -1817622, -2015703, -2918255, -3308042, -2417732, -701032, 914381, 1720493, 1337653, 38445, -1090676, -1143041, -494886, -153258, -188415, 240902, 1372376, 2347585, 2323142, 1234176, -520065, -2237997, -2861511, -1895070, -449255, -198197, -1150433, -1699847, -1093146, -386521]
36071c86521q2273k07603M53641O39925K46486M57271J246111J071389m62434
36062B975992j763165j728812j109174o79696m2181Q49469R71763K22504J90078
36053a13222J469341K080981M45879j681986j536512N33182J710778Q74631l56842
36044C426230o03248l61665l40453k94770j93188p07331j671523j652120j14361
36035b512429J310531R51701n07987j068981j75886Q79578R99494M87582J87814
36026E51417M07504R22404J341519J210862K88748j010204j816819j679616r67651
36017g51836k72453K50665P08539R54439O70392r2595q31632j153061j148268
36008a665810j053346p86286j29740P32845J236236J074615N43018R8129j69588
$$ y = [-386521, -468794, -676397, -222756, 417169, 663655, 1120926, 2367037, 3438426, 2975992, 1212827, -515985, -1625159, -2304855, -2347036, -1497567, -525804, -303300, -113222, 1356119, 3437100, 3882979, 2200993, 664481, 1197663, 2908441, 3783072, 3426230, 2822982, 2461317, 2120864, 1826094, 1632906, 925575, -745948, -2398068, -2512429, -1201898, -250197, -758184, -1827165, -2003051, -1123473, -123979, 363603, 551417, 958921, 1881325, 3222844, 4433706, 4722454, 3712250, 1895431, 215815, -751836, -1024289, -773624, -65085, 889354, 1559746, 1467151, 635519, -517542, -1665810, -2719156, -3505442, -3635182, -2902337, -1666101, -591486, -48468, 49661, -119927]
35999a19927m02012n10637k02972M87760R70396O31649l87694j150338q93475
35990a577250j0539L22954k87326p37939J36141J725678K182255Q86682o21300
35981B019356o91572L31646Q78707L83303l20502n26840m46379m06418k86487
35972I34814n9486o6825l55867m32945r1134J79840R9994K28337R70233J527980
35962B934941Q26070p55114j640192j177669m80743o80634j222482p83249N85314
35953b393758J329987N16459q70168j271947n72012K1652j35473k57371N68372
35944c064259J885854K324853J338563j36597q57934o13201r0075J91283K72630
35935A251117K16279j37573o09631m99807M32769J232086Q33962k90544o40762
$$ y = [-119927, -521939, -1032576, -1235548, -747788, 222608, 854257, 466563, -683775, -1577250, -1587789, -1264835, -1552161, -2290100, -2153959, -428281, 1753974, 2640656, 2019356, 1327784, 1659430, 2538137, 2921440, 2600938, 2074098, 1627719, 1221301, 934814, 875328, 808503, 452636, 19691, -71443, 108397, 208391, 436728, 1406961, 2934941, 3761011, 3005897, 1365705, 188036, -292707, -973341, -2195823, -2979072, -2393758, -1063771, -547312, -1417480, -2689427, -3261439, -3239787, -3375260, -3632631, -3064259, -1178405, 1146448, 2485011, 2348414, 1490480, 877279, 787204, 978487, 1251117, 1467396, 1329823, 720192, 220385, 653154, 1885240, 2719202, 2428658, 1787896]
35926A787896M0973K71971p86304j765442j137695K31251L23391q04480j087663
35917b926102K38834J529982J470532Q38456N32125j09557j444117j838542n1011
35908a759400K026243J610567o72170j512101J25304J617054R05581o02307p36079
35899A002692P9169Q6205p14882q56731J4471P87138Q15372N77926M35906O3274
35889B290540p26178j535861j878350j484151l41132R10498J096361l2295r30241
35880b630809r0294J556940J593269m38758k150403j507608M69994J297563L90714
35871a509392n02488K3156J172663J193900k04246j399534q74360Q42080J813020
35862E54799J157326M0551j62890K19818L1193o23800n83718K25036M16380o71329
$$ y = [1787896, 1828869, 2100840, 1314536, -450906, -1588601, -1357350, -1033959, -1838439, -2926102, -2687268, -1157286, 313246, 1151702, 1683827, 1574270, 130153, -1708389, -1759400, 266843, 1877410, 1205240, -306861, -181557, 1435497, 2341078, 1738771, 1002692, 1081861, 1168066, 453184, -403547, -389076, 398062, 1213434, 1791360, 2227266, 2290540, 1564362, 28501, -1849849, -3334000, -3675132, -2764634, -1668273, -1700568, -2630809, -2721103, -1164163, 429106, -9652, -2160055, -3667663, -3197669, -1900106, -1509392, -2011880, -1988724, -816061, 377839, 173593, -1225941, -2100301, -1258221, 554799, 1712125, 1752676, 1589786, 1809604, 1840797, 1216997, 633279, 858315, 1274695, 603366]
35852F03366j793691j570449l61325N44096P71575Q66975J020645Q49566K43668
35843A174426l92846o67807m52582J62429P40956P20970K00769j7981L42429M78714
35833B289477j41419p15120m08812P8641l72862j229954j002774K38608Q45181
35824d19034J98684m81311l77703k95385q06461q87865L13882J691250J628296
35815E64353L31620p17905r41347q72345p26855k24324M20420O46786N57426O33813
35805c28358O62535J39311m89246l25754L57445M33293j35778k24228L76358M80477
35795I46055l43200q11418l2341R11471O91673j77519l77179L1758l060n59877
35785B76363p30713l07004j8239j16595n2448K94650K72625l36366p86190m63372
$$ y = [603366, -1190325, -2760774, -3122099, -2578003, -1806428, -939453, 81192, 930758, 1174426, 781580, 113773, -338809, -176380, 564576, 1285546, 1486315, 1468334, 1810763, 2289477, 2148058, 1432938, 1024126, 1102767, 729905, -500049, -1502823, -1264215, -419034, -220350, -701661, -1079364, -1374749, -2181210, -3069075, -2755193, -1063943, 564353, 895973, 178068, -763279, -1635624, -2362479, -2586803, -2166383, -1519597, -962171, -328358, 334177, 473488, -15758, -341512, 15933, 449226, 313448, 89220, 465578, 946055, 602855, -208563, -240904, 670567, 1362240, 1184721, 807542, 839300, 836240, 276363, -454350, -761354, -779593, -896188, -948636, -653986, -381361, -717727, -1503917, -1967289]
35775a967289K80237P82138R03584Q64566P83666O42790K70582o60745j995425
35766i5896k516948j026677J702831L135375J857992n68023j552313o44605L68697
35757F60433K29432k75590J02577J095719J394301N63823n01347r94011j132486
35748A142851j328093j237009m36014M55457L98666m12851o67501Q7424P91113
35739a205957P00587N71162J064659J255559J88020j075413q11969N56245J066540
35730B309433L50646r9376J17159l59548j678958j781914J77134J770633P17822
35721A523031j500729j853994k18387R84157P11609J37831k3069k95604n22639
35712a057794J82117J188597O36998j321343k086933n19944J094063N20801j084350
$$ y = [-1967289, -1687052, -904914, -1330, 863236, 1646902, 2289692, 2560274, 1899529, -95896, -2612844, -3639521, -1936690, 1198685, 3056677, 2488654, 936341, 291736, 660433, 889865, 614275, 716852, 1812571, 3206872, 3770695, 3269348, 2275337, 1142851, -185242, -1422251, -1858265, -1402808, -1004142, -1416993, -2084494, -1997070, -1205957, -505370, 65792, 1130451, 2386010, 2574030, 1498617, 686648, 1242893, 2309433, 2660079, 2560703, 2677862, 2318314, 639356, -1142558, -965424, 805209, 1523031, 22302, -1831692, -2050079, -1065922, -354313, -216482, -239551, -535155, -1057794, -875677, 312920, 949918, -371425, -2458358, -2978302, -1884239, -1363438, -2447788]
35703b447788j241153J30898J226918J401214J426970J419912P29681l36384o66595
35694A643673k35351j12084n18796n54153l6817O6005n16657o84377J76008J066728
35684B94179R95979N07028N17576N99379k71773j741870k180869q38244J036942
35675a081673J571381L15075j350496j703478m76686Q78365Q31520m58320j424909
35666b899221j116995k65398n099k25350L7765R00055J291711N29182n37888n31474
35656b822712O47781J676263J488925N08079j21123n4192P3816k33785p75781
35647C87271j271350j760350k053054j519492l8398J389690J709173J145651P78273
35638a232586J060935J471037J381664N90083p26477j837533j654752p2634J288069
$$ y = [-2447788, -3688941, -3558043, -2331125, -929911, 497059, 1916971, 2646652, 2310268, 1643673, 1408322, 1296238, 777442, 223289, 186472, 252477, -264180, -948557, -772549, 294179, 1290158, 1797186, 2314762, 2914141, 2642368, 900498, -1280371, -2118615, -1081673, 489708, 804783, -545713, -2249191, -2725877, -1847512, -1015992, -1474312, -2899221, -4016216, -4281614, -4286713, -4512063, -4474298, -3574243, -2282532, -1753350, -2291238, -2822712, -2174931, -498668, 990257, 1498336, 1377213, 1323021, 1396837, 1163052, 387271, -884079, -2644429, -4697483, -6216975, -6255373, -4865683, -3156510, -2010859, -1232586, -171651, 1299386, 2681050, 3271133, 2544656, 707123, -947629, -1020263, 267806]
35629B67806Q99730m35805o89584K31884L78055q87098j646010n98779O28922
35620a850879R8307j178763q24673J071620K119820J249987j34640o87357o47780
35611g84358m56050J38179Q70488O95678l22825n29840P24365J568656K90774
35602B195067j726839j767229K11703J553351Q81808j26589K82337J137438M62566
35593C103613j394419k101113p49015R07862J063665J93048j58534K41884M78879
35584A585870L57160N34535R36218O34066l93359q98508l92041p4580p70437j313261
35574B05663m00756J058158J203678J04644n42441k20810o5851n35188o86653
35565A20444j65048J02187j34355K29293J370963J533733k46808k090454j772604
$$ y = [267806, 1167536, 731731, 42147, 274031, 652086, -235012, -1881022, -2479801, -1850879, -1752572, -2931335, -3756008, -2684388, -564568, 685419, 550779, -136578, -784358, -1240408, -1102229, -231741, 463937, 141112, -388728, 335637, 1904293, 2195067, 468228, -1299001, -1087298, 466053, 1347861, 1221272, 1503609, 2641047, 3103613, 1709194, -391919, -1140934, -233072, 830593, 1023641, 865107, 1106991, 1585870, 1943030, 2477565, 3413783, 4047849, 3654490, 2755982, 2363941, 2289361, 1518924, 205663, -195093, 863065, 2066743, 2171387, 1628946, 1408136, 1342285, 807097, 120444, -44604, 57583, -76772, 152521, 1523484, 3057217, 2810409, 719955, -1052649]
35556a052649J2559R08442M71196K51029P64258P45403l60019j237745p50240
35547b47766M14043R55232O74034J93473j43328l68107m92611n54958o00003l79617
35537e49608L31725J012564Q13204q5361m77526J09177O32779J09951r25063j308620
35527c36778q54693k07275L06273P05207O75695o7836r04534q31776N2214N40569
35517i22934P0655l93195J93620J270493J301718o2269j339674j094703J67262
35508h09027P03687j02356j003806p47656K57298Q36485Q54769R94169J139175
35499B122738M40326q79036j288895j99474Q80938N16501l98042k7599J392102
35490B559559J705018L7258j830245j930331o50400J81603j13180n79130l89428
$$ y = [-1052649, -1040090, -131648, 339548, 590577, 1354835, 2100238, 1740219, 502474, -247766, 166277, 1121509, 1795543, 1989016, 1845688, 1477581, 984970, 430012, -169991, -549608, -217883, 794681, 1607885, 1522524, 1044998, 1154175, 1786954, 1896905, 971842, -336778, -1191471, -1398746, -1092473, -387266, 288429, 220593, -683941, -1515717, -1463503, -922934, -852279, -1245474, -1051854, 218639, 1520357, 1458088, 118414, -976289, -809027, -105340, -207696, -1211502, -1959158, -1701860, -865375, -10606, 983563, 2122738, 2563064, 1684028, 395133, 195659, 1076597, 1593098, 1195056, 1167457, 2559559, 4264577, 4301835, 2471590, 541259, -109141, 72462, -40718, -619848, -1009276]
35481a009276Q3350J69971L1151L38056J159160J677132J098029l67485j616262
35472A563826j785661j127946n52658m04582j40329O31891J336335J186897M03217
35463A110990j03366j65825n43156j401311j614866l45081J430172K022961J261971
35454A652489M39500K20665q275n13511m73571L65012O62730o01507k151390j912576
35444b320434j5918J346080J031367K90436N73229J430551J452988L18461j062878
35435C043882j883141k040422j677289q41508L56775J555270K127143J500710
35427B141420p2622j195498n71276J263221K309661J533910k528q87679j117425
35418C401184j249727r06100M57113J895720J726076r3483j724782j818138r18701
$$ y = [-1009276, -925926, -755955, -724804, -386748, 772412, 2449544, 3547573, 3180088, 1563826, -221835, -1349781, -1902439, -2307021, -2447350, -1815459, -479124, 707773, 1110990, 1007624, 841799, 298643, -1102668, -2717534, -3062615, -1632443, 390518, 1652489, 2091989, 2312654, 2304379, 1790868, 1317297, 1682309, 2345039, 1743532, -407858, -2320434, -2336352, -990272, 41095, 331531, 904760, 2335311, 3788299, 4106760, 3043882, 1160741, -879681, -2556970, -3398478, -3041703, -1486433, 640710, 2141420, 2068798, 873300, 302024, 1565245, 3874906, 5408816, 5406288, 4518609, 3401184, 2151457, 1245357, 1702470, 3598190, 5324266, 5230783, 3506001, 1687863, 769162]
35409G69162j96064M2501J2717l14884q31339q88653j52442O39213N88747o0398
35399c91440l66593j62651j42979n05713m97891L48852J346871J595767J214167
35390B438390R12500P23241O1499r95517j460144q42215k0223o1840p18863q89576
35380h52748k67708L51062L49208J3856j57344j07070O8845L65362N44338K45085
35370E52886k75599k52929L40168M81567l65084j226809r76994m633N18992M92423
35360g16012P46538J320660J252331K35736p39406q15478l46459p5917r0924j43957
35350F27112k86104n53972n87735j77972K48528K60508J34726L49935P37737P96357
35340A549120N64592M25306J72753q36780k380202l010818j633075R19915K548234
$$ y = [769162, 573098, 615599, 628316, 313432, -517907, -1406560, -1559002, -919789, -331042, -391440, -758033, -920684, -1063663, -1569376, -2067267, -1718415, -371544, 1224223, 2438390, 3350890, 4074131, 4135630, 3140113, 1679969, 837754, 817531, 755691, 36828, -852748, -1120456, -769394, -420186, -406330, -563674, -670744, -601899, -236537, 307801, 552886, 277287, 24358, 364526, 846093, 481009, -745800, -1722794, -1727427, -1208435, -716012, 30526, 1351186, 2603517, 2839253, 2099847, 1284369, 937910, 861993, 771069, 627112, 341008, -212964, -800699, -978671, -730143, -469635, -334909, 15026, 752763, 1549120, 2113712, 2539018, 2711771, 1874991, -505211, -3516029, -5149104, -4229189, -1680955]
35331a680955K136891O32970k96565j99566L0935l11818q13659p52924k51622
35322a506313m0739l07540m14280J12943P99155P86960K1695n19629L6475J271477
35312B40204J793865Q88573n26816j010535l66527L58722M87955L63377K24540
35303B453358m12637j586538k134006j189716K68793O36104j0278k12304M41679
35294a745545P53639M0200o75901l04629O50801R89683N59623J61412K25582M64035
35284A118900N63264M99626L12055R0228J6700K930m25038j374196k009175j397878
35274b602584J27307J106850O55990m21345n72478O22181J884267J694823Q3560
35265B578571j398140j483904n10240K79839K40864l11993p79129o84060K13788
$$ y = [-1680955, 455936, 1088906, 792341, 592775, 623710, 311892, -501767, -1254691, -1506313, -1547052, -1854592, -2268872, -2155929, -1356774, -569814, -548119, -1067748, -1031273, 240204, 2034069, 2922642, 2395826, 1385291, 1018764, 1377486, 1865441, 2228818, 2453358, 2040721, 454183, -1679823, -2869539, -2600746, -1964642, -1974920, -2187224, -1745545, -991906, -951706, -1627607, -1932236, -1281435, -291752, 267871, 429283, 654865, 1118900, 1682164, 2181790, 2493845, 2584073, 2600773, 2603703, 2178665, 804469, -1204706, -2602584, -2475277, -1368427, -712437, -1133782, -1706260, -1084079, 800188, 2495011, 2578571, 1180431, -303473, -813713, -533874, -293010, -605003, -1384132, -2068192, -1854404]
35256a854404J446308J785263N72484j098741j536521o49693J54418K00936K32340
35247g47610O11630M68104n72858j248456m31174R89627J265141J43820j068912
35238e90688j276438m25687Q73702J619200R28415p14029j418221k40416J195773
35229d8389Q63750o06475r06697K86123Q58858k32269j248407m96132R63488R94053
35219D27903l88899j187031l38037J075759J556819R16621m2461o95415r31521
35210C93738p82506k65206L97769O85871J55668r84919j819517j536961l52636
35201d108699O60115P83674M26301M54014R84838J243960O49010l25096o70707
35192I7410j12849N67541O21137L08376L42794O65119N03671l25896r63907o75840
$$ y = [-1854404, -408096, 1377167, 1949651, 850910, -685611, -1335304, -1180886, -979950, -747610, -135980, 332124, -240734, -1489190, -1920364, -930737, 334404, 478224, -590688, -1867126, -2292813, -1419111, 200089, 1128504, 414475, -1003746, -1244162, -48389, 815361, 208886, -697811, -411688, 447170, 214901, -1033506, -1529638, -566150, 427903, 39004, -1148027, -1486064, -410305, 1146514, 2063135, 2020674, 1325259, 393738, -388768, -653974, -256205, 429666, 585334, -399585, -2219102, -3756063, -4108699, -3448584, -2664910, -2238609, -1784595, -799757, 444203, 1093213, 768117, 97410, -15439, 552102, 1173239, 1481615, 1824409, 2489528, 2993199, 2667303, 1703396, 1027556]
35182A027556J48605O08787M28185L2691j20620Q8135L88573J88980q06682j857844
35172A26366j804797p37477r4331n60792r85634k66064Q42837J058620O68440
35163a752832P03350Q55415J11892j051924j175403l02060J57694L4885N31214
35154a887769J432735Q18531j471433k653516r66826J359904J289074n49622j114310
35145c743232L31466J475493P15946q20221j423052r65297k19252M61866R53717
35136c232566R31884M07670l940J15294M70668O58737P16477P95552Q15406O76756
35126B351938M07018J6950l95050n29641l91693o03662j439692j899466q87898
35117c371196Q32163J277828M4369j019241m83853P80176J279881J047645Q39396
$$ y = [1027556, 1176161, 1784948, 2213133, 2245824, 2125204, 2213339, 2601912, 2790892, 1984210, 126366, -1678431, -2415908, -2510239, -3071031, -4056665, -4322729, -3479892, -2421272, -1752832, -1049482, -194067, -82175, -1134099, -2309502, -2611562, -2453868, -2418983, -1887769, -455034, 363497, -1107936, -3761452, -4728278, -3368374, -2079300, -2628922, -3743232, -3411766, -1936273, -1220327, -2040548, -3463600, -4428897, -4648149, -4186283, -3232566, -2300682, -1893012, -1896952, -1781658, -1310990, -652253, 64224, 859776, 1675182, 2351938, 2758956, 2775906, 2380856, 1851215, 1459522, 855860, -583832, -2483298, -3371196, -2539033, -1261205, -1216836, -2236077, -2719930, -1939754, -659873, 387772, 1227168]
35108A227168M01081p78806j774820j193649M33861J107718L03236l64947J64412
35099d74746Q63628O23814J31126M27170Q95544L16586q66587j050987P4862J148191
35089B088601J155734M31675m36013j290994j721519j054779L97178J215892O54951
35080A440726l84758p52841n03745k99015k58121j92446k25016l90779l05362
35071a871357M3954n0260p74581j060663r9063J198873J412692O21802k1856j21174
35061g21633j13532p8444R9088j21162j033249j405078J6424J984074J929486
35052E55974j65656j410618k20483J382831R51324q61766j671163q44353K69013
35043b014897P48071R20710J094498R75876L87034m08668j048194j132188l37264
$$ y = [1227168, 1628249, 849443, -925377, -2119026, -1685165, -577447, -274211, -639158, -474746, 388882, 1012696, 1143822, 1570992, 2466536, 2783122, 1916535, 865548, 940410, 2088601, 3244335, 3676010, 3239997, 1949003, 227484, -827295, -430117, 785775, 1440726, 1055968, 303127, -200618, -499633, -757754, -950200, -1175216, -1565995, -1871357, -1827403, -1877663, -2652244, -3712907, -3811970, -2613097, -1200405, -578603, -600459, -721633, -835165, -913609, -814521, -935683, -1968932, -3374010, -3357586, -1373512, 555974, 390318, -1020300, -1240783, 142048, 1093372, 231606, -1439557, -2283910, -2014897, -1266826, -346116, 748382, 1724258, 2111292, 1702624, 654430, -477758, -815022]
35034h15022R04328J399909O29910l91354n03595j4356M0980l62706m35685j14876
35024C37533j09227m68755l33841O18196J415207R49663n76150j722319j240649
35015a130342N64297J910811J300178p45430k227994k049573j066893n08396l31396
35006d284738J88532J068272J632070J369295K38388j223139j769091n27907J307219
34997b001099J353494n58601j622730q5103J846802J263153q97717j392807K16625
34988a877983J228956L67753o08917l96636j27830o90280q09616M89568J694458
34979g30527J045125o05326j115244j31070R57677J314865J201928P73235o3475
34970B647188p95378o63330J07462M20298k81985j360471j705837p50175J002365
$$ y = [-815022, 89306, 1489215, 2119125, 1727771, 1224176, 1209820, 1250800, 888094, 452409, 337533, 228306, -240449, -574290, 43906, 1459113, 2408776, 1832626, 110307, -1130342, -566045, 1344766, 2644944, 1899514, -328480, -2378053, -3444946, -3953342, -4284738, -4096206, -3027934, -1395864, -26569, 211819, -1011320, -2780411, -3308318, -2001099, -647605, -1206206, -2828936, -2914039, -1067237, 195916, -701801, -2094608, -1877983, -649027, -281274, -890191, -1286827, -1414657, -2104937, -2914553, -2424985, -730527, 314598, -290728, -1405972, -1537042, -579365, 735500, 1937428, 2710663, 2647188, 1851810, 1188480, 1295942, 1716240, 1434255, 73784, -1632053, -2382228, -1379863]
34961a379863K198843J824821L79988o97905q57555p86469q41457m71747L03904
34952c27440L91630m31855n81264Q97134K277224J430452p72984j539117k63312
34943A080468P37830j08609j397135j123052L58715J121844M83898l56794k38129
34934E59036N08211P19624q1926j179803j511979p91920L01544R04313O77023
34925A04123j75843j100888j301236k84768J314009K061964J392802L30948q6859
34916B254252l51166j376485k485254k043860n6540J484727J297603M10524K66057
34907f00142N44665J56478n53462l03271O99018O51973j002135k192151q74399
34898c473426J857800K894248J169874r69954r91325N87057J323521L76740o91255
$$ y = [-1379863, 818980, 2643801, 3023789, 2325884, 1468329, 681860, -159597, -631344, -327440, 64190, -367665, -948929, -51795, 2225429, 3655881, 2882897, 1343780, 1080468, 1818298, 1709689, 312554, -810498, -451783, 670061, 1153959, 797165, 559036, 1067247, 1786871, 1704945, 525142, -986837, -1778757, -1477213, -572900, 104123, -71720, -1172608, -2473844, -2758612, -1444603, 617361, 2010163, 2341111, 2254252, 1903086, 526601, -1958653, -4002513, -4059053, -2574326, -1276723, -866199, -600142, -55477, 101001, -452461, -755732, -56714, 595259, -406876, -2599027, -3473426, -1615626, 1278622, 2448496, 1478542, 487217, 1074274, 2397795, 2774535, 2083280]
34889B083280n55039M3713k11150j093129j353108p27755j64201j59990r7480
34880b234859M31876O90346m5853j052772r16619M47317J579226J493303Q92673
34871A284638P53266O40811m11290j901562k239548j127602k8731J54218L09659
34862b566141J194471J802700J020230k84823n00102K12428L97118k63821q33607
34853A78453j034276j321111j288727j47753J220116J032570k61684j55469J862197
34844H4316L051480J542955p78911j349368o56911o11710j016965l83276R17396
34835G99006J105208L7902p36684p02968q07724j281983j285939p83589o24844
34826d281615o24825K77290J691002J881307P40057L19526J436297K003285K73929
$$ y = [2083280, 1528241, 1571954, 1360804, 267675, -1085433, -1813188, -1977389, -2137379, -2234859, -1802983, -1112637, -1158490, -2211262, -3127881, -2680564, -1101338, 391965, 1284638, 2037904, 2678715, 2267425, 365863, -1873685, -3001287, -3030018, -2875800, -2566141, -1371670, 431030, 1451260, 1166437, 666335, 878763, 1275881, 1012060, 178453, -855823, -2176934, -3465661, -3613414, -2393298, -1360728, -1622412, -1777881, 84316, 3135796, 4678751, 3899840, 2550472, 1893561, 1281851, 264886, -118390, 799006, 1904214, 1942116, 1205432, 502464, -305260, -1587243, -2873182, -3656771, -4281615, -4906440, -4629150, -2938148, -1056841, -316784, 2742, 1439039, 3442324, 3716253]
34817C716253k122429k363819m58041R91015N00867p44442j098583n41117l785
34808b124081K30112N52082R56851Q87812K84229M1700P82718J543530P12679
34799C867632j559403l016172k042373K09996J417704R74168O0255m63050p07844
34790a259087o91378k22553K44473J39426M9023Q59691J744027R56309j149189
34781F70742k056841p40057P67870N95065k08667K03815J272425J074328m30639
34772A148041j387621r20964p7870J51892J03761L51441O27230M17911j15753
34763B98068l25235J45710R68889J360358P92779l57650j138557j147008q69600
34754b72246p10145m03922J43827K55550m64402j103185m97434R80465J696288
$$ y = [3716253, 1593824, -769995, -1228036, -237021, 263846, -480596, -1579179, -2120296, -2124081, -1893969, -1341887, -385036, 502776, 787005, 828705, 1611423, 3154953, 3867632, 2308229, -707943, -2750316, -2540320, -1122616, -148448, -88193, -551243, -1259087, -1950465, -2173018, -1928545, -1789119, -1740096, -880405, 863622, 1819931, 670742, -1386099, -2126156, -1358286, -763221, -971888, -768073, 504352, 1578680, 1148041, -239580, -1160544, -1238414, -1086522, -982761, -631320, -4090, 413821, 298068, -27167, 118543, 1087432, 2447790, 3240569, 2882919, 1744362, 597354, -272246, -982391, -1386313, -1242486, -986936, -1451338, -2554523, -3051957, -2071492, -375204]
34745c75204P96998q22897j689780j263466j37369Q13841J239469J360888J326120
34736A248600Q17514k86485j152404q00848K84782M78269o66845j590928r51180
34727b619525M50866R96383N54483K06976L64173N05214L82974K11530q3209o40286
34717C29579r50694m91317K18187L39930J31157L27613N20844k03314j194108
34708i72123p44773J066087K033406J035513l12117l15934K59743q0645p47514
34699A221643r9369J448617J650940j51433j884825j683452l35026K77538m2978
34690D01655r335P81061J230266N79991m35139q09119o69512o72887o83941q8308
34680c75268Q69733J163366M92705k58726l80436k65495n24621r67338j061182
$$ y = [-375204, 421794, -401103, -2090883, -3354349, -3491718, -2677877, -1438408, -77520, 1248600, 2066114, 1779629, 627225, -173623, 111159, 589428, -77417, -1668345, -2619525, -2168659, -1172276, -617793, -410817, -46644, 458570, 841544, 1053074, 969865, 329579, -621115, -1112432, -894245, -554315, -423158, -95545, 425299, 221985, -972123, -1716896, -650809, 1382597, 2418110, 2105993, 1790059, 2049802, 1969157, 1221643, 1122274, 2570891, 4221831, 4070398, 2185573, 502121, 167095, 444633, 401655, 392320, 1173381, 2403647, 2983638, 2548499, 1739380, 1069868, 396981, -286960, -375268, 494465, 1657831, 2150536, 1891810, 1511374, 1245879, 721258, -246080, -1307262]
34671a307262p21244k6899J107698K215473K050536K17273j598304j431431K41913
34662G47753J117615L39714n50436l08485J76854k70011r84747o95754J63855
34653b63642J59550o35686p33971J15611K91564r47669j762945k40968K427876
34644a590280L137443J058187j188373j113258M62691J035284J03160n51700N4845
34635A407999O92809J37776q21898p60560R3088L76071j67060m69525o7400J94041
34625F15341l15061r87312j043542o78267m65098l40855Q0055O94308J127292
34616a313139J357090J422086R05076m09874j577127j234313M97595J787234J252631
34607B687259l57683j275223r47482l23441j99568l01607j64956J1205q1639j26674
$$ y = [-1307262, -2028506, -2055405, -947707, 1267766, 3318302, 3535575, 1937271, 505840, 747753, 1865368, 2205082, 1654646, 1346161, 1523015, 1253004, 268257, -427497, -263642, -104092, -739778, -1473749, -1358138, -1066574, -2014243, -3777188, -4018156, -1590280, 1547163, 2605350, 1416977, 303719, 766410, 1801694, 1904854, 1353154, 1407999, 2100808, 2238584, 1416686, 656126, 749214, 1125285, 958225, 488700, 421300, 615341, 300280, -687032, -1730574, -2408841, -2873939, -3214794, -3134739, -2440431, -1313139, 43951, 1466037, 2371113, 1961239, 384112, -850201, -352606, 1434628, 2687259, 2329576, 1054353, 106871, -216570, -416138, -717745, -882701, -871496, -953135, -1079809]
34597a079809K83931P72745O06568j44810o19869l74523Q7593J70075n105O1110
34587b42094M82530Q51040O49873k81468j423726j742792o32627J193352K168411
34578A022499J399762n20710k169141k388259r76246J026216J858424P18260j054621
34569a083816j411351k47639N81180J31226k85210N60784J617043J120583n94575
34560C88225j466153m78238J299599K251288J670369q9174j841255k164054p91135
34551a220528Q22173J237808Q52082Q47544J005820K50656r92336j033461K74654
34542B044412J010123J37976r06382o61213M0283k94309j160832r01901M52756
34533b39087J092700J71943r92942r53612j14980J33129m72748q19191j27788
$$ y = [-1079809, -795878, -23133, 583435, 438625, -181244, -555767, -468174, -298099, -303204, -242094, 240436, 1091476, 1741349, 1459881, 36155, -1706637, -2339264, -1145912, 1022499, 2422261, 1901551, -267590, -2655849, -3632095, -2605879, -747455, -29195, -1083816, -2495167, -2742806, -2161626, -2030400, -2315610, -1754826, -137783, 982800, 388225, -1077928, -1556166, -256567, 1994721, 3665090, 3575916, 1734661, -429393, -1220528, -398355, 839453, 1691535, 2539079, 3544899, 3795555, 2803219, 1769758, 2044412, 3054535, 3192511, 2286129, 1624916, 1665199, 1370890, 210058, -691843, -239087, 853613, 1025556, 32614, -920998, -1035978, -902849, -1375597, -2194788, -2322576]
34524b322576R59944J334308Q50481J94947l27516r67937j480676j011292M20900
34515b349417J360820P94561k38676j46027P53193Q24989j15022m54230N38023
34506I68214J432492Q06721p02248j490448j098281k45404M27719O62955K44852
34497A006572o68194j241920q02821K52048R39260P94218Q2033o64733r07565
34488a211102m07173L09266L53917k30700l16660O01548J388336Q52262l73271
34479I66423p21773n5320K15796n78603j254456n23029J023695J567377M61018
34470A101128q50288o33227Q85848J784121R72660m08111p09188q5527O3137n05074
34460A615479o12710J03839M24624l04073q58693j65307P02563J70068j098242
$$ y = [-2322576, -1362632, -28324, 822157, 1017104, 689588, -278349, -1759025, -2770317, -2349417, -988597, -194036, -432712, -578739, 174454, 999443, 884421, 430191, 968214, 2400706, 3207427, 2505179, 1014731, -83550, -328954, 98765, 761720, 1006572, 338378, -903542, -1706363, -1454315, -515055, 279163, 361196, -303537, -1211102, -1618275, -1309009, -955092, -1185792, -1502452, -900904, 487432, 1339694, 966423, 244650, 189330, 405126, -173477, -1427933, -1950962, -927267, 640110, 1101128, 250840, -382387, 503461, 2287582, 3260242, 2852131, 2142943, 2057416, 2120553, 1615479, 1002769, 1106608, 1531232, 1227159, 368466, 203159, 905722, 1075790, -22452]
34451b2452j020328O27627J699523Q05173p16475q28723L63577R87584R4709j195847
34441G94368j354332l87691L89907J44252n99634r36096p93081o99024p65144
34432d206475n87064M676P73446J537224K056038J622607j59163k080470k099540
34423c138721N77J864535J388576n86556j502021m03801J191080J567817P75586
34414A157072J9094j04315j25709n93703r92959l50939J039449J424076o2342
34405A409724j657308j087574R75629J585740j46761j667563q71916Q58483J192499
34396E90953M95015O14018J346938Q37512r97219k091417j446041m03488j90406
34387a244135k28164K85329Q39801P30722M01253N29206P20160K36806n89803
$$ y = [-22452, -1042780, -415153, 1284370, 2089543, 1373068, 544345, 907922, 1895506, 1990215, 794368, -559964, -947655, -557748, -413496, -1013130, -1949226, -2742307, -3441331, -4206475, -4793539, -4788863, -4015417, -2478193, -422155, 1200452, 1041289, -1039181, -3138721, -3138144, -1273609, 114967, -471589, -1973610, -2377411, -1186331, 381486, 1157072, 1176166, 1071851, 946142, 352439, -640520, -991459, 47990, 1472066, 1409724, -247584, -1335158, -359529, 1226211, 1079450, -588113, -1460029, -601546, 590953, 1085968, 1699986, 3046924, 3884436, 2887217, 795800, -650241, -1053729, -1244135, -1472299, -1186970, -347169, 383553, 784806, 1314012, 2034172, 2270978, 1681175]
34378A681175p45908m3611O46691O25859J39185k21053l95225p66591j322064
34369d01542j368991m27439Q47733J220179L68729p50188j118279n98721L81488
34360a847031J233556J168268j21220j407026r05365J057251J876678K24248j802019
34351e22660j644256J0459N75843l73173q37043J27602J088076P19697l84708
34342a240163r73495o92112J15102R19999J024115J99884n83693k69296N39889
34333i59770L74283o27021p56717N14059J596190J161551q4696p22038m28173
34324F7668J97156N53831K65070n79293j132321p13155n112j04731n50019L3600
34314a967306J337657J444235j23989j495578j282818l23308K73744Q01610J528419
$$ y = [1681175, 935267, 891656, 1538347, 2164206, 2303391, 2082338, 1687113, 920522, -401542, -1770533, -2197972, -1350239, -130060, 238669, -511519, -1629798, -2228519, -1847031, -613475, 554793, 433573, -973453, -1878818, -821567, 1055111, 1279359, -522660, -2166916, -2156457, -1580614, -1953787, -2790830, -2663228, -1575152, -855455, -1240163, -2213658, -2905770, -2790668, -1870669, -846554, -646670, -1230363, -1499659, -959770, -585487, -1212508, -1969225, -1455166, 141024, 1302575, 1217879, 495841, 67668, 264824, 818655, 1083725, 504432, -627889, -1341044, -1346156, -1450887, -2000906, -1967306, -629649, 814586, 690597, -804981, -2087799, -2411107, -2137363, -1335753, 192666]
34305A92666J510377K61912r89149j126084p53211o52546k25956R69919J686126
34296H74054Q12815n40752p04190p0728q5462n90438l48036M46172M13615n10273
34286c03223r51235n13500l64777j058186j473875n88865R23304J587041R35059
34277a808257p3229j56482Q71740J723487J078464m91761r73179K52208J261274
34268A684265L05536j530224j914917o53147L24203n3895q34171q83139l07976
34259c863465K56710N52458N63234L62427K30714K57369N1588l97255j35794J313426
34249h08588K481294J511926r98988k438254j606021l3907N47142L74123M54674
34240e16599O76204L60703k37065l05531J16271K73621L9771N4557M69355N54835
$$ y = [192666, 1703043, 1964955, 975806, -150278, -903489, -1556035, -1781991, -812072, 874054, 1686869, 1146117, 441927, 371199, 285737, -304701, -652737, -206565, 207050, -303223, -1254458, -1767958, -2132735, -3190921, -4664796, -5253661, -4330357, -2743316, -1808257, -1881486, -2037968, -1166228, 557259, 1635723, 1143962, 170783, 422991, 1684265, 1989801, 459577, -1455340, -2108487, -1784284, -1838179, -2672350, -3555489, -3863465, -3606755, -3054297, -2491063, -2128636, -1897922, -1640553, -1588965, -1986220, -2122014, -808588, 1672706, 3184632, 2185644, -252610, -1858631, -1892538, -1345396, -971273, -516599, 159605, 520308, 283243, -22288, 93983, 367604, 407375, 461932, 931287, 1486122]
34230A486122p3312o91158n99944l52388q17457j409192p16298R36933J336492
34221i00202k71319j473975j24933K046933J856674k84333j014087M42357J117828
34212A394943m25352j489485O0776J889041R04237j732543k666906j513340m69427
34203d048056j46429N82098J373958P12910q06102q90368O23733J494234Q70086
34194b33936L01773N49567M32211m59911q18210k42284n9635o17276n02196N34393
34184a115504P17997m37742q47317N24300J573874N64926r11400p90860K3951
34175f97775k89170j003652l27219J158896J493839P05662L41426M38265j85328
34166A634944j122061p42675P08245J108218j70412j345271j173923n69081n70358
$$ y = [1486122, 1412810, 721652, 121708, -230680, -1048137, -2457329, -3173627, -2236694, -900202, -1171521, -2645496, -2770429, -723496, 1133178, 848845, -165242, 277115, 1394943, 969591, -519894, -459118, 1429923, 2334160, 601617, -2065289, -3578629, -4048056, -4194485, -3612387, -2238429, -1525519, -2331621, -3221989, -2598256, -1104022, -233936, 67837, 617404, 1049615, 589704, -228506, -470790, -530425, -1147701, -1649897, -1115504, -397507, -835249, -1682566, -1158266, 415608, 980534, 69134, -721726, -697775, -986945, -1990597, -2317816, -1158920, 334919, 1040581, 1382007, 1820272, 1634944, 512883, -229792, 478453, 1586671, 1416259, 70988, -1102935, -1672016, -2242374]
34157b242374p19699l47449K06292N44892R18130J143868K88880j571162k592453
34148d371075j398974Q59413J898662J107221j43121n15716M2326Q47837J317881
34139c55546J204010O16926q0808o65579j167314j411171r36782J68335Q63878
34130a764051L11325q63152j245939m38161O20262J094084J129843J099979Q57757
34121H01947K23836m42456o93628n46962j90783L06563O05208J63271p11360p51861
34111a236225M22322J248229L09000j278929j270568L66070J508419J200248O81737
34102A950303P17742K99703r69288j492870k85335R98578N98538m13939p063J250558
34092B646927J078072p25616j973596j477442l65850K46026P41850J520825J809936
$$ y = [-2242374, -2962073, -3309522, -3103230, -2558338, -1640208, -496340, -207460, -1778622, -4371075, -5770049, -4910636, -3011974, -1904753, -2047874, -2563590, -2521264, -1673427, -355546, 848464, 1465390, 1384582, 719003, -448311, -1859482, -2796264, -2627929, -1764051, -1452726, -2315878, -3561817, -3999978, -3379716, -2285632, -1155789, -55810, 801947, 1025783, 583327, -110301, -657263, -848046, -541483, 63725, 226996, -484364, -1236225, -813903, 434326, 743326, -535603, -1806171, -1440101, 68318, 1268566, 1950303, 2668045, 2967748, 1998460, 505590, 220255, 1218833, 1817371, 1403432, 1396369, 2646927, 3724999, 2999383, 1025787, -451655, -817505, -571479, 170371, 1691196, 3501132]
34083C501132Q77892o91263j667932j458225m49048L45306O4770r48886j261633
34074a687887k25351R27349Q34353k7603m29324m75549q93460j114334j67088
34065c258894J098772R87128j18721j72276J179941K014984J205357j23134o63618
34056B149539m82910n8482M26038M92269j99967p25226j0166J048846O98747o36349
34046B702339r29171p8935p184j007348j113273K44658J111720N38486J36564
34037A597856Q25480J072570l1994q46657j68234N28918j61768j048301o37072
34028A130798K56590K71291j39878q7098o7650n47092o05524K44038Q22402N11369
34018A789246N76156J567331J756004J20867j463505j196102k33797l19346p52591
$$ y = [3501132, 4379024, 3687761, 2019829, 561604, 112556, 457862, 522632, -426254, -1687887, -1913238, -985889, -151536, -179139, -608463, -1084012, -1977472, -3091806, -3258894, -2160122, -1172994, -1291715, -1463991, -284050, 1730934, 2936291, 2813157, 2149539, 1666629, 1608147, 2034185, 2526454, 2326487, 1601261, 1591095, 2639941, 3338688, 2702339, 1773168, 1694233, 1687049, 679701, -433572, -188914, 922806, 1461292, 1597856, 2423336, 3495906, 3463912, 2617255, 2449021, 2977939, 2816171, 1767870, 1130798, 1387388, 1658679, 1518801, 1431703, 1364053, 816961, 211437, 455475, 1277877, 1789246, 2365402, 3932733, 5688737, 5809604, 4346099, 3149997, 2916200, 2596854, 1844263]
34009A844263j87127O26302M45536J8419M71942R72922L81057m66050l76418L424
33999C734270k96321o96429o26055q51680j422813p96412J030941J411519o53226
33990H33794k209379r58869J053592J251751O65470J037376J237188J40157l52325
33981B698755R96902J546558o43044k612647j332458R34062Q69708r3654N68696
33972B932878R61246j209516k934240p01686K549784K123759k07027J14116J895080
33963E524394J097079r53477m62952Q35314p73576k636819k30982L244117J920950
33954G564048j331713K68320M352042L551675k01503P38956M493673L324129K15172
33945B2974799M378145J1938588J1198309O261156J1556572K2260122K0338737
$$ y = [1844263, 1657136, 2283438, 2728974, 2747393, 3219335, 4192257, 4573314, 4107264, 3730846, 3734270, 3437949, 2741520, 2115465, 1263785, -159028, -955440, 75501, 1487020, 833794, -1375585, -2334454, -1280862, -29111, 636359, 1673735, 2910923, 3051080, 2698755, 3695657, 5242215, 4599171, 1986524, 654066, 1588128, 2457836, 2364182, 2932878, 3894124, 2684608, -249632, -951318, 1598466, 3722225, 3515198, 3629314, 5524394, 6621473, 5667996, 5205044, 6040358, 5266782, 2629963, 2398981, 5643098, 7564048, 6232335, 6500655, 10852697, 14404372, 14202869, 14941825, 19435498, 22759627, 22974799, 27352944, 39291532, 50489841, 56750997, 68307569, 90567691, 110906428]
33938A10906428J5677526M2927209R7794316J15172095M7954265n8112660j12132033
33931B60187146q7599315m0232063k1736204k4047887j8836426p353076n726856
33924E4655319j0699500q583153j586329j154422n792869n560418r40214l4206
33916B0304208k777692k882092p88948j460744l323599j422226K007290J256032
33908A0912229j850517j251454J948236J674802j811957k778268n96577p398j758252
33899D480844j854897K54598R25655l82545n50113N87673J67595j325102n79891
33890A723817J682613J303113j629767k528465l33464R40361l12043q72644O53990
33881F27511J119979j000430k451310q90841J222300J251963N15201Q98646J218101
$$ y = [110906428, 126583954, 169511163, 267305479, 382477574, 430431839, 372319179, 260187146, 172587831, 132355768, 110619564, 86571677, 67735251, 60382175, 54655319, 43955819, 35372666, 33786337, 32631915, 26839046, 21278628, 20338414, 20304208, 17526516, 14644424, 13855476, 12394732, 9071133, 7648907, 9656197, 10912229, 9061712, 7810258, 9758494, 11433296, 9621339, 6843071, 6246494, 6239096, 4480844, 2625947, 2880545, 3806200, 3423655, 2873542, 3461215, 3628810, 2303708, 1723817, 3406430, 4709543, 3079776, 551311, 217847, 1158208, 846165, -26479, 627511, 1747490, 747060, -1704250, -2595091, -1372791, -120828, 394373, 1293019, 2511120]
33872B511120K715j294177q68383K19643J53500m59726q8187P88531O59790l39819
33862A285007q20544l82401J56775K13976k5653j15049K30319P78436P68412m3558
33852B045720n94579J19936J235958J026644n00202j609715j358948m77277K54325
33843A41862Q23696J062094N21866m34015p73731k36863M70620Q18408O85340
33834C079277j51907j463560k009231j012553L48441N03356j23440j07320L14076
33825f22861k00783j318078j250762K54588J481011J498992J166279J031986L72300
33816B412672j067112k160007j912890n75143J052266K173283J937666L03840
33808B164575j152281q56330M96651R21597J20311l75523J27089O44531M04805
$$ y = [2511120, 2513835, 1219658, 351275, 570918, 724418, 264692, 176505, 965036, 1624826, 1285007, 464463, 82062, 238837, 452813, 427160, 312111, 542430, 1320866, 2089278, 2045720, 1451141, 1571077, 2807035, 3833679, 3333477, 1723762, 364814, -112463, 141862, 965558, 2027652, 2549518, 2115503, 1341772, 1104909, 1575529, 2393937, 3079277, 2927370, 1463810, -545421, -1557974, -1209533, -706177, -829617, -936937, -622861, -823644, -2141722, -3392484, -3137896, -1656885, -157893, 1008386, 2040372, 2412672, 1345560, -814447, -2727337, -3302480, -2250214, -76931, 1860735, 2164575, 1012294, 155964, 652615, 1574212, 1694523, 1319000, 1446089, 2090620, 2495425]
33799B495425k41403q59206j246425q77943L15514J017352J86392r38716n46666
33790f95676P68266J113983N64870N03766N00828p75348k061707q34249J860672
33781I45405K158063m21887j945373n14678P82999n02182j949966p09819J471772
33772f85666J304934o56123j394750l21101O97609Q75412R41508R84931N69741
33763B316495J83186K88481n2201j443248k295770j066346Q66302J110186l1711
33754a24626m48083Q4316k5415r15285r82810J50457J010261Q64717O48702R17131
33744A179365R24316K57929l28899k55796O7986J46360J6372j83097k97948O3471
33734A590059Q61772J090457M5075j282733j336854j46199R14354J080285O05573
$$ y = [2495425, 2254022, 1394816, 148391, -729552, -414038, 603314, 789706, -149010, -695676, 72590, 1186573, 1751443, 2255209, 2756037, 1980689, -81018, -915267, 945405, 3103468, 2681581, 736208, 221530, 1004529, 502347, -1447619, -2157438, -685666, 619268, -36855, -1431605, -1752706, -1055097, -179685, 761823, 1746754, 2316495, 2499681, 2788162, 2735961, 1292713, -1003057, -2069403, -1203101, -92915, -124626, -572709, -488393, -513808, -1429093, -2411903, -2261446, -1251185, -386468, 262234, 1179365, 2103681, 2361610, 2032711, 1776915, 1844901, 1991261, 2007633, 1824536, 1526588, 1590059, 2451831, 3542288, 3587363, 2304630, 967776, 821577, 1735931, 2816216, 3421789]
33725C421789k71525j277451j447576j46534J471713J570581Q2353j343384j640452
33716D19514j168312m99944J44064M05483J49471J24103Q95284J494894O91334
33707B655891p78528j050812R307P16475L21212j12343J76993N47619M30027K23587
33697C139428K07407K4186l20363k93518N7215J67030J74733N60213O54963n68096
33687C803198k153750j868443L04476J727047R75832k27370j35849L49362j54027
33678B620476p76855n1407J219323J127953k14182r78175n36959M231j2180l5231
33668B366994J66655m0247p49331r63045o7837J125379J443987Q00039n166n07263
33658C570165r85938j646530j898460r58089Q32996J972654J583072O09486L68966
$$ y = [3421789, 3150264, 1872813, 425237, 278703, 1750416, 3320997, 3403350, 2059966, 419514, -748798, -1248742, -1104678, -699195, -549724, -425621, 469663, 1964557, 2655891, 1877363, 826551, 835858, 1552333, 1873545, 1761202, 1938195, 2485814, 2915841, 3139428, 3346835, 3371021, 3050658, 2757140, 2814355, 2981385, 3156118, 3716331, 4371294, 3803198, 1649448, -218995, 85481, 1812528, 2788360, 2560990, 2425141, 2774503, 2620476, 1843621, 1792214, 3011537, 4139490, 3925308, 2947133, 2410174, 2414405, 2402225, 2366994, 2533649, 2493402, 1744071, 781026, 713189, 1838568, 3282555, 4082594, 4077428, 3570165, 2584227, 937697, -960763, -1918852, -1085856, 886798, 2469870, 3079356, 3448322]
33649C448322M87223l57622j926496k411226j178900K54865O00525L77045K45270
33640d60994l73272j635261j965822l04327J635398J489167k35166r96457q5829
33631b932563P03956K74958k53647J53130O02227j49682j563017j944141o19963
33622e728742J316307K205357J470598K43010J74331J313091J794214M28843j255684
33613A961325j056461M38647N27599j418172k768804j483911R25735J713692O04498
33604e55852n16486n52279n0773L03915L92500Q8645n79140q03125J40570J413879
33594g18146J314567l42094j743209j388975J20303J122196R03826R7827l26081
33585i59786R8991J077488J665862J020922n43151j602684j174552R5548P91007
$$ y = [3448322, 3935545, 3577923, 1651427, -759799, -1938699, -1683834, -1083309, -706264, -460994, -834266, -2469527, -4435349, -4739676, -3104278, -1615111, -1850277, -2846734, -2932563, -2228607, -1953649, -2207296, -2054166, -1451939, -1601621, -3164638, -5108779, -5728742, -4412435, -2207078, -736480, -493470, -319139, 993952, 2788166, 3217009, 1961325, 904864, 1343511, 1871110, 452938, -2315866, -3799777, -2874042, -1160350, -555852, -1072338, -1624617, -1675390, -1371475, -978975, -890330, -1469470, -2272595, -2132025, -718146, 596421, 254327, -1488882, -2877857, -2757554, -1635358, -731532, -633705, -959786, -860795, 216693, 1882555, 2903477, 2360326, 757642, -416910, -321362, 469645]
33576D69645N16662J97708N87807J138890P76982n02226j406817r12536L51266
33567A217381Q10874j3108q54060m47132O85118R61210m4069j074485r80299j24187
33557A37243L83344J14705n23828r88471q97561j31146Q19260J080533N32711
33548E26790J46250N05049O83946l51617j785506j797089j96809J283288J484812
33539D99114J069292Q10736K44256j010277j906828j281203L29115J404158J356813
33530A515176O50073k78159r95648p32494M67910Q98521p52351k918539k779832
33521d925343l12116J523659J034442j14004r682O22663K91134m42153j63190
33512b494590O88767O39073j01749q4120O18139M78568o31606j035788j67042
$$ y = [469645, 986307, 1184015, 1771822, 2910712, 3687694, 3185468, 1778651, 866115, 1217381, 2028255, 2015147, 1161087, 713955, 1399073, 2360283, 2316214, 1241729, 261430, 137243, 520587, 635292, 111464, -877007, -1774568, -1905714, -1086454, -5921, 526790, 673040, 1178089, 1862035, 1510418, -275088, -2072177, -2268986, -985698, 499114, 1568406, 2379142, 2623398, 1613121, -293707, -1574910, -1245795, 158363, 1515176, 2165249, 1887090, 891442, 158948, 626858, 1525379, 773028, -2145511, -4925343, -5237459, -3713800, -2679358, -2793362, -2803044, -2180381, -1889247, -2331400, -2494590, -1805823, -1166750, -1268499, -1352619, -734480, -255912, -887518, -1923306, -2090348]
33503b090348L54048n27962j458317q58104O53572J481740J419079J224998Q61255
33494A059961j35318j156170j120099k91913O3544k75067l11509K50646M54639
33485a461286j99174q70909p52235j44555M17565R95420J485882J121670k89100
33476C03278j468361j122910K58624J124724R42481M55949J79639j09493l71649
33467A92282n5794P65804J055407K27873q27950q59815P7375P82292N34033j13120
33457A778387k36378K37892N14446n007r01445j164199m10688N86823P82453L9454
33447A221738q65708j217552r22185k48002M34824O47907J26809o69357q51429
33438b342955j21323Q76829J342829J026869J11785r71039j446828p09882O60118
$$ y = [-2090348, -1736300, -2264262, -3722579, -4580683, -3927111, -2445371, -1026292, 198706, 1059961, 924643, -231527, -1351626, -1643539, -1579995, -1855062, -2166571, -1915925, -1461286, -1660460, -2531369, -3283604, -3428159, -3010594, -2015174, -529292, 592378, 303278, -1165083, -2287993, -2029369, -904645, 37836, 493785, 673424, 563931, 192282, 136488, 902292, 1957699, 2185572, 1357622, 497807, 575182, 1357474, 1891507, 1778387, 1542009, 1779901, 2294347, 2289340, 1387895, 223696, -186992, 399831, 1182284, 1221738, 356030, -861522, -1783707, -2031709, -1596885, -948978, -822169, -1491526, -2342955, -2464278, -1587449, -244620, 782249, 894034, -77005, -1523833, -2233715, -1573597]
33429a573597J185360M11599k32814O04371K033870J953345n498j880875j925281
33420E70480n85901N19251O24043J26093l92911o18475l63064K39745N62550J63148
33410H44959m69617n07757p9120j73921j027736j447437m35896J105644J334996
33401h55885m310j154444p65148L61635P17565L31049L46125R23087J048774L73608
33391A322056k37415k55323j99829l64733k48060J10008k58843j333809j376978
33382b842926M45462K159396J596131k44942p28995L06361O42020l53882p84809
33373A93816J92472P09028n55056j880957j167520P35077J464983O96285R0813
33364D78941L99680O71188J70700o12540r57894o59796K02457J192914J385941
$$ y = [-1573597, -388237, 23362, -209452, 394919, 2428789, 4382134, 4376636, 2495761, 570480, -15421, 503830, 1127873, 1253966, 861055, 242580, -120484, 119261, 681811, 844959, 375342, -132415, -211535, -385456, -1413192, -2860629, -3296525, -2190881, -855885, -860195, -2014639, -2779787, -2418152, -1700587, -1369538, -1023413, -100326, 948448, 1322056, 1084641, 829318, 629489, 264756, 16696, 126704, -132139, -1465948, -2842926, -2397464, -238068, 1358063, 1113121, 384126, 690487, 1332507, 978625, 193816, 386288, 1095316, 540260, -1340697, -2508217, -1773140, -308157, 388128, 478941, 878621, 1549809, 1720509, 1107969, 150075, -509721, -307264, 885650, 2271591]
33355B271591L55754q95197j024877j22212O55360Q59705R13830P82327j6050
33346C780231j019291r53868L46882J414104J055148k07726j087038j052064m77954
33337A798424l0522k25117r20064j147107k61656P95021N37411p19042j043156
33328a215808J94245J242764O73131m42479m00275L97218L31320o00901p82277
33319f03062L49151J369319R53870m15778j329865j103643r4932R18475J248360
33310A291895O92959k21146p00326n17622j01767J21949L9771l64050r16873j019980
33300a695190k39543P78706P85229l78834j305944p59547O88243J434868R40289
33291B48277K66485M65320J104506R00635m03121j453008r52209M95070R94482
$$ y = [2271591, 2627345, 1732148, 707271, 585059, 1240419, 2100124, 3013954, 3796281, 3780231, 2760940, 1807072, 2153954, 3568058, 4623206, 4415480, 3328442, 2276378, 1798424, 1767902, 1542785, 622721, -524386, -786042, 8979, 546390, -172652, -1215808, -1021563, 221201, 894332, 451853, 51578, 448796, 780116, 179215, -603062, -253911, 1115408, 2069278, 1653500, 323635, -780008, -874940, 43535, 1291895, 1984854, 1763708, 1063382, 545760, 443993, 565942, 605713, 241663, -675210, -1695190, -1934733, -1156027, -370798, -749632, -2055576, -2815123, -2126880, -692012, 248277, 514762, 980082, 2084588, 2985223, 2582102, 1129094, 176885, 671955, 1666437]
33282A666437j19634j304851r34341M21399R01271P6610o07170j77452M74948
33273C97217J58853p68978j052136l68620M41137O80489N28138N27730Q63843
33264A407673J121435O03116p74250j822284j113730R22693J944259O03079j432707
33255A459284j655393j60738P81405K22089m26617q1219L45368j44213p97102
33246d57136m92186L44358O33265M73495O23731R23851P27880L10767L15486K98127
33236C701638n32928j506976j259085j69249k4148j032241j285376J40918J587339
33227c80108J399789L20861q3127J54574J33540m2652J38129J55784n77232j146910
33217G2648m32871P09471O08798l78493m37938M99284N90917o18347j248727k27125
$$ y = [1666437, 1546803, 241952, -692389, -270990, 630281, 706891, 99721, -77731, 397217, 556070, -212908, -1265044, -1633664, -1192527, -512038, 16100, 543830, 1407673, 2529108, 3132224, 2357974, 535690, -578040, 344653, 2288912, 2891991, 1459284, -196109, -356847, 424558, 646647, 220030, 138811, 484179, 339966, -457136, -949322, -604964, 28301, 501796, 1125527, 2049378, 2777258, 3088025, 3403511, 3701638, 3168710, 1661734, 402649, 233400, 209252, -822989, -2108365, -1967447, -380108, 1019681, 1340542, 1257415, 1411989, 1545529, 1502877, 1641006, 1796790, 1219558, 72648, -360223, 349248, 958046, 579553, 141615, 640899, 1231816, 613469, -635258, -862383]
33207h62383R50494P77709k6758k94312n14636j378196j825612o72933R56892
33198b889735J051412j55213o51836J57157R22146R13031R22228J303714J150683
33189B723587R2460q17861q21505n84134p59702p88462j14921N91251N44090J91278
33179B56081K92410M57545j28202j058567j073083J07664J372360J633452Q70521
33170B730181j83529p50366n11700L6395n8324r85161j708039j364606n86666
33161c381815m51660n84501L16331K104900K888131J648639j55338n79919J57089
33152A961857K39163j010921k251071k044378o08958P30077J079599M90539m73259
33143a887352j044138n12552J044534K362770K065713L30483j138393j083444
$$ y = [-862383, 88111, 865820, 839062, 544750, 30114, -1348082, -3173694, -3846627, -2889735, -1838323, -1993536, -2645372, -2488215, -1566069, -653038, 269190, 1572904, 2723587, 2816047, 1998186, 1176681, 592547, -167155, -955617, -1070538, -479287, 64803, 256081, 548491, 1006036, 877834, -180733, -1253816, -1146152, 226208, 1859660, 2730181, 2546652, 1796286, 1284586, 1320981, 1262657, 277496, -1430543, -2795149, -3381815, -3833475, -4417976, -4101645, -1996745, 891386, 2540025, 2384687, 1804768, 1961857, 2201020, 1190099, -1060972, -3105350, -3714308, -2984231, -1904632, -1414093, -1887352, -2931490, -3444042, -2399508, -36738, 2028975, 2359458, 1221065, 137621]
33135A37621o3145N28565K02928m39063p43685n26244L4722L42462k60686j287198
33125b073723j028653J044545K623749J265150j692817k461309k42935J607769
33117i58224Q77836k37004P23756K047629Q39117j697036j974585O9182J053960
33108G44631k8042m34822J105429K013668M42496j456421j245046j06850k63122
33099G71921j003397l93339R45540R83894p6530m29977k8400k68019r24619m69231
33089h92157P87054Q76807l47233p79301M24628J543207J210281K45772k57853
33080B811205m70183n53296L7641R99937R38751k64060q11232J14629Q41969L5364
33070C680725r73527n45203L30055k57833j719293j750222K5505J547310J397350
$$ y = [137621, 74476, 603041, 805969, 366906, -376779, -903023, -868301, -525839, -786525, -2073723, -3102376, -2057831, 565918, 1831068, 138251, -2323058, -2565993, -958224, -80388, -317392, 406364, 2453993, 3293110, 1596074, -378511, -309329, 744631, 716589, 281767, 1387196, 3400864, 3843360, 2386939, 1141893, 1035043, 771921, -231476, -624815, 320725, 1304619, 1228089, 798112, 769712, 501693, -422926, -892157, -105103, 771704, 424471, -354830, 69798, 1613005, 2823286, 3069058, 2811205, 2341022, 1787726, 1825367, 2825304, 3764055, 3499995, 2688763, 2803392, 3645361, 3680725, 2707198, 2161995, 2492050, 2234217, 514924, -1235298, -1209793, 337517, 1734867]
33061A734867L47490m01900p23834p98273l79665L76077M71937o06680j780818
33052a760799j502302K26999J701307J484213J3250j102131j034140l60205K03737
33043b130071P70213J502030J765119J011092j20632o84237q65350j260377j287846
33034a300059p644J788897K261205J278068M17546P1360j025857k799856l030575
33025b346915q17593J545057J788568O44938j17746m85152r68193o73146Q86001
33016e44181J800705L81775j626406j367074O74467J569886N24067n53908n84382
33007B74949k97896J06906J136697J782995L17050k303081k935772q57322J103321
32998a672153Q90228k37447n72263m69819n48365p4871J095001J326138j53595
$$ y = [1734867, 2082357, 1680457, 956623, 158350, -221315, 154762, 626699, 20019, -1760799, -3263101, -3036102, -1334795, 149418, 162668, -939463, -1973603, -2333808, -2130071, -1359858, 142172, 1907291, 2918383, 2797751, 2113514, 1248164, -12213, -1300059, -1307703, 481194, 2742399, 4020467, 4438013, 4509373, 3483516, 683660, -2346915, -3164508, -1619451, 169117, 814055, 696309, 211157, -757036, -1430182, -544181, 1256524, 1638299, 11893, -1355181, -680714, 889172, 1413239, 859331, 274949, -22947, 83959, 1220656, 3003651, 3320701, 1017620, -1918152, -2775474, -1672153, -781925, -1019372, -1591635, -2061454, -2609819, -2684690, -1589689, -263551, -417146]
32989d17146j467565q58655N93567R54776M34712L51620N66303J24241o19529
32980c37676o11386j02160j80338q15625r46708j53915R49051J573276J208069
32971E82588m3741r84052l31045J178584J294238l38382j311686k69935P57115
32962E33684j57514j304587j17738K258761K518189L44351j383810j206876n97616
32953H86844o72167n50284K52992N78283j15036n23966K23515R71087M81824o08197
32943I24895j055084q79296o75631j72076J092227K326499K117511L73115j365638
32934B686522j719037r88778n69714j038305j312636j53982J808192K560183J398991
32925B671436q7111l75822l2318k84740q61541p89805l03304j63039N7924R90117
$$ y = [-417146, -1884711, -2743366, -2149799, -1195023, -760311, -408691, 157612, 281853, -337676, -949062, -1051222, -1231560, -2047185, -2993893, -3147808, -2198757, -625481, 582588, 538847, -445205, -776250, 402334, 1696572, 1358190, 46504, -223431, 533684, 376170, -928417, -1046155, 1212606, 3730795, 4075146, 2691336, 1484460, 886844, 214677, -335607, -82615, 495668, 380632, -143334, 80181, 1051268, 1533092, 924895, -130189, -1009485, -1685116, -1857192, -764965, 1561534, 3679045, 4052160, 2686522, 967485, -21293, -591007, -1629312, -2941948, -3095930, -1287738, 1272445, 2671436, 2584325, 2208503, 2176185, 1891445, 1029904, 240099, -63205, -226244, -168320, 821797]
32915H21797J492348M2819k225414k477415l49298J406760J062861J86772O58768
32906F19998J690766J475968J51923p26738o91175o42111j068596j329827p10549
32897a230341N53129J377894Q38939o94489j624290r22560M43268P86541L2951
32888d38958m83189k78127j90481n91678q15619o20759n62884n89999J6616R17701
32878c637377Q11274j83897k55532J133803K056791J106969l68823n45119J10392
32869B28481J34829k75686Q7944J051311J213496Q8025j348403j916796j077964
32860a814763Q44085K409076J956724k42866j759484j020890N75526Q45434j01117
32851A691725n85236j66790J18536k53083p76737j052534j021456m44991N96894
$$ y = [821797, 2314145, 2356964, 131550, -2345865, -2695163, -1288403, -225542, -38770, 619998, 2310764, 3786732, 3938655, 3211917, 2520742, 1878631, 810035, -519792, -1230341, -677212, 700682, 1539621, 845132, -779158, -1701718, -1258450, -471909, -438958, -922147, -1200274, -1390755, -1982433, -2798052, -3418811, -3981695, -4571694, -4555078, -3637377, -2826103, -3010000, -3265532, -2131729, -74938, 1032031, 663208, 118089, 228481, 363310, 87624, 175568, 1226879, 2440375, 2528400, 1179997, -736799, -1814763, -970678, 1438398, 3395122, 3152256, 1392772, 371882, 947408, 1792842, 1691725, 1106489, 939699, 1058235, 805152, 28415, -1024119, -2045575, -2490566, -1893672]
32842a893672J180420P08310o137K475L20744J80927K9150M75591O53236m67982
32832A183062j895419j793838k98121R07967J308992J641780J685706M79734j268259
32823A951604j535619j36466Q32096K46265o11089n90907l97531p30406p59636
32814a731689K32987J359376J576188J228172R68550N05526l74318q48162m16645
32805B499985l8315n75307j199418p69331J72682L27635j89087k27524L14700
32796C16020M13992k14855o63095l76453R0486J73200J40582M18639Q06227Q15125
32786A919868L41438l35262r07301j151654r51070m62661j38159l30233q35338
32777b850372r88750l93932M84935P38172J22536n57243m11059M92845J336046
$$ y = [-1893672, -713252, -4942, -11079, -8604, 312140, 493067, 522217, 997808, 1651044, 1183062, -712357, -2506195, -2804316, -1896349, -587357, 1054423, 2740129, 3219863, 1951604, 415985, 279519, 1111615, 1357880, 746791, 155884, -241647, -972053, -1731689, -1498702, -139326, 1436862, 2665034, 3633584, 4139110, 3764792, 2916630, 2499985, 2461670, 1886363, 686945, -82386, 90296, 417931, 228844, 1320, 316020, 730012, 515157, -147938, -524391, -433905, -260705, -120123, 298516, 1104743, 1919868, 2261306, 1926044, 1018743, -132911, -1083981, -1546642, -1684801, -2015034, -2850372, -3839122, -4233054, -3748119, -3009947, -2887411, -3444654, -3855713, -3362868, -2026822]
32768b026822J481687Q68694j27643p89199m45127O60994J301683O87932m72937
32759A139262j013468q36740n35356j08998P22671J377497J008147O1007k00607
32750A613415L06914M30204k21121p48767o42480m17784k64216L01809R69370
32741A327344N74120p51301j134344K65831J688592J306396j38521p97716n55932
32732A784469n71850q79389m78752N20693P80395q7194q04525l40281O53351Q84539
32722A461456J06120q19691j113972q49774n87601n04212j44136P91447J720124
32713E9761J805314J147660N88740L79401j1399o92700j083637j096860j347145
32704b50865j758906j342637k9816P30441J96597k76364O07314J830199J599194
$$ y = [-2026822, -545135, 323559, 195916, -593283, -1038410, -377416, 924267, 1612199, 1139262, 125794, -710946, -1246302, -1355300, -632629, 744868, 1753015, 1814022, 1613415, 1920329, 2350533, 2129412, 1380645, 738165, 320381, 56165, 357974, 1327344, 1901464, 1150163, 15819, 281650, 1970242, 3276638, 3138117, 2340401, 1784469, 1212619, 333230, -145522, 375171, 1155566, 1068372, 263847, -76434, 576917, 1461456, 1567576, 747885, -366087, -1215861, -1803462, -2307674, -2451810, -1660363, 59761, 1865075, 3012735, 3601475, 3980876, 3969477, 3276777, 2193140, 1096280, -250865, -2009771, -3352408, -3382224, -2651783, -2455186, -2731550, -2124236, -294037, 1305157]
32695A305157J41618q39973q23184o98424p44164l13050M62717M92433l78187
32686a395057q52489j48153P79789P06771q9750l42205L80932J066744N23946
32677F30528j005817j820963p08367J269726J784463K03595j533591j535838k75242
32668b991506O20720P31133O90889N94995R9354m18832k70230L12186O21295P43712
32658G33716J104587J245727M84769o25400r65257n93740l48418j83097M04788
32649A257675P39153k48108j762972j785868j25085J173552Q11523k63880p60869
32640i64879n81263M9487J149093K030626J522866j47910j272758j039899l76699
32631C68664M1399O87958J432609J025122o07376j569662p95373K50580P8255
$$ y = [1305157, 1446775, 606802, -216382, -914806, -1658970, -1972020, -1509303, -1016870, -1395057, -2247546, -2395699, -1615910, -909139, -998889, -1341094, -960162, 106582, 630528, -375289, -2196252, -2904619, -1634893, 149570, 353165, -1180426, -2716264, -2991506, -2370786, -1639653, -948764, -353769, -254415, -673247, -943477, -631291, -9996, 733716, 1838303, 3084030, 3568799, 2943399, 1978142, 1384402, 1035984, 852887, 1257675, 1996828, 1748720, -14252, -1800120, -1925205, -751653, 59870, -204010, -964879, -1546142, -1496655, -347562, 1683064, 3205930, 3058020, 1785262, 745363, 368664, 410063, 1098021, 2530630, 3555752, 2948376, 1378714, 583341, 833921, 912176]
32622I12176m81074r8421O08029L83412l13707k82845J94952N4417n19294n78508
32612a20863j55161J59450N34128J134089R80857n88202k183168k019349n53028
32603b811247M79881Q25547J331647J592183N48927r35971q30396O75667J183928
32594B060166j02890j172288n75110M19371K22132n59335m30391O42619J500031
32585B004305J351088J66560j452444k189223j058087Q80841J309732j80329j370227
32576e37784p42491L24530N2196q21275n15414P20087J164096M90856m4605M4112
32566A34308p5442p31859j125742p96367k67022R7314O15921J318055J573383
32557G42549J111735M48634o5271o60307j219475r65391K54113J222742P85786
$$ y = [912176, 431102, 332681, 940710, 1324122, 1010415, 727570, 922522, 976939, 457645, -120863, -276024, -116574, 417554, 1551643, 2532500, 1944298, -238870, -2258219, -2811247, -2331366, -1505819, -174172, 1418011, 1966938, 1030967, 200571, 876238, 2060166, 1957276, 784988, 209878, 629249, 851381, 292046, -138345, 504274, 2004305, 3355393, 3521953, 2069509, -119714, -1177801, -296960, 1012772, 832443, -537784, -1280275, -955745, -903549, -1724824, -2240238, -1520151, -356055, 134801, 90196, 134308, 58866, -672993, -1798735, -2595102, -2862124, -2764810, -2148889, -830834, 742549, 1854284, 2302918, 2237647, 1577340, 357865, -607526, -353413, 869329, 1655115]
32548A655115m93357j015049k57056O61976O04890j46771m68356M0318O33478
32539A215188N33395l9764k58123J50381N64833L07516n43267j287623j283893
32530f41357m25725P41669J284111O37489o89115j487938j124165j11037P20923
32521a095145J131599J244223R54938J37992q58434j458933j447657r48431j03199
32512b443047Q22408J346456J275193R97823Q06553L49482o06189j335625r86537
32503B26517K7463M63803j2580n32840m62107q2077K62495N75176N39098l35062
32493F69886j449371j302029L19082J560902R60436m31654o87966J73767O20542
32484D33595K35073N2999M07386L39209m72323r05675k54830N22364L23203m69106
$$ y = [1655115, 1161758, 146709, -110347, 551629, 1156519, 1009748, 541392, 581710, 1215188, 1748583, 1708819, 1450696, 1601077, 2165910, 2473426, 1930159, 642536, -641357, -1067082, -325413, 958698, 1596187, 907072, -580866, -1705031, -1816068, -1095145, 36454, 1280677, 2235615, 2373607, 1515173, 56240, -1391417, -2339848, -2443047, -1620639, -274183, 1001010, 1998833, 2805386, 3154868, 2548679, 1213054, 226517, 253980, 717783, 705203, 172363, -289744, -371821, -109326, 465850, 1004948, 669886, -779485, -2081514, -1762432, -201530, 758906, 327252, -360714, -186947, 433595, 668668, 721667, 1129053, 1468262, 995939, 90264, -164566, 357798, 681001, 211895]
32474B11895q23761n54260k879Q17239J638337J385412l72204k021721j569733
32465a291675M96117J609472N34465j141984j388189k46211P82419Q15207J49437
32456C19058n39536o88205j0066J058706J426347N44804p17989j015771j37007
32447B40341Q51223R08863J8649r67048j107040k05787Q26355P73581l83913j225188
32437b69964o49747O02742R29898J9003q81056p74871j14417N7748m98912j055287
32427b634863q15230K46104J311929J483620P10338k21672p16312r24502j027099
32418b587687o79146J90599P26235K62554m44676k72713M12163L66068l01885
32409b328488k05491Q62652J376088N98402q7440N64187J572018J275555j43062
$$ y = [211895, -611866, -1166126, -1169005, -351766, 1286571, 2671983, 2299779, 278058, -1291675, -795558, 813914, 1348379, 206395, -1181794, -1428005, -645586, 169621, 319058, -220478, -908683, -918749, 139957, 1566304, 2111108, 1393119, 377348, 240341, 1091564, 2000427, 2019076, 1052028, -55012, -260799, 565556, 1339137, 955224, -269964, -919711, -316969, 612929, 631932, -249124, -1023995, -1138412, -1080664, -1579576, -2634863, -3450093, -3203989, -1892060, -408440, 301898, 80226, -636086, -1560588, -2587687, -3266833, -3076234, -2349999, -2087445, -2532121, -2804834, -2392671, -2026603, -2328488, -2533979, -1671327, -295239, 303163, 215723, 779910, 2351928, 3627483, 3484421]
32400C484421j154127j098029m87338K67182J004590J162383L73144o17132q83732
32391B051362p54259r88527j082746o9381J350577J430969J52170o49808k52550
32382A187807n2920q70097j322865j92556J313028J309095O0733o28437j10816
32373F92972N78117M72928l24589j127781j203544k46091R40187R69229j10025
32364F41403m19541R67579K155855J077259j166976j900709r64050m57144p63838
32355h30162n7754J761094K027113l12962k305656j227160J213808J647508J69011
32346B084840m75599L05308M36098p38977j280603k57962M99236m05657j490808
32337a324124r13072N29353R52038M84858N56541J002367L26212j391568k215559
$$ y = [3484421, 2330294, 1232265, 744927, 1012109, 2016699, 3179082, 3552226, 2935094, 2051362, 1297103, 308576, -774170, -843551, 507026, 1937995, 2090165, 1440357, 1187807, 1134887, 264790, -1058075, -1250631, 62397, 1371492, 1432225, 803788, 692972, 1271089, 1744017, 1419428, 291647, -911897, -1157988, -217801, 751428, 641403, 221862, 1189441, 3345296, 4422555, 3255579, 1354870, 390820, -66324, -830162, -887916, 873178, 2900291, 2587329, 281673, -945487, 268321, 1915829, 2084840, 1609241, 1914549, 2350647, 1611670, 331067, 73105, 572341, 166684, -1324124, -2237196, -1707843, -755805, -270947, 285594, 1287961, 1614173, 222605, -1992954]
32328a992954j351234l03463k56560k61580O48796J264335J27370j423714o67216
32319d216220K153311L486635J354150j694306k157110l52117O86822J3086l54768
32310a080517O85467J430691L91922j130716j136657P0249Q00213P22365P47795
32301A500812R12437L58409q28621j508695j192066m22868M04649J182857J262699
32292A669613J22653j203185j091468K00148Q18909K32706j39261L70187N19315
32283A499617m27381j223867q05997k3310J92055N24992J473266J663374Q0811
32274B953560j548918j051182O70710J026216j55013p57375k38777k78919j290515
32265f70213j336233M49694K023981J550150K08960P3170Q08834N48376r34018
$$ y = [-1992954, -3344188, -3647651, -3904211, -4165791, -3516995, -2252660, -2125290, -3549004, -4216220, -2062909, 1423726, 2777876, 1083570, -1073540, -1425657, -738835, -725749, -1080517, -395050, 1035641, 1427563, 296847, -839810, -769561, 30652, 753017, 1500812, 2413249, 2771658, 1943037, 434342, -757724, -1180592, -775943, 406914, 1669613, 1792266, 589081, -502387, -302239, 516670, 749376, 610115, 980302, 1499617, 1072236, -151631, -957628, -980938, -788883, -263891, 1209375, 2872749, 2953560, 1404642, 353460, 1024170, 2050386, 1895373, 1137998, 899221, 620302, -670213, -2006446, -1556752, 467229, 2017379, 2226339, 2299509, 3108343, 3656719, 2722701]
32256B722701j961084j538903m86442J33765L91444Q53888J379238J150771j92975
32247B452403j786012k228443j211376k2114P3718n14371n07603K26592P08628
32238b808578O82241Q79494J318843J010827j31212p37762j41394M69464N2933
32229E94856o35169n92560l04951m70274l68103P25662J656936R63820n03990
32220A066227p08818L39757P18309k12496r85644n81866K87915Q29173J116480
32211A869037R19992m19476k220028k507896q18327Q29124Q43312J91781L28479
32202i84002P75214M87279P0012N35429J018465O5471j532204j639620k14774
32193a418730O29342J04522k11836N90090J107664J89885r36310o99511K61903
$$ y = [2722701, 761617, -777286, -1263728, -1129963, -738519, 115369, 1494607, 2645378, 2452403, 666391, -1562052, -2773428, -2795542, -2721824, -3236195, -3743798, -3517206, -2808578, -2126337, -1246843, 72000, 1082827, 951615, 213853, 72459, 541923, 594856, -40313, -632873, -937824, -1408098, -1776201, -1050539, 606397, 1570217, 1066227, 357409, 697166, 1415475, 1202979, 217335, -364531, -76616, 752557, 1869037, 2789029, 2369553, 149525, -2358371, -3176698, -2347574, -1504262, -1312481, -984002, -208788, 278491, 348503, 883932, 1902397, 1967868, 435664, -1203956, -1418730, -789388, -684866, -896702, -306612, 801052, 990937, 54627, -644884, -382981]
32184c82981L60408l17025n14395j05356J0888k02293j2267L77592R3731n17449
32174a209147k15940P56007O98286o15101j167480J05629J380309P49427p62023
32165b80033r56706N5795M10745k46060m40093L76428J017679P43405K42132L7894
32155I61186k32486m67939J14367J188874J180939j85380j028665j57119R89702
32146B363479O99363l51097n70968j95656m76345j161255j019162k46117j08398
32137a066156n08601j33588J026248J506237R07631M50817N75710J63390j093751
32128A827937j638657n16572Q91966R60616J52587j79643n2095l09826p96052
32119C40261p08926j80352k928k14893k98144l64201p90218j035936k57954J079643
$$ y = [-382981, -22573, -339598, -853993, -959349, -948461, -1150754, -1163021, -785429, -691698, -1209147, -1425087, -669080, 29206, -585895, -1753375, -1647746, -267437, 481990, -280033, -1236739, -1180944, -770199, -1016259, -1456352, -1079924, -62245, 681160, 923292, 961186, 728700, 260761, 375128, 1564002, 2744941, 2559561, 1530896, 1373777, 2363479, 3062842, 2711745, 2140777, 1945121, 1468776, 307521, -711641, -957758, -1066156, -1574757, -1708345, -682097, 824140, 1731771, 2182588, 2758298, 2921688, 1827937, 189280, -327292, 564674, 1525290, 1677877, 1498234, 1446139, 1136313, 340261, -368665, -549017, -551945, -766838, -1064982, -1429183, -2219401, -3255337, -3513291, -2433648]
32109b433648J631507J168159P41272P81487N21039l35856q27786l16487L62302
32100A291989K07459m41143o57903m28537l40016l23558J36628P85632P44742
32091I75293o5095o89863n95161l80489n56654n33965L10000J211358Q45383o14179
32081i3372j502882r83715j71361k84788p36156j85784J158498J691766P46699
32072c61095n27365q54717k85891M21168Q45819Q04416J49054o61257o18495M32179
32062f56184J188257N68031o59302r42893j45243M90291K98935j01273j10623
32053g0004k7956k89360o47255n34317K02493J129144J488030P83707m45767q07500
32043G81215K43280J277866N82395j270449j979657p52943O53627O98916J64084
$$ y = [-2433648, -802141, 366018, 1107290, 1888777, 2409816, 2073960, 1246174, 929687, 1291989, 1499448, 1058305, 400402, -28135, -368151, -691709, -555081, 230551, 975293, 910198, 220335, -374826, -755315, -1311969, -1845934, -1535934, -324576, 520807, -93372, -1596254, -2579969, -2751330, -3036118, -3772274, -3958058, -2799560, -1107794, -361095, -888460, -1743177, -2029068, -1607900, -762081, 42335, 191389, -469868, -1088363, -656184, 532073, 1100104, 440802, -502091, -647334, -157043, 141892, 40619, -70004, -97960, -387320, -1034575, -1568892, -1366399, -237255, 1250775, 2034482, 1588715, 781215, 1024495, 2302361, 2884756, 1614307, -365350, -1118293, -464666, 234250, 398334]
32034C98334L58269P23227l1944j337967j328540K41306J537797J328854M15043
32025B304379j35148n55478j243196j437177m33159P43271M64776r92698j595024
32016b879454l54667J365350J859311J230069O82709N36636J28231o36783q79668
32007A051734j47036P20265O66191j79320p70224n39824M0302K47283k8450l56401
31997G04520m13224l10396l16905m32200l79626k5019L92529O00847O66077P18683
31987A205286M89159l52303j383399j605732p21660L26003N18738r336m10116
31978a943360l26713j5M60135J078572J428507R00137l41504j361925j544111
31969a650277j058906k32410P62886J432562J098924k4396o96974k20334N28598
$$ y = [398334, 756603, 1479830, 1447886, 109919, -1218621, -977315, 560482, 1889336, 2304379, 2169231, 1613753, 370557, -1066620, -1499779, -756508, -291732, -1284430, -2879454, -3234121, -1868771, -9460, 1220609, 1903318, 2439954, 2568185, 1931402, 1051734, 904698, 1624963, 2291154, 2111834, 1341610, 801786, 842088, 1089371, 1060921, 704520, 291296, -19100, -336005, -768205, -1147831, -1172850, -780321, -179474, 486603, 1205286, 1694445, 1342142, -41257, -1646989, -2368649, -2042646, -1523908, -1533244, -1943360, -2270073, -2270088, -1809953, -731381, 697126, 1597263, 1255759, -106166, -1650277, -2709183, -2941593, -2178707, -746145, 352779, 328383, -368591, -588925, -60327]
31960f0327L91944l10486l22904M88529P61429l68384j771543j557370M72197
31951b276915K322952K034434J4043j417722q18451P46037J317501N84816j92870
31942B313825l91583o97564j394893j529896n68096M38022M43974N0273K14203
31933a121735L77694l75677j093732r8220J862873K028693l10631k441173j973256
31924c145164J8997J045811O85365J92756m6421m73968n08632R07791K949185
31915A625720L252261J135960j277168j894418j141464o88456r08122q43163m5070
31906g83920P83319Q93864M11942L775L2875K09018M1000l92351m17818J87294
31896I68998N65675r0072j127679j206681l40970J32661k40910l85603K33787
$$ y = [-60327, 331617, 21131, -301773, 186756, 948185, 579801, -1191742, -2749112, -2276915, 46037, 2080471, 2094514, 676792, -141659, 604378, 1921879, 2506695, 2313825, 1922242, 1224678, -170215, -1700111, -2268207, -1830185, -1386211, -1335938, -1121735, -744041, -1119718, -2213450, -2311670, -448797, 1579896, 1269265, -1171908, -3145164, -3126167, -2080356, -1394991, -1202235, -1248656, -1722624, -2231256, -1323465, 1625720, 4877981, 6013941, 4736773, 2842355, 1700891, 1012435, 104313, -738850, -783920, -601, 893263, 1305205, 1308980, 1341855, 1550873, 1591873, 1199522, 781704, 968998, 1534673, 1444601, 316922, -889759, -1230729, -1098068, -1338978, -1724581, -1490794]
31887a490794N48962o6568k96029R57323K193705J232380j193184k113669n53692
31878g81566J239432J307095N17929N02466R38484N60234l64130m60970L59625
31869C818599O99238j19607j090612j132753n41819k51316m13729m36406p0810
31860D60785K22909L1970l55386l32432J42355L88399j14579r12466r91077j9731
31850a479253J123668J248655J72515r83039q97492M43493J475397P19990j227004
31841E96930k087468o99619J396614K020382J199022O01526O79578K64091r14280
31832C056776j393462m76581L14467l98894j569444j447197l86048r672l66254
31823b676309l7118J181466J814645J161473L24714K27036K46632l38705r18248
$$ y = [-1490794, -941832, -1008400, -1304429, -347106, 1846599, 3078979, 1885795, -227874, -781566, 457866, 1764961, 2282890, 2785356, 3723840, 4284074, 3919944, 3458974, 3818599, 4517837, 4398230, 3307618, 2174865, 1633046, 1381730, 968001, 531595, 460785, 683694, 715664, 360278, 27846, 170201, 558600, 444021, -468445, -1459522, -1479253, -355585, 893070, 1065585, 82546, -814946, -371453, 1103944, 1823934, 596930, -1490538, -2190157, -793543, 1226839, 2425861, 3027387, 3706965, 3971056, 3056776, 1663314, 1186733, 1501200, 1102306, -467138, -1914335, -2300383, -2310055, -2676309, -2713427, -1531961, 282684, 1444157, 1768871, 1995907, 2242539, 1903834, 985586]
31814I85586o15124J84398M60383J17311q0338J92524M43125K18052k81316n61068
31804A063533n18026n78002j053392j421490p34527R11305J956849J241780k36941
31795F31089n96760K16959M87895m46278j141193m25832P71770J035603N82546
31786A115799M41809N06105p0663j086735j412936p43297L7975K38045M8672j63983
31776a089209l08255k52799P4963K48856j54214o27110k67895O77823R04399J6050
31766g77391o99717j49301Q79799R41315K03826J76002J245605J890385R31997
31757D642520n45815o73365M10435P15312n88318j856680j411585K7364O12464
31748A332332J17680j91959J08580K44378Q0892L51118P59704q3659k078137k975214
$$ y = [985586, 370462, 554860, 1015243, 1132554, 1052216, 1244740, 1687865, 1905917, 1624601, 1063533, 545507, -32495, -1085887, -2507377, -3241904, -2330599, -373750, 868030, 631089, 34329, 251288, 739183, 292905, -848288, -1274120, -502350, 533253, 1115799, 1557608, 2063713, 1993050, 906315, -506621, -1249918, -1211943, -973898, -925226, -1089209, -1397464, -1650263, -1575300, -1326444, -1480658, -2107768, -2375663, -1697840, -793441, -777391, -1477108, -1626409, -746610, 194705, 398531, 574533, 1820138, 3710523, 4642520, 4096705, 3423340, 3833775, 4549087, 3960769, 2104089, 692504, 719868, 1332332, 1450012, 1258053, 1366633, 1611011, 1691903, 2043021, 2802725, 2719066, 640929, -2334285]
31738b334285j513053N82367J214993Q58149J034281J383097N96427p49706q94209
31729A78061M1341K42330o16941q90698N6455P88944L27948m53133p11510q27326
31719a864529q58049P0516J693303K013017K64604j411553r97293L95452N43558
31710a50974l37344m13183M34937O65127M929j99246L86206M38917n67751j325129
31700a063511q66148o6800l8959m20186k95551K68498O61003Q62388J113599J069753
31690A224086L12744o54842q79321k83056K82195K96301J44302K55535L36429
31681A034373n3607n51002l45327M42780N33077p40785k009607j346554R24528
31672b112124K280176J347541k03585k10169P63700M76773j358820k537531j597060
$$ y = [-2334285, -3847338, -3264971, -2049978, -1191829, -157548, 1225549, 1821976, 1072270, 178061, 219402, 461732, -155209, -1045907, -989452, -200508, 127440, -325693, -1037203, -1864529, -2722578, -2652062, -958759, 1054258, 1318862, -92691, -1089984, -694532, -150974, -488318, -901501, -466564, 198563, 203492, 4246, 390452, 829369, 261618, -1063511, -1929659, -1996459, -2035418, -2455604, -2751155, -2482657, -1821654, -959266, 154333, 1224086, 1536830, 881988, 2667, -280389, 1806, 298107, 442409, 697944, 1034373, 980766, 429764, 84437, 527217, 1060294, 319509, -1690098, -3036652, -2112124, 168052, 1515593, 1312008, 1101839, 1865539, 2342312, 983492, -1554039, -3151099]
31663c151099K44810J055376O34405R1813P0127L93417P68461R20242N03203l97945
31653A132810j083984j104666q10101n47010O260R95455J581191R75548j61646
31644I83857m74587J32713M46388p3600m54104J23210Q02566J84296j458939k228433
31634b016633j080919O79007J130149L67741K07093J264931J825617M74736j430841
31625A420881j541603m5957O27731l95917j192023l16806Q14880L40927r28405
31616a216292q10596Q01716J868394J176356m60910j788772k180346j268458O62056
31607c216852J875115P36576j583848j981864L03428K326456J545563o17642j105738
31598a718806L60246J421327Q73378k7276n5250K87177J65428j15336M8919L35693
$$ y = [-3151099, -2906289, -1850913, -1216508, -1124695, -1054568, -661151, 107310, 1027552, 1530755, 1132810, 48826, -1055840, -1865941, -2412951, -2406691, -1411236, 169955, 1145503, 983857, 509270, 641983, 1088371, 1014771, 560667, 683877, 1486443, 1670739, 211800, -2016633, -3097552, -2418545, -1288396, -920655, -713562, 551369, 2376986, 2851722, 1420881, -120722, -166679, 461052, 65135, -1126888, -1443694, -628814, -287887, -1216292, -2026888, -1225172, 643222, 1819578, 1358668, -430104, -2610450, -3878908, -3216852, -1341737, -605161, -2189009, -4170873, -3867445, -1540989, 4574, -613068, -1718806, -1358560, 62767, 936145, 908869, 853619, 1140796, 1306224, 1190888, 1239807, 1575500]
31588A575500Q2131n53136q79365p48552n82870n10199j80032M74977Q52431M01376
31578f7739n11009q84981l22770L92543K83663n05669r14674m19552L71366P18112
31568a860710O39587M58012J52509k82233m34067r2676K39233J45269O8008M65026
31558e02042P51568J39132r05965j261644r05953p03649o31035J28013J186110
31549b705465R38880p88568j900958r66877O19074Q92432L30516O94616J861938
31540a024412K082115J034810L19961O69212Q31276n3302q97899o15738k1777
31531B324246l40775j019937p28416J97989J59542j032020j663781o79790P71686
31522b011256J094194L89197j36933q9957k8910r7156K21297R05782J084899L40258
$$ y = [1575500, 1657631, 1104495, 225130, -523422, -1106292, -1616491, -1796523, -1321546, -469115, -67739, -578748, -1463729, -1786499, -1393956, -1110293, -1615962, -2530636, -2950188, -2578822, -1860710, -1221123, -763111, -610602, -892835, -1326902, -1419578, -1180345, -1035076, -967068, -502042, 249526, 388658, -517307, -1778951, -2684904, -3388553, -4019588, -3891575, -2705465, -1766585, -2555153, -4456111, -5422988, -4803914, -3911482, -3580966, -2886350, -1024412, 1057703, 2092513, 2412474, 3081686, 3912962, 3859660, 2961761, 2346023, 2324246, 1983471, 963534, 235118, 433107, 592649, -439371, -2103152, -2782942, -2011256, -917062, -527865, -664798, -754755, -783665, -880821, -659524, 246258, 1331157, 1671415]
31512A671415n50953p43982m59853k98811j30193L48979N11085l96468j533225
31503a582006j151153O77761J681141O09873p36417j97851J289554J030641j180845
31494D40698k529051j236345R91771J600781O00935q3715L71375Q93197L75025
31485A424671q94467j707772j179615L99148J594073J125336n14373j408579o60579
31476a822157M22656L73984k51016k0258Q95240J083679L10583k69159k68569
31467D54983n13867j010915m81301J194216J935198L12499j960811k160966l25062
31458b556026R91922M20585o36306m37209O42128R46921m6449j123680r56255
31449b754369K92289J208322Q54091q1398k56571L82433N15066m34081j205756
$$ y = [1671415, 1120462, 376480, -83373, -382184, -512377, -163398, 347687, -48781, -1582006, -2733159, -2055398, -374257, 235616, -500801, -698652, 590902, 1621543, 440698, -2088353, -3324698, -2332927, -732146, -131211, -214926, 156449, 1049646, 1424671, 530204, -1177568, -2357183, -1958035, -363962, 761374, 247001, -1161578, -1822157, -1399501, -1025517, -1276533, -1296791, -401551, 682128, 992711, 723552, 454983, -58884, -1069799, -1551100, -356884, 1578314, 1890813, -69998, -2230964, -2556026, -1564104, -1143519, -1779825, -2217034, -1574906, -627985, -674434, -1798114, -2754369, -2462080, -1253758, -399667, -481065, -737636, -355203, 159863, -274218, -1479974]
31440a479974o16007M44546L32901o75169q22783J86338O93269l7717m71588N73343
31430a872841J710529J062610o71690j212726j41110P24142L39671j70732L38052
31421A05905J193995J158517K91658m83969q18949r07838o89285j27520J85571
31412i1915k25007o96266k45159P84911J089665M39982N4064N61457Q90310J0305
31402B572347j272207j449096n90548j22354n21384o40176L55771J570549J601624
31393A504526M18288p55599j014500n48894q1014q0585m41012n88631q6013O60083
31383a013351O97635j43131p85252l36768N77849P31742P5709m17933l78809k95325
31373a287634k45828K58223R61360Q29399j59971o01141J72318Q87022M08677
$$ y = [-1479974, -2095981, -1651435, -1318534, -1993703, -2816486, -2630148, -1936879, -1974596, -2446184, -1872841, -162312, 900298, 228608, -984118, -1125228, -401086, -61415, -232147, 105905, 1299900, 2458417, 2750075, 2266106, 1447157, 539319, -149966, -277486, -91915, -316922, -1013188, -1258347, -473436, 616229, 1056211, 1110275, 1671732, 2562042, 2572347, 1300140, -148956, -739504, -861858, -1383242, -2023418, -1667647, -97098, 1504526, 1922814, 1167215, 152715, -396179, -477193, -557778, -998790, -1587421, -1673434, -1013351, -315716, -458847, -1244099, -1580867, -1003018, -271276, -195567, -613500, -992309, -1287634, -1533462, -1275239, -313879, 515520, 355549, -245592, -73274, 813748, 1222425]
31364A222425k98557J73795J141389Q82255m00573q53339j16390O8075j102117
31355G16963j974820j061220N76959J024598L34385Q233M53824O62300J29738
31346H70960m65257o14809p30278j174419j476182r66010L40161J739988K333770
31337a42076J540065k84381j717149j487088n0299P27728j41252j415138j196839
31328d166429N20645J757677J100931m72260r59027n4559N30227l44356j446350
31319c533501q94367R94303J972421R74353m57083m17278Q55987J647988J135564
31310B278387L6485o68764o72514j79069L78389N21765K03804m5147J14366K63447
31300B231149n5379m91451m20876M7002K71828l0857o57118j219327j111994O9386
$$ y = [1222425, 923868, 1097663, 2239052, 3121307, 2720734, 1867395, 1751005, 1819080, 716963, -1257857, -2319077, -1742118, -717520, -383135, -374902, 78922, 741222, 870960, 405703, -209106, -939384, -2113803, -3589985, -4555995, -4215834, -2475846, -142076, 1397989, 1113608, -603541, -2090629, -2140928, -1413200, -1554452, -2969590, -4166429, -3645784, -1888107, -787176, -1259436, -2218463, -2273022, -1742795, -2087151, -3533501, -4427868, -3433565, -1461144, -486791, -943874, -1361152, -505165, 1142823, 2278387, 2314872, 1646108, 973594, 794525, 1172914, 1694679, 1898483, 1853336, 1967702, 2231149, 2175770, 1684319, 1263443, 1310445, 1582273, 1551416, 894298, -325029, -1437023, -1367637]
31290a367637J461450J335896m94885j904085j391430l85069p13898j246621J79675
31281d526604K478058K442678J0583j353467j77059R48436K16224l55109R24340
31272F08080J823576M5009k262155j777381L61632N46587j089420j146820Q46093
31263b044799J579170j43827j350637k77198M95075j252060l115531j770486J568893
31254f311400K904151J271201n13663l55102Q26846J381358J076124M49469k15479
31245E13505o61106n82488j94797l7118j19018o4916l562l79192r39134q80421
31235c348247o0008P94724J111356R03723K35572q10307j566702j182926J14991
31226c807824J016914P75946J50102K41315R81865J336717O90811m51025j051985
$$ y = [-1367637, 93813, 1429709, 934824, -969261, -2360691, -2745760, -3459658, -4706279, -4526604, -2048546, 394132, 404715, -948752, -1125811, -177375, 38849, -316260, 608080, 2431656, 2476665, 214510, -1562871, -1201239, -654652, -1744072, -2890892, -2044799, -465629, -609456, -1960093, -2237291, -1742216, -2994276, -6109807, -7880293, -6311400, -3407249, -2136048, -2649711, -3004813, -2177967, -796609, 279515, 728984, 513505, -147601, -730089, -924886, -962004, -1081022, -1145938, -1149500, -1528692, -2467826, -3348247, -3408255, -2613531, -1502175, -598452, -362880, -1173187, -2739889, -3922815, -3807824, -2790910, -2014964, -1864862, -1623547, -641682, 695035, 1385846, 934821, -117164]
31217a17164n82587M51749R67202M59868l40147l26047M79397Q24205r5716j387676
31207C33084j490749k24726R37773Q21963O9337R8383R81628J329045L80052q19616
31197B416174r54484l23456j76229o73535p86610j56577K94366k0127l24478K23776
31187d81180J122303J254391M44708m89917q45512n52855N5422M67035L05844
$$ y = [-117164, -699751, -248002, 719200, 1179068, 838921, 512874, 992271, 1816476, 1720760, 333084, -1157665, -1382391, -444618, 377345, 446682, 545065, 1526693, 2855738, 3235790, 2416174, 1461690, 1138234, 962005, 288470, -498140, -654717, -360351, -380478, -704956, -481180, 641123, 1895514, 2340222, 1850305, 1004793, 451938, 507360, 974395, 1280239]
$$ [...]
##END NTUPLES=NMR SPECTRUM
##END=
