##TITLE=31Pdec_LY-TMF-4.24.R.t
 D2O, 24 sc
 27.2.2020
##JCAMPDX= 6.0         $$ Bruker NMR JCAMP-DX V2.0
##DATA TYPE= NMR SPECTRUM
##DATA CLASS= NTUPLES
##ORIGIN= UXNMR, Bruker Analytische Messtechnik GmbH
##OWNER= root
$$ XWIN-NMR		Version 3.5
$$ Thu Feb 27 14:37:18 2020 Russian Standard Time (UT+4h)  she@DPX200
##.OBSERVE FREQUENCY= 81.013821
##.OBSERVE NUCLEUS= ^31P
##.ACQUISITION MODE= SIMULTANEOUS
##.ACQUISITION SCHEME= undefined
##.AVERAGES= 24
##.DIGITISER RES= 17
##SPECTROMETER/DATA SYSTEM= spect
##.PULSE SEQUENCE= zgpg30
##.SOLVENT NAME= CDCl3
##.SHIFT REFERENCE= (INTERNAL, CDCl3, 0, 182.463)
##AUDIT TRAIL= $$ (NUMBER, WHEN, WHO, WHERE, WHAT)
$$ ##TITLE= Audit trail, XWIN-NMR		Version 3.5
$$ ##JCAMPDX= 5.01
$$ ##ORIGIN= Bruker BioSpin GmbH
$$ ##OWNER= she
$$ F:/spectra/data/she/nmr/P31/1/pdata/1/auditp.txt
$$ ##AUDIT TRAIL=  $$ (NUMBER, WHEN, WHO, WHERE, WHAT)
(   1,<2020-02-27 14:36:21.10 +0400>,<she>,<DPX200>,
      <created by zg, POWCHK disabled, PULCHK disabled
       configuration hash MD5:
       00 E9 B6 7A A2 85 ED C7 34 08 36 98 17 FE 4E 26
       data hash MD5: 32K
       44 AA AE 08 AB C6 01 79 DA 88 F7 9B A5 CC 6D 83>)
(   2,<2020-02-27 14:36:23.57 +0400>,<she>,<DPX200>,
      <Start of raw data processing
       efp BC_mod = 2 LB = 1 FT_mod = 6 PKNL = 1 PHC0 = -1615.775 PHC1 = 672.0014 SI = 64K 
       data hash MD5: 64K
       24 45 D4 68 43 5B CE 90 37 EF 77 83 64 16 74 34>)
(   3,<2020-02-27 14:36:43.06 +0400>,<she>,<DPX200>,
      <pk PHC0 = 10.69745 PHC1 = -7 
       data hash MD5: 64K
       D9 48 58 70 D1 02 69 5B 3F 85 CD D3 8F B4 09 FD>)
(   4,<2020-02-27 14:36:46.06 +0400>,<she>,<DPX200>,
      <abs ABSG = 5 
       data hash MD5: 64K
       2E A6 ED 8F FF 29 47 03 1F AF 8F F8 2E 57 11 EB>)
$$ ##END=
$$ 
$$ hash MD5
$$ 81 26 22 55 F4 17 33 DD D5 C7 5A 9D 1A 2F 56 F2
##$RELAX= 
##$RELAX= 
##$RELAX= 
##$RELAX= 
##$RELAX= 
##$RELAX= 
##$RELAX= 
##$RELAX= 
$$ Bruker specific parameters
$$ --------------------------
##$DU= <F:/spectra>
##$EXPNO= 1
##$NAME= <P31>
##$PROCNO= 1
##$TYPE= <nmr>
##$USER= <she>
##$AMP= (0..31)
100 100 100 100 100 100 100 100 100 100 100 100 100 100 100 100 100 100 
100 100 100 100 100 100 100 100 100 100 100 100 100 100 
##$AQSEQ= 0
##$AQ_mod= 1
##$AUNM= <au_zg>
##$AUTOPOS= <>
##$BF1= 81.014009
##$BF2= 200.13
##$BF3= 200.13
##$BF4= 200.13
##$BF5= 200.13
##$BF6= 200.13
##$BF7= 200.13
##$BF8= 200.13
##$BYTORDA= 1
##$CFDGTYP= 0
##$CFRGTYP= 5
##$CHEMSTR= <none>
##$CNST= (0..31)
1 1 145 1 1 1 1 1 1 1 1 1 1 1 1 1 1 1 1 1 1 1 1 1 1 1 1 1 1 1 1 1 
##$CPDPRG= <waltz16>
##$CPDPRG1= <>
##$CPDPRG2= <waltz16>
##$CPDPRG3= <>
##$CPDPRG4= <mlev>
##$CPDPRG5= <mlev>
##$CPDPRG6= <mlev>
##$CPDPRG7= <mlev>
##$CPDPRG8= <mlev>
##$CPDPRGB= <>
##$CPDPRGT= <>
##$D= (0..31)
0 1 0 0 0 0 0 0 0 0 0 0.03 2e-05 3e-06 0 0 0 0 0 0 0 0 0 0 0 0 0 0 0 0 
0 0 
##$DATE= 1582799780
##$DBL= (0..7)
120 120 120 11 120 120 24 19 
##$DBP= (0..7)
150 150 150 150 150 150 150 150 
##$DBP07= 0
##$DBPNAM0= <>
##$DBPNAM1= <>
##$DBPNAM2= <>
$$ [...]
##$SUBNAM3= <"">
##$SUBNAM4= <"">
##$SUBNAM5= <"">
##$SUBNAM6= <"">
##$SUBNAM7= <"">
##$SUBNAM8= <"">
##$SUBNAM9= <"">
##$SW= 369.568048894756
##$SWIBOX= (0..15)
0 1 3 0 0 0 0 0 0 0 0 0 0 0 0 0 
##$SW_h= 29940.119760479
##$TD= 32768
##$TD0= 1
##$TE= 0
##$TE2= 300
##$TE3= 300
##$TEG= 300
##$TL= (0..7)
0 120 53 12 22 120 120 120 
##$TP= (0..7)
150 150 150 150 150 150 150 150 
##$TP07= 0
##$TPNAME0= <>
##$TPNAME1= <>
##$TPNAME2= <>
##$TPNAME3= <>
##$TPNAME4= <>
##$TPNAME5= <>
##$TPNAME6= <>
##$TPNAME7= <>
##$TPOAL= (0..7)
0.5 0.5 0.5 0.5 0.5 0.5 0.5 0.5 
##$TPOFFS= (0..7)
0 0 0 0 0 0 0 0 
##$TUNHIN= 0
##$TUNHOUT= 0
##$TUNXOUT= 0
##$USERA1= <user>
##$USERA2= <user>
##$USERA3= <user>
##$USERA4= <user>
##$USERA5= <user>
##$V9= 5
##$VALIST= <valist>
##$VCLIST= <CCCCCCCCCCCCCCC>
##$VD= 0
##$VDLIST= <DDDDDDDDDDDDDDD>
##$VPLIST= <PPPPPPPPPPPPPPP>
##$VTLIST= <TTTTTTTTTTTTTTT>
##$WBST= 1024
##$WBSW= 4
##$XGAIN= (0..3)
0 0 0 0 
##$XL= 0
##$YL= 0
##$YMAX_a= 3612
##$YMIN_a= -9559
##$ZGOPTNS= <>
##$ZL1= 120
##$ZL2= 120
##$ZL3= 120
##$ZL4= 120
##$ABSF1= 182.463
##$ABSF2= -187.1042
##$ABSG= 5
##$ABSL= 3
##$ALPHA= 0
##$AQORDER= 0
##$ASSFAC= 0
##$ASSFACI= 0
##$ASSFACX= 0
##$ASSWID= 0
##$AUNMP= <proc_1d>
##$AZFE= 0.1
##$AZFW= 0.5
##$BCFW= 0
##$BC_mod= 2
##$BYTORDP= 0
##$COROFFS= 0
##$CY= -3
##$DATMOD= 1
##$DC= 0
##$DFILT= <>
##$DTYPP= 0
##$F1P= 0
##$F2P= 0
##$FCOR= 1
##$FTSIZE= 65536
##$FT_mod= 6
##$GAMMA= 0
##$GB= 0
##$INTBC= 1
##$INTSCL= 5.30512e-09
##$ISEN= 30
##$LB= 1
##$LEV0= 0
##$LPBIN= 0
##$MAXI= 10000
##$MC2= 0
##$MEAN= 0
##$ME_mod= 0
##$MI= 50
##$NCOEF= 0
##$NC_proc= -6
##$NLEV= 6
##$NOISF1= 182.463
##$NOISF2= 159.3651
##$NSP= 0
##$NTH_PI= 0
##$NZP= 0
##$OFFSET= 182.463
##$PC= 4
##$PHC0= -1605.078
##$PHC1= 665.0014
##$PH_mod= 1
##$PKNL= yes
##$PPARMOD= 0
##$PSCAL= 0
##$PSIGN= 0
##$REVERSE= no
##$SF= 81.0140089999434
##$SI= 65536
##$SIGF1= 159.3651
##$SIGF2= -187.1042
##$SINO= 113.3802
##$SIOLD= 16384
##$SREGLST= <1H.CDCl3>
##$SSB= 0
##$STSI= 65536
##$STSR= 0
##$SW_p= 29940.119760479
##$SYMM= 0
##$S_DEV= 0
##$TDeff= 32768
##$TDoff= 0
##$TI= <>
##$TILT= no
##$TM1= 0
##$TM2= 0
##$TOPLEV= 0
##$USERP1= <user>
##$USERP2= <user>
##$USERP3= <user>
##$USERP4= <user>
##$USERP5= <user>
##$WDW= 1
##$XDIM= 65536
##$YMAX_p= 331501152
##$YMIN_p= -15219233
$$ End of Bruker specific parameters
$$ ---------------------------------
##NTUPLES= NMR SPECTRUM
##VAR_NAME=  FREQUENCY,     SPECTRUM/REAL,   SPECTRUM/IMAG
##SYMBOL=    X,             R,               I
##VAR_TYPE=  INDEPENDENT,   DEPENDENT,       DEPENDENT
##VAR_FORM=  AFFN,          ASDF,            ASDF
##VAR_DIM=   65536,         65536,           65536
##UNITS=     HZ,            ARBITRARY UNITS, ARBITRARY UNITS
##FACTOR=    0.456856943014862, 1,           1
##FIRST=     14782.0589164792, 0,            0
##LAST=      -15158.0608439998, 0,           0
##MIN=       -15158.0608439998, -15219233,   0
##MAX=       14782.0589164792, 331501152,    0
$$ Real data points
##PAGE= N=1
##DATA TABLE= (X++(R..R)), XYDATA
$$ [...]
##PAGE= N=2
##DATA TABLE= (X++(I..I)), XYDATA
36737a81082K50867P31587J09237p63811o33551M59955J221922Q93191J09127
36728B197442l31532n64280r03279r26665k48680M98800N11533J42347K96006
36719F71692Q49512Q22896k2830q50336j000278o15858l1592N07924N38008j99360
36709F69778r55426o37800N82210J360591J060583M31291J25844k20174q56916
36700A559981j053937k56918P73750R33234K45924m84723q96574j047179p33863
36691i60305J28342Q03711M71882m68378p99597j61269N85668P18075M54228J91800
36681I64157j69139p02608r52166n27735K02576N30417K71124j86622m67334m52052
36671a489382j14885M56024R22498R47884O12550L00688J66309J0964k61021m09081
$$ plain form
36737 -181082 69785 801372 910609 146798 -486753 -26798 1195124 2088315 2197442
36728 2197442 1865910 1301630 398351 -528314 -776994 -278194 233339 375686 671692
36719 671692 1521204 2344100 2321270 1470934 470656 -145202 -176794 331130 869138 669778
36709 669778 -285648 -923448 -341238 1019353 2079936 2511227 2637071 2416897 1559981
36700 1559981 506044 249126 1022876 1956110 2202034 1717311 820737 -226442 -960305
36691 -960305 -831963 -28252 443630 -24748 -824345 -985614 -399946 318129 772357 964157
36681 964157 795018 92410 -859756 -1387491 -1184915 -654498 -383374 -569996 -1037330 -1489382
36671 -1489382 -1604267 -1148243 -225745 722139 1334689 1635377 1801686 1812650 1551629 1142548
36661A142548k55011k6179k3462j41459n5602K06623K55846o2533m07838m21945
36651B10988j94760m8531l7031J07088N57831J058167J049018K34120r00018j347194
36641F89678o79376K96589M67975j14102l97348j4101J32648n71780j237386p19377
36631b146580N37508J043531M13157k08369K0819M90907L01953k86716l12187
36622a45977M08081R83714O36403l08110q35991m93249P4266J1095n33290n98145
36612h01203J22392P09549L51595m15444n38529k4624K49221K2334r4314J91662
36602b27361M39832L96207L57550L63874k8053p71311j014967l11755N94873P99750
36592E98639M44538K47851L19405J76068l04631o23012l64814K49712O22126M30754
$$ plain form
36661 1142548 887537 861358 837896 696437 640835 847458 1103304 1040771 632933 210988
36651 210988 16228 -32303 -69334 37754 595585 1653752 2702770 2936890 2036872 689678
36641 689678 10302 306891 774866 660764 263416 249315 381963 -189817 -1427203 -2146580
36631 -2146580 -1609072 -565541 -152384 -360753 -339934 150973 452926 166210 -145977
36622 -145977 262104 1245818 1882221 1574111 738120 244871 319137 330232 -203058 -801203
36612 -801203 -678811 30738 382333 -33111 -571640 -596264 -347043 -324709 -419023 -227361
36602 -227361 212471 608678 966228 1330102 1302049 530738 -484229 -795984 -201111 598639
36592 598639 1043177 1291028 1610433 1786501 1481870 858858 494044 743756 1365882 1796636
36582A796636j1587j07421K52705M99832K21787j49447J3686N04452N90813J48395
36572C759851k97748n16777o88290o83467k21092K79504Q6967n30624n51818Q8738
36562G25244L32103j60072m01036J31043N08895k8290p42294o32184P1109N72088
36552C76606O68955L86123m68334j463675j416035j29225Q92594N72828j44335
36543g24498p2462K30818j50131m57366L92854J483224J133762k41901p88526
36534H05774k55456o5943n55472n23064L33053Q12839M29299J21986K58151n5993
36524A305174j000984j292376k72361Q87621R63102K38061m81155j032332j315138
36515b000388q73372J38477P34099N05604J43378R2781k2345k14613J52198R37372
$$ plain form
36582 1796636 1785049 1677628 1930333 2430165 2651952 2502505 2516191 3020643 3611456 3759851
36572 3759851 3462103 2945326 2257036 1573569 1352477 1631981 1718948 1188324 636506 725244
36562 725244 1057347 897275 496239 627282 1136177 1107887 365593 -266591 -195482 376606
36552 376606 1045561 1431684 963350 -500325 -1916360 -2045585 -1152991 -580163 -724498
36543 -724498 -796960 -566142 -716273 -1173639 -780785 702439 1836201 1594300 805774
36534 805774 550318 484375 -71097 -594161 -261108 551731 981030 1103016 1361167 1305174
36524 1305174 304190 -988186 -1260547 -372926 590176 828237 347082 -685250 -2000388
36515 -2000388 -2873760 -2735283 -2001184 -1495580 -1352202 -1259421 -1281766 -1496379 -1344181 -406809
36505d06809J057937L39626q1154J84608J15816n85270o98716J62684N21038l15224
36495B94536p25947L81806J332899M46983q78707m47364R27804Q24181o31643
36486A524548j109850q6649N73603N1797l38873Q5412K43180l39377m82433L04664
36476D26022O35278l42454j244775o35477O12079P43583j66206n55444J68890
36467c58504R65234P77057k47524j168789j210865l17395Q09232J275100Q40069
36458A363615P9120l42194k53094J49714N37427M80380k31351j119276j324595
36449f60254n90971M07425Q49710N80347R5847N710M74462R53312O48639m42152
36439B322075j273801r58158J16540Q69732Q41002L37862k79858p36865o64465
$$ plain form
36505 -406809 651128 990754 909600 1094208 1210024 624754 -73962 88722 609760 294536
36495 294536 -431411 -49605 1283294 1730277 851570 404206 1332010 2156191 1524548
36486 1524548 414698 328049 901652 953449 614576 699988 943168 603791 121358 426022
36476 426022 1061300 718846 -525929 -1161406 -549327 194256 28050 -527394 -358504
36467 -358504 606730 1383787 1136263 -32526 -1243391 -1560786 -751554 523546 1363615
36458 1363615 1442735 1100541 847447 997161 1534588 2014968 1783617 664341 -660254
36449 -660254 -1251225 -843800 5910 586257 682104 687814 1162276 2115588 2764227 2322075
36439 2322075 1048274 90116 206656 1076388 1917390 2255252 1975394 1238529 574064
36430E74064p2106L59084J99335J1701L48221O35170J41475n59307m28579K20752
36420A429810K37771l66153n14750J6098L99173L89792N05093O14855J08168n22895
36410B296962j81594O36323K65912j178922j603822l56916N67991j35056r05088
36401e94210l7708J484829J750263Q16798m9373n91651j108320j080709j97825
36392C92094M17204o6705m21823O11637J740107R89724p97405j090928K15007
36383A988912P11678m80526j434947p73929K62185J27179p30478j074276p73849
36374b178051l32670K09550Q46726J078144O96396K93594L35756N10783M46783
36365A907011K24939j63931r02519j569008j351676l86839K63673L10739N91457
$$ plain form
36430 574064 501958 861042 1060377 1072078 1420299 2055469 2196944 1637637 1209058 1429810
36420 1429810 1667581 1301428 786678 802776 1201949 1591741 2096834 2711689 2819857 2296962
36410 2296962 2115368 2751691 3017603 1838681 234859 -122057 445934 310878 -594210
36401 -594210 -631918 852911 2603174 3419972 3370599 2778948 1670628 589919 392094
36392 392094 809298 742593 320770 932407 2672514 3662238 2864833 1773905 1988912
36383 1988912 2700590 2220064 785117 11188 273373 400552 -329926 -1404202 -2178051
36374 -2178051 -2510721 -2301171 -1454445 -376301 320095 613689 949445 1460228 1907011
36365 1907011 2131950 1968019 1065500 -503508 -1855184 -2242023 -1978350 -1667611 -1076154
36356a076154J279264J284524K28599n49311j08455M11368k89203j282696p95235
36347h97299P93090J366986L12530o38501j74690O92548L59976r41766j598270
36338g25396r06328J92812O27444N31633O64652J036668Q33193k63957j343499
36329F47222j306078k55306P29197R78745P26042L36532j28033m71077l17589
36320I39655J71615K61177k84991p39155m70392J27933K87639o6138m22540m32106
36310f27303p3992M93407Q19229M11174m20680n75042L48003J182103O81261o24334
36300A613826j114563l66278M06962K64828k45718k01600K89115M57525R0857
36291A194954l18817l88251k08900K2676K30093K54310j23265p19318q46481r6291
$$ plain form
36356 -1076154 203110 1487634 1716233 1166922 1058467 1469835 1180632 -102064 -897299
36347 -897299 -104209 1262777 1575307 936806 762116 1454664 1814640 872874 -725396
36338 -725396 -1631724 -1438912 -811468 -279835 384817 1421485 2254678 1990721 647222
36329 647222 -658856 -914162 -184965 793780 1519822 1856354 1728321 1257244 939655
36320 939655 1111270 1372447 1087456 348301 -122091 5842 293481 227343 -195197 -627303
36310 -627303 -701295 -207888 611341 1022515 601835 26793 374796 1556899 2238160 1613826
36300 1613826 499263 132985 539947 804775 559057 357457 646572 1104097 1194954
36291 1194954 876137 487886 278986 301662 531755 786065 662800 -56518 -902999 -999290
36281i99290Q88900R59463m7588q69076l38058J006183J509426N15805q45596
36272A780169j159093l46540N63408P71875L50346j39890k34854Q1296L53945
36263B020662J37667l87227n66987j58291L43350M52065L09066K49758K06873
36254B606936l7835l66733n33983n75472n89342l79637K09991P90667P36851k5502
36244A835941q66691j092483n74319J77651M83672J75179k06514j33766J24034
36235g7296o2608n63028n54867J71980Q07064P11839K09657j84524m58518n62892
36225e63193j27086O51907Q13235J12089l13428K79731Q69991L53916m36827o9017
36215A571318R26761Q08658m35278j021117l04704L20974q4439o11447l86859
$$ plain form
36281 -999290 -110390 849073 801485 -67591 -405649 600534 2109960 2625765 1780169
36272 1780169 621076 274536 837944 1609819 1960165 1820275 1585421 1666717 2020662
36263 2020662 2158329 1771102 1204115 1045824 1389174 1841239 2150305 2400063 2606936
36254 2606936 2569101 2202368 1668385 1092913 503571 123934 333925 1124592 1861443 1835941
36244 1835941 969250 -123233 -697552 -519901 -36229 138950 -67564 -201330 -77296
36235 -77296 -139904 -702932 -1257799 -1085819 -278755 433084 642741 458217 -301 -563193
36225 -563193 -690279 -38372 774863 886952 573524 853255 1723246 2077162 1640335 1571318
36215 1571318 2498079 3306737 2871459 1850342 1545638 1866612 1782173 1170726 783867
36206G83867o2046l46171n88403p8360M95672K26732l93646m12759j21953l61611
36196h58678p62996k70123Q74580J239720L89754m28377j66012N84535O25564
36187A227967j53365q24832p84007m13276l81012o80883o50260P2261R26473J094178
36177e66756N90539J49536O8620j01256n37893o54349q7627N69527O57578M23923
36167E11842L91847L65111p8158n96722n52773j10565J11702J86989N96575J000290
36157A826138N20230o74740j289587p36480L9003L6223m66218o51435m01379p9079
36147a877324K71628P31523R45346N09434k84147o79087l36503L82334Q55669
36138E18873O70728p5860p11453n69709J35687M77772J13011k12618J05866N01398
$$ plain form
36206 783867 721821 375650 -212753 -291113 204559 431291 37645 -375114 -497067 -858678
36196 -858678 -1621674 -1891797 -1017217 222503 612257 183880 17868 602403 1227967
36187 1227967 1074602 249770 -534237 -947513 -1328525 -2009408 -2659668 -2587407 -1660934 -566756
36177 -566756 23783 173319 241939 140683 -397210 -1051559 -1139186 -569659 87919 511842
36167 511842 903689 1268800 1190642 593920 41147 -69418 42284 229273 825848 1826138
36157 1826138 2346368 1671628 382041 -354439 -315436 -279213 -745431 -1396866 -1798245 -1877324
36147 -1877324 -1605696 -874173 71173 580607 296460 -382627 -719130 -336796 518873
36138 518873 1189601 1113741 402288 -167421 -31734 446038 559049 346431 452297 953695
36128I53695J67076n66277p31580k45543R2788l7476j60183n8272j10298l72104
36118a068174l04866K19546N19658J70252l00477k78705O7245L03940M38289N41763
36108C08471L46159j41177k77515K37215O78970M11527j8340R6105K14861n01810
36098A354466j384807j042331K40638P07438o6611m72100L91663J149906N02215
36089A380477m87033j01610J144843J232310k73107j658384j567047n38894J90617
36080f77828K15252p9980k01273J22375P01946R28765N70961K81691O05477Q78076
36070C345462J51207j080293j346898l60328O00851O03291P7854l22751n94404
36061A073991p26552m29499K2812j01991n98357l76550N60097P59461k31068p54129
$$ plain form
36128 953695 1120771 554494 -177086 -422629 -329841 -367317 -527500 -585772 -696070 -1068174
36118 -1068174 -1373040 -1153494 -633836 -463584 -764061 -1042766 -975521 -671581 -233292 308471
36108 308471 654630 513453 235938 473153 1152123 1563650 1545310 1641415 1856276 1354466
36098 1354466 -30341 -1072672 -832034 -124596 -191207 -663307 -271644 878262 1380477
36089 1380477 893444 791834 1936677 3168987 2895880 1237496 -329551 -868445 -677828
36080 -677828 -462576 -542556 -743829 -621454 80492 1009257 1580218 1861909 2467386 3345462
36070 3345462 3496669 2416376 1069478 709150 1310001 1913292 1991146 1668395 1073991
36061 1073991 347439 -82060 -59248 -161239 -759596 -1136146 -576049 183412 -47656 -801785
36051h01785L37873J558725J034030m37495o85096L39345P05020j99129q80175
36042I71313m51126Q5631r8618k51584L21678P90546J89412q40056r44045n706
36032b32555Q73403Q99605K31268n58995r40893o15821J58977O62580N39710K06870
36022A224149Q4994o0093n11055q68661o22692o5808J33468K7555K34129P57789
36012C33775Q40794J81568m94076n16916k86018n23718r23230m52949R44562J885953
36002I89745J297368p2682p19661n00213n47336j157703j151270J23518J400180
35993c38054J159481j58419q35540k73933N48043P68763N28452J79162j93304
35984A384651l05712J83483Q53343Q36006J67276j81582J45288L74211k2800n17320
$$ plain form
36051 -801785 -463912 1094813 2128843 1691348 1006252 1345597 2050617 1851488 971313
36042 971313 520187 605818 507200 255616 577294 1367840 1557252 717196 -226849 -232555
36032 -232555 640848 1540453 1771721 1212726 271833 -343988 -185011 477569 1017279 1224149
36022 1224149 1309143 1249050 737995 -130666 -753358 -819166 -685698 -658143 -424014 333775
36012 333775 1174569 1356137 862061 345145 59127 -464591 -1387821 -1840770 -896208 989745
36002 989745 2287113 2214431 1494770 994557 447221 -710482 -1861752 -1738234 -338054
35993 -338054 821427 663008 -172532 -446465 101578 870341 1398793 1577955 1384651
35984 1384651 1078939 1262422 2115765 2951771 3119047 2937465 3082753 3456964 3434164 2916844
35974B916844n44991l16306j17357J90750M71397J76816n30436o64135o2533J23016
35964A643065n94647r85702j83297O06623M6472r23380n56206P30289J048329
35955H31546K00200j85885L83160N23442l93140j071848n78502J39669P8460j51787
35945b24685K67193P01546K45137n25933m78372J56862K56213k88489n31068j12987
35935e34583L06804K36877o3004k28404j91561P0885M76025N85543J12021m35681
35925C34922l32576K62369N71023M64970N73620J063062J232388O14523l02350
35916D481951q27202q91963p44382m24749k1613N9059l57829p33142m43591K78075
35906C74614N66242P8064n24765m15041L43232Q38663M07918n27980r53198n30602
$$ plain form
35974 2916844 2371853 2055547 1938190 2128940 2600337 2777153 2246717 1582582 1520049 1643065
35964 1643065 1048418 62716 -120581 486042 532514 -390866 -947072 -216783 831546
35955 831546 1031746 845861 1229021 1752463 1359323 287475 -291027 -151358 -72898 -224685
35945 -224685 42508 744054 989191 463258 -15114 141748 397961 109472 -421596 -534583
35935 -534583 -227779 9098 -53906 -282310 -473871 -402986 73039 658582 770603 334922
35925 334922 2346 264715 835738 1300708 1874328 2937390 4169778 4784301 4481951
35916 4481951 3654749 2762786 2018404 1593655 1572042 1631101 1273272 540130 96539 374614
35906 374614 940856 1018920 494155 79114 422346 1261009 1668927 1140947 187749 -342853
35896c42853Q286n0297l72031j63807M89520O57443o668o46424l81684M78084
35886c30431R07431M93813k09242m77958j63354K75197K29268m46161j129741
35877h51178r85069J6136R45109J012310M33877p6844k17677p0140L45078Q49253
35867A400855Q24561o2113j048994j012907J9079Q71923P77671J39026l79341
35858A529760o69503p75102m64157K71917Q55910P78099K28851k81342n18040
35849I56393m43812o3442K92190Q6180n81574q18773j46252P03377P92742K34928
35839A011957k39442m10262m42549j65187N10431Q48991J44194q79681p96394
35830d17942L44006R06950J05046p79004l63595P11432P49474m86524j402405
$$ plain form
35896 -342853 -334567 -384864 -756895 -920702 -431182 226261 219593 -426831 -808515 -330431
35886 -330431 577000 1070813 861571 383613 220259 495456 724724 278563 -851178
35877 -851178 -1836247 -1820111 -875002 137308 571185 494341 276664 206524 551602 1400855
35867 1400855 2225416 2163303 1114309 101402 120481 992404 1770075 1909101 1529760
35858 1529760 860257 85155 -379002 -107085 748825 1526924 1755775 1474433 956393
35849 956393 512581 449139 741329 827509 245935 -572838 -719090 -15713 777029 1011957
35839 1011957 772515 362253 -80296 -245483 264948 1113939 1258133 378452 -417942
35830 -417942 -73936 833014 938060 159056 -204539 506893 1256367 769843 -632562
35821f32562p21356Q84686J685059R87639j43001l42510K58628K80624q16139
35812A441068j741734j146610L44706J014792N62090K74248O93849P61959j48859
35803B055509r02384l59575P20442Q36415j2114n88622m07214j05084p3836m876
35793A158661J92676J43362j71650k71463l3054J11275q062m6220J08709P7142
35783A261376k72867n03054l28772p5180o9942r8854J36218M19827L16837j66385
35773F19204n83425o01789k85272J21645M61395O60753O02308J89563l84993o31322
35763A68067k94130K10070K64313q5890k23279O8128L25955K44149J03558J05879
35753H86820K627k43551k03529J36166Q1380n52409q40064k12996L76309j34408
$$ plain form
35821 -632562 -1353918 -469232 1215827 2203466 2060465 1717955 1976583 2257207 1441068
35812 1441068 -300666 -1447276 -1102570 -87778 474312 748560 1442409 2204368 2055509
35803 2055509 1153125 793550 1513992 2350407 2338293 1749671 1342457 1237373 1163537 1158661
35793 1158661 1351337 1494699 1323049 1051586 1018532 1129807 1121745 1075525 1184234 1261376
35783 1261376 988509 485455 156683 81503 11561 -87293 48925 468752 785589 619204
35773 619204 35779 -566010 -851282 -729637 -268242 392511 994819 1184382 799389 168067
35763 168067 -126063 84007 348320 262430 39151 107279 433234 677383 780941 886820
35753 886820 889447 645896 442367 578533 659913 107504 -732560 -945556 -569247 -703655
35743g03655j106649j100371k7878R36685J174950R81177M75959l60248q27447
35734e57477k34633O53892N06036l30544k41345R11692J410997M68050n61427
35725B025241m82546M6853Q6156k1833K00902J83195m56824q46051l57916Q3407
35715D60584l89009q84006k56651P48096O48178k74852n27283M2064J91492l48938
35705e90325l76492O23649J459008J003198j90618p63089l12304L22965K12691
35696A388683n85526j078229n44602L84013M28528m50654q32078K5860R61495
35687c02510P32091m8280p2100M94007N56858J31590J20163M62063K67520l65306
35677A976096m18914J26818J80963m32392n38200L41535J071195O78669k80291
$$ plain form
35743 -703655 -1810304 -2910675 -2938553 -2001868 -826918 154259 630218 269970 -557477
35734 -557477 -792110 -138218 367818 37274 -204071 707621 2118618 2586668 2025241
35725 2025241 1542695 1589548 1675704 1653871 1854773 2037968 1581144 735093 377177 460584
35715 460584 71575 -812431 -1069082 -320986 327192 52340 -474943 -432879 -241387 -590325
35705 -590325 -966817 -343168 1115840 2119038 1928420 1165331 853027 1175992 1388683
35696 1388683 803157 -275072 -819674 -435661 -7133 -457787 -1289865 -1264005 -302510
35687 -302510 429581 381301 309201 803208 1360066 1491656 1611819 2073882 2341402 1976096
35677 1976096 1557182 1684000 1864963 1432571 894371 1235906 2307101 2985770 2705479
35668B705479q07247p63349m66297m0124K56658M0083l70788j44341O10794P19490
35658A740358k01258r57621n64475L23628O17821M00264L61591N01836M09326
35649B631470J70465N0969j83207p55996j177398q70990j08997L94192M51353
35640F01861L51835K44663J43562J49224J73747j14347o47009q04864l41885J51002
35630i2211J55441p7745j98444l33974m60686r7041O80359Q51033l5394q54808
35620d63470m68017N27068P97599L22320P6800J98038l3377n94704n94995J57597
35610g5141P59444O33861K60305J87113K60195J64471o0513l50728p75221j104105
35600a00319q58367o2577N95528O08886K21505j1767J48492N39216P89868N76364
$$ plain form
35668 2705479 1898232 1134883 668586 628462 885120 925203 554415 410074 1020868 1740358
35658 1740358 1539100 581479 17004 340632 958453 1358717 1720308 2222144 2631470
35649 2631470 2801935 2852904 2669697 1913701 736303 -134687 -243684 150508 601861
35640 601861 953696 1198359 1341921 1491145 1664892 1550545 903536 98672 -243213 -92211
35630 -92211 63230 -14515 -212959 -546933 -1007619 -1104660 -424301 426732 391338 -463470
35620 -463470 -931487 -404419 393180 715500 792300 990338 956961 362257 -232738 -75141
35610 -75141 684303 1318164 1578469 1765582 2025777 2190248 2129735 1779007 1003786 -100319
35600 -100319 -958686 -1021263 -425735 183151 404656 392889 541381 1080597 1870465 2446829
35590B446829j3828m43390l57594o9139n0510k20327k10226n3266l6380j14430
35580H77739p1461l2041j88520k63043P6123M80740L36760k45490n76967l94565
35570g25k5407K96150N59756N89883K60571n9378O398J36867j41584n15864l86310
35559G20357J8723O6476m2942L32378Q59717N76721l71872p76894k94870J04885
35549A192679j04396k82828p6938q4283m48725k91614O18326J048168J96235q68493
35539H98131q52308k02173j00288m38733k77744L21991M42791j7135j83638L29380
35529g9726R05032R20991M21447k14870o42255o89385o05347q42870j189201p69384
35519b785568M65201J113210J94238j140366j081921K16486J006423O34021K14331
$$ plain form
35590 2446829 2433001 1989611 1632017 1562878 1512368 1292041 1081815 1028549 992169 877739
35580 877739 806278 774237 585717 322674 398797 879537 1216297 970807 393840 -725
35570 -725 -26132 270018 829774 1419657 1680228 1620850 1627248 1764115 1622531 1106667 720357
35559 720357 739080 805556 762614 1094992 1954709 2531430 2159558 1382664 1087794 1192679
35549 1192679 1088283 805455 728517 644234 195509 -96105 522221 1570389 1766624 898131
35539 898131 45823 -156350 -256638 -695371 -973115 -651124 -208333 -225468 -409106 -79726
35529 -79726 825306 1746297 2167744 1952874 1310619 621234 15887 -826983 -2016184 -2785568
35519 -2785568 -2320367 -1207157 -1012919 -2153285 -3235206 -3018720 -2012297 -1378276 -1163945
35510a163945N25865Q38322L47547n12840q74987o21565j59679K57732M82436
35501h81114L65473R2526O1002J87434o458m34081l79869L13325Q47472O75584
35491H41294K66866J55361N8373l91997p88303o16768j94220j01386j62226J31067
35481h01939N52389M60879j7274j18126K42734K53455m42250j028431o40050L86824
35471a151789R65219O40734j6429k86660r0803J65013J81884o905k38202l88429
35461b26367l24065Q7416P38519J171330R59765K18538m83352p49174o56649l94838
35451C41123L8763N55033P30252K70990m27243o32704j83361L59109N01158L31470
35441A884590J02203k32934p11672r56392n82649J39858N54514N24327N37107
$$ plain form
35510 -1163945 -638080 200242 547789 34949 -840038 -1461603 -1621282 -1363550 -881114
35501 -881114 -515641 -423115 -362113 -174679 -181137 -615218 -995087 -681762 165710 841294
35491 841294 1108160 1263521 1321894 929897 141594 -475174 -669394 -770780 -933006 -801939
35481 -801939 -249550 211329 194055 75929 318663 572118 129868 -898563 -1538613 -1151789
35471 -1151789 -186570 454164 437735 151075 60272 225285 407169 400264 162062 -226367
35461 -226367 -550432 -463016 275503 1446833 2406598 2625136 2141784 1392610 735961 341123
35451 341123 379886 934919 1665171 1936161 1508918 876214 692853 1051962 1553120 1884590
35441 1884590 1986793 1753859 1042187 85795 -496854 -356996 197518 721845 1258952
35432A258952P99884Q03892J31497p66469j098150p55326k82222K945K56601N04278
35422H55882M29923j6307l24522j00398L06863K46447l39972q32066p11571j51607
35412f37328K66340K87079K46340M98184P51673M01600m05049o57151R8041Q32877
35402A682606L99018o35116p26606J72968L90869p97516j793501r85013P76690
35393a515601J404446N18392l69680k73859J95400K42084N723q7525l8203Q5500
35383A66677L92068O85626M84266j42249m68059j94700O9179j72077m78927k12891
35373A28913M35952P37594L96925k44854p24022p78001l94673J16782L04649R7107
35363G6372n1048K55452Q37008J185172R96707L38280m44985q70213o84646k32984
$$ plain form
35432 1258952 2058836 2862728 2994225 2227756 1129606 374280 92058 95003 351604 855882
35422 855882 1285805 1269498 944976 844578 1151441 1397888 1057916 225850 -485721 -637328
35412 -637328 -370988 -83909 162431 660615 1412288 1813888 1408839 751688 849729 1682606
35402 1682606 2081624 1446508 719902 892870 1283739 486223 -1307278 -2292291 -1515601
35393 -1515601 -111155 407237 37557 -236302 -40902 201182 206905 119380 81177 166677
35383 166677 558745 1244371 1728637 1586388 1118329 923629 992808 820731 341804 128913
35373 128913 564865 1302459 1699384 1454530 730508 -47493 -442166 -325384 -20735 76372
35363 76372 25324 280776 1117784 2302956 3299663 3637943 3192958 2322745 1638099 1405115
35353A405115j51848n82965j011641r72383n42673m3375L39984N17351M88145
35344e54290M85055P06384Q56030M72500k21161m42286N505L99860J89512k75967
35334A621142m68667m41520m03053j96408K34959M44881J56272j71918n9095J99185
35324I15778Q9717k18261k29983L110Q6066L0420P7990O2649k83392n92206k42938
35313c01050N63407Q74773K59592n78531o63835J15301Q87983P26308k67736q94373
35303G21839k68262Q06838O91862p17378j609707q28584M19500N02872j34061
35294d15081J9459Q37197Q07975k66543q46143k01957M62212J02045n56814m46604
35284e04254Q6500P5672m10598n27864m1204M97160O50827M74486K21203J56689
$$ plain form
35353 1405115 1253267 670302 -341339 -1313722 -1856395 -1899770 -1559786 -1042435 -554290
35344 -554290 -69235 637149 1493179 1965679 1744518 1302232 1307737 1707597 1897109 1621142
35334 1621142 1152475 710955 307902 111494 346453 791334 947606 775688 716593 915778
35324 915778 1005495 787234 557251 560361 646427 676847 754837 817486 534094 -58112 -301050
35313 -301050 262357 1137130 1396722 818191 154356 269657 1157640 1883948 1616212 721839
35303 721839 453577 1260415 1952277 1234899 -374808 -1203392 -783892 -281020 -415081
35294 -415081 -395622 441575 1249550 983007 136864 -65093 397119 499164 -57650 -504254
35284 -504254 -417754 -342082 -752680 -1280544 -1321748 -824588 -173761 300725 521928 678617
35274F78617L85374N44962J02889p49673j063565l83428N33686P09298J34040
35265H92200m85920o60495l35984K99446P50865M60670l95528q53173l78277L82104
35255c24092N65185K29157n4093j45333j75573J8469M85603O18705j03933j116426
35245b331j356250o89056M8482L05073L18067L80951L76767J93023K0116M2334
35235c62824J98078L42761M00482L66683L23647L17591J52782l33376p24425l88794
35225B92605L96530N50842j13483l36283N96349J373585N16369j113041j377382
35216G86091n0943R27467M40133m35966n08878j81825k33606l67711r1045J04254
35206C87971l38534p85232l36877N66791P22886J6653n04755l03732M3669N2590
$$ plain form
35274 678617 1063991 1608953 1711842 962169 -101396 -484824 48862 758160 892200
35265 892200 406280 -254215 -590199 -290753 460112 920782 525254 -327919 -706196 -324092
35255 -324092 241093 470250 416157 270824 95251 113720 599323 1218028 1114095 -2331
35245 -2331 -1358581 -2047637 -1999155 -1694082 -1376015 -995064 -618297 -425274 -405158 -362824
35235 -362824 -164746 178015 578497 945180 1268827 1586418 1739200 1405824 681399 292605
35225 292605 689135 1239977 1126494 790211 1386560 2760145 3276514 2163473 786091
35216 786091 735148 1662615 2102748 1666782 1157904 976079 742473 374762 283717 387971
35206 387971 49437 -735795 -1072672 -505881 217005 233658 -271097 -574829 -531160 -478570
35196d78570J06364O02697J083481Q36146j971n33711k59262L04973L56539j17819
35186A898867l81719m0038L97324L16034r4164k57263j85637l00921m73938j61055
35176G17490M44654M01604m82495j073080m35857Q02296J329025Q04781q5320
35167B423098p40822r98684p41950k9522N30131L25214l52084n97221r5092N52636
35157B75704P08871L64910r7139l01941l2498N23667O92717J8466r31540j068024
35147A53193k20917N44343L50130l19935l77469L00193P11482J56813p38907p86656
35137b27730K24035J216292J152113K41113n19370o73183n75623m71435r9642
35128B66570N61994R06910N35297q3122l11234k09965j24173P4680N66907Q27089
$$ plain form
35196 -478570 -372206 230491 1313972 2150118 2148147 1614436 1355174 1660147 2016686 1898867
35186 1898867 1517148 1477110 1874434 2190468 2096304 1839041 1653404 1352483 878545 717490
35176 717490 1162144 1563748 1081253 8173 -427684 374612 1703637 2508418 2423098
35167 2423098 1682276 683592 -58358 -87880 442251 767465 415381 -181840 -276932 275704
35157 275704 984575 1349485 1252346 950405 917907 1441574 2134291 2152757 1221217 153193
35147 153193 -67724 476619 826749 506814 129345 429538 1141020 1297833 558926 -227730
35137 -227730 -3695 1212597 2364710 2605823 2086453 1413270 837647 366212 266570
35128 266570 828564 1735474 2270771 2187649 1876415 1666450 1542277 1616957 2183864 3010953
35118C010953K42511o86174p67621J67065R00914M81462n40244r72314n24714
35109A311838L1067l7657o02085r17025n02026K81649O51112M23505K43371N37695
35099A421444P66539K97713m46257n76233j68982q1425m40359m70668L4666K73377
35089F09815j39728m49368q1499L49511J60679j66087J59684Q23100Q95673L11357
35079B473137j57344j49036j8469l0392q2471j77445m40891o86232n83918k19260
35069g2321O2868K36791M58403N44806K32449k20011l61864l06662m32277n24655
35059c82473r8112N27116M61409l35430q39572m23280L48320O94825N70434K84749
35049H07986k6539j57704J65549O29789M70754l05280p19433l61822j22624o16271
$$ plain form
35118 3010953 3253464 2567290 1799669 1966734 2867648 3349110 2808866 1836552 1311838
35109 1311838 1342905 1305248 703163 -213862 -715888 -434239 216873 640378 883749 1421444
35099 1421444 2187983 2485696 2039439 1463206 1294224 1212799 772440 301772 336438 609815
35089 609815 470087 20719 -60780 288731 449410 283323 443007 1266107 2161780 2473137
35079 2473137 2315793 2166757 2148288 2117896 2035425 1857980 1417089 730857 146939 -72321
35069 -72321 -9453 227338 685741 1230547 1462996 1242985 881121 574459 142182 -382473
35059 -382473 -480585 46531 507940 172510 -667062 -1090342 -742022 -47197 523237 807986
35049 807986 781447 623743 789292 1419081 1889835 1584555 865122 503300 380676 -235595
35039b35595r36992j25437J014210J005191K2222m75709j52825r8249o22455n57865
35029a163504O19906J568646J011072l00085p36159q0992N44396M87883J01514
35020B052677k12084l60707j13146O50189J239489P17060o84779j599151j225629
35011D63919k11409M40075N62614N26597M40476K03195j07198l85079o87070r00130
35001C45990o36399J17411O66512M57296n6598K1005P82708J403435J214040M03023
34991D718423l62215o15998l58102M8006J76717r0273n10039q30281r60864p31651
34981D83723M5680R86276J155654K37240p81819p89252l9163L49043O8259k06245
34971A509396j79044k93461n83434l70681M41253Q66542K96555m79580m97495
$$ plain form
35039 -235595 -1172587 -1298024 -283814 721377 743599 267890 115065 16816 -605639 -1163504
35029 -1163504 -543598 1025048 2036120 1736035 999876 918884 1463280 1951163 2052677
35020 2052677 1840593 1479886 1366740 2016929 3256418 3973478 3288699 1689548 463919
35011 463919 252510 692585 1255199 1781796 2222272 2425467 2318269 1933190 1246120 345990
35001 345990 -290409 -172998 493514 950810 894212 915217 1697925 3101360 4315400 4718423
34991 4718423 4356208 3740210 3382108 3430114 3606831 3516558 3006519 2176238 1215374 483723
34981 483723 529403 1515679 2671333 2908573 2126754 1337502 1298339 1647382 1715641 1509396
34971 1509396 1330352 1036891 453457 82776 524029 1390571 1687126 1207546 710051
34962G10051k8849J34221O6682L07767O36048M53464M5122J77044N82017K14399
34952C297966q58276j234063l28926N75968K69059n38305m38984M11520O64585
34943A820544J8818m13880p5583J54832l81969q17869j10094J107703J264034
34934B566536J23604r06235q10672j66310P7292q460J41436M29395L61065J3382
34924A821033j66816k61066o58049j066989p31140K94377J024432R38494N90868
34915A785144M77346K19306n28419j161560r17241l9308O36646Q62239R62941
34906B297094R59980N31525k68609r68100j302581j296856q49538J04469J075665
34897B83049J337749Q25927J68984j93189l78652n42548n70974l95604j35519
$$ plain form
34962 710051 681202 815423 882105 1189872 1825920 2279384 2324506 2501550 3083567 3297966
34952 3297966 2439690 1205627 876701 1452669 1721728 1183423 744439 1155959 1820544
34943 1820544 1839362 1425482 1349899 1504731 1122762 304893 194799 1302502 2566536
34934 2566536 2690140 1783905 973233 806923 884215 875755 1017191 1446586 1807651 1821033
34924 1821033 1654217 1393151 735102 -331887 -1063027 -768650 255782 1194276 1785144
34915 1785144 2262490 2481796 1953377 791817 -125424 -164732 471914 1334153 2297094
34906 2297094 3257074 3788599 3519990 2551890 1249309 -47547 -897085 -792616 283049
34897 283049 1620798 2446725 2615709 2422520 2043868 1501320 930346 534742 399223
34888C99223J31259L21468J67815l68596o41404q425J043818J313493N61677j28394
34878B791934L680L29389J0780n93561o00187j36651j48415q08357j133995m49529
34868g34912N46904P08421J8431l85177K49305J257094J380723L35688r11186
34859B465291j370405j007456l54664K64868P17530P59592L53722k7256o588P0975
34849A865609k44033n89161l16907K86756K98689l50250p10225k96386K64156
34840B08248L51159J53954m893j95693k93555J65540R79819J084910N7205j059976
34830A446718j189401o25445j73260K18377Q88004J299692P49016k40052n15552
34821A858097k7422K68163N7430k8828K50662L44905L6545j27669J43463L52190
$$ plain form
34888 399223 530482 851950 1019765 651169 9765 1340 1045158 2358651 2920328 2791934
34878 2791934 2795614 3125003 3135783 2542222 1942035 1805384 1656969 848612 -285383 -734912
34868 -734912 -188008 520413 538844 153667 402972 1660066 3040789 3376477 2465291
34859 2465291 1094886 87430 -267234 -2366 715164 1474756 1828478 1801222 1794634 1865609
34849 1865609 1621576 1032415 715508 1002264 1300953 950703 240478 -55908 208248
34840 208248 559407 713361 708468 512775 219220 384760 1364579 2449489 2506694 1446718
34830 1446718 257317 -368128 -541388 -323011 564993 1864685 2613701 2373649 1858097
34821 1858097 1830675 2098838 2156268 2127440 2378102 2723007 2759552 2631883 2775346 3127536
34811C127536N6157m95832q70175r54843p60693l23048Q2805K23360L84461Q71287
34801A341015J166774N46743n10776p10641Q5538N55870K1222m90767n3577N55348
34791B506749K02398o34903o35331K07861O20679M5181p01252q37704n54805k70359
34781e1486R9249O88395J170727J146434O46905j5268n61663p77030o23980m56283
34771A266000o75405j024382p40851L02519J128497Q13029k44242q10561m33322
34762d18718J00392L5383k65611J5464P88647J080829M84048j24761K01122R98191
34752B894986R12507l34548j342862q13011O98403J494454Q89171j61024n63652
34743C674424l90987l13335m04383k02493L05010M94071K4398n69315n07912K54806
$$ plain form
34811 3127536 3183693 2687861 1817686 862843 102150 -220898 -138093 85267 469728 1341015
34801 1341015 2507789 3054532 2543756 1833115 1918653 2474523 2495745 2004978 1951401 2506749
34791 2506749 2709147 2074244 1438913 1646774 2267453 2312634 1611382 773678 218873 -51486
34781 -51486 47763 736158 1906885 3053319 3700224 3684956 3123293 2346263 1722283 1266000
34771 1266000 590595 -433787 -1174638 -872119 256378 1069407 825165 14604 -418718
34762 -418718 -318326 -282943 -548554 -533090 255557 1336386 1820434 1695673 1896795 2894986
34752 2894986 3807493 3472945 2130083 1317072 2015475 3509929 4399100 4238076 3674424
34743 3674424 3283437 2970102 2565719 2363226 2668236 3162307 3186705 2617390 2109478 2364284
34733B364284R46392P84406k52043j367307j617392p99570K66884N63087L1055
34724I19796m15648j71667K65242J85940j43168M8774O21688N69621l47314r77245
34714E56019l42547Q76538J188610K39513q53579r96121k84992L75706L57367
34705A116514j17121k52792M32869J375320J398288J79648j096307j094087n6892
34696A885440N32286n2620r04190q10027K00628J052762R73321K15728m03163
34687B690165l76490P3269L20002N1642m09579n81678m49979l89357n80343p93027
34677d45375p11073k31514M93734J092641J161259O69347O7268k29271k69779
34668A597237k56245j24901J82456L68903K11173L7898J96601L42635k5693n72099
$$ plain form
34733 2364284 3310676 4095082 3843039 2475732 858340 58770 325654 888741 919796
34724 919796 504148 332481 597723 783663 640495 689269 1310957 1880578 1533264 556019
34714 556019 213472 1090010 2278620 2518133 1664554 668433 383441 759147 1116514
34705 1116514 999393 746601 1179470 2554790 3953078 4132726 3036419 1942332 1885440
34696 1885440 2417726 2365106 1460916 650889 851517 1904279 2877600 3093328 2690165
34687 2690165 2313675 2386944 2706946 2758588 2349009 1767331 1317352 927995 347652 -445375
34677 -445375 -1156448 -1387962 -894228 198413 1359672 2029019 2096287 1867016 1597237
34668 1597237 1340992 1216091 1398547 1767450 1978623 2016521 2213122 2555757 2530064 1957965
34658A957965n31124n24J49545k61854l80935K42375Q37088N97617q2072k55535
34648B272546K26417P22348Q25800O96083M85727N4696o16366j120610j015250
34639B531391m43049q6844k98925m98905L9885Q62400O58536p34185j669667q68164
34629e07527O73791J162957O25790M58287Q59356O40775m15663j014509n83596
34620A899661j58473l40885k23373O60582J080390J35934r81643q16670R836r508
34610A255851p00307o48114L67619J115901Q42815K85p73296j134524p21640M20273
34600B4863J294728R63493j09878p43718o86448m82423j83807M68794R59345N54435
34590B059384k45946k60271M70707P55862J83402m53442o67921p63745p41355
$$ plain form
34658 1957965 1426841 1426317 1575862 1314008 933073 1175448 2012536 2610153 2528081 2272546
34648 2272546 2498963 3221311 4047111 4743194 5228921 5283617 4667251 3546641 2531391
34639 2531391 2088342 2001498 1702573 1203668 1243553 2105953 2764489 2030304 360637 -507527
34629 -507527 166264 1329221 1955011 2413298 3272654 3913429 3497766 2483257 1899661
34620 1899661 1741188 1400303 1176930 1837512 2917902 3053836 2072193 1255523 1265359 1255851
34610 1255851 555544 -92570 275049 1390950 2233765 2234050 1460754 326230 -395410 24863
34600 24863 1319591 2283084 2173206 1429488 743040 260617 76810 545604 1504949 2059384
34590 2059384 1813438 1553167 2023874 2779736 2963138 2509696 1841775 1078030 336675
34581C36675k09120M57590L65077k68433k43834N82954R78252M30188p0384J07296
34571B466261K52686r0387k08467K01946J84638o26044q96914K61730J461936
34562C007385R92334n25161j198612p14086k62422k23598J10975P13028O33163
34553B533006j64153m69422K07274P56295J82934r26910j369934r12188k04442
34544c67540K80945N45213O53909O03383M58431K96129J19895k9665o9113p2098
34534B419489k34642n31697o41804l46694J65224M98345M33880P0680l02686m46056
34524A084039l48353j64574K2361K37939L92722K76359r3283l74083l34663j18102
34514E80362J22677M86585Q93078Q05377l9016q93402p45735K26081P40514J91183
$$ plain form
34581 336675 127555 585145 950222 681789 437955 1020909 1999161 2429349 2358965 2466261
34571 2466261 2718947 2628560 2420093 2622039 2806677 2180633 1283719 1545449 3007385
34562 3007385 3999719 3474558 2275946 1561860 1299438 1075840 1186815 1899843 2533006
34553 2533006 2368853 1899431 2106705 2863000 3045934 2119024 749090 -163098 -367540
34544 -367540 -86595 458618 1112527 1715910 2174341 2470470 2590365 2560700 2491587 2419489
34534 2419489 2184847 1653150 1011346 664652 829876 1328221 1762101 1832781 1530095 1084039
34524 1084039 735686 571112 593473 831412 1224134 1500493 1407210 1033127 698464 580362
34514 580362 703039 1189624 2082702 2888079 2849063 1955661 1209926 1436007 2176521 2367704
34504B367704m47494o1653Q74544R16392k18530j159691p91736K43967N94978
34495B318481R5151k91647j09831N2432k57918o22250n48252j97636J33348N25140
34485A097018Q98161O95049k16038r68919q20370k69548j86581l81839j03000
34476b56067M73648M87744m2250j62072M36222R28715O73679L503n35070q07127
34466A200925p31341j94373M39201N70630K94338K39345M19828K36747k97297
34457B178003m81817k39566k43179m78953j07194P95103R06518j67471r43626
34448A217818l46158N17974K54516m23117O2033J359271J569292J62273j224818
34439C149084j106982P1688Q55278N23062m74260j228921j222435p15104l31212
$$ plain form
34504 2367704 1920210 1858557 2733101 3649493 3430963 2271272 1479536 1723503 2318481
34495 2318481 2413632 2121985 2012154 2064586 1806668 1184418 636166 438530 571878 1097018
34485 1097018 1995179 2690228 2474190 1505271 684901 415353 228772 -153067 -256067
34476 -256067 217581 705325 663075 501003 937225 1865940 2539619 2543122 2008052 1200925
34466 1200925 469584 275211 714412 1285042 1579380 1818725 2238553 2475300 2178003
34457 2178003 1696186 1456620 1213441 734488 627294 1422397 2328915 2161444 1217818
34448 1217818 871660 1389634 1644150 1221033 1283066 2642337 4211629 4373902 3149084
34439 3149084 2042102 2113790 2969068 3492130 3017870 1788949 566514 -148590 -479802
34430d79802k16480K0005M31687N13639J83990J17218N17091M94085m62242j267534
34420a48343o53432Q45041J579447J067831L11669L9096q4321m12118o20471l88856
34410A535543K442J03266j25222l51141k59453R7142K70721J2830j48413M24976
34400A562691J214573R77293k71499r90931m57783N1412n50579j239917o33096
34391c37836N90637Q36794K15506K1955K89842J2492n83907k44664Q57830J091056
34381B749705R0930n64991L1522P71885N66657j9112j18194k8186k46264l05527
34371B928425K55381P24832J97100q94324j247718l85438Q41513J252067M49024
34362D120862q36305j367347o94105K35143K36797n41746r48283n04538J93867
$$ plain form
34430 -479802 -696282 -676277 -244590 269049 453039 570257 1087348 1581433 1119191 -148343
34420 -148343 -801775 43266 1622713 2690544 3002213 3041309 2956988 2544870 1924399 1535543
34410 1535543 1537985 1641251 1516029 1164888 905435 1002577 1273298 1286128 1137715 1562691
34400 1562691 2777264 3754557 3483058 2492127 2034344 2085756 1535177 295260 -337836
34391 -337836 252801 1089595 1305101 1327056 1616898 1629390 1045483 800819 1658649 2749705
34381 2749705 2840635 2275644 2307166 3079051 3645708 3626596 3508402 3480216 3233952 2928425
34371 2928425 3183806 3908638 4105738 3211414 1963696 1578258 2419771 3671838 4120862
34362 4120862 3284557 1917210 1223105 1458248 1695045 1153299 205016 -299522 -105655
34353a05655O56611R94897J165657Q06995O1102l85331l07419j53775j53737p3546
34343B505799J04037J39574J34105K80937K42136k10956l48104M06472R91798
34334D245798P7753j417184j293116M38839J378034M64237n58572k60147L25978
34325C401620K52l89019K16304Q78096K79879q50533r41264j49183J96830q5382
34315B557600j41053P2558j58474p22067p55009j50938L48766M33716M26037L76803
34305B287939N1653l15407k19048K70415O19005N86371K62162k61036o60449l88228
34295B233377M43592Q45254L36340k20171k6106K61828l26429j260320j168569
34286A118796N8402J074650Q88910r3294p85016m96450N33505J220053O54184
$$ plain form
34353 -105655 550956 1545853 2711510 3518505 3579607 3194276 2886857 2733082 2579345 2505799
34343 2505799 2609836 2749410 2883515 3164452 3406588 3195632 2847528 3254000 4245798
34334 4245798 4323551 2906367 1613251 2052090 3430124 3894361 3335789 3075642 3401620
34325 3401620 3401872 3012853 3229157 4107253 4387132 3536599 2595335 2446152 2642982 2557600
34315 2557600 2416547 2489105 2330631 1608564 853555 702617 1051383 1485099 1911136 2287939
34305 2287939 2339592 2024185 1805137 2075552 2694557 3280928 3543090 3282054 2621605 2233377
34295 2233377 2676969 3522223 3858563 3638392 3612286 3874114 3547685 2287365 1118796
34286 1118796 1177198 2251848 3140758 3047464 2262448 1765998 2299503 3519556 4173740
34277D173740n84480q58345K98303J336739Q11212o79709j607644j557239j039714
34268B92863k49606O70153R61260K76311l11169K46029J150630R13131k24101
34259C725501o69875K2792O96723N37115m9026n42467r05711r51049l89161L19215
34249A794057L00151l61849o13644J7037P68113P40778o3013r12472j028330j89061
34239D51767Q87700J099136L56541j49001L33017R28186N35440m25206p79340
34230C238240l96978o454J73966L68828L74441J2215j08504M48941Q43720J79475
34220E127890q12323q19238q2012J44129k63122m18951k78803n28685r03122m73938
34210F91825M98948Q09638L46524J35409L97873L56424l6210n763L60744J99577
$$ plain form
34277 4173740 3589260 2730915 3029218 4365957 5177169 4497460 2889816 1332577 292863
34268 292863 43257 713410 1674670 1950981 1639812 1885841 3036471 3949602 3725501
34259 3725501 3055626 3078418 3775141 4312256 4263230 3720763 2815052 1864003 1474842 1794057
34249 1794057 2094208 1732359 1118715 1135752 1903865 2644643 2581630 1669158 640828 451767
34239 451767 1339467 2438603 2795144 2646143 2979160 3907346 4442786 4017580 3238240
34230 3238240 2841262 2834808 3008774 3377602 3752043 3764258 3655754 4104695 4948415 5127890
34220 5127890 4315567 3496329 3414317 3558446 3295324 2876373 2597570 2068885 1165763 691825
34210 691825 1190773 2000411 2346935 2482344 2880217 3236641 3200431 3194668 3555412 3754989
34200C754989k81872J1672Q49215O87776o92877j574499r23135K29441O98640
34191B759350O78316O27819L08235k54376l53707Q1703J63095l33920m88631J6028
34181C203912K49053j62950k39185M71848Q56317J74795m87966k2902P34842L11706
34171E089470j010893j560621o10226Q03227J273304N15783n16026p26036j21919
34162C136063K50384j05180k85179M73780J230762O78319o25117j070132n60190
34153C123510l16566m65676n3486O19924J46724j217082j429117O5858J354224
34144A828313J171306O38527Q57513J070200N00823n6671J10566K41587k99835
34135F062329p47800m84043j64747j84964J49188Q02009M06781j200597j970517
$$ plain form
34200 3754989 3473117 3484789 4334004 5021780 4328903 2754404 1831269 2060710 2759350
34191 2759350 3437666 4065485 4373720 4119344 3765637 3847340 4010435 3676515 3187884 3203912
34181 3203912 3452965 3290015 3050830 3522678 4378995 4553790 4065824 4042922 4777764 5089470
34171 5089470 4078577 2517956 1907730 2710957 3984261 4500044 3984018 3257982 3136063
34162 3136063 3386447 3281267 2996088 3469868 4700630 5378949 4753832 3683700 3123510
34153 3123510 2806944 2341268 2287782 2907706 3054430 1837348 408231 474089 1828313
34144 1828313 2999619 3638146 4495659 5565859 6066682 6010011 6120577 6362164 6062329
34135 6062329 5314529 4830486 4665739 4480775 4629963 5431972 5838753 4638156 2667639
34126B667639p38076P35508N91188k65843j34868N20261L37408k69219m3677O87321
34116D087642P27698J81006q2881j96970o72053r45975l57082L64719K91784j0091
34106C387797L36591P43972L26266k68707m6945L93057K4523n50447k07207M99015
34096D637915K93058m97216o20400j47782k5279r1136M29542J070871P77019j02509
34086E724083l66138r478R0452k2727K62295N30850l258p19058l52104Q07722
34076E942639J268532O22519j47437l87085l28737k19836j55413l61747o13733
34067E619702j25468R83105J263459J75587o70238k710R21842M53028o42209o35856
34057G340242K20991M86933J24673M0327P0363l51630n65962P8260N02448l21363
$$ plain form
34126 2667639 1929563 2665071 3256259 2990416 2855548 3375809 3713217 3443998 3400321 4087642
34116 4087642 4815340 4996346 4913465 4716495 4044442 3098467 2741385 3106104 3397888 3387797
34106 3387797 3724388 4468360 4794626 4525919 4478974 4872031 4896554 4346107 4138900 4637915
34096 4637915 4930973 4433757 3813357 3665575 3640296 3549160 3978702 5049573 5826592 5724083
34086 5724083 5357945 5348467 5438919 5416192 5678487 6209337 6206079 5487021 5134917 5942639
34076 5942639 7211171 7833690 7686253 7299168 6970431 6750595 6595182 6233435 5619702
34067 5619702 5494234 6477339 7740798 7916385 7246147 7243437 8165279 8618307 7976098 7340242
34057 7340242 7561233 8048166 8172839 8213166 8283529 7931899 7365937 7444197 7946645 7625282
34047G625282j120635l03688J068069R37617k88378p00421k07012m2327j7489
34038F951018P47221J320070K94407j222411j094700J68811M22442k53724q8784
34029G244350O90128K99289r09116q20291N69311J166274N66703L77404Q13779
34020I997831M33673o83762q68189m9573K16886j51706R0421N28693k50702j278909
34010G984663k85368J918543K116502m9541j471041o47485N27744O17642M80347
34001A1192006N71693J6982r07802p00409M55390Q54298M45352O01739J003046
33992A3532295K93745o52830N284J243347P92312l25782M06829J746928O38964
33983A7681092j547828q52731J824428J813771r10779j554622Q21442J853774
$$ plain form
34047 7625282 6504647 6200959 7269028 8206645 7918267 7217846 7010834 6968507 6951018
34038 6951018 7698239 9018309 9312716 8090305 6995605 7164416 7586858 7333134 7244350
34029 7244350 7934478 8233767 7324651 6504360 7073671 8239945 8806648 9184052 9997831
34020 9997831 10431504 9747742 8879553 8829980 9046866 8895160 8985581 9514274 9263572 7984663
34010 7984663 7699295 9617838 11734340 11684799 10213758 9566273 10094017 10711659 11192006
34001 11192006 11763699 11780681 10872879 10172470 10627860 11482158 11927510 12529249 13532295
33992 13532295 13826040 13173210 13178494 14421841 15214153 14888371 15295200 17042128 17681092
33983 17681092 16133264 15280533 17104961 18918732 18007953 16453331 17274773 19128547
33975A9128547J07045p30716O67871J052855m19517m40903J408676J461869m15019
33966B1820708K4866K795399K756497n98272j538657J293601K377773K01221K03531
33957B9336667L497237L859612N1562p73257L275222M514435N56582l53985M568710
33948D8532785O314937J732630R66508P624605R856407L230404J919779J1633107
33940I1811162J4951735M835750N712790K8644212L1244863k9288674j15391043
33933C2520795j37715527p0838255J1933970L7099059J5938663K611453J0693369
33926i7756473J4275266N064079J139581P927005J0313914L477982J50244M725259
33918e0683143O259514Q82896j385918L339718N760498J428254j575061J533682
$$ plain form
33975 19128547 19235592 18504876 19172747 20225602 19806085 19365182 20773858 22235727 21820708
33966 21820708 21845574 24640973 27397470 26799198 25260541 26554142 28931915 29133136 29336667
33957 29336667 32833904 36693516 36745078 35971821 39247043 43761478 44318060 43964075 48532785
33948 48532785 54847722 56580352 57546860 65171465 75027872 78258276 80178055 91811162
33940 91811162 106762897 111598647 117311437 145955649 177200512 147911838 32520795
33933 32520795 -105194732 -176032987 -164099017 -126999958 -111061295 -108449842 -97756473
33926 -97756473 -83481207 -78417128 -77277547 -69350542 -59036628 -55558646 -55408402 -50683143
33918 -50683143 -44423629 -43540733 -44926651 -41586933 -35826435 -34398181 -35973242 -34439560
33910c4439560M132357J622116o83782J119886K439113J20444j335116R64698
33902b6059844K572837N49229q83017J293742L063044J052306j375069p06457
33894b0493229P30343J35267n12226Q46434J918330O55965o84672J3952Q99660
33885a6490176K83022J0074J327904J867512J30130j266705j62291J307612O90647
33876a2302271o64059n91095J97585L09959L79759R65489Q52548k10909k63020
33867a1326014J209515J691916p2281j635751j018306R0925j96591o19922L76803
33858a1499706J468350R62929j19147j48767K93221J40086R8703Q57361J206846
33849f740124J75823r71481q84986l10693l13198l22658L24802Q63851O82745
$$ plain form
33910 -34439560 -30307203 -28685087 -29368869 -28248983 -25809870 -25689426 -27024542 -26059844
33902 -26059844 -23487007 -22937778 -23820795 -22527053 -19464009 -18411703 -19786772 -20493229
33894 -20493229 -19762886 -19627619 -20139845 -19293411 -17375081 -16719116 -17403788 -17389836 -16490176
33885 -16490176 -16207154 -16197080 -14869176 -13001664 -12871534 -14138239 -14300530 -12992918 -12302271
33876 -12302271 -12966330 -13557425 -13359840 -13049881 -12670122 -11704633 -10852085 -11062994 -11326014
33867 -11326014 -10116499 -8424583 -8496864 -10132615 -11150921 -11059996 -11256587 -11876509 -11499706
33858 -11499706 -10031356 -9068427 -9187574 -9336341 -9043120 -8903034 -8804331 -7946970 -6740124
33849 -6740124 -6564301 -7535782 -8420768 -8731461 -9044659 -9367317 -9042515 -8178664 -7495919
33840g495919M93217O23040K37798o13023n38402N00996O39944n77068j127068
33831g856485p4904P30696N3567o19391r3636L47464l35746q58079k01108M26762
33821h480860J06760m3558N49516M81966o24817p81327O82090J352646m2513j041044
33811g841141K59413J704241R62877l47796J10623J053333K53624j077247o09914
33802e531987O37041K41992j072856r19449K89227L88247l24945P3210J128769
33793e090751P90879n73071p46612L14196O45986m216j20711L28105P218p39450
33783e188427l34037P83702O73459m97890o67547L63208O74390j72649n24503
33774d890294J07166L04050l37873n11539J01740K43967l25809l42669L96875
$$ plain form
33840 -7495919 -7002702 -6379662 -6141864 -6754887 -7293289 -6792293 -6152349 -6729417 -7856485
33831 -7856485 -7931389 -7200693 -7147126 -7766517 -7860153 -7512689 -7848435 -8706514 -8907622 -8480860
33821 -8480860 -8374100 -8417658 -7868142 -7386176 -8010993 -8792320 -8110230 -6757584 -6800097 -7841141
33811 -7841141 -7581728 -5877487 -4914610 -5262406 -5151783 -4098450 -3844826 -4922073 -5531987
33802 -5531987 -4894946 -4652954 -5725810 -6645259 -6356032 -5967785 -6292730 -6219520 -5090751
33793 -5090751 -4299872 -4872943 -5619555 -5305359 -4659373 -4663589 -4784300 -4456195 -4448977 -5188427
33783 -5188427 -5522464 -4738762 -4065303 -4563193 -5230740 -4867532 -4193142 -4365791 -4890294
33774 -4890294 -4783128 -4479078 -4816951 -5328490 -5226750 -4982783 -5308592 -5651261 -5254386
33765e254386O00435L8669o8752L75785O3471r67188j012381K49783J060650O21578
33755d292336K04592M78627L96606l36242l37189P72592J255939J18050j184508
33746b923869j188049m81562r2454J44382L90382J058q51825p75234L87709P99233
33736d590229l08681j026041Q8238J406111Q66843o43616r33291r9902N3431p07268
33726e894405q81489k367O86436M13942q2290J084M54989P59531Q12948O63386
33716c068235K89378j29669k80057j77427j74141m51301p32913n14142L99291
33707d839216J409834J446818K72202q47410o04788M74484P56913k1289m44670
33698b397122K02808Q38289M88138k01837l16100k38852o99439j252716r86477
$$ plain form
33765 -5254386 -4653951 -4615282 -4684034 -4308249 -4244778 -5211966 -6224347 -5974564 -4913914 -4292336
33755 -4292336 -4087744 -3609117 -3212511 -3548753 -3885942 -3113350 -1857411 -1739361 -2923869
33746 -2923869 -4111918 -4593480 -4685934 -4541552 -4151170 -4150112 -5001937 -5777171 -5389462 -4590229
33736 -4590229 -4898910 -5924951 -5836713 -4430602 -3563759 -4207375 -5140666 -5240568 -5187137 -5894405
33726 -5894405 -6775894 -6778261 -6091825 -5677883 -5760173 -5759089 -5304100 -4544569 -3731621 -3068235
33716 -3068235 -2778857 -2908526 -3188583 -3366010 -3540151 -3991452 -4724365 -5238507 -4839216
33707 -4839216 -3429382 -1982564 -1710362 -2557772 -3162560 -2688076 -1931163 -1952452 -2397122
33698 -2397122 -2194314 -1356025 -867887 -1069724 -1385824 -1624676 -2324115 -3576831 -4563308
33689d563308p7125N37016N69927M42260L05061k2064l86894m17615j46318J21823
33679c637237L61060O89136R08622P08590J50955m34475q34935r56158p30350
33670c774792k76670J39292M55922P69912R06589N58824r1697m99006n49006n50421
33660b911053m34797J52073Q65975Q00291j00778p65338n12021J19915M43881
33651b341852M99525M03179o6838o45438m63787N06818R83723K10226p73589o89049
33641b377082J12063M57071J95028J819M86j53497k68470P7736N41169M50783
33631i62894o862j17747O5277j41220p24598q74689k85087L90020N48898L35021
33621a773881J34391K1789r8912k65147m75912o26337m95683j04461J34789k1684
$$ plain form
33689 -4563308 -4640433 -4103417 -3533490 -3091230 -2786169 -2808233 -3195127 -3612742 -3759060 -3637237
33679 -3637237 -3276177 -2587041 -1678419 -969829 -818874 -1253349 -2088284 -3044442 -3774792
33670 -3774792 -4051462 -3912170 -3456248 -2686336 -1779747 -1220923 -1312620 -1811626 -2360632 -2911053
33660 -2911053 -3345850 -3193777 -2327802 -1527511 -1628289 -2393627 -2905648 -2785733 -2341852
33651 -2341852 -1842327 -1439148 -1505986 -2151424 -2615211 -2108393 -1124670 -914444 -1688033 -2377082
33641 -2377082 -2265019 -1807948 -1612920 -1611101 -1610615 -1764112 -2032582 -1954846 -1413677 -962894
33631 -962894 -969756 -1087503 -1022226 -1163446 -1888044 -2762733 -3047820 -2657800 -2108902 -1773881
33621 -1773881 -1639490 -1617701 -1716613 -1981760 -2457672 -3084009 -3579692 -3684153 -3549364 -3571048
33611c571048k44044j85187l1365J278K10697P55407R69078K67172o20320m39866
33601b888198O64716J198768M61151n02763n67666j39266l04273j040619j253547
33592d371697m18298O66660R55928M26148p6224K6915M47213N42171J16183m17617
33582b102618n02945N3122Q88368J293580Q21107j58017p55283o13906k99740
33573a376332l44722m03708L7033N71857L96649l05034n24529k053L97623R9597
33563a453619l89582m68698k86899j38182J13822M57646L91266k23995o86727
33554b684968m54430O1852L11854M86400Q73428J043787N25787k69968o36199
33545g42457n85315m80109j84867M92970R61212M67299o62633j327117j053815
$$ plain form
33611 -3571048 -3815092 -4000279 -4031644 -4030366 -3819669 -3064262 -2095184 -1828012 -2448332 -2888198
33601 -2888198 -2223482 -1024714 -563563 -1066326 -1633992 -1773258 -2077531 -3118150 -4371697
33592 -4371697 -4789995 -4123335 -3167407 -2741259 -2817483 -2790568 -2343355 -1801184 -1685001 -2102618
33582 -2102618 -2605563 -2552441 -1664073 -370493 450614 292597 -462686 -1076592 -1376332
33573 -1376332 -1721054 -2124762 -2087729 -1515872 -1119223 -1424257 -1948786 -1950839 -1553216 -1453619
33563 -1453619 -1843201 -2311899 -2598798 -2736980 -2623158 -2165512 -1774246 -1998241 -2684968
33554 -2684968 -3139398 -3077546 -2765692 -2279292 -1405864 -362077 163710 -106258 -742457
33545 -742457 -1327772 -1807881 -1992748 -1499778 -538566 -71267 -733900 -2061017 -3114832
33536c114832l25781K92440N82732M52075P1328R151M48977N92543k35051j224614
33526b451032r98782K63210R58345M62686q450N26362J204963P51830m59314j016385
33516g66567o38088m10729q70942j098662k30181J037452J309529M24124m12159
33507a656223l60913J03731K58214K44320M86300O98435L72589j79540k65346
33498b98433l7067k06304o50186n07213K31182N03572q2664n44253j38406M79541
33488a250231M68375J08192J5363N842k77897m46086j12991J67785j96210o57820
33478b175678l84707K83910M21763Q3398O0715M19970N13229K38585J12567K03868
33468b22380R2382j82270j58355J15639J32123j69559m18820n57391o87004m70268
$$ plain form
33536 -3114832 -3440613 -3148173 -2565441 -2113366 -2042038 -2032887 -1583910 -991367 -1226418 -2451032
33526 -2451032 -3449814 -3186604 -2228259 -1765573 -1774023 -1247661 -42698 709132 249818 -766567
33516 -766567 -1404655 -1815384 -2686326 -3784988 -4015169 -2977717 -1668188 -1244064 -1656223
33507 -1656223 -2017136 -1913405 -1655191 -1410871 -924571 -226136 146453 -33087 -298433
33498 -298433 -335500 -541804 -1191990 -1699203 -1468021 -964449 -1047113 -1591366 -1729772 -1250231
33488 -1250231 -781856 -673664 -658301 -652459 -930356 -1376442 -1489433 -1321648 -1517858 -2175678
33478 -2175678 -2560385 -2276475 -1854712 -1771314 -1710599 -1290629 -777400 -538815 -426248 -222380
33468 -222380 -129998 -312268 -470623 -354984 -222861 -392420 -811240 -1368631 -2055635 -2525903
33458b525903L10943R23262N56086k55641l45734J87711K28366l32227m14785
33449a667922K44255N41726q1956o91165m81541k1463o1088k49378M4597N26605
33439a897330N13122M2776l21303l32189j33736P3357N4763k94419n79737k93810
33429c168506K85978L46327j70552m40029j27543J68491J70320M30344J055811
33420a449359J156613L49399l39338m2488N15198K72500m01865m88698j36863
33411e64901k70732q23914q29092j29766L68951K42903J03469L62577N55373L09936
33401f75196N5930K26065M75909K92469j52450l65463l74877n65397q41153o16849
33391b541012K46547J036536J039110M45833q575r0824j86200m19861l75957O2027
$$ plain form
33458 -2525903 -2214960 -1291698 -735612 -991253 -1336987 -1149276 -920910 -1253137 -1667922
33449 -1667922 -1423667 -881941 -963897 -1655062 -2136603 -2158066 -2219154 -2468532 -2423935 -1897330
33439 -1897330 -1384208 -1341432 -1662735 -1994924 -2128660 -2055303 -2000540 -2294959 -2874696 -3168506
33429 -3168506 -2882528 -2536201 -2706753 -3146782 -3274325 -3105834 -2935514 -2505170 -1449359
33420 -1449359 -292746 56653 -282685 -325173 190025 462525 60660 -428038 -564901
33411 -564901 -835633 -1659547 -2488639 -2618405 -2249454 -2006551 -1903082 -1540505 -985132 -675196
33401 -675196 -619266 -393201 82708 375177 222727 -142736 -517613 -1083010 -1924163 -2541012
33391 -2541012 -2294465 -1257929 -218819 227014 218439 127615 -58585 -478446 -854403 -792376
33381g92376L20253Q3697o7242K85365L88659n19239j529491j022857P38599J599942
33371e14690N44212q06341o08801O08221J049688M07551l0542L68948P39691K54414
33361B012351o75058j139309q77924k62161L29454P11343P78973N33315J25322
33352A536306k47214m31505l58984j43553p2987l04562o01684n62346j14078L66220
33342i34387M63567J87607k2426J99531O39669O66452L0736p05195q19000l40001
33332f33447P1270N1366j14549p4166J18012K22215J44610p9625l66364n76224
33322a236902o23057n38170k60305L82209J168251J331058M53827p58051j212901
33313a294041p17418O8210O28153Q13485M46861l59628p91418k82674L82308R3366
$$ plain form
33381 -792376 -472123 -388426 -455668 -170303 218356 -300883 -1830374 -2853231 -2114632 -514690
33371 -514690 29522 -776819 -1385620 -777399 272289 679840 649298 1018246 1757937 2012351
33361 2012351 1337293 197984 -679940 -942101 -612647 98696 877669 1410984 1536306
33352 1536306 1289092 857587 498603 355050 282063 -22499 -624183 -1186529 -1300607 -934387
33342 -934387 -470820 -283213 -305639 -106108 533561 1200013 1230749 525554 -293446 -633447
33332 -633447 -562177 -510811 -625360 -699526 -581514 -359299 -214689 -294314 -660678 -1236902
33322 -1236902 -1859959 -2398129 -2658434 -2276225 -1107974 223084 676911 -81140 -1294041
33313 -1294041 -2011459 -1943249 -1315096 -501611 -54750 -414378 -1205796 -1488470 -1106162 -1012796
33303a012796p17811o59504K80702O44005o3977o12614k34447J76735j28643l95794
33293b724144J10283O54682L34325l62983n29639l19334k62455r8131M91520R04586
33283a801290N87228J00452O3108r998n93532r32042l48220K68417j10088p03696
33273c479661k27279P04317N45972l75561k88632R53526J493957M50205p71119
33264i94275p47357O0770M28288P3906m59051o51098k30258O57110J251639R21727
33254C11401J20214k18324m7038R891q1413N2360Q0345n00286r84102k86734R66900
33243e76786J039724j60427r08751n27561k86191q39738r78926K2159Q62582M04669
33233a949246l60946j15856N27114K91129m48873m31710K66834N24478J16771
$$ plain form
33303 -1012796 -1730607 -2390111 -2109409 -1465404 -1529381 -2141995 -2376442 -2199707 -2328350 -2724144
33293 -2724144 -2613861 -1959179 -1624854 -1987837 -2517476 -2836810 -3099265 -3197396 -2705876 -1801290
33283 -1801290 -1214062 -1113610 -1050502 -1060500 -1654032 -2586074 -2934294 -2665877 -2775965 -3479661
33273 -3479661 -3706940 -3002623 -2456651 -2832212 -3120844 -2167318 -673361 -223156 -994275
33264 -994275 -1741632 -1680862 -1252574 -1178668 -1637719 -2288817 -2519075 -1861965 -610326 311401
33254 311401 431615 213291 166253 176144 94731 147091 227436 -272850 -1256952 -1543686 -576786
33243 -576786 462938 302511 -606240 -1133801 -1419992 -2259730 -3238656 -3216497 -2353915 -1949246
33233 -1949246 -2310192 -2426048 -1898934 -1607805 -2056678 -2488388 -2221554 -1697076 -1580305
33224a580305j94953q8169J93848P02412J440848J611131N77768p90694j133746
33215G38140o27971n40525r93721q22442K48194R41516M36898l81208m19392K6542
33205a393969Q3705j31968J62993R22671J129699K31121j014906j459703r27837
33196b398194k27553N3211K00779O06758R03814N27661j51323j82400M18163M94182
33186B45098m51166j267512p56707N05818R70866K71094n23742o15158l21647
33177a943056j14696J46678O01400Q00153L37988l75745n67929j34143K72209
33168i77141J64151j80216j99187J64071M67612M54900L18332J81089k11644r19892
33158g37925j333931q68304R0039O04165M61359K86783L89052L52166j6710k06930
$$ plain form
33224 -1580305 -1775258 -1863427 -1669579 -967167 473681 2084812 2662580 1871886 738140
33215 738140 110169 -430356 -1424077 -2246519 -1998325 -1056809 -619911 -1001119 -1420511 -1393969
33205 -1393969 -1310264 -1442232 -1279239 -356568 773131 1004252 -10654 -1470357 -2398194
33196 -2398194 -2625747 -2572536 -2371757 -1764999 -861185 -333524 -484847 -667247 -249084 245098
33186 245098 -206068 -1473580 -2230287 -1724469 -753603 -482509 -1006251 -1621409 -1943056
33177 -1943056 -2057752 -1911074 -1309674 -509521 -171533 -547278 -1115207 -1249350 -977141
33168 -977141 -812990 -993206 -1192393 -1028322 -560710 -105810 212522 393611 181967 -737925
33158 -737925 -2071856 -2940160 -2850121 -2245956 -1784597 -1497814 -1108762 -756596 -773306 -980236
33148i80236J01884M21193K63017p2831j05313j738j45321l21800m8456N42155
33138c47446P89690L78894l33383p85637p07461k76329M1303m376p9537K17114
33128a107168N42280K04020n66673o62424K40090J025947P28791j29322n28237
33119b52696m32688l59132j88059M73868J191829J082559J32890p58989r51728
33110f2146n67461l5992K22252n9967n57721m46534M39701J068656N72722m48229
33100A25281q82486p20702o15299m53608K48728R46628O07003m63155q51974j88071
33090b247655M17277K85679O8865L34117O36419N65392M77671N49316K36620o18033
33080G05668j185666r06235l95529l23411k94424K79705R88736J059796N70761
$$ plain form
33148 -980236 -878352 -457159 -194142 -266973 -372286 -374024 -519345 -841145 -889601 -347446
33138 -347446 442244 821138 487755 -297882 -1005343 -1281672 -1240369 -1244745 -1324282 -1107168
33128 -1107168 -564888 -360868 -927541 -1589965 -1349875 -323928 404863 275541 -252696
33119 -252696 -685384 -1044516 -1232575 -758707 433122 1515681 1648571 889582 -62146
33110 -62146 -629607 -665599 -443347 -503314 -1061035 -1507569 -1067868 788 573510 125281
33100 125281 -757205 -1477907 -2093206 -2546814 -2298086 -1351458 -744455 -1207610 -2059584 -2247655
33090 -2247655 -1830378 -1544699 -1475834 -1141717 -505298 60094 537765 1087081 1323701 705668
33080 705668 -479998 -1386233 -1781762 -2105173 -2399597 -2119892 -1131156 -71360 499401
33071D99401J20583j83365n24461o55839l16787K0522k09532n55044q5081J069069
33061h20534J726837J314393N54996J92098j14980r99187k040483k047971o91655
33052b926486P96394R45845j88055j086664o64075M12866P23078M7691m17128
33043b356534J54915J014635R13967j08936p52565k11298P51115Q28720r8393
33034A35626q30607m78660L63448N32280l1592l23384Q8518M42822J31869k89814
33024b59494j10332L47207M27940L58039O68297R18283K64016r41608j416877
33015B55471q12372q3261Q5303K1548O7536M7216M379K90227O04607J67044p97046
33004a49348j057466l47998Q4979m14181p62125r5671N79983P8677q37064o35435
$$ plain form
33071 499401 619984 436619 -87842 -743681 -1060468 -1039946 -1249478 -1804522 -1889603 -820534
33061 -820534 906303 2220696 2775692 2967790 2852810 1853623 -186860 -2234831 -2926486
33052 -2926486 -2130092 -1184247 -1372302 -2458966 -3123041 -2710175 -1987097 -1939406 -2356534
33043 -2356534 -2201619 -1186984 -273017 -381953 -1134518 -1345816 -594701 234019 135626
33034 135626 -694981 -1173641 -810193 -277913 -309505 -632889 -544371 -101549 30320 -259494
33024 -259494 -369826 -22619 405321 763360 1431657 2349940 2613956 1672348 255471
33015 255471 -556901 -640162 -554859 -533311 -465775 -418559 -414180 -123953 480654 647698 -149348
33004 -149348 -1206814 -1554812 -1469833 -1884014 -2646139 -2741810 -2161827 -2083150 -2920214 -3555649
32994c555649N30729J227219J016994O53712L57457l75648j278333j263373j54736
32985b841628Q67573R10390L54240r1476k68943j88539K44885P40343P08193J73132
32975F08170j85005j28810j21678k60461P10O29856O32199l75909j198340o81872
32965a081140M27703M77292o15048j200966l32403Q58605P95414l68448j079708
32956b118699n33049M36227P11087L38614J21313K97402L74754J04367j72482
32947d40466k52527m02755o80983o25131o3629M08064L35618J92816N37114R13419
32937g8460N26658l41628o47754k19003J0102m48111q66452n06784K35795M82816
32927a852821J30458j44768J11752N97300O90448K08438l28084k79760K27859
$$ plain form
32994 -3555649 -3024920 -1797701 -780707 -126995 230462 -145186 -1423519 -2686892 -2841628
32985 -2841628 -1974055 -1063665 -709425 -800901 -1069844 -1258383 -1013498 -273155 435038 608170
32975 608170 423165 294355 172677 -87784 -87074 542782 1174981 799072 -399268 -1081140
32965 -1081140 -653437 -176145 -791193 -1992159 -2324562 -1465957 -670543 -1038991 -2118699
32956 -2118699 -2651748 -2215521 -1504434 -1165820 -1044507 -747105 -372351 -267984 -440466
32947 -440466 -692993 -1095748 -1776731 -2401862 -2465491 -2057427 -1721809 -1528993 -991879 -78460
32937 -78460 448198 106570 -541184 -760187 -750085 -1198196 -2064648 -2571432 -2335637 -1852821
32927 -1852821 -1722363 -1867131 -1755379 -1158079 -467631 -259193 -587277 -867037 -639178
32918f39178L73757j23707l81216L64033J314150J011918m63850j412774q49349
32909h06216K26770M11423k43812o69538l41072L54090Q14571O60739r6022p99045
32899d88112n50472N99033J388996Q70152l35137r55668p37226l90754k96504
32890h95692j86141O4189K03371J80063K44438M20033M24940J43769k43922n17965
32880a62917m53453J00856P46324O13097m17348j095677l70979Q60789Q26404
32871F47096m89326j235999m23775P29952P72021j7153n28064n69113n74709m11475
32861b100545K40267Q15962M63353m95684q72382l43817K09481J85936J8224J56002
32851a723203K56138j00446n95441o58772l22983r1083k18576m79949m60915Q6463
$$ plain form
32918 -639178 -265421 -389128 -770344 -406311 907839 1919757 1455907 43133 -806216
32909 -806216 -579446 -168023 -411835 -1081373 -1422445 -1068355 -253784 406955 310933 -488112
32899 -488112 -1038584 -439551 949445 1819597 1484460 528792 -208434 -599188 -895692
32890 -895692 -1081833 -1017644 -814273 -634210 -389772 30261 455201 598970 355048 -162917
32880 -162917 -616370 -515514 230810 843907 426559 -669118 -1040097 -179308 647096
32871 647096 157770 -1078229 -1502004 -772052 -31 -17184 -545248 -1114361 -1689070 -2100545
32861 -2100545 -1860278 -1044316 -580963 -1076647 -1949029 -2292846 -2083365 -1897429 -1879205 -1723203
32851 -1723203 -1467065 -1567511 -2162952 -2821724 -3144707 -3235790 -3454366 -3934315 -4395230 -4308767
32841d308767R33679J383249R90960K96533K43249P73312P89346j59090j045649
32832a03178q87267k70643l56682r44362p94763L04024J130879R01532L18255
32823g02205K33868L43397K2767l48905K9838Q84207J043654J36904q12547p74232
32813E6746k1740L80416j2348o23605p28118k86728J85551L04632J43038l1135
32803f33291p0368N5847L04061M01202o1392r79435j406369n16266J074935J690639
32793a40437O28695q56106j157618l21786L53136L12836K67334O86139Q77462
32784F49655J20538j029495j348379n56864L66340M63514j43781o02223l58364
32775b439059L72444R64218R70024M03807l46878p79966n79534J11791O86703
$$ plain form
32841 -4308767 -3375088 -1991839 -1000879 -704346 -461097 312215 1101561 942471 -103178
32832 -103178 -990445 -1261088 -1617770 -2562132 -3356895 -3052871 -1921992 -1020460 -702205
32823 -702205 -468337 -124940 -102173 -451078 -421240 462967 1506621 1643525 830978 56746
32813 56746 35006 415422 403074 -220531 -948649 -1235377 -1049826 -745194 -602156 -633291
32803 -633291 -703659 -647812 -343751 57451 -3941 -983376 -2389745 -2906011 -1831076 -140437
32793 -140437 488258 -367848 -1525466 -1847252 -1494116 -1181280 -913946 -227807 649655
32784 649655 770193 -259302 -1607681 -2164545 -1798205 -1334691 -1478472 -2080695 -2439059
32775 -2439059 -2066615 -1102397 -132373 271434 -75444 -855410 -1434944 -1323153 -636450
32766f36450N80177n7765m10087L2754P40381P69087J6158o47990n53985j796
32756a69516L68346M36687M04247J74465m27568j022629r63681k93768K10833
32747a282584J25450q1682J17734N05860O09913N12957N29302M11929k92391j184130
32737b7642j219791k21375O45212L84615n01118q29109l48094K34992M78608N66928
32727h36774N68816K47241k62629l83067L1296M02616K93411l6920k07568k19307
32717d02885p0897M26188R94153P73277m62471j574724j375660k53643M05635
32708a541027J42355k11391k3191K96469J94984j11203q6275K86931N67941M83297
32698a110J76137k9906K8459J63116L3085l26332l92443J16607O66920N47022
$$ plain form
32766 -636450 -56273 -114038 -524125 -491371 249010 1018097 1034255 386265 -167720 -169516
32756 -169516 198830 635517 1039764 1214229 786661 -235968 -1199649 -1493417 -1282584
32747 -1282584 -1157134 -1238816 -1121082 -615222 -5309 507648 1036950 1448879 1156488 -27642
32737 -27642 -1247433 -1468808 -823596 -438981 -940099 -1769208 -2117302 -1882310 -1403702 -836774
32727 -836774 -267958 -20717 -283346 -666413 -635117 -232501 60910 23990 -183578 -402885
32717 -402885 -473782 -47594 946559 1719836 1257365 -317359 -1693019 -1946662 -1541027
32708 -1541027 -1398672 -1610063 -1633254 -1336785 -1141801 -1253004 -1339279 -1052348 -484407 -1110
32698 -1110 175027 145121 173580 336696 369781 43449 -348994 -232387 434533 981555
32688I81555j19549n69928m57981q3985K87407N82218M70620l24678j178770j000053
32678a413144J91289J074643Q41806K24230J15668J85691k12770o26033k30821
32669A50559N34277M44886n05259r05899j2224J105228J057327k8855q56474o53056
32659C30510J43508O63966N03667j33145p62468r80282p12933k46025L7521R007
32649a146674r5601N5610M46857N89746N7227p99705j001537j08929J015174J114849
32639A27017J63341n20992j8220Q89188P41663n29651j366571o52905O92235Q92770
32629D17875k57402j121018n44058N31358M98239n69402j100127l45636O64745
32620a825426P56899J68758j35898L9796J21540j39093l48226j71171K27001M80327
$$ plain form
32688 981555 862006 292078 -165903 -249888 37519 619737 1090357 765679 -413091 -1413144
32678 -1413144 -1221855 -147212 694594 918824 1034492 1220183 1007413 381380 150559
32669 150559 684836 1129722 624463 -281436 -293660 811568 1868895 1840040 983566 330510
32659 330510 474018 1137984 1641651 1508506 746038 -234244 -947177 -1193202 -1155681 -1146674
32649 -1146674 -1242275 -1186665 -739808 -150062 -92835 -892540 -1894077 -2003006 -987832 127017
32639 127017 290358 -230634 -248854 640334 1381997 852346 -514225 -1167130 -474895 417875
32629 417875 160473 -960545 -1504603 -973245 -475006 -1044408 -2144535 -2490171 -1825426
32620 -1825426 -1068527 -899769 -1035667 -995871 -874331 -1013424 -1361650 -1532821 -1305820 -825493
32610h25493M01527O3327k53452k49089P3600L68738L35052p478m35820o28035
32600a157123k11881P55078J345017N85553j030288j764186q63281L74652N16856
32591a449603j6403r577L85825J18622o15874n05836N67186J120617M23573l57569
32581c39039j22083M93598M40397N2629K34384O98437M36888m75019r04059m13314
32571A02819J82091J68975j17789k7412M22367O71039L28387m79737j222406j345188
32561a316854p92859j34111J02237J04224M17314J012925J218747O49677k35049
32552A026251o80428m34796J49563N58129M99999M5298m54224o46628m49100l0490
32542d16426L85634O12829N40927K65279O9093Q8795J18818l7169j74892L9330
$$ plain form
32610 -825493 -423966 -360639 -614091 -863180 -789580 -420842 -85790 -93268 -529088 -1157123
32600 -1157123 -1369004 -613926 731091 1316644 286356 -1477830 -2341111 -1966459 -1449603
32591 -1449603 -1466006 -1475583 -1089758 -971136 -1587010 -2092846 -1525660 -405043 18530 -339039
32581 -339039 -461122 32476 472873 525502 759886 1458323 1895211 1420192 516133 102819
32571 102819 284910 453885 336096 308684 731051 1402090 1730477 1250740 28334 -1316854
32561 -1316854 -2109713 -2243824 -2141587 -2037363 -1620049 -607124 611623 1261300 1026251
32552 1026251 345823 -88973 60590 618719 1118718 1164016 709792 63164 -385936 -416426
32542 -416426 -30792 582037 1122964 1388243 1457336 1546131 1664949 1627780 1452888 1492218
32532A492218M84124O13139J09847p31214j309185j222914n17059L44848P70957
32523C4761N41829N1675j08829K08433O17698O58816K00576m73833q13902m52287
32513D64937K46060L69583m14563j197871q55478M20528J269710Q54088k52836
32504I04158r82148r18094l01172M65435R13319O40921j62090o75792l73641K97001
32494a92103N33133J73100l19284n63221m91978j14461M48244Q01681O01178P170
32484H83459m85336n74315k74199K40680N95925L35339m67621j009643p14627
32475a470338j12684q8549m80383k98705O65433J398216J100955K26177l60246
32466E79876n12882n27145l47033K13163Q26128R54359O13149K11540k01508q44823
$$ plain form
32532 1492218 1976342 2589481 2699328 1968114 658929 -563985 -1081044 -736196 34761
32523 34761 576590 628265 519436 727869 1345567 2004383 2204959 1731126 917224 464937
32513 464937 710997 1080580 666017 -531854 -1387332 -966804 302906 1156994 904158
32504 904158 -77990 -996084 -1297256 -831821 81498 722419 560329 -115463 -489104 -192103
32494 -192103 341030 514130 194846 -368375 -860353 -974814 -526570 275111 876289 883459
32484 883459 398123 -176192 -450391 -209711 386214 721553 253932 -755711 -1470338
32475 -1470338 -1583022 -1671571 -2151954 -2450659 -1785226 -387010 713945 940122 579876
32466 579876 66994 -460151 -807184 -594021 232107 1186466 1799615 2011155 1809647 964824
32456I64824j399680j077108K11078J343563J178427j4003q41888n01641L05781
32447A69353M10543k78837p92311n22175O9071L65065M84702O98410O03585k08759
32437I98647j059366q79306R1046N14774J7637k78152K79903P53475K92056l46847
32427C83867j42434L90317J95521l42973p7231P49464Q06697l3685n19365k39136
32417A171042k03138p99307r77117k24530L20734j90061p24436n3020J114789
32408e65044J173157L9436r19695q99291k72770M39306R55237Q48144N020o80195
32398A23305k42798Q11995J049023J38832q15778j012405p70721m57393J01652
32389a074288P06757N31908n02807j127254l51338J045411J513963O81031m98674
$$ plain form
32456 964824 -434856 -1511964 -1300886 42677 1221104 1207101 365213 -136428 169353
32447 169353 579896 301059 -491252 -1013427 -944356 -579291 -94589 603821 1207406 998647
32437 998647 -60719 -940025 -848979 -334205 -316568 -594720 -314817 438658 730714 383867
32427 383867 241433 631750 827271 484298 407067 1156531 1963228 1929543 1410178 1171042
32417 1171042 967904 168597 -808520 -1033050 -712316 -902377 -1626813 -1679833 -565044
32408 -565044 608113 647549 -272146 -1171437 -1444207 -1004901 -49664 798480 803500 123305
32398 123305 -119493 692502 1741525 1880357 1064579 52174 -718547 -1175940 -1074288
32389 -1074288 -367531 164377 -338430 -1465684 -1817022 -771611 742352 1423383 924709
32380I24709j076129q03968J16147J122121J328257L19827j080377j537724p74587
32371a461724J77648L66748n8298m04419m11228k70327p9288K23670N29835N77563
32361h09820K88669j76558o39587q99980o11840L83693J520308J801046R43342
32352A799273j69155n90535m83673n98563r23782p55696o3924K63642j24502l44288
32342a991203L11393J099181Q58779k77141j187555j344819j038248l44595Q70967
32333c043241J946793J730108K57156r65336q61981l4517M27992M25299L85420
32324B67693J99494l66801p77570l56040M74201O58429J32229j10888L04717N07614
32314I33078j12590p71734m99061K21910J29860p54820r73997J86730J459986
$$ plain form
32380 924709 -151420 -955388 -839241 282880 1611137 1930964 850587 -687137 -1461724
32371 -1461724 -1284076 -917328 -975626 -1380045 -1791273 -2061600 -2140888 -1917218 -1387383 -809820
32361 -809820 -521151 -697709 -1337296 -2237276 -2849116 -2465423 -945115 855931 1799273
32352 1799273 1630118 1039583 555910 -42653 -966435 -1722131 -1786055 -1522413 -1646915 -1991203
32342 -1991203 -1679810 -580629 278150 1009 -1186546 -2531365 -3569613 -3914208 -3043241
32333 -3043241 -1096448 633660 890816 -74520 -936501 -971018 -543026 -117727 267693
32324 267693 467187 100386 -677184 -1033224 -559023 99406 231635 120747 425464 933078
32314 933078 820488 48754 -450307 -228397 -98537 -853357 -1827354 -1640624 -180638
32305a80638J297763N1789n96487k5588P02514O57942K43819Q7574j45913r06801
32295A185974j517103r56513M50393J278882Q98555J14195j86231p5828k4199
32286A168125j29247l00029n46902p09844m58295R6945L38270M2208j98733J15496
32276e82006N54768L67852l80729q13354k91747Q57261J627333J236596r4595
32267B481379j236269j270480n06098k4933k72369o25862m15101K36807P84733
32258h48193R11392N65261j21066o89922o40453j07512K24956Q2515q8852M4070
32248f67804K35375K91184M11730N31263J34930p27933j062074k85057P30654
32239d07732Q12057J19532k66253M1928M60345M91628J86309k75227o72146n74716
$$ plain form
32305 -180638 1117125 1168914 572427 546839 1249353 1907295 2151114 2238688 2092775 1185974
32295 1185974 -331129 -1287642 -837249 441633 1340188 1454383 1268152 1192324 1168125
32286 1168125 1038878 738849 191947 -517897 -976192 -879247 -540977 -498769 -697502 -582006
32276 -582006 -27238 340614 -40115 -853469 -1145216 -287955 1339378 2575974 2481379
32267 2481379 1245110 -25370 -531468 -556401 -828770 -1454632 -1869733 -1632926 -848193
32258 -848193 63199 628460 507394 -182528 -822981 -930493 -705537 -623022 -711874 -667804
32248 -667804 -432429 -141245 270485 801748 936678 208745 -853329 -1138386 -407732
32239 -407732 404325 523857 257604 299532 759877 1251505 1437814 1162587 490441 -84275
32229h4275J44663P65931M62558m80928r51280n01337J76148L51341J41013Q0825
32219A04659L46040O48826O01609O4489o52073r67346o43166q9341J90616K30673
32209a65014L45558N05327M17025O2098k90648n01423o05997n51204k38386K24902
32199g97762N58037N36589J37267l40328l70729J44007M35035k09291j141623
32190a048798r83923L11496J249944J005042M41009K94860n6989r30251j070166
32181g87776L21039J683362J199850k92075o87617m6626j27797r89541q62156
32172e89337M69616R65994k66941j412266q98213K81836N75272L10676N50994
32163a2369J001664P36815l6470m69428n46948p39657q51307m40792J52299L03332
$$ plain form
32229 -84275 60388 826319 1288877 807949 -143331 -644668 -468520 -117179 23834 104659
32219 104659 450699 1099525 1701134 1765623 1113550 146204 -496962 -586303 -395687 -165014
32209 -165014 180544 685871 1102896 1164994 874346 372923 -233074 -784278 -1022664 -797762
32199 -797762 -239725 296864 434131 93803 -276926 -132919 302116 92825 -1048798
32190 -1048798 -2032721 -1721225 -471281 533761 974770 1269630 1212641 282390 -787776
32181 -787776 -466737 1216625 2416475 2124400 1436783 1390157 1262360 272819 -589337
32172 -589337 -119721 846273 579332 -832934 -1731147 -1449311 -874039 -563363 -12369
32163 -12369 989295 1726110 1689640 1220212 673264 -66393 -917700 -1358492 -1206193 -902861
32153i02861J59415K49060M92254M66154K28083J08734J12587J65087M44227Q63171
32143B385911Q07903J2945q72862j150467q91609m44857J05826N14071L08897
32134G75758k95991m21109p733q5993q45140q70952N71758J906932J414779j30076
32124B012233p22342j33152K19635j88789n13444l61466k83653m29583k82397
32115f82958J67868L49622K49153L55762N16342J44293m95880n78088k55944m69760
32105f99590j138069j047050J64762J306084J332819N53680k18197n96994m31452
32096g74007J85518M89726j82847j026699n35978J093090J871022Q39407n90451
32087A368781q96821n09444n44536q45127o26915o9007J31833R4591L43809O06391
$$ plain form
32153 -902861 -743446 -494386 -2132 464022 692105 800839 913426 1078513 1522740 2385911
32143 2385911 3193814 3206759 2333897 1183430 291821 -153036 -47210 466861 775758
32134 775758 479767 58658 50925 -35068 -880208 -1751160 -1179402 727530 2142309 2012233
32124 2012233 1289891 1156739 1376374 1187585 674141 312675 29022 -400561 -682958
32115 -682958 -515090 -165468 83685 439447 955789 1100082 604202 26114 -229830 -699590
32105 -699590 -1837659 -2884709 -2719947 -1413863 -81044 472636 254439 -342555 -774007
32096 -774007 -588489 -98763 -281610 -1308309 -1844287 -751197 1119825 1959232 1368781
32087 1368781 471960 -37484 -582020 -1427147 -2054062 -2123069 -1991236 -1896645 -1552836 -946445
32077i46445K70009l42674l66640J60880L77540L7992j62843K16882P47460Q95991
32067H88152O98943M13376L0713n49824j130827j252586o53557K74069O36280
32058f45261J2253p79959n13555P14112J369500N32228p59381r56824j13942M54382
32048f86447K04490j11802R5334M04159K94187R429K1052K59117L97540M53800
32038A340859N77584N52663O6618o53996j006007q31508o02173o26557n22627
32029a705144J47178J010894J199151M99007l31869n68841l61453k65078l54100
32020g30255k75076O7509L87582M81136L81948J24497k46541m86270l55394J7289
32010f33575K98300L74415L01483L7257l60012m98412j28402L56742M39251K33718
$$ plain form
32077 -946445 -676436 -1019110 -1385750 -1224870 -847330 -809338 -972181 -755299 -7839 888152
32067 888152 1587095 2000471 2031184 1481360 350533 -902053 -1555610 -1281541 -645261
32058 -645261 -633008 -1412967 -1926522 -1212410 157090 689318 -70063 -1026887 -1140829 -686447
32048 -686447 -481957 -593759 -498425 -94266 199921 209350 230402 489519 887059 1340859
32038 1340859 1918443 2471106 2537724 1883728 877721 46213 -555960 -1182517 -1705144
32029 -1705144 -1557966 -547072 652079 1151086 819217 250376 -111077 -376155 -730255
32020 -730255 -1005331 -937822 -550240 -69104 312844 437341 190800 -295470 -650864 -633575
32010 -633575 -335275 39140 340623 377880 17868 -480544 -608946 -252204 187047 420765
32000D20765R2584j79742q08597j049533L5880J762552K172832O75126r51380
31991B170487r68100K6393K75868n07078j012476m61296M35333P38699M75134
31982A172964J93618J8299l37833q81823j120951o47305K30894P08434M34966
31973b28737l3183k2997L12284L49489M9796p3183M5815p4112m38108l88753K10613
31962b91076N02043r4656q84149q53408p3540N48039N38114K58425K60213O71924
31952E81929J049608O76707n97583j763517j573744k28242P15127M25150j99057
31943i13622j20045L34961L84620J93383K85152L77114K20l51329M2420P06116
31933I38990N77876k65209p65690n88694m04347n24223m95683j56957L5694q1108
$$ plain form
32000 420765 513349 333607 -474990 -1524523 -1488643 273909 2446741 3121867 2170487
31991 2170487 1202387 1228780 1504648 997570 -14906 -476202 -40869 697830 1172964
31982 1172964 1366582 1384881 1047048 165225 -955726 -1603031 -1372137 -663703 -228737
31973 -228737 -261920 -284917 27367 376856 426652 353469 399284 325172 -112936 -501689 -291076
31962 -291076 210967 116311 -767838 -1621246 -1694786 -1146747 -608633 -350208 -89995 581929
31952 581929 1631537 2308244 1710661 -52856 -1626600 -1854842 -1139715 -714565 -913622
31943 -913622 -1033667 -698706 -314086 -120703 164449 541563 541783 190454 232874 938990
31933 938990 1516866 1251657 485967 -102727 -507074 -1031297 -1526980 -1683937 -1648243 -1729351
31923a729351j38836p0126k22784m87018k76152M03896P83538M73227p2585m28881
31913a765072o40170n80203J29428J180022J504955O80670l82320o74262l06372
31904h53324K4077R8665R1827j4781k68565l72596o3934L79374M73620J88809
31894c16828p1918m72L28294N54161L57120j08870k16936L10133P70445L24434
31884A929563o49984r17237j90951M03827K9738o65613o58799m7389L24792J49663
31874b92390k17821n00527o39893m93017l1780L94383N27657O36073R56903J085679
31864A425267N68247k22243n33650l36611k14071l00654j77238J66888J47180
31855E23115m00654p95561n08997L4543J53648q0153j14699J26536K16811L8811
$$ plain form
31923 -1729351 -1868187 -1938313 -2161097 -2648115 -2924267 -2520371 -1736833 -1263606 -1336191 -1765072
31913 -1765072 -2405242 -2985445 -2856017 -1675995 -171040 509630 127310 -546952 -853324
31904 -853324 -829247 -730582 -638755 -653536 -922101 -1294697 -1358631 -979257 -505637 -316828
31894 -316828 -388746 -389218 -60924 493237 850357 741487 524551 834684 1605129 1929563
31884 1929563 1279579 362342 171391 575218 604956 -60657 -719456 -766845 -442053 -292390
31874 -292390 -510211 -1010738 -1650631 -2143648 -2175428 -1781045 -1253388 -617315 339588 1425267
31864 1425267 1993514 1771271 1237621 901010 686939 386285 209047 375935 523115
31855 523115 122461 -673100 -1182097 -1147554 -993906 -1074059 -1188758 -1062222 -845411 -806600
31845h06600l3458J31119R5213m22680r25410o95797K06632R40407Q55368J46731
31835e08475m76721n04481J9103O08947P74204M91754J70111J6565k42580o77529
31825c29102o66855J78286R82530N88359n37104p06599M34883J236560N77622
31816A758580m18026l15001L38652J87846m97648m03019M36260P41657K49104
31807B078405k8359J81946j8476q28565j192653o19153J0295L0171n9687J53710
31797b92366K02079j28678k19877J19379J59970k50363j28721Q33518J371545
31788A666486O32144l48623l76723M1985n2056k77787N2128K98546l12944q88688
31778D34468k26087Q25606N04652q60657j223689o0842R53923P18258Q3603j7650
$$ plain form
31845 -806600 -840058 -708939 -613726 -1036406 -1961816 -2657613 -2450981 -1510574 -655206 -508475
31835 -508475 -985196 -1489677 -1470574 -861627 -87423 404331 574442 591007 348427 -329102
31825 -329102 -995957 -817671 164859 753218 216114 -490485 -55602 1180958 1758580
31816 1758580 1340554 1025553 1364205 1552051 1054403 651384 1087644 1829301 2078405
31807 2078405 2050046 2231992 2213516 1384951 192298 -426855 -416560 -386389 -446076 -292366
31797 -292366 -90287 -218965 -438842 -319463 -159493 -409856 -538577 294941 1666486
31788 1666486 2298630 1950007 1573284 1615269 1563213 1285426 1337554 1636100 1323156 434468
31778 434468 208381 1033987 1538639 677982 -545707 -606549 347374 1065632 1149235 1131585
31768A131585K7132l04392o24166n35687l39422k21055J14711N20356L32576l10526
31758b08888l83859K59523M38817l43325r01750l34708M24509K57571j98880K15999
31748g74991R89601P07448n18474j140444n54050K18991L55235K60077L86071
31739g0536L36484j81571n29484r4447O05983O23265l0105n03042m16595k47809
31729e07857l70011m65524k03730Q6466o3610m27797l79411J19069M54622L26242
31719a431541J28086J85390K52340J14467O7635L02574L87677j2138m20309k78022
31709g03841R9647J42886J16392N29159Q66493K54389p74826p26041M71046J133889
31699A409193M08620m48644k69655J24870m12997j123183n75198O86559P70375
$$ plain form
31768 1131585 1158717 854325 230159 -305528 -644950 -866005 -751294 -230938 101638 -208888
31758 -208888 -592747 -333224 105593 -237732 -1139482 -1474190 -1049681 -792110 -990990 -774991
31748 -774991 214610 922058 403584 -736860 -1290910 -1071919 -716684 -456607 -70536
31739 -70536 265948 84377 -445107 -539554 66429 689694 659589 156547 -260048 -507857
31729 -507857 -877868 -1343392 -1547122 -1460656 -1524266 -1952063 -2331474 -2212405 -1757783 -1431541
31719 -1431541 -1303455 -1118065 -865725 -751258 -683623 -381049 6628 -5510 -425819 -703841
31709 -703841 -604194 -461308 -344916 184243 1050736 1305125 530299 -195742 275304 1409193
31699 1409193 1817813 1369169 1099514 1224384 811387 -311796 -886994 -200435 569940
31690E69940n27754j324203n67208M77655L99173k50399j58233N25797N50234
31681c04998l43496j000157n52106M49579Q94329M62157k37051n14090k78042
31672a423875k74j57171o47780p90955q0027J090956J732134J348018M30715k49602
31662A252139m81795m66963k21072L16650P42960M53760m17609r55444o56601
31653d33975j04560l3094k73079k39640O384k955j30767J87504P90053Q00195
31643E66066K8635n42911j39200O78768Q28855J07530p89392j208802r63095k12347
31633a645893N04099M66905l74001j017272n25929O59863J214084O61447r5424
31624a52121j02331M55026P07016K79489m06588q05011q29901p45931o84651m36026
$$ plain form
31690 569940 42186 -1282017 -1849225 -1371570 -972397 -1222796 -1381029 -855232 -304998
31681 -304998 -648494 -1648651 -2200757 -1751178 -856849 -394692 -631743 -1145833 -1423875
31672 -1423875 -1424149 -1581320 -2229100 -3020055 -3100082 -2009126 -276992 1071026 1501741 1252139
31662 1252139 770344 303381 82309 398959 1141919 1595679 1178070 222626 -433975
31653 -433975 -538535 -571629 -844708 -1084348 -1077964 -1080919 -1211686 -1024182 -234129 566066
31643 566066 594701 51790 -87410 591358 1420213 1527743 738351 -470451 -1433546 -1645893
31633 -1645893 -1141794 -674889 -1048890 -2066162 -2592091 -1932228 -718144 -56697 -152121
31624 -152121 -254452 200574 907590 1187079 780491 -24520 -854421 -1600352 -2285003 -2721029
31614b721029K05529R61268J178698N66138l66068q21471n71382p9097J42114
31605a505300M5791o8756J7263K18725K91937J80727J57184M66635Q63389P97470
31595A465065J75767l87720l37548O5839J10479l70298p49979m28224L52195P06159
31585F01735J50401o74147o11266N18409J409818P77472q77688j799320j271158
31576a775744l96491k47674l14183L80043J462173J684112Q05958j58165m67241
31567I72788l69005k57181j24348m3258k72914n89270l36112M93726R76382M79305
31557I30113m82916j033315r55093n02902J51311P29110P07184N7589l42780K02286
31547e39413J052350R73302j36518j099145j061698m51012q6467k9782J96869
$$ plain form
31614 -2721029 -2515500 -1554232 -375534 190604 -175464 -996935 -1568317 -1647414 -1505300
31605 -1505300 -1459509 -1528265 -1511002 -1292277 -1000340 -819613 -662429 -195794 667595 1465065
31595 1465065 1640832 1253112 915564 981403 1091882 721584 -28395 -456619 -104424 601735
31585 601735 752136 77989 -533277 -14868 1394950 2172422 1294734 -504586 -1775744
31576 -1775744 -2172235 -2419909 -2734092 -2354049 -891876 792236 1598194 1440029 972788
31567 972788 603783 346602 222254 178996 -93918 -683188 -1019300 -525574 450808 930113
31557 930113 447197 -586118 -1541211 -2044113 -1892802 -1163692 -456508 -398919 -741699 -539413
31547 -539413 512937 1486239 1349721 250576 -811122 -1262134 -1348601 -1378383 -1181514
31538a181514O43229P62593K14775n43663p06892r8108N28981L59198m16954p58082
31528a196437r3390Q97521J133281M59476l15365n51127m13322l32340l25858
31519g37561j37532K23922M13147K00093j78190k15850K67326P85688O60072p3839
31509A207276n28384m7737Q08492Q67666j11941j061994r54313m8613N53147K64329
31499I47928m96759j007521r93924o49290k32123J57113M72289N56636K48278
31490i97373k70680m33637Q3148P77316Q19331J94400k04553J31056N48547K52298
31480H99853m39823o09469j61949J62459P6748N4646K21525k9679q60038j333636
31470b019363o73884M77824Q89696M07768n8214J6370K23381J43358J3388K01850
$$ plain form
31538 -1181514 -538285 224308 439083 -104580 -811472 -909580 -380599 -21401 -438355 -1196437
31528 -1196437 -1289827 -392306 740975 1200451 885086 333959 -79363 -411703 -737561
31519 -737561 -875093 -651171 -238024 -37931 -216121 -431971 -164645 621043 1281115 1207276
31509 1207276 678892 631155 1439647 2307313 2195372 1133378 179065 130452 683599 947928
31499 947928 451169 -556352 -1550276 -2199566 -2431689 -2274576 -1802287 -1245651 -997373
31490 -997373 -1268053 -1701690 -1618542 -841226 -21895 172505 -32048 99008 647555 899853
31480 899853 460030 -149439 -311388 -148929 -72181 -17535 203990 174311 -685727 -2019363
31470 -2019363 -2693247 -2215423 -1325727 -917959 -976173 -959803 -736422 -593064 -579676 -377826
31460c77826N44381N33523n3776q64431j196682o10587M96575J127975P95900
31451C95052J33534N603L42317M51490J86506j5129j15451n16285r98082o55506
31441g85951O50939J658924J203966k45199j247803j156049n22413l8739J93193
31432b89132L55823M55102L36751n0187m56300m20753J89032P12884K63099j020933
31422G5386j817828j150717L67002J313769J122815M08144o1197o0750K58894
31413D55518N85554M80127k49183j115686j329379p08115J22821N18823M92130
31404g47390M75497O37273O35157Q8043p57547j058964l58344O23464O99562k45958
31394i207j067910r09432k36216Q7996N4238J90623N47814P64913P82847P65877
$$ plain form
31460 -377826 166555 700078 646302 -218129 -1414811 -2025398 -1528823 -400848 395052
31451 395052 528586 534189 876506 1327996 1514502 1499373 1383922 867637 -130445 -785951
31441 -785951 -135012 1523912 2727878 2482679 1234876 78827 -443586 -482325 -289132
31432 -289132 66691 521793 858544 808357 352057 -68696 120336 833220 1096319 75386
31422 75386 -1742442 -2893159 -2526157 -1212388 -89573 318571 257374 196624 455518
31413 455518 1041072 1521199 1272016 156330 -1173049 -1881164 -1758343 -1239520 -747390
31404 -747390 -271893 365380 1000537 1088580 331033 -727931 -1086275 -462811 236751 -9207
31394 -9207 -1077117 -1986549 -2222765 -2134769 -2080531 -1889908 -1342094 -577181 205666 971543
31384I71543O06004J95860j06173n046M8147m77907j099004q26582K86765J031850
31374F25457N87247n81936j487722j593092r12235J87386J080147J281778R05241
31365I2271M08509J3672k42443j96469J32429K62804n7264k81924L8004L08740
31355D78329j48224p24154m05616L98382M58831j08106o9792N47787L32177q97174
31345a37560j438454m75354N02035J79880n24982l15737K46154M9002m18275r9464
31335b432755N38862M00566r8209K29323J077085J145500M90259L11643N96513
31326B258787J06582j147458j528650l93837P72281O05048l23041p73094n77115
31317a000497j99123K96243Q73878J002597L92088l85821o83721n67000l10806
$$ plain form
31384 971543 1577547 1773407 1667234 1662188 1710335 1232428 133424 -693158 -406393 625457
31374 625457 1212704 630768 -856954 -2450046 -3362281 -3174895 -2094748 -812970 92271
31365 92271 500780 514452 272009 75540 207969 470773 413509 131585 169589 478329
31355 478329 330105 -394049 -799665 -401283 57548 -50558 -120350 427437 759614 -137560
31345 -137560 -1576014 -2051368 -1549333 -1369453 -1894435 -2210172 -1964018 -1915016 -2333291 -2432755
31335 -2432755 -1893893 -1493327 -1591536 -1362213 -285128 860372 1350631 1662274 2258787
31326 2258787 2365369 1217911 -310739 -704576 67705 672753 349712 -423382 -1000497
31317 -1000497 -1199620 -903377 -29499 973098 1365186 979365 295644 -271356 -582162
31308e82162J35337O20542N23813l02680r98776p96341p1447L36025K73800J14869
31298g47020K1500L6395L61066Q58110Q13848o0625q97848p61063k4927K27106
31288a73458j47399k88731K07916P52436P69081M08973M4698k62982n33115o38397
31278A39022n62273m60460k92273J79663Q40570J121010P13514K0583m16925o07888
31268F74543q44054j005475o66362J09293O00571L22556k66623l61209P5760L26285
31258a034715P6176p4298L80411Q89165N73874l63190p81950j71312P17749J019217
31248A231127P73086L97132j42534r51599j478109j005549K24379J092140R12825
31239A052898J62861k49578m0295L26552L08209j42639n97984o46795l51221j41846
$$ plain form
31308 -582162 -446825 173717 697530 394850 -603926 -1400267 -1471714 -1135689 -861889 -747020
31298 -747020 -725520 -689125 -328059 530051 1343899 1283274 385426 -375637 -400564 -173458
31288 -173458 -320857 -609588 -401672 350764 1119845 1528818 1573516 1310534 777419 139022
31278 139022 -423251 -883711 -1175984 -996321 -155751 965259 1678773 1699356 1282431 674543
31268 674543 -169511 -1174986 -1841348 -1732055 -1131484 -808928 -1075551 -1436760 -1361000 -1034715
31258 -1034715 -958539 -1032837 -652426 236739 810613 447423 -334527 -505839 211910 1231127
31248 1231127 2004213 2401345 2258811 1307212 -170897 -1176446 -952067 140073 1052898
31239 1052898 1215759 966181 925886 1252438 1560647 1418008 820024 173229 -177992 -319838
31229c19838k31901l21494l7860N03455Q11704O00589N0652m09756l92210K25707
31219D79048J058768J296103M18003j085712k016469j646894m25009O07686Q99703
31210d14773P02999M66451K70879o562k33527j00704L14245M40410m5349o11805
31200G82264m36899M65805J130691P81040k70662j058674j012786l47146L57845
31191C91478O83441N92974L38053J33268q3175m25940o82054n13430o3488J15775
31181D86902q8211j12157L25654N81314p855r61316j148344l12459O18293P86225
31171A68046L16100j75967l74084k72903R8689N49103O26226O9947p48000j137916
31161h80759q13277j28278L44707L43552Q0597k8595J60873L33811J34250k71319
$$ plain form
31229 -319838 -551739 -873233 -911093 -407638 404066 1004655 1055307 645551 253341 479048
31219 479048 1537816 2833919 3251922 2166210 149741 -1497153 -1922162 -1314476 -414773
31210 -414773 288226 754677 1025556 1018994 785467 684763 999008 1439418 1394069 782264
31200 782264 345365 811170 1941861 2722901 2452239 1393565 380779 33633 391478
31191 391478 1074919 1667893 2005946 2139214 2056039 1630099 948045 434615 371127 486902
31181 486902 398691 286534 612188 1193502 1185647 224331 -924013 -1236472 -618179 168046
31171 168046 484146 308179 -65905 -338808 -240119 308984 935210 1005157 257157 -880759
31161 -880759 -1694036 -1822314 -1477607 -1134055 -1053458 -1082053 -921180 -587369 -453119 -724438
31151g24438l39636O8221M06665J95404k54740k69174K04777N41382L92687J77160
31141C98308L54225O47361M65552j26855m42822j95440R1003n8470l09800r6279
31131G26783L84592L89885k23572p23897n48298o5245N6456j81791k53326K922
31121d35491J75490k1943l08326k87903l8057N1098j06667j71163O7606L07270
31111g68086J56977k33279l39819k9833K85944L64097M58007O46922M33602m12817
$$ plain form
31151 -724438 -1064074 -995853 -589188 -393784 -648524 -917698 -712921 -171539 221148 398308
31141 398308 752533 1399894 1865446 1738591 1295769 1100329 1191332 1132862 823062 726783
31131 726783 1111375 1501260 1277688 553791 5493 -59752 -3296 -185087 -438413 -435491
31121 -435491 -260001 -281944 -590270 -878173 -916230 -865132 -971799 -1142962 -1075356 -768086
31111 -768086 -611109 -844388 -1184207 -1214040 -928096 -563999 -105992 540930 974532 561715
$$ [...]
##END NTUPLES=NMR SPECTRUM
##END=
